##TITLE=31Pdec_LR-798-C1M
 CDCl3, 24 sc
 13.3.2025
##JCAMPDX= 6.0         $$ Bruker NMR JCAMP-DX V2.0
##DATA TYPE= NMR SPECTRUM
##DATA CLASS= NTUPLES
##ORIGIN= UXNMR, Bruker Analytische Messtechnik GmbH
##OWNER= root
$$ XWIN-NMR		Version 3.5
$$ Fri Mar 14 13:52:33 2025 Russian Standard Time (UT+4h)  she@DPX200
##.OBSERVE FREQUENCY= 81.013821
##.OBSERVE NUCLEUS= ^31P
##.ACQUISITION MODE= SIMULTANEOUS
##.ACQUISITION SCHEME= undefined
##.AVERAGES= 24
##.DIGITISER RES= 17
##SPECTROMETER/DATA SYSTEM= spect
##.PULSE SEQUENCE= zgpg30
##.SOLVENT NAME= CDCl3
##.SHIFT REFERENCE= (INTERNAL, CDCl3, 0, 198.062)
##AUDIT TRAIL= $$ (NUMBER, WHEN, WHO, WHERE, WHAT)
$$ ##TITLE= Audit trail, XWIN-NMR		Version 3.5
$$ ##JCAMPDX= 5.01
$$ ##ORIGIN= Bruker BioSpin GmbH
$$ ##OWNER= she
$$ F:/spectra/data/she/nmr/P31/2/pdata/1/auditp.txt
$$ ##AUDIT TRAIL=  $$ (NUMBER, WHEN, WHO, WHERE, WHAT)
(   1,<2025-03-14 13:50:31.50 +0400>,<she>,<DPX200>,
      <created by zg, POWCHK disabled, PULCHK disabled
       configuration hash MD5:
       00 E9 B6 7A A2 85 ED C7 34 08 36 98 17 FE 4E 26
       data hash MD5: 32K
       93 0A 00 8C F5 99 88 E7 C6 01 CB 3C 1F 66 71 9E>)
(   2,<2025-03-14 13:50:34.62 +0400>,<she>,<DPX200>,
      <Start of raw data processing
       efp BC_mod = 2 LB = 1.5 FT_mod = 6 PKNL = 1 PHC0 = 1730.209 PHC1 = 114.0944 SI = 64K 
       data hash MD5: 64K
       20 6A 80 01 AB FB 62 02 2A 9D 68 9C A6 1E 93 C4>)
(   3,<2025-03-14 13:50:59.89 +0400>,<she>,<DPX200>,
      <pk PHC0 = 114.2504 PHC1 = -209.4 
       data hash MD5: 64K
       13 E8 19 D8 52 96 21 FE 14 41 E3 D1 54 A5 B1 FC>)
(   4,<2025-03-14 13:52:02.23 +0400>,<she>,<DPX200>,
      <pk PHC0 = -1.800014 PHC1 = 0 
       data hash MD5: 64K
       03 BC 7D 97 21 99 81 A6 D5 B6 39 8C EF 66 A1 9C>)
(   5,<2025-03-14 13:52:07.71 +0400>,<she>,<DPX200>,
      <abs ABSG = 5 
       data hash MD5: 64K
       E0 F6 F5 88 94 67 C6 BF 72 E5 8A 78 E3 74 81 61>)
$$ ##END=
$$ 
$$ hash MD5
$$ 65 67 B2 3C 8F E7 5C 3E C6 96 17 45 F2 34 68 EA
##$RELAX= 
##$RELAX= 
##$RELAX= 
##$RELAX= 
##$RELAX= 
##$RELAX= 
##$RELAX= 
##$RELAX= 
$$ Bruker specific parameters
$$ --------------------------
##$DU= <F:/spectra>
##$EXPNO= 2
##$NAME= <P31>
##$PROCNO= 1
##$TYPE= <nmr>
##$USER= <she>
##$AMP= (0..31)
100 100 100 100 100 100 100 100 100 100 100 100 100 100 100 100 100 100 
100 100 100 100 100 100 100 100 100 100 100 100 100 100 
##$AQSEQ= 0
##$AQ_mod= 1
##$AUNM= <au_zg>
##$AUTOPOS= <>
##$BF1= 81.014009
##$BF2= 200.13
##$BF3= 200.13
##$BF4= 200.13
##$BF5= 200.13
##$BF6= 200.13
##$BF7= 200.13
##$BF8= 200.13
##$BYTORDA= 1
##$CFDGTYP= 0
##$CFRGTYP= 5
##$CHEMSTR= <none>
##$CNST= (0..31)
1 1 145 1 1 1 1 1 1 1 1 1 1 1 1 1 1 1 1 1 1 1 1 1 1 1 1 1 1 1 1 1 
##$CPDPRG= <waltz16>
##$CPDPRG1= <>
##$CPDPRG2= <waltz16>
##$CPDPRG3= <>
##$CPDPRG4= <mlev>
##$CPDPRG5= <mlev>
##$CPDPRG6= <mlev>
##$CPDPRG7= <mlev>
##$CPDPRG8= <mlev>
##$CPDPRGB= <>
##$CPDPRGT= <>
##$D= (0..31)
0 1 0 0 0 0 0 0 0 0.06 0 0.03 2e-05 3e-06 0 0 0.0002 0 0 0 0 0 0 0 0 0 
$$ [...]
##$SUBNAM3= <"">
##$SUBNAM4= <"">
##$SUBNAM5= <"">
##$SUBNAM6= <"">
##$SUBNAM7= <"">
##$SUBNAM8= <"">
##$SUBNAM9= <"">
##$SW= 400.765351723535
##$SWIBOX= (0..15)
0 1 3 0 0 0 0 0 0 0 0 0 0 0 0 0 
##$SW_h= 32467.5324675325
##$TD= 32768
##$TD0= 1
##$TE= 0
##$TE2= 300
##$TE3= 300
##$TEG= 300
##$TL= (0..7)
0 120 53 12 22 120 120 120 
##$TP= (0..7)
150 150 150 150 150 150 150 150 
##$TP07= 0
##$TPNAME0= <>
##$TPNAME1= <>
##$TPNAME2= <>
##$TPNAME3= <>
##$TPNAME4= <>
##$TPNAME5= <>
##$TPNAME6= <>
##$TPNAME7= <>
##$TPOAL= (0..7)
0.5 0.5 0.5 0.5 0.5 0.5 0.5 0.5 
##$TPOFFS= (0..7)
0 0 0 0 0 0 0 0 
##$TUNHIN= 0
##$TUNHOUT= 0
##$TUNXOUT= 0
##$USERA1= <user>
##$USERA2= <user>
##$USERA3= <user>
##$USERA4= <user>
##$USERA5= <user>
##$V9= 5
##$VALIST= <valist>
##$VCLIST= <CCCCCCCCCCCCCCC>
##$VD= 0
##$VDLIST= <DDDDDDDDDDDDDDD>
##$VPLIST= <PPPPPPPPPPPPPPP>
##$VTLIST= <TTTTTTTTTTTTTTT>
##$WBST= 1024
##$WBSW= 4
##$XGAIN= (0..3)
0 0 0 0 
##$XL= 0
##$YL= 0
##$YMAX_a= 9235
##$YMIN_a= -6225
##$ZGOPTNS= <>
##$ZL1= 120
##$ZL2= 120
##$ZL3= 120
##$ZL4= 120
##$ABSF1= 198.0616
##$ABSF2= -202.7028
##$ABSG= 5
##$ABSL= 3
##$ALPHA= 0
##$AQORDER= 0
##$ASSFAC= 0
##$ASSFACI= 0
##$ASSFACX= 0
##$ASSWID= 0
##$AUNMP= <proc_1d>
##$AZFE= 0.1
##$AZFW= 0.5
##$BCFW= 0
##$BC_mod= 2
##$BYTORDP= 0
##$COROFFS= 0
##$CY= -3
##$DATMOD= 1
##$DC= 0
##$DFILT= <>
##$DTYPP= 0
##$F1P= 0
##$F2P= 0
##$FCOR= 1
##$FTSIZE= 65536
##$FT_mod= 6
##$GAMMA= 0
##$GB= 0
##$INTBC= 1
##$INTSCL= 9.790993e-09
##$ISEN= 30
##$LB= 1.5
##$LEV0= 0
##$LPBIN= 0
##$MAXI= 10000
##$MC2= 0
##$MEAN= 0
##$ME_mod= 0
##$MI= 50
##$NCOEF= 0
##$NC_proc= -6
##$NLEV= 6
##$NOISF1= 182.463
##$NOISF2= 159.3651
##$NSP= 0
##$NTH_PI= 0
##$NZP= 0
##$OFFSET= 198.0616
##$PC= 4
##$PHC0= 1842.659
##$PHC1= -95.3056
##$PH_mod= 1
##$PKNL= yes
##$PPARMOD= 0
##$PSCAL= 0
##$PSIGN= 0
##$REVERSE= no
##$SF= 81.0140089999434
##$SI= 65536
##$SIGF1= 159.3651
##$SIGF2= -187.1042
##$SINO= 113.3802
##$SIOLD= 16384
##$SREGLST= <1H.CDCl3>
##$SSB= 0
##$STSI= 65536
##$STSR= 0
##$SW_p= 32467.5324675325
##$SYMM= 0
##$S_DEV= 0
##$TDeff= 32768
##$TDoff= 0
##$TI= <>
##$TILT= no
##$TM1= 0
##$TM2= 0
##$TOPLEV= 0
##$USERP1= <user>
##$USERP2= <user>
##$USERP3= <user>
##$USERP4= <user>
##$USERP5= <user>
##$WDW= 1
##$XDIM= 65536
##$YMAX_p= 281066391
##$YMIN_p= -27522494
$$ End of Bruker specific parameters
$$ ---------------------------------
##NTUPLES= NMR SPECTRUM
##VAR_NAME=  FREQUENCY,     SPECTRUM/REAL,   SPECTRUM/IMAG
##SYMBOL=    X,             R,               I
##VAR_TYPE=  INDEPENDENT,   DEPENDENT,       DEPENDENT
##VAR_FORM=  AFFN,          ASDF,            ASDF
##VAR_DIM=   65536,         65536,           65536
##UNITS=     HZ,            ARBITRARY UNITS, ARBITRARY UNITS
##FACTOR=    0.49542278885378, 1,            1
##FIRST=     16045.7642231865, 0,            0
##LAST=      -16421.768244346, 0,            0
##MIN=       -16421.768244346, -27522494,    0
##MAX=       16045.7642231865, 281066391,    0
$$ Real data points
##PAGE= N=1
##DATA TABLE= (X++(R..R)), XYDATA
$$ [...]
43171E02298m63899m53998j93487r3516N835L58838O58935M96771Q4094j14978
43161G86893j57361l82087o55997n33139l2495L63018M22845L48884K96958K13242
43151F70761J06665M4584o5551k96862m21856k16550J05510J94197J12247J04698
43141C37843M1710l09360o27507l65764K92023N26612M6594n06499n03503p8838
43131a146689K97049M49213M18166K17624k6097p0619N9308N0493j34491j03743
43121A0214K82514N23356J67636m49054o13694j80809L23722M46734K61709O8957
43111H41285l7226j77580m13890n96025n08918j59980J64685K22631J07785O6103
43101d91130J12291O9937n8837o5821R3139K00739J39085P3753J45068K05847
$$ y = [502298, 38399, -415599, -609086, -702602, -696767, -337929, 321006, 817777, 901871, 786893, 629532, 247445, -408552, -941691, -974186, -611168, -188323, 160561, 457519, 670761, 777426, 822010, 756459, 459597, 37741, -178809, -73299, 120898, 233145, 337843, 379553, 70193, -557314, -923078, -631055, -104443, -57849, -564348, -1067851, -1146689, -849640, -400427, 17739, 235363, 209266, 138647, 197955, 248448, 113957, 10214, 292728, 816084, 983720, 534666, -79028, -259837, 63885, 510619, 772328, 841285, 804059, 626479, 212589, -383436, -892354, -1052334, -887649, -665018, -557233, -491130, -378839, -308902, -367739, -433560, -340421, -139682, -597, 73156, 218224, 424071]
43091D24071L5549l23801n79794m75341l3674M11481M83431J71830j31248j48411
43081a65907p5975j79178k80223p5278K24657J31177k90364m31238o6446L16916
43071h91859L01202R0422J6859R908r9003j72592m9376J05882Q9820J9124Q3655
43060d95958K01881K18237J96206K37802K45334J08058j06171l32686n91738p25563
43050a044598m47906J15323L82725J32205j01310J50815N26454M19801m2542k28188
43040a37221K8894K87672K24797k4195k06109k20452r6949N38j12568k95857j59642
43029g11092K38308K51564l42423p39324k16044O41576P17940M2929l39318k8935
43019d84819K99021J79354k1413j5056r2933l28817k31185L12264O13019K76697
$$ y = [424071, 459620, 135819, -443975, -919316, -952990, -541509, -58078, 113752, -17496, -165907, -241882, -421060, -701283, -776561, -551904, -420727, -711091, -1142329, -1208775, -891859, -590657, -500235, -483376, -473468, -572471, -745063, -794439, -688557, -598737, -579613, -495958, -294077, -75840, 120366, 358168, 603502, 711560, 605389, 272703, -319035, -1044598, -1492504, -1377181, -994456, -862251, -963561, -812746, -286292, 133509, 90967, -137221, -108327, 179345, 404142, 379947, 173838, -46614, -143563, -143025, -255593, -551450, -711092, -472784, -221220, -563643, -1302967, -1519011, -877435, -159495, -116566, -455884, -484819, -185798, -6444, -27857, -42913, -135846, -464663, -695848, -383584, 229435, 506132]
43009E06132r4892M5895K18667j99317p76421o67414L145L85068K61910J90261
42999a26966L89840M51300K20315R7136K43395K49561j08887m34980l87414k41604
42989C51696l62629n66671m66059j24752R8220J40606K05341K58893M4216l76999
42979g98138n34656j84704K85696L53689N9772j17939n745N4297j54484k81764
42969a323976M3010N07330M77929k2727l00664o0900J38056j65281n24715l01010
42959a532948K57021L95639R0020N3450N06086P88377M49082o3508k28912k82382
42949D31925o04219q34470l90496M32003P21641K64097j97499j26461J31216J13081
42939e9182q70J34135L15690J51780j96082k49358l2849l9976l82262n58333k24991
$$ y = [506132, 411240, 457135, 675802, 476485, -299936, -967350, -964205, -579137, -317227, -126966, 262874, 714174, 934489, 1031625, 1275020, 1524581, 1415694, 980714, 593300, 351696, -10933, -577604, -1043663, -1168415, -1070195, -929589, -724248, -465355, -421139, -798138, -1332794, -1517498, -1231802, -878113, -818341, -936280, -942025, -887728, -1042212, -1323976, -1280966, -773636, -295707, -318434, -619098, -679998, -541942, -707223, -1231938, -1532948, -1275927, -880288, -790268, -736818, -230732, 557645, 1006727, 943219, 714307, 431925, -172294, -1006764, -1397260, -965257, -243616, 20481, -177018, -303479, -172263, -59182, -60052, 74083, 389773, 541553, 345471, 96113, 63264, 23288, -358974, -917307, -1142298]
42928a142298K80329M30460J68368j71936l20174j98140J55483N13561N11237
42919B26890N6130m46701n35819k32324J06905L11497M50114M89011L09383O1011
42909G96097Q3346L62621M35496L1152m87112n75897j97275K23620L86648L61446
42899A420142K87335J34921j28618l35228k54361J04394M47037M81898J98771
42890B356291j64037l80111l96454k69136p1434P4544j494l40021p12819q01473
42880g06144n29114j21895J58515K44957K21886J67680J06792P1636J36165L31683
42870H2161N10944L89886j20892o53729o87373j86844L09871L84766K35424K35288
42860D99502K99382R8565k86210m27341k27500m1022o8233j05529k1502j1198
$$ y = [-1142298, -861969, -431509, -263141, -435077, -755251, -953391, -797908, -284347, 226890, 283020, -163681, -699500, -931824, -824919, -513422, -63308, 425703, 735086, 796097, 879443, 1242064, 1677560, 1708712, 1221600, 645703, 448428, 672048, 1058696, 1420142, 1707477, 1842398, 1713780, 1378552, 1124191, 1228585, 1675622, 2157520, 2356291, 2192254, 1812143, 1415689, 1146553, 1075119, 1149663, 1148169, 808148, 95329, -706144, -1235258, -1357153, -1198638, -953681, -731795, -564115, -457323, -385687, -249522, 82161, 593105, 982991, 862099, 208370, -479003, -665847, -355976, 28790, 264214, 499502, 798884, 897449, 611239, 183898, -43602, -84624, -152857, -258386, -279888, -291086]
42850b91086j65018k16456m373J86413P8636j19791o2782J66504K46014J88699
42840F760K73456M66087L61017j98927p76214q03189k45324L49641M38427M9475
42830g8791k77063j31503K77412M14501J13950k71625m04423l21442j88219m1227
42820i08430O8322J3583j16449j98L88540N79272K51960k40935l77533j83267
42810e25135k120J55868M81036P64840N62827n1911m57758k92491J58543M53252
42800A246951M47925J87312k37643n91951o02495k85054Q4710L22680L74326J22634
42790A069395l96187o84427k78133M41173N88254M2541l45796p4426K56154j2129
42780F06419m93686m06281J68820M65893K12527j36545k39840k29804k12641n5024
$$ y = [-291086, -456104, -672560, -676933, -490520, -411884, -531675, -594457, -427953, -181939, 6760, 280216, 746303, 1107320, 908393, 132179, -671010, -916334, -566693, -128266, -78791, -355854, -487357, -209945, 204556, 318506, 46881, -357542, -678984, -867203, -908430, -840108, -826525, -942974, -943172, -554632, 24640, 276600, 35665, -341868, -525135, -527255, -371387, 109649, 874489, 1437316, 1385405, 927647, 635156, 793699, 1246951, 1694876, 1882188, 1644545, 1052594, 450099, 165045, 249755, 572435, 946761, 1069395, 673208, -11219, -289352, 151821, 740075, 782616, 436820, 362394, 618548, 606419, 112733, -293548, -124728, 341165, 553692, 417147, 177307, -52497, -265138, -320162]
42770c20162K01448K57452O1586n9821M3300R2130j00946k65178j22382J24851
42760h7722J18865n9598k6363K55788L53614k2549n63595p04422k91129K72078
42750g55033N05188L22412n053j99763j77219O6J92952K34781P9702q8426o0084
42739D9523P7898L5284k16258l26697o0084L33320M53835K71778N0574j01946
42729E67227k89867m93193m99327k25830J24975L07093K58502N9355j53544j96508
42719e41117L3140L60100M45755K07195m1837o660J75935J39054j73983m11549
42709A86033l05061m5215l183k07141l41720k48909j34082j56029j15678J70446
42699a200539M34606L19052L9311J45725N84932O03634j48618r68644r93583l29592
$$ y = [-320162, -118714, 138738, 200324, 140503, 183803, 275933, 174987, -90191, -212573, -87722, 31143, -28455, -54818, 200970, 554584, 532035, -31560, -735982, -1027111, -755033, -249845, 72567, 67514, -132249, -309468, -309402, -116450, 118331, 198033, 109607, 49523, 127421, 162705, -53553, -380250, -440334, -107014, 346821, 618599, 669173, 567227, 277360, -215833, -715160, -940990, -816015, -508922, -250420, -191065, -344609, -541117, -507977, -147877, 297878, 505073, 463236, 456576, 632511, 771565, 597582, 186033, -119028, -164243, -167426, -374567, -716287, -965196, -1099278, -1255307, -1370985, -1200539, -765933, -446881, -407570, -261845, 323087, 926721, 778103, -190541, -1184124, -1513716]
42689a513716K37735L41797K31915P8185k08998m60566k46441L99341Q09646N36343
42679B05241m5905k76025J846M55863P41446O54572J16958o27773j021793p60354
42669e55924k03963R3275R6588J59131L19155K14045k56419o26616m43030J29056
42659a074702N16292M04653j1035l55779m44752l24323j16974P8342J99311K39739
42649h89228K66356L40150L87280K29647j75471n89857p04200m62793o7186K92283
42639a373019N42286O02709M00873O5422j26087j01045q2702k06056k83831j49116
42629g10566Q144o0709k05374q6630K26821K78785q7340m32335l04389J54109
42619a219484M39995L63357J98921K10121L05819K63490R2672j0743L04n3645
$$ y = [-1513716, -1275981, -934184, -702269, -624084, -833082, -1293648, -1540089, -1140748, -331102, 205241, 159336, -116689, -114843, 341020, 1082466, 1737038, 1853996, 1226223, 204430, -555924, -759887, -666612, -570024, -410893, -91738, 122307, -134112, -760728, -1203758, -1074702, -558410, -153757, -164792, -520571, -965323, -1289646, -1406620, -1328278, -1128967, -889228, -622872, -282722, 104558, 334205, 158734, -431123, -1135323, -1598116, -1665302, -1373019, -830733, -228024, 172849, 238271, 112184, 11139, -71563, -277619, -561450, -710566, -702422, -763131, -968505, -1055135, -828314, -549529, -636869, -1069204, -1373593, -1219484, -779489, -416132, -217211, -7090, 298729, 562219, 654891, 644148, 644452, 590807]
42609E90807k63056m11281k39591J49728L62276J95659j36190l14877k59017n9125
42599c84667K18459M82918N38569K88028o2843k11512j15836L5706J24332J48270
42589A061424N0530k11688m33163k96297J85911O06313O28380L12496o9108l06932
42579A527866k87107k6339K15082J24372k23621l89237j80703P0847O1129j6529
42569H75760J11040K30362k9588m94461o08582k62914M7671m3511l34336m53680
42559i62239k98267N2976M66616O55820L69745j24994j85522L12451O57104K58804
42549A202494m72927p10655l59366k8526l2208q5550o814n7506l65389n42340
42539a458787k13617M17835Q43249Q33086N01101L8587l30410l38256N4649M75569
$$ y = [590807, 327751, -83530, -323121, -173393, 188883, 384542, 248352, -66525, -325542, -384667, -166208, 316710, 855279, 1143307, 1080464, 868952, 753116, 788822, 913154, 1061424, 1111954, 900266, 467103, 170806, 356717, 963030, 1591410, 1903906, 1834798, 1527866, 1240759, 1214420, 1429502, 1553874, 1330253, 941016, 760313, 831160, 892289, 875760, 986800, 1217162, 1187574, 693113, 84531, -178383, -130712, -174223, -508559, -962239, -1260506, -1207530, -740914, -85094, 284651, 159657, -25865, 286586, 943690, 1202494, 729567, 18912, -340454, -368980, -401188, -486738, -493552, -551058, -916447, -1458787, -1672404, -1254569, -411320, 421766, 922867, 961454, 631044, 292788, 347437, 823006]
42529H23006M98434J34725k41229l80286l47572k72824j56414K6953J91195J91314
42519D67302j8875k92869l79980j94026K3076l2607k84349l31340k8293K71269
42509h00692K28959J524o0748N0675J19226J65781L66014N88638M72734P820l71143
42498G68788l75592j96711j16248j20293q3738m6128p6379q1516L1115J71586
42488a25116K32242K59693K76147J21125k84415o58996o19471j58890L58841O27066
42478B8226O03590L55350k7834l41694l53456r0855J36613J21127P394K4085J09325
42467E71871J7394k63227m53758l95878k67087k29756j00116L30057P78026O99946
42457F87472Q1715m32064l93423j29569j48665l43881k69042N3121J88002N4115
$$ y = [823006, 1321440, 1456165, 1214936, 834650, 487078, 214254, 57840, 84793, 275988, 467302, 448427, 155558, -224422, -418448, -395372, -427979, -712328, -1043668, -1071961, -800692, -571733, -570209, -630957, -580282, -461056, -295275, 70739, 659377, 1132111, 1139931, 768788, 393196, 196485, 80237, -40056, -123794, -169922, -246301, -327817, -296702, -125116, 107126, 366819, 642966, 764091, 479676, -179320, -798791, -957681, -598840, 28226, 631816, 987166, 959332, 617638, 264182, 173327, 309940, 431067, 438461, 462546, 571871, 589265, 326038, -127720, -523598, -790685, -1020441, -1120557, -790500, -12474, 687472, 769187, 337123, -56300, -185869, -334534, -678415, -947457, -894336, -706334, -652219]
42447f52219J4710J69196J67767j06461k58539n5982J54643O4640m3867J90194
42437c55918N32236M93416P0034l45601n67722o48578n17188j16988K40405K11250
42427a004654K7292J98160O32683O76577J26735m04485l77730m4564O1311q5257
42417a93932j38080j3984N4037l1212j04450m5566N6122P0166q140p6295k7271
42406d58605J35689K44669J18785j75585l37887j89075J01646K36049J22012j00348
42396c02650k49048k06480N4747M10580O07517M74648J08077k20247l17629k04737
42386A54778n1738k8079j68074l36182l50354j67440O8947J69411Q1501m4489
42376f71719K2014L34310O38328O28395L50315J57995K06612K48749Q3326r6088
$$ y = [-652219, -637509, -468313, -300546, -407007, -665546, -721528, -566885, -502245, -546112, -355918, 176318, 669734, 739768, 394167, -173555, -822133, -1339321, -1456309, -1215904, -1004654, -977362, -779202, -146519, 530058, 656793, 252308, -125422, -169986, -108675, -193932, -332012, -345996, -291959, -323171, -427621, -473187, -417065, -346899, -355039, -431334, -458605, -322916, -78247, 40538, -135047, -472934, -662009, -560363, -324314, -202302, -302650, -551698, -758178, -703431, -292851, 314666, 789314, 897391, 677144, 359515, 154778, 103040, 74961, -93113, -429295, -779649, -947089, -878142, -708731, -627230, -671719, -649705, -315395, 322933, 951328, 1301643, 1459638, 1666250, 1914999, 1998325, 1902237]
42366A902237o8780q922j60547l36135k10127O6738Q9088p5848O01K76426J94398
42355A669129l82687q45327p17054k79504O911J57129L38126L89000J33939k12779
42345B56883l90484m74863n15385k34039M09458P98270M47232j42759j42375L47569
42335C59507M88320L4722l62251k46080M9120J20356J24459L34591N88895N63821
42325B055460K50394j43379m85615o83652o17851l23191k8266J18953J52548P2345
42315C67746j67147l90433k89750R8295L65039L19415K30371L09980L55670J54100
42305A353286j30349k68842l42401m75976m89626j88644K09369L13189R9112j04565
42295b5447p8138J11586K95482L26655J28616j64889k49752m7007J03404j05491
$$ y = [1902237, 1833457, 1824535, 1663988, 1327853, 1117726, 1184464, 1273552, 1197704, 1198305, 1474731, 1669129, 1286442, 441115, -275939, -555443, -548532, -391403, -53277, 335723, 469662, 256883, -133601, -608464, -1123849, -1357888, -948430, -150160, 297072, 154313, 11938, 359507, 847827, 882549, 520298, 274218, 323338, 443694, 568153, 902744, 1491639, 2055460, 2305854, 2162475, 1676860, 993208, 375357, 52166, 23900, 142853, 295401, 367746, 200599, -189834, -479584, -381289, -16250, 303165, 533536, 843516, 1199186, 1353286, 1222937, 954095, 611694, 135718, -353908, -542552, -333183, -19994, 79118, -25447, -103585, 8001, 303483, 630138, 758754, 593865, 344113, 297106, 400510, 295019]
42285B95019m70251n53043k98084l0782P6406J68003L30888M06037K74060O7363
42275B65616l0447k2691k6001p8078j16923r5393n7248j01177k55334l94308l57566
42264a269550j59249L7190J68109L16112M55245L82135M2775k81373l00792o7223
42254f76621J69226K65970J78730j21289m81965n47014j89006K29964L33951K57413
42244e80641L36036M92034L85651L0700k47488l80827n39096n81173j57040N41687
42234g00157P79415K82249l21090l92394r6646P6055J01096K02488K39053o1704
42224A08365m73840n01199j48489J10042J06247J50229L72756M68887K75089R1976
42214E60063J70560L06631K46419J13162Q2503j9407l65427o46367m43228O4822
$$ y = [295019, -175232, -728275, -1026359, -1057141, -980735, -812732, -481844, -75807, 198253, 265616, 235169, 212478, 186477, 108399, -8524, -103917, -161165, -262342, -517676, -911984, -1269550, -1428799, -1391609, -1223500, -907388, -452143, -70008, -27233, -308606, -609398, -676621, -507395, -241425, -62695, -183984, -665949, -1212963, -1401969, -1172005, -838054, -580641, -244605, 247429, 633080, 663780, 416292, 35465, -503631, -1084804, -1241844, -700157, 79258, 361507, 40417, -351977, -448623, -372568, -271472, -68984, 170069, 108365, -365475, -866674, -1015163, -905121, -798874, -648645, -275889, 192998, 468087, 560063, 730623, 1037254, 1283673, 1396835, 1479338, 1459931, 1094504, 448137, 4909, 69731]
42204F9731K81121M0147k33306k48444j96204k15689n1223M25765P86162N82735
42194A240795M2799k39757j28178M794n7692j47221j42901j54638j73605K9085
42184B73481M69118P59296N72021M7438m27738o23488n23006k38626k2279j06136
42174A80081l80831m79823k96248r7343j331K26874O12797O83236J59489m59005
42164A47896n20521j25894J46470J57622K12337L25540K09079l6315M4356M16988
42154I77558M59496n1089n07977l85741o418N2873j61584k25431j12215j39097
42144i9625l11285k83675K9613K72763J80158m1595k3323K62950M69596K98931
42134G54508j31094m09419l31236j53874k14543m16315l69496J216L37517L80291
$$ y = [69731, 350852, 390999, 157693, -90751, -286955, -502644, -553867, -128102, 658060, 1240795, 1283594, 1043837, 915659, 920453, 862761, 715540, 572639, 418001, 244396, 273481, 742599, 1501895, 2073916, 2121354, 1693616, 1070128, 547122, 308496, 286217, 180081, -200750, -680573, -976821, -1074164, -1075495, -848621, -235824, 447412, 606901, 147896, -372625, -498519, -352049, -194427, 17910, 343450, 552529, 516214, 560570, 977558, 1437054, 1385965, 877988, 492247, 485829, 538702, 377118, 151687, 39472, -99625, -410910, -694585, -664972, -392209, -212051, -253646, -276969, -14019, 455577, 754508, 623414, 213995, -117241, -271115, -485658, -901973, -1271469, -1270253, -932736, -552445]
42124e52445K58993J44830O247j04248P6790N61203Q55345N37886j43288o04513
42114A036800o54369n27366l69273j07217K25070M06447L12885M9528k03094l12334
42104a42923k25412k6036J29460K24175L46038L67601M381o08112q13352k82352
42094a026532M09432N31008J98094N5357K24023K57769K3120j14853j5291L7983
42084E80110j6642J38340M83888M61599j47948p12003n67066P3204M94443M29828
42074A217753J57553r7475l49129n27625m23915k6982L48365L60727j9132m60575
42064A79565n43656j71929K84510M00663K01041K0399m8147j67975k46932L7384
42054e5077N43356N89437p0546p18977o13797l5926J88072r6252k99343r9426
$$ y = [-552445, -293452, -148622, -142375, -246623, -169833, 391370, 1246715, 1784601, 1641313, 1036800, 382431, -144935, -514208, -621425, -396355, 10092, 322977, 372505, 169411, -142923, -368335, -394371, -264911, -40736, 305302, 672903, 677284, 69172, -744180, -1026532, -617100, -86092, 112002, 167359, 391382, 649151, 672271, 557418, 542127, 580110, 563468, 701808, 1185696, 1647295, 1499347, 787344, 220278, 293482, 787925, 1217753, 1375306, 1277831, 928702, 401077, -22838, -49820, 298545, 659272, 640140, 179565, -364091, -536020, -251510, 149153, 350194, 370593, 322446, 154471, -92461, -55077, 488279, 1077716, 1007170, 288193, -325604, -361530, -173458, -269710, -569053, -668479]
42044f68479J50464Q8323j46170k29149o3753K82121P00974R47833P14715M813
42034A781692p36668j009778p00450j20476K78665K59113l45q9575J47321M31413
42024B40912M68958L31409K07171M4823k22705l56964j59797P0840m3766k55131
42014C25750j7050N53505P53020L83620K1320K677r0054n74437j015738r27804
42004e85191n17537j83078J56830O02236O97943J14889n20643l77527K73812M57715
41994A19449M7492j20112K66141M81884O6378l78551k32126J49387J50002q5929
41984D64015j02497m1043k66589m86945j30061O10822R54670O62354K01374j52196
41974A713904n34977p91577m66715K62978N20437j0414n36885l71635M5096o587
$$ y = [-668479, -518015, -429692, -575862, -805011, -868764, -586643, 114331, 1062164, 1776879, 1781692, 1045024, 35246, -665204, -785680, -507015, -247902, -248247, -337822, -190501, 240912, 709870, 1041279, 1248450, 1293273, 1070568, 713604, 553807, 624647, 580881, 325750, 308700, 862205, 1615225, 1998845, 2020165, 2022842, 1932788, 1358351, 342613, -585191, -1102728, -1285806, -1128976, -526740, 171203, 286092, -234551, -612078, -338266, 119449, 166941, 46829, 312970, 794854, 861232, 482681, 250555, 399942, 549944, 464015, 361518, 320475, 53886, -433059, -563120, 47702, 1002372, 1664726, 1866100, 1713904, 1178927, 387350, -79365, 183613, 704050, 693636, 156751, -214884, -169788, -176375]
41964a76375l08062j76812K85702L69075j2279j93956J02008L59012J84682j05833
41954C27162j31012m7651j37388k81367k52780j56289j80522k07196m3263J89439
41944i20867K47308J60834J16480J07551J2242j16996j38980r1256j02826j36447
41934h62957o6549P7889J76788K24425K56089J93343q752j90555k02270j46615
41924e49164j55253r5583J88599N04225N35699L14128Q2118j65700n45877q03130
41914f89938n38121O6924L55248J60159N0400L64391O22730L30686j73617k52805
41904B96057L2650J23158n9148l2414L53092O02712L32706j75015m24503l29968
41894G19327j26792L5051J22177O2566j49635l21054k78165j34555j25626k42231
$$ y = [-176375, -484437, -661249, -375547, -6472, -18751, -212707, -110699, 248313, 432995, 327162, 196150, 148499, 11111, -270256, -523036, -679325, -859847, -1067043, -1110306, -920867, -673559, -512725, -396245, -288694, -276452, -393448, -532428, -623684, -726510, -862957, -929506, -851617, -674829, -450404, -194315, -972, -9724, -200279, -402549, -549164, -704417, -800000, -611401, -107176, 428523, 742651, 824769, 659069, 113192, -689938, -1228059, -1161135, -805887, -645728, -595328, -230937, 391793, 722479, 548862, 296057, 328707, 451865, 392717, 360303, 713395, 1316107, 1648813, 1473798, 1049295, 719327, 592535, 627586, 749763, 812329, 662694, 341640, 63475, -71080, -196706, -438937]
41884d38937k37820J7474L58627N06987L26553o2936l36136k13931K02686M56628
41874E79195K67980q3057j61986m1582j56253n08967n41083n663N21671M22467
41864B92722m5248j63629J29763K07494j80230n00623l28518k9908j37447m88874
41854a244498n10680j13336K18571J52167j11491j89022P0571N16600P83977N20015
41844I2874j83800o73654m02465L28693O91089L91150k4243j1530K82661M01832
41834H92607K48809M2484j27579l39769n53306n83874l41851P7934M88215O76369
41824D80039N03183Q4169k39534k57450j13430n8815j34333k39356l33471l66705
41814f75703j87159K14312N02967L60577j7525j20673J72645M23247K57269j42819
$$ y = [-438937, -676757, -659283, -300656, 206331, 532884, 469948, 133812, -80119, 122567, 579195, 847175, 764118, 602132, 560550, 404297, -104670, -645753, -651416, -129745, 292722, 247474, 83845, 213608, 421102, 240872, -259751, -588269, -618177, -755624, -1244498, -1755178, -1868514, -1649943, -1497776, -1609267, -1798289, -1727718, -1211118, -427141, 92874, -90926, -764580, -1167045, -838352, -147263, 243887, 219644, 208114, 490775, 892607, 1141416, 1183900, 1056321, 716552, 163246, -420628, -762479, -684545, -196330, 480039, 983222, 1067391, 827857, 570407, 456977, 398162, 263829, 24473, -308998, -675703, -862862, -648550, -145583, 214994, 197469, 76796, 249441, 672688, 929957, 787138]
41804G87138l52879k78047j67775j89477k39429j61708M4863K80647M62556N20768
41794G06657L85883Q2449k09170k87143j38137M6998Q0993m4615j99155k66456
41784A58304k31734j59644j06575k9936J73750M55838N17842J40035l96458n16013
41774E409r9294K87843J57336k13302k29630J19704L05140R7521j69732k17127
41764D3868j77869j97444j51778J2641P1717q2387j99218q9805M7574M81r1608
41753h13828n6187m4767k04011k88868l5788L02900K60478j36295l91507k06937
41743a614810K43500O41900P88094O02942K06361o0243Q857J76761R5779j76915
41733I12226l10890k07184j6898J94845M04221M00276O3258k56696j62307Q0695
$$ y = [787138, 434259, 156212, -11563, -201040, -440469, -602177, -557314, -276667, 185889, 706657, 1092540, 1174989, 965819, 678676, 540539, 587537, 668530, 623915, 424760, 158304, -73430, -233074, -339649, -369585, -195835, 260003, 777845, 917880, 521422, 5409, -93885, 193958, 351294, 137992, -91638, 28066, 333206, 430727, 260995, 43868, -134001, -331445, -483223, -470582, -398865, -481252, -680470, -770275, -722701, -722220, -813828, -870015, -914782, -1118793, -1407661, -1443449, -1140549, -880071, -1016366, -1407873, -1614810, -1371310, -729410, 58684, 661626, 867987, 807744, 816601, 993362, 1089141, 912226, 601336, 394152, 377254, 572099, 976320, 1376596, 1439854, 1183158, 1020851, 1101546]
41723A101546j39548p52331r54544l51605M56733O97655L28597j68867m48941
41714b31305m33056j54127J97503L37605K38604J62045J95537J11919j38854k20577
41704F5294M6090L33012L02107Q2904n9248j51508k60929k01564R1648K55772
41694E03578L0344k36057j27226R5524r8716n63391o17233r1243M22239M62012
41684b20169K65496K57210M41056N48163M54028K20979m3082k09863k02561j29623
41674A381634j61454k53347k28239j36305k20023m66505n35944k63965Q8353K62293
41664e33502L65241N57519O53319L84731r0479l27402k20493j33150l09917m90192
41654a44325l45131o1353j08813m74988n66898n4814N68090O31094K24347k572
$$ y = [1101546, 961998, 209667, -744877, -1096482, -639749, 57906, 386503, 217636, -231305, -664361, -818488, -620985, -283380, -44776, 117269, 312806, 424725, 285871, 65294, 111384, 444396, 746503, 829407, 770159, 618651, 357722, 156158, 247806, 503578, 533922, 297865, 170639, 266163, 167447, -395944, -1013177, -1104420, -682181, -220169, 45327, 302537, 743593, 1291756, 1745784, 1966763, 1923681, 1713818, 1511257, 1381634, 1220180, 966833, 738594, 602289, 382266, -84239, -620183, -884148, -795795, -533502, -168261, 389258, 1042577, 1427308, 1336829, 1009427, 788934, 655784, 345867, -144325, -489456, -550809, -659622, -1134610, -1701508, -1756322, -1188232, -557138, -332791, -335363]
41644c35363J45891K01938r1175l30917j71363P3877o751k03005p3771K60792
41634e29847L29119J28622J05013L52527M35318R4793l69371n65907m53504j90683
41624f63920Q8658K28792J21090o0033K470K95303M49589K75583M749r9362n0612
41613E92307N2362K10833L75853L87981J99801o3335l12855n07701m71314o9130
41603C94802M04009M43314K9986l28866l56574l06947l52394k36566J67256M79388
41593C37408L84056J26105L5554q792k01437l30878j90530o5954k31499l33475
41583d79442M1077M78451K26257n56540q80646l40001L31128L54428r8646l59039
41573a282973j97996R0310K18184J61406P1436J54761M83002Q10301P82893L94150
$$ y = [-335363, -189472, 12466, -78709, -409626, -580989, -507112, -513863, -716868, -790639, -529847, -200728, -72106, 32907, 385434, 820752, 915545, 546174, -19733, -473237, -663920, -575262, -346470, -225380, -285413, -282943, 12360, 461949, 737532, 742281, 642919, 592307, 644669, 855502, 1231355, 1619336, 1819137, 1755802, 1442947, 935246, 463932, 394802, 798811, 1242125, 1272111, 943245, 586671, 279724, -72670, -309236, -141980, 337408, 721464, 847569, 883123, 874331, 672894, 342016, 151486, 85532, -145967, -479442, -438365, 40086, 266343, -290197, -1170843, -1510844, -1179716, -825288, -923934, -1282973, -1480969, -1390659, -1172475, -1011069, -939633, -784872, -301870, 508431, 1291324, 1685474]
41563A685474k5245l02512n53493p41312n50793O2868N93689N83019K13675j7103
41553I48267L1022J45645K23455L20179L46719J24693k44932m09007k31548J8859
41543A273352L5479j70010l61751l71778k04789L6511K31993K92375J86631o3266
41533H84747l74138n66571m42090j8595L72586L96703J30426q745J84377L96086
41523I54786K07131k97994n90417l96281p1474r0145l58843l70457Q344L05446
41513f99904J43163j95767k07677R1484K78110K32808K53089M31381M18372J6829
41503G61888l92630l50234K1808K24366J02401j9301J00061K73975K21147j4325
41493I29156j64190j36101j19356k86560n25147n56687k86926O8250K44490K24018
$$ y = [1685474, 1660229, 1357717, 804224, 62912, -487881, -425013, 168676, 751695, 965370, 948267, 979289, 1124934, 1348389, 1668568, 2015287, 2139980, 1895048, 1486041, 1254493, 1273352, 1308831, 1138821, 777070, 405292, 200503, 237014, 469007, 761382, 948013, 884747, 510609, -55962, -498052, -516647, -144061, 252642, 383068, 374323, 558700, 954786, 1161917, 863923, 273506, -122775, -194249, -284394, -643237, -1013694, -1005350, -699904, -556741, -752508, -960185, -868701, -590591, -357783, -104694, 326687, 745059, 761888, 369258, 19024, 40832, 265198, 367599, 348298, 448359, 722334, 943481, 929156, 764966, 628865, 509509, 222949, -302198, -858885, -1145811, -1077561, -833071, -609053]
41483f09053J80427K08496K54304K74847K84491K26297j0994l70717n83110m49980
41473e94992p0943K82921M13219K78327j833j65260k7511K27830K03720j35335
41463D10143l17620k3351L92503M03096J22087J16342M62969N54844J2868o92201
41453A441680q51729m14644J00154L46378L80168K76838j519l05012k97307M5006
41443G20013K58952j1369m73305n49129j53382K25937J97484j02393l06713k58003
41433d51908l0937K33922L49956J47757k76730n38766m01237r3537K6036k5060
41423a060504K7049J99856K13817l4105k75422k15823J57185O29503Q90044O50087
41413A181687l8676o00642m73785J20408L93641P9824k30016p4943J56010m5389
$$ y = [-609053, -428626, -220130, 34174, 309021, 593512, 819809, 808815, 438098, -145012, -594992, -665935, -383014, 30205, 308532, 306699, 141439, 113928, 341758, 545478, 410143, 92523, 69172, 461675, 864771, 986858, 1103200, 1566169, 2121013, 2133881, 1441680, 589951, 175307, 275461, 621839, 1002007, 1278845, 1277326, 972314, 675007, 720013, 978965, 967596, 494291, -54838, -208220, 17717, 215201, 112808, -193905, -451908, -482845, -248923, 101033, 248790, -27940, -566706, -967943, -1061480, -1035444, -1060504, -1033455, -833599, -619782, -653887, -929309, -1145132, -987947, -358444, 531600, 1181687, 1143011, 542369, 68584, 188992, 582633, 662457, 432441, 357498, 513508, 468119]
41403D68119l83935k42871K40270L49072o3855l64286j61319J44402Q0739j99179
41393a32843k79490j07564J10983L17235N16953N22016J66621l19027m89664k31691
41383G3529J18072K17880Q8488k0634J0931O6996J8347o7087m4147L3575l9061
41372D56889k49436l05505j01734M4549r2612j93411J06688M99139L81036j48274
41362C97329l55116J264L29050K12674L4977J86851L24836M758m64191m85362
41352A87070j41889J0550j01018l7979K94376M40584J21303l72765o21016m93629
41342g14413r2500L31488M03580p869m43802l10774L01061P06833N52631J64198
41332H90433q0595j97923k83251k58417j24381k6124Q5317L90312O75773M44975
$$ y = [468119, 84184, -158687, 81583, 430655, 366800, 2514, -158805, -14403, 66336, -132843, -412333, -519897, -408914, -91679, 425274, 947290, 1113911, 794884, 305220, 73529, 191601, 409481, 497969, 477335, 488266, 555262, 573609, 506522, 462375, 495950, 456889, 207453, -98052, -199786, -155237, -247849, -441260, -334572, 164567, 545603, 397329, 42213, 43477, 372527, 585201, 620178, 807029, 1131865, 1136623, 672432, 187070, 45181, 55731, -45287, -83266, 211110, 651694, 772997, 400232, -220784, -714413, -806913, -475425, -71845, -79714, -523516, -834290, -533229, 173604, 726235, 890433, 809838, 611915, 328664, 70247, -54134, -80258, 5059, 395371, 1071144, 1516119]
41322A516119k32956o09595l33455p105j95546m98178k72209K19956K11306k93004
41312d94667m98552n0560M87781N18069J45672j66536j97179o211K46716L36030
41302C20563J20653k04700k73529m5132J34957L2900k03485l33910k89691q4814
41292h26188K30239M42873L12366o3191k91311j91099J7537J00993P7039M314
41282a86428j48863k89501k02156N5255J03745j81865l87438j43827K93756M06505
41272f80817J51368l7065J03367L43379L07736o9815m66889m76755n3942L38164
41262e41269K15925k63955m38980l9896M35867M83647K98749L13781L94491Q4765
41252I43125n20330p88111m75082p4671n8817k26368q8067L94494P65339O68682
$$ y = [1516119, 1283163, 673568, 340113, 333008, 137462, -360716, -632925, -412969, -201663, -494667, -993219, -1043779, -555998, -37929, 107743, -58793, -255972, -262183, -15467, 320563, 441216, 236516, -37013, -82145, 52812, 85712, -117773, -451683, -741374, -826188, -595949, -153076, 159290, 96099, -195212, -386311, -368774, -267781, -190742, -186428, -335291, -624792, -826948, -771693, -667948, -849813, -1237251, -1381078, -1087322, -680817, -529449, -566514, -463147, -119768, 187968, 118153, -348736, -825491, -879433, -541269, -325344, -589299, -1028279, -1068175, -632308, -148661, 150088, 463869, 858360, 943125, 422795, -365316, -840398, -915069, -973886, -1200254, -1288321, -893827, -128488, 540194]
41242E40194K73522O9898K72514M87376J56035o08238r61106m00853M19218M72564
41232G21124k29582o71935k94025L07280L79944M6687j25790n9822p2632j73347
41222a72098q4602J60717K14644M963j52500r0231q299m3097o51K81895N85784
41211F96525N50370J18611m19370p31438o89973m12720j50899o9211q6513k701
41201a197319K10269L60607L03840J23535j0515l8984J2241J45874L68384N95503
41191H73435O72730M99711J26286k49818m05774k91561r8699m4465j03633q1784
41181H96428M9316Q0144r6333k67728j94874J7387O9432p1362j11929J19867L97132
41170H87480L94656J15085j56898k49170k64082l37266l99226k77183K9595K80987
$$ y = [540194, 813716, 883614, 1156128, 1643504, 1799539, 1191301, 230195, -170658, 248560, 721124, 491542, -180393, -474418, -167138, 212806, 259493, 133703, 73881, 1249, -172098, -256700, -95983, 118661, 123624, -28876, -119107, -127406, -170503, -171154, 110741, 696525, 1246895, 1365506, 946136, 214698, -475275, -887995, -1038894, -1108105, -1194618, -1197319, -987050, -626443, -322603, -199068, -209583, -248567, -236326, -90452, 277932, 873435, 1546165, 2045876, 2172162, 1922344, 1516570, 1225009, 1126310, 1081845, 978212, 896428, 945744, 1025888, 929555, 661827, 466953, 484340, 553772, 482410, 370481, 490348, 887480, 1282136, 1397221, 1240323, 991153, 727071, 389805, -9421, -286604, -257009, 23978]
41160B3978K32813q7304l81182l78925j10719J66841K83611K82727K27808O7328
41150C26976j83161k94755r6456K00806K36452L0594m3508J39344K57708J03308
41140F77308m7066Q5311K61424J04376k34003k78980J756J54931k3929k14573
41130D86555j43540L0265R2264J24721K30917K47636J8776k98963m57302m19450
41120h8121k37026J03978M76095N43318K04925j56628k00033j33105l08908n66999
41110c62504m73876p4344J41513J2093p2934J72315M98499N31467K80197K8004
41100F80430o0971n4791j07970k95217n01873m99954k51707k7945k5813k7116
41090a172927K50041O01000N60847J33805j63945l8664K35751K95267J03089k00593
$$ y = [23978, 256791, 169487, -211695, -590620, -701339, -534498, -250887, 31840, 259648, 326976, 143815, -150940, -247396, -46590, 189862, 220456, 176948, 316292, 574000, 677308, 630242, 715553, 976977, 1081353, 847350, 568370, 570126, 725057, 701128, 486555, 343015, 373280, 465544, 590265, 821182, 1068818, 1087594, 788631, 331329, -88121, -325147, -221169, 254926, 798244, 1003169, 846541, 646508, 513403, 204495, -362504, -836380, -910724, -769211, -757118, -830052, -657737, -159238, 372229, 652426, 680430, 619459, 564668, 456698, 161481, -340392, -840346, -1092053, -1119998, -1145811, -1172927, -922886, -321886, 238961, 372766, 208821, 170157, 405908, 701175, 804264, 603671]
41080F03671m57779m19880K7344M57376K40491n23542r54662n53326J30167L52703
41070a097437J70996R6296K26434L03286K90555K95707J68129k39261o02771m97271
41060h85337q0584J48585J31568K04747L94751L96638K17023J92794L29840K52549
41050A302574r2556k98227k06518j56277l26512m24656k87058k15104l79281m18969
41040a502584m1356M30439N35441L17179P1472j66883m16310l83485J23744O48657
41030c83686N48292q3419m97759k90486J70018L64734K26496p45j31741j01713
41020a80009O8249K14442J44718q1436j84738p4833j0667k04001m51726l84865
41010a144866M77K94087J87400j44843l01328j78827l9890o6463r5734O8888L12788
$$ y = [603671, 145892, -273988, -246644, 210732, 451223, -72319, -1026981, -1580307, -1450140, -1097437, -926441, -830145, -603711, -300425, -9870, 285837, 453966, 214705, -388066, -885337, -965921, -817336, -685768, -481021, -86270, 310368, 527391, 720185, 1050025, 1302574, 1210018, 911791, 705273, 548996, 222484, -202172, -489230, -704334, -1083615, -1502584, -1543940, -1113501, -578060, -260881, -189409, -356292, -772602, -1156087, -1032343, -383686, 164606, 81187, -416572, -707058, -537040, -172306, 54190, 53445, -78296, -180009, -111760, 102682, 247400, 165964, -18774, -93607, -104274, -308275, -760001, -1144866, -1144389, -850302, -662902, -807745, -1109073, -1287900, -1327790, -1394253, -1489987, -1421099, -1108311]
40999a108311M19382M44611N48863N75983K31484l27684n61536l23041r0909k06007
40989c97165l37068n5236M38287N89683K55499k08323m42931l35424L6482L77574
40979g8622K97149k04012n85638m48018q9028J8360k0438J66045M35787L47777
40969a60638o055j28465l4399k50729p93825r43524l27333M55714O75630L76168
40959a137456N6242m9644K9529K70793N11734M35142Q9762R792L92688O10765
40949A219347R3745o91355q15824k10700K99099K14069q2310r2792P7890N1623
40939F2792j94348l56071k62013m9220O2584L9061N9173K72075N40664N53115
40929G27812K40406j02333k27670k54321l90111n55078n34487l30579q8745J68160
$$ y = [-1108311, -688929, -244318, 304545, 880528, 1112012, 784328, 222792, -100249, -191158, -397165, -734233, -789469, -351182, 238501, 494000, 285677, -157254, -492678, -456196, -78622, 218527, 14515, -571123, -1019141, -1108169, -1089809, -1110247, -944202, -508415, -160638, -166693, -295158, -329557, -580286, -1374111, -2317635, -2644968, -2189254, -1513624, -1137456, -1081214, -1130858, -1101329, -830536, -318802, 116340, 206102, 215894, 608582, 1219347, 1313092, 621737, -194087, -404787, -105688, 108381, 26071, -66721, 11169, 62792, -131556, -487627, -749640, -798860, -736276, -697215, -638042, -365967, 174697, 727812, 968218, 865885, 638215, 383894, -6217, -561295, -1095782, -1426361, -1515106, -1346946]
40919a346946M41673N46779L29618r702j37503m4264L1342K9851O1219N0471j88888
40908b36350n21648n40197j38601K98700L94162J93094q083p231K05127M69765
40898A08738N17343K02220k79742n78564n80016m24198k16591J0306J16017l0499
40888a154986k55901k36746K9265K34742K69014L44973N40984N97995L46985K5166
40878G41491n4356O2321O6705j95330n29571n64525j22291N01416P36009L72832
40868A014701j49065l06470j26844M2709J31472K56020K74252P670k56686j40147
40858G47612P2937j90153p12828o70062J0876M22308R1115l30893k31997L6492
40848g54593L285l5771K64995M69805J32258k44975J0510N09242L74437l09941
$$ y = [-1346946, -905273, -358494, -28876, -38578, -176081, -220345, -189003, -159152, -97933, -47462, -236350, -757998, -1298195, -1436796, -1138096, -743934, -550840, -558923, -566154, -361027, 108738, 626081, 828301, 548559, -30005, -610021, -1034219, -1250810, -1240504, -1124487, -1154986, -1410887, -1647633, -1618368, -1383626, -1114612, -769639, -228655, 369340, 716325, 741491, 687135, 749456, 816161, 620831, 91260, -473265, -595556, -94140, 641869, 1014701, 865636, 559166, 432322, 475031, 606503, 862523, 1136775, 1144445, 887759, 747612, 820549, 630396, -82432, -752494, -741618, -319310, -228195, -559088, -791085, -754593, -751308, -787079, -522084, -52279, 79979, -164996, -154486, 354756, 729193, 419252]
40838D19252o68050m27394j20075o152J87743M52649L97061O9469j3451J97417
40828D88469J79082j62112k62033N9539J87817k48087o75596m26344K84461P15640
40818A40836N20960o6810n98796o67619j87072L50324L06357k22451m38720L7908
40808h25083O36573O96557K99953j10998m04485o13641n96589l15724p8339o8395
40798a380171O268L97716Q15813Q58723N99479L33897R0741j91087l49545l04403
40788H77431l38526o30017q43915o52381l09564k05363k02536J4870K65775J88934
40778a835292k2634J12564N27320P03329N03005K56426R2683j52607l80392k53259
40768d48857J47361L10385O9322j72642j33154l4257j17661k57102k59217j51905
$$ y = [419252, -248798, -676192, -796267, -802419, -614676, -162027, 235034, 304503, 291052, 488469, 667551, 505439, 243406, 302945, 490762, 242675, -432921, -859265, -574804, 140836, 661796, 594986, -3810, -671429, -858501, -508177, -201820, -424271, -862991, -825083, -188510, 508047, 808000, 697002, 292517, -321124, -917713, -1233437, -1311776, -1380171, -1373903, -976187, -160374, 698349, 1297828, 1631725, 1722466, 1531379, 1181834, 877431, 538905, -91112, -935027, -1587408, -1896972, -2102335, -2304871, -2290001, -2024226, -1835292, -1857926, -1745362, -1218042, -514713, -11708, 244718, 337401, 184794, -195598, -448857, -301496, 8889, 78211, -94431, -227585, -261842, -379503, -636605, -895822, -1047727]
40758a047727k723J92986L25478K33035L1722J030R1593p923k48131j84850K71443
40747c44067N93286L79564r3413l51510l46690k91063k27667j05172o930n170
40737g98832p554L0204j1186j26142p4741K30102N29732O19559O05864N50642
40727A547648K67116k28181m79938k18769J47138J29887q4367k2390K17160J41705
40717A417009k38370l82840j23767N5382j82155n05393m61094r9527K47734M60377
40707A87356N67837M68293P8892l71843n22607l02246M5685K90852L64894K66898
40697A074011N9165q0688l7410K4297j40482m31645m60956j18390K12772J87951
40687B88625k0304m7090Q8454J08983M7106K19267O06686P33428L36025k41638
$$ y = [-1047727, -1050450, -857464, -531986, -298951, -267229, -266199, -174606, -182529, -430660, -615510, -344067, 249219, 628783, 535370, 183860, -162830, -453893, -681560, -786732, -793662, -798832, -806386, -776182, -787368, -913510, -988251, -758149, -228417, 391142, 997006, 1547648, 1814764, 1586583, 1106645, 887876, 1035014, 1164901, 1080534, 1058144, 1275304, 1417009, 1178639, 795799, 672032, 727414, 545259, 39866, -421228, -520755, -273021, 187356, 755193, 1223486, 1302378, 930535, 407928, 105682, 151367, 442219, 807113, 1074011, 1133176, 1052488, 1015078, 1039375, 898893, 467248, 6292, -112098, 100674, 288625, 268321, 221231, 309685, 418668, 465774, 685041, 1291727, 2025155, 2361180, 2119542]
40677B119542n54721o01177n78600m47228j20416J74013J58143l4103o5499P7331
40667A27285J73749K37574M26674N82934L71746j40723n35473o48569o26341m13878
40657d45022J76023Q11067P70211q322o55999n20938j1287J40099q4815k24745
40647e3728j73257j52284j30817J08366M44101M86085J28815l50112o63160o63501
40637a019492k94060K44407M57443J10929l22440k05297L88938P87843O30057
40628G78328K10831n9777j10189p7844q4916j96248l43304l20881r1985M0677
40618b55308j40088l63846k75836k8121K1235J1743L64924R31289J032495M64136
40608A762623j57095k52940K7424K06357J16140j00099k51091j57389K25291O10824
$$ y = [2119542, 1564821, 963644, 385044, -62184, -182600, -8587, 149556, 115453, 49954, 127285, 301034, 538608, 965282, 1548216, 1919962, 1779239, 1243766, 595197, -31144, -445022, -268999, 542068, 1312279, 1303957, 647958, 127020, 115733, 255832, 171017, -53728, -226985, -379269, -510086, -401720, 42381, 528466, 657281, 307169, -355991, -1019492, -1313552, -1069145, -611702, -500773, -823213, -1028510, -639572, 148271, 778328, 989159, 929382, 819193, 741349, 656433, 460185, 116881, -204000, -295985, -255308, -395396, -759242, -1035078, -1063199, -1041964, -1030221, -665297, 265992, 1298487, 1762623, 1605528, 1352588, 1380012, 1586369, 1702509, 1602410, 1351319, 1193930, 1419221, 2030045]
40598B030045O45652M22652L20411L10772j7836o42087r48096o33918j42785J13852
40588A458662L15209O00691N56616o4586o76418o20490j72661m8523k48960k08844
40578H90696J22578K14908o6899k40626o9233Q7231k2524j31038q518J25600M2195
40567I44370j09368j39572j36827j75107r8310J12744J39409j71087m39850k75832
40557c49430J13833K42262O2979o6062j8348m0343k37739l20510j5294N03505
40547a25147P62547M95617o0855l56935o4646N21224P29172K68805l93600n95657
40537A180525k84154L086j01528l68714l70059l2529L45898M54139K04278k42250
40527G88692n34511l37268L29930R77285J021655L39623n91462j118423r77216
$$ y = [2030045, 2675697, 3098349, 3418760, 3729532, 3711696, 3069609, 2121513, 1487595, 1344810, 1458662, 1773871, 2374562, 2931178, 2866592, 2190174, 1569684, 1397023, 1348500, 1099540, 890696, 1013274, 1228182, 1161283, 920657, 851424, 938655, 916131, 785093, 776575, 902175, 944370, 835002, 695430, 558603, 383496, 285186, 397930, 537339, 366252, -73598, -349430, -235597, 6665, 69644, 3582, -14766, -55109, -292848, -613358, -628652, -125147, 637400, 1133017, 1072162, 715227, 650581, 1171805, 1900977, 2169782, 1776182, 1180525, 896371, 899457, 797929, 429215, 59156, 26627, 372525, 826664, 1030942, 788692, 254181, -83087, 246843, 1224128, 2245783, 2585406, 1993944, 875521, -101695]
40518a01695m68004r6423n3778j01104K2246K31511K98505K74145L87313N48413
40508I41129L72948j49435m35157q3330M76129N63854K29662Q9735L06402L81861
40498B693798N2711k51107j18693K00418K48679M5969r6759j29245j85907k03025
40488B256839o7659K1017k10183o11075p61622n45460j91171J54856M78433O08976
40478A132951L52860r4293l12607k38931j45938o7853K21106O09226O20038J53893
40468B230452l04566m49356n51351p80979p34273j32066N05765N12792P5669p8896
40458B93191J92179L22793J5857l09347k15480J29832L03589K36632J59167J47584
40448A275997M2121k19448m17307k91020J08816M15740L35723k5833l07513k93389
$$ y = [-101695, -569699, -666122, -719900, -821004, -798758, -567247, -268742, 5403, 392716, 941129, 1314077, 1164642, 729485, 646155, 1122284, 1686138, 1915800, 2005535, 2311937, 2693798, 2746509, 2495402, 2376709, 2577127, 2825806, 2871775, 2775016, 2645771, 2459864, 2256839, 2189180, 2210197, 2000014, 1388939, 627317, 81857, -109314, 45542, 523975, 1132951, 1485811, 1391518, 1078911, 839980, 694042, 626189, 847295, 1456521, 2076559, 2230452, 1925886, 1476530, 925179, 144200, -590073, -722139, -216374, 296418, 372087, 293191, 485370, 808163, 824020, 514673, 299193, 429025, 732614, 969246, 1128413, 1275997, 1318118, 1098670, 681363, 390343, 499159, 914899, 1250622, 1224789, 917276, 623887]
40438F23887m0993K96784N45882M77185L2280m11350l91300m3070K7632k99338
40428H17599l94496R5515N39700K15668n34263p68831l17531J02454P0933l6530
40418b09782J27182K95584J60883l5925Q0769L78013M02658K3038m38693o13620
40408A70107m13504l5271K22053K15180Q9575O8103J36834J13004k1262j04118
40398D40701r7434j15606j35864k493K16803K16168p8300l23582k02570J92111
40388A09934N43096O38554M23757K520k99801j75366K23143L84869J40254q3323
40378A907637Q4809M10003M64938K77386J79821K31672K08659N7073l7543j7378
40368C767077n5118k50874m73519n49164m31335j73274J09115K44425J27883j34903
$$ y = [623887, 582894, 879678, 1425560, 1902745, 1935025, 1523675, 1132375, 1089305, 1116937, 817599, 423103, 518618, 1058318, 1273986, 739723, -29108, -346639, -244185, -173252, -209782, -82600, 212984, 373867, 337942, 418711, 796724, 1199382, 1222420, 783727, 170107, -243397, -278668, -56615, 158565, 248140, 316243, 453077, 566081, 544819, 440701, 343267, 227661, 91797, 89304, 306107, 522275, 443975, 120393, -82177, 109934, 653030, 1291584, 1715341, 1717861, 1418060, 1242694, 1465837, 1850706, 1990960, 1907637, 1992446, 2402449, 2867387, 3144773, 3324594, 3556266, 3764925, 3821998, 3784455, 3767077, 3711959, 3461085, 2987566, 2438402, 2007067, 1833793, 1942908, 2187333, 2315216, 2180313]
40358B180313l00339k19694L3262K29984J73231r4439k65786r3740K54710L67627
40348B265129J31297j60268k99201m22456o09549n96317k03581K49343L45797
40339G00194J63559N2838J4035k08119n06246m44134L1865M39496M83808M43750
40329A171046N68925N55154O3328n56627o15625o1638M35215M38061K65397L24192
40319B587428L95022M6964n13630o11449j12956L10980J36412k96979l74933j14157
40309A452702J0810j06651j24436P1578J72076J7208j12780L8328L17476M35924
40299B172235L39791J45610l5868q3603O7786K43976J85144m5572j33772n6203
40289B799524j30699l90639l97486N1269M86036M18152N7934n1503J59080K87217
$$ y = [2180313, 1879974, 1660280, 1693542, 1923526, 2096757, 2002318, 1736532, 1642792, 1897502, 2265129, 2396426, 2236158, 1936957, 1514501, 904952, 308635, 105054, 354397, 700194, 863753, 916591, 930626, 722507, 216261, -227873, -196008, 243488, 727296, 1171046, 1739971, 2295125, 2358453, 1801826, 1186201, 1124563, 1559778, 1997839, 2263236, 2587428, 2982450, 3029414, 2515784, 1904335, 1791379, 2102359, 2238771, 1941792, 1566859, 1452702, 1463512, 1356861, 1232425, 1304003, 1476079, 1493287, 1380507, 1418835, 1736311, 2172235, 2512026, 2657636, 2621768, 2538165, 2605951, 2849927, 3035071, 2989499, 2855727, 2799524, 2668825, 2278186, 1880700, 1931969, 2418005, 2836157, 2894091, 2842588, 3001668, 3288885]
40279C288885R1020k72288n20830m52754j4825N55082P99367N04871m4837m49792
40269C483899n95694n20563k26578J26036J95495o6320k50212q5339J93343L70823
40259B624890O45048J068402J123710M51497m11310o47505j98506L76514P33792
40250E766532Q70705Q00431O95021R53450J547614J805571J472945J335216K005853
40241A7253338K873029L256113L756004N170826O963474Q462661J0748972J5253322
40233G3737739K1101395K6287287L0913032L5946604L8611952L3241988J8831564
40226B78671561K394830q195029j2389003j4970718j8154317j9839339j8837024
40219A88680961j7317599j7164572j7334079j6322199j4715844j3683256j2857829
$$ y = [3288885, 3379905, 3107617, 2586787, 2134033, 2119208, 2674290, 3473657, 3978528, 3933691, 3483899, 2888205, 2367642, 2141064, 2267100, 2462595, 2396275, 2146063, 2060724, 2254067, 2624890, 3269938, 4338340, 5462050, 5913547, 5502237, 4854732, 4656226, 5032740, 5766532, 6637237, 7437668, 8132689, 9086139, 10633753, 12439324, 13912269, 15247485, 17253338, 20126367, 23382480, 27138484, 32309310, 39272784, 47735445, 58484417, 73737739, 94839134, 121126421, 152039453, 187986057, 226598009, 259839997, 278671561, 281066391, 272871362, 260482359, 245511641, 227357324, 207517985, 188680961, 171363362, 154198790, 136864711, 120542512, 105826668, 92143412, 79285583]
40212G9285583j1357821r524004q167978p137987n912739m748856m085264l566564
40204B4784370k732489k007293j969813k215110j950299j263283q39908p77507
40196A1028668n97551k07558j5882j87026m45777n66514n76262n70823o58249
40187G203026q74014r31359m59994K70557M53632p3259m53142j37966J80546k70513
40177D907514r81969r63920l68129j53488m36310l91424K39815P01389M64307
40168C017785p6633m09124n27144m55126Q259O71285Q15733J63063o09336p67608
40158A831154m24244j15137K4095J69802L14422L77266N09652Q13924J010556
40149D511490Q37328N46624N26490O11442L00680m00666q80386p33236k43029
$$ y = [79285583, 67927762, 58403758, 50235780, 43097793, 37185054, 32436198, 28350934, 24784370, 22051881, 20044588, 18074775, 15859665, 13909366, 12646083, 11806175, 11028668, 10431117, 10223559, 10207677, 10020651, 9574874, 9008360, 8432098, 7861275, 7203026, 6329012, 5397653, 4937659, 5208216, 5661848, 5588589, 5135447, 4997481, 5178027, 4907514, 3925545, 2961625, 2593496, 2440008, 2003698, 1612274, 1852089, 2553478, 3017785, 2941152, 2532028, 2004884, 1549758, 1558017, 2229302, 3045035, 3208098, 2598762, 1831154, 1406910, 1291773, 1315868, 1485670, 1800092, 2177358, 2687010, 3500934, 4511490, 5348818, 5895442, 6421932, 7033374, 7334054, 6933388, 6053002, 5319766, 5076737]
40140E076737R3351J58213J07045m8588m26692r28896j204836j041155o20002
40131A165177k83068j47829r4560m9187n9268p8915O2013L42188M35434J38706
40121A430691k60643l29255r0300L8794j26583l11956k35235K3543K20624K73227
40111F32907K48360K03425J52647O3954j57877n27439q01763o70191j86796K11901
40101h30872K24343J8731n7421R4012L16337M55192M74179M15710L43016K52870
40091A706097N1512k53192m01585j70767K18812L07004L3313j82717p4387J52393
40081A386483K58971K94903K69640k4006n23265o79795j90760M08370M01295j22962
40071A478874m78343l66486q6581Q7193J44085M3313k12162k66386J73574O32462
$$ y = [5076737, 5170088, 5328301, 5435346, 5386758, 4960066, 4031170, 2826334, 1785179, 1165177, 882109, 734280, 639720, 590533, 531265, 452350, 514363, 856551, 1291985, 1430691, 1170048, 840793, 750493, 789287, 662704, 350748, 115513, 139056, 359680, 632907, 881267, 1084692, 1237339, 1301293, 1143416, 615977, -185786, -855977, -1042773, -830872, -606529, -587798, -645219, -551207, -234870, 220322, 694501, 1110211, 1453227, 1706097, 1757609, 1504417, 1102832, 932065, 1150877, 1457881, 1491194, 1308477, 1234090, 1386483, 1645454, 1940357, 2209997, 2185991, 1662726, 982931, 792171, 1200541, 1601836, 1478874, 1000531, 634045, 547464, 634657, 778742, 822055, 609893, 343507, 517081, 1149543]
40061A149543L32122n36711q52220j82722M83790J99852m99255m32916M37506
40052I8989J004883O27933j49903n65673n46894m07561k42186O245K40069L00790
40042C66692J82085k7636k38625l13999j64873L6285M971k15004k63463k0193
40032f53760J91140J18490n3901r3456j23283l06230m20506j72730K45124L53978
40022i15134P5293j83794j31045Q6118J93747J12054q6721k55323j71081K39301
40012a036585O25313M97664r8976n20207k98463K95497O59290N66429K40989m5032
40002H85919j79642j68959j33666k37250m29087m09271m9995L30390L68280J54821
39992A31540L1973M7190j6428j63867j65925j0180M9148l3709J7313K91184M59326
$$ y = [1149543, 1481665, 944954, 92734, -89988, 393802, 593654, 94399, -338517, 98989, 1103872, 1731805, 1581902, 1016229, 469335, 61774, -180412, -174167, 65902, 366692, 548777, 521141, 282516, -31483, -196356, -160071, -155100, -370104, -633567, -653760, -462620, -344130, -398031, -491487, -614770, -921000, -1341506, -1514236, -1269112, -915134, -839841, -1023635, -1154680, -1068562, -874815, -762761, -849482, -1104805, -1275886, -1036585, -411272, 86392, -12584, -532791, -831254, -535757, 123533, 689962, 930951, 885919, 706277, 537318, 403652, 166402, -262685, -671956, -721951, -391561, -23281, 131540, 163513, 210703, 194275, 30408, -135517, -145697, -96549, -130258, -112945, 178239, 637565]
39981F37565K85603K7659K8163J73751J20833j11197j70262M3700J97752K5213
39971A258780k70421k91008J2782K62507J20634k84594n01260l04225L2353J12191
39961A47739o0086j55280o4723m0763j89807j71057L00640Q69298Q60668J75878
39951A672507n00882n19036l0910K59254k0459n15046o44950l03457J02314K31918
39941b68747J99650K74722L91076K30519k41992o26831n77879k16402Q4335J44719
39931f06830N1446n6841r5697l6943L8949q344j53701j67905N2774K79526K58354
39920d45212P1858j9870L7430J03879J23876J42541J30599L1207r3544j72331
39910h9567k67213l87479l24449M1311M25955M71006K48198P9585J0380j14609
$$ y = [637565, 923168, 950827, 978990, 1152741, 1273574, 1162377, 992115, 1035815, 1233567, 1258780, 988359, 697351, 710133, 972640, 1093274, 808680, 307420, 3195, 35548, 147739, 87653, -67627, -132350, -173113, -362920, -533977, -233337, 635961, 1496629, 1672507, 1171625, 652589, 621679, 880933, 860474, 345428, -299522, -602979, -500665, -268747, -69097, 205625, 596701, 827220, 585228, -41603, -619482, -835884, -751549, -606830, -555384, -612225, -707922, -744865, -705916, -714260, -867961, -1035866, -983092, -703566, -445212, -373354, -393224, -355794, -251915, -128039, 14502, 145101, 176308, 82764, -89567, -356780, -744259, -1068708, -1027397, -601442, -130436, 117762, 197347, 207727, 93118]
39900I3118j99408l4836K10218K03608R1890K75116N50777K71448m87938p81763
39890A92230j94031M32983K46458l64753n09288k02238j41941m30082m53476L9709
39880a384429N62143O45633L36180j15781m91862n15407r0105L38925K10991l31068
39870h34780n94173l24469N1937K17040L21016M24435K85539l6796l9776M04027
39860a26000O94020L92708q7833j77650k3420j04238l77433m23780j73439R7749
39850c09316K99888N09486N81124L20983o0826j83879r5195j37058l10548l07857
39840C06802j29180r6537k35662k28328n9659r9087l59789l15055K13282N73853
39830d29360J97570m56761m87497J69677O96232N70508J70866O1636K03927J90994
$$ y = [93118, -106290, -141126, 69092, 272700, 364590, 639706, 1190483, 1461931, 973993, 192230, -1801, 431182, 677640, 312887, -196401, -398639, -540580, -970662, -1424138, -1384429, -822286, -176653, 159527, 43746, -448116, -963523, -1053628, -714703, -503712, -834780, -1428953, -1753422, -1701485, -1484445, -1163429, -738994, -453455, -490251, -530027, -126000, 568020, 960728, 872895, 695245, 671825, 567587, 190154, -233626, -407065, -309316, -9428, 500058, 1081182, 1402165, 1341339, 1157460, 1062265, 925207, 614659, 306802, 177622, 81085, -154577, -382905, -442564, -541651, -901440, -1216495, -1003213, -429360, -231790, -688551, -1176048, -1006371, -310139, 260369, 431235, 492871, 696798, 887792]
39820H87792o7637k77985k44179q7719J2759M9583Q8786J21648J13399R4059J01235
39809G91741R1118p896j79583l14061k98988j05447J53270K44521K7908l08749
39799I3834m00404j97427q4629l00555m83663j67478M40582O76825L96826J73246
39789A47157L76133O18475M33327J2817j74221j32840k02454m11024m77612l11486
39779a21728m3626L05554P16307Q56542M21725k56217n01856k38988q1489l63953
39769F92271o44106m19291J38284M87451M09747Q3698k60747m68820m37075k07654
39759f26242L6363J85206K48857J75932p1845k31136N4918O02222P25783J72437
39749A272495m32893m29955j7916J26418j86715n52773o20718l92710k2223K73964
$$ y = [887792, 820155, 542170, 297991, 210272, 223031, 272614, 361400, 483048, 596447, 690506, 791741, 882859, 874963, 695380, 381319, 82331, -23116, 130154, 374675, 402583, 93834, -306570, -503997, -588626, -889181, -1372844, -1540322, -1099740, -422915, -26089, 147157, 523290, 1141765, 1575092, 1587909, 1413688, 1280848, 1078394, 667370, 189758, -121728, -165354, 140200, 856507, 1713049, 2134774, 1878557, 1376701, 1137713, 1056224, 692271, 48165, -371126, -232842, 254609, 664356, 748054, 487307, 18487, -418588, -626242, -589879, -404673, -155816, 20116, -51729, -282865, -227947, 374275, 1100058, 1272495, 839602, 409647, 391731, 518149, 331434, -221339, -842057, -1234767, -1256990, -983026]
39739i83026K33038j28334l35076n057N40789O51788K47769j07737j8678K93811
39729C89287M00725J56130k79887o06827n52315j47799K01934K01318R4040K45199
39719A01805M56231K31614l22409m93548R863O06160O58728K53092j36631l22854
39709A042051l99520m03094l30449k55316j55316J32238N48458P00682L90054
39700A269788k9126j21955N1822J48483P7191j2735n4727k5685J92430N31333
39690B026819N44690l7119p22027p53912j46696L08581J17447l60243n80469n39859
39680a42788n17011m71582j47786L66185O07540L42997p2420j19055K25198M65878
39670E37156K65422r3398j29003J08422J07359k77010n14157j71214L81576M53574
$$ y = [-983026, -749988, -878322, -1213398, -1218455, -677666, -25878, 221891, 114154, 95476, 389287, 790012, 946142, 666255, 59428, -492887, -640686, -438752, -237434, -143394, 101805, 558036, 789650, 467241, -26307, -16444, 589716, 1248444, 1501536, 1364905, 1042051, 642531, 239437, -91012, -346328, -501644, -369406, 179052, 879734, 1269788, 1240662, 1118707, 1170529, 1319012, 1396203, 1383468, 1328741, 1303056, 1495486, 2026819, 2571509, 2534390, 1812363, 1058451, 911755, 1220336, 1337783, 977540, 397071, -142788, -659799, -1131381, -1279167, -912982, -305442, 37555, -34865, -153920, 71278, 537156, 802578, 709180, 580177, 688599, 795958, 518948, 4791, -166423, 215153, 668727]
39660F68727j396l66510k25370J93272M40273L30992m0664m34090n47200k65132
39650b47098J35151K99132K82502L80417N18872L01848k57505n78987l15430J49516
39640F68418K95901J47247J3724o2784j86684k33467n6858J37239P2089j04989
39630F89836n3157J68201K01348j205j53339j78478k60902l34321q6283L74216
39620C65916M16312k26417r16847q70269j42832N48127P59284O27773L80233L6375
39610I77655l43474n27595m08726j77482l4816Q1807L15045N64955N50427J75840
39600A173636l00626n08854l36483l2053P2800n5274j14185J16192M06028L25268
39590G46449j29676m29659k04997J93185J50493l07739n03208o8557N16279O17047
$$ y = [668727, 667331, 300821, 75451, 268723, 708996, 1039988, 999324, 565234, 18034, -247098, -111947, 187185, 469687, 850104, 1368976, 1670824, 1413319, 834332, 518902, 668418, 964319, 1111566, 1125290, 1062506, 875822, 642355, 585497, 722736, 794825, 689836, 636679, 804880, 1006228, 1005023, 851684, 673206, 412304, 77983, -8300, 365916, 782228, 555811, -361036, -1231305, -1374137, -826010, -66726, 561047, 941280, 977655, 634181, 106586, -302140, -479622, -514438, -432631, -117586, 447369, 997796, 1173636, 873010, 364156, 27673, -4380, 68420, 13146, -101039, 15153, 421181, 746449, 616773, 187114, -17883, 175302, 325795, 18056, -485152, -553709, -37430, 579617]
39580E79617L06300J07978J26748n855l53089m43343k1613M67017M88347J51878
39570A403985o2610m4546p0776k33528l13099k05391p9193n9516p5865p2759q2864
39559A03838n7130Q9905K37280J64568o3834j51906o0000o5769k38666k69004
39549c10718j6034J78409J3491k75159k83108k9457J68709J92984J46324O8576
39539a45983k6395O95J94253L07520J61611j1914L0499N6238k35266n42988l31356
39528e43086K55565N50097M12197L46489M61556J92759n77163r83149m00565M82309
39518A97009O15179J18229n0821L12337M07410j90417q37666q30617l76639j01284
39508g37280j09071o1329J18423J37070j56322n26904o33190l45480J78087N88586
$$ y = [579617, 885917, 993895, 1120643, 1114788, 761699, 318356, 296743, 763760, 1252107, 1403985, 1341375, 1296829, 1226053, 992525, 679426, 474035, 394842, 335326, 259461, 186702, 103838, 46708, 136613, 373893, 538461, 474627, 322721, 262721, 196952, -41714, -310718, -326752, -148343, -134852, -410011, -693119, -722576, -553867, -360883, -214559, -145983, -172378, -171683, 22570, 330090, 491701, 479787, 510286, 566524, 331258, -211730, -543086, -287521, 262576, 674773, 1021262, 1482818, 1675577, 1098414, 115265, -285300, 197009, 812188, 930417, 879596, 1191933, 1599343, 1408926, 571260, -259357, -635996, -737280, -846351, -907680, -789257, -652187, -808509, -1335413, -1968603, -2314083, -2135996, -1547410]
39498a547410O02980L06025R6148J91355L25371J29896l07189n37383l70273j07886
39488a218366q4213k14442j73120J26785M43828N53345M77736L28178J02187k18760
39478A23158m83254m85995k62778p9685p8292j10373j8080J02328P7925m2057
39468a257103p5573j7021l4182j74779k79740k10662o87K40348M24325M75596
39458i09478L66295J80573L2564n9820j08695m8520J25882K12464N4565j27796
39448b81966J0788L68785M60232J26240k15925k03824k6411l9269k22775l35666
39438c59791l30511k78278j13116J90173L82806K61567N3527R0331K52463J76657
39428C25828r8143j85450r684J09626O3290R8324K40594J41773k45843l90698
$$ y = [-1547410, -944430, -638405, -542257, -350902, -25531, 104365, -202824, -740207, -1110480, -1218366, -1302579, -1517021, -1690141, -1563356, -1119528, -566183, -88447, 239731, 341918, 123158, -360096, -846091, -1108869, -1188554, -1266846, -1377219, -1395299, -1292971, -1215046, -1257103, -1332676, -1349697, -1383879, -1558658, -1838398, -2049060, -2049747, -1809399, -1385074, -909478, -543183, -362610, -330046, -389866, -498561, -547081, -421199, -208735, -154170, -281966, -271178, 97607, 557839, 684079, 468154, 264330, 237919, 198650, -24125, -359791, -690302, -968580, -1081696, -891523, -508717, -247150, -193623, -103292, 149171, 325828, 227685, 42235, 32551, 142177, 205467, 303791, 544385, 686158, 440315, 49617]
39418D9617J6316M35103J87111m98536p50249k67630L12677L45363l1336k61502
39408d63066j62634j4654k7254o1900P9800L19810L97588K14375o8393k76506
39398f2834m06873m77443l65615j1372L20811K85872k7561j49856J04795L54407
39388d35669K20948j18201k28740k9931K11114L07174K33905n3255n02396p78031
39378a173082o01760k13982o6164j02433J40890O85335R43759N98720R2758p2666
39368B31375j8759n7756n7233K00420L83466K2206o10034p32818j89836L13810
39358e15159K51105m7980k3301L11863N49776N03998K81285M295j97971j36836
39348I81075J74498L80354K08788j21499k22581j02081o2279j64546j87364p2569
$$ y = [49617, 65933, 501036, 688147, 189611, -560638, -828268, -515591, -170228, -201564, -463066, -625700, -640354, -667608, -729508, -649708, -329898, 67690, 282065, 213672, -62834, -469707, -947150, -1312765, -1324137, -1003326, -717454, -745015, -894871, -790076, -435669, -214721, -332922, -561662, -591593, -380479, -73305, 160600, 107345, -395051, -1173082, -1774842, -1988824, -2054988, -2157421, -2016531, -1331196, -387437, 211283, 304041, 231375, 212616, 154860, 97627, 298047, 681513, 703719, 93685, -639133, -828969, -515159, -264054, -312034, -335335, -23472, 526304, 1030302, 1311587, 1315882, 1117911, 981075, 1155573, 1535927, 1744715, 1623216, 1400635, 1298554, 1236275, 1071729, 884365, 811796]
39338H11796k2038j16076j86195j43199j17931j75708j80751p3668k1700j33348
39328c58818k42866j55372O0518J91828J66625P8744L1307P0238J82053K72442
39318B96699K35689R3526l8474j23670j85307j40519R4074L20288K15047j42309
39308F25044k80931n5056P4896k08799m78861k06807L15536L47360j40210l82586
39298c90414J1777M83125L94907n9340k46345k0612K09196J47919r0126k91725
39288A48362l86752l58270j88528M0963J74695J51078K7460j41325l04981l28253
39278a165551r1183K85714M87714L61027J00858p156O2567R9776k1897j87777
39268g5908k16416o8080J77973M39639O08615N04314N6423m61683o06345k72195
$$ y = [811796, 789758, 673682, 487487, 344288, 226357, 50649, -130102, -203770, -225470, -358818, -601684, -757056, -696538, -504710, -338085, -259341, -228034, -157796, 24257, 296699, 532388, 625914, 587440, 463770, 278463, 137944, 232018, 552306, 767353, 625044, 344113, 289057, 363953, 155154, -323707, -530514, -214978, 132382, -7828, -390414, -378637, 104488, 499395, 440055, 193710, 173098, 382294, 530213, 440087, 148362, -238390, -596660, -785188, -744225, -569530, -418452, -390992, -532317, -837298, -1165551, -1256734, -971020, -483306, -122279, -21421, -28577, 33990, 133766, 111869, -75908, -292324, -360404, -182431, 257208, 865823, 1370137, 1426560, 964877, 358532, 86337]
39258H6337J55696K85361J61065M4551l0289j85538l34184k72337r4327j07210
39248b90875k81353k07871K41286O12418M89305P8105j56406j73735k79094n18331
39238d86551n81641l06034Q4731L16521L72350L67900L25439J94089j3439j94003
39228G9362k34461j17615L1273O9069L5144R4870K26963J85228p6639j99817P7069
39217A70446M31481L67342k5102j89508M4193K37557P2997j98988k63474k30834
39207D16110k95507k96011l2171K66997K52118L6846j868J21800O4059j68877
39197C63496j60571J89079M13000J93933j37682j61677j7845n5876j58972K0975
39187D87860L22786K08742l28569o17885k92555J30688M3987l19831k83559J98775
$$ y = [86337, 242033, 527394, 688459, 733010, 702721, 517183, 182999, -89338, -183665, -290875, -572228, -780099, -538813, 73605, 562910, 641015, 484609, 310874, 31780, -486551, -1068192, -1374226, -1289495, -972974, -600624, -232724, 92715, 286804, 273365, 79362, -155099, -272714, -241441, -172372, -137228, -42358, 184605, 369833, 293194, 93377, 170446, 601927, 969269, 944167, 754659, 798852, 1036409, 1109406, 910418, 646944, 416110, 120603, -175408, -207579, 59418, 311536, 348382, 346514, 468314, 532373, 363496, 202925, 392004, 805004, 998937, 861255, 699578, 681733, 625857, 466885, 487860, 810646, 1019388, 690819, 72934, -219621, -88933, -44946, -364777, -648336, -449561]
39177d49561M76810J98599j97906j68113J98616M08917K60009q549j28281r4116
39167D96425o0796j25036k39190k74594j76518n6734n7882j36347j18075J2438
39157g36309N7309r0003k57712k19435L3815L34437N06407M22658Q7757k36200
39147i7276k11789J14221K71345o899l55916k67591J94680N22017M74123K74444
39137I11359J29022m0319k92399m41524l22414p2376L3060o9986j71307m6627
39127c83511K65225M61895L16434P037o7522J43416K27158o3755l73479k59512
39117B73386J06738J92281j01268l76117m02629l44328l11869j94228j3051L4063
39107a137022O26J86914N52061O13320J67368l27772l76819p9624J45755J33955
$$ y = [-449561, 27249, 225848, 27942, -140171, 58445, 467362, 727371, 718822, 590541, 496425, 435629, 310593, 71403, -203191, -379709, -436443, -494325, -630672, -748747, -736309, -679000, -769003, -1026715, -1246150, -1212335, -877898, -371491, 51167, 138924, -97276, -309065, -194844, 76501, 69602, -286314, -553905, -359225, 162792, 636915, 911359, 1040381, 1000062, 707663, 266139, -56275, -128651, -95591, -165577, -336884, -383511, -118286, 343609, 660043, 667080, 599558, 742974, 970132, 906377, 532898, 273386, 380124, 572405, 471137, 95020, -307609, -651937, -963806, -1158034, -1171085, -1137022, -1136396, -949482, -397421, 215899, 383267, 55495, -321324, -400948, -255193, -121238]
39097a21238j5629j87389k42439n5501K12008J97447j00313k41453o2764J6425
39087f00846k41641l47539J72777R19325J116786O71637J25404j98816l78093
39078A238994m12654k17453J0462J0716m7987J38388L67091K20450j34346j71998
39068A001663L6427p7134m85026m78104J01957M46984K3937n64200n19130M850
39058e07776L20958K61242J54430J40065J42268K41312M76501N17355J08327l65109
39048A489573l44096K6196R6829k87249o12611n44557l42791k83367k07792P8192
39038i31673L61592L20791M3022p5539J18627L17767J40609l56079o65760m06074
39028a132717J70862M45539K17591o4767J7396K83613L26150J44872K5817O969
$$ y = [-121238, -136867, -324256, -566695, -622196, -410188, -212741, -313054, -554507, -617271, -600846, -842487, -1190026, -1017249, -97924, 1018862, 1690499, 1815903, 1617087, 1238994, 826340, 608887, 619349, 630065, 582078, 720466, 1087557, 1308007, 1173661, 1001663, 1038090, 960956, 475930, -2174, 99783, 546767, 570704, 6504, -512626, -507776, -186818, 74424, 228854, 368919, 511187, 752499, 1229000, 1746355, 1854682, 1489573, 1145477, 1171673, 1268502, 981253, 368642, -175915, -518706, -802073, -1009865, -931673, -570081, -249290, -206268, -281807, -163180, 154587, 295196, -60883, -726643, -1132717, -961855, -516316, -298725, -363492, -346096, -62483, 263667, 408539, 434356, 441325]
39018D41325q7132k06994j46092K414o5678k96168k69834J28764M75728M11978
39008C88311J00478j16991j71419j49444m5230R6439M7938k87874o06341n24665
38998a268798o8183L85511N32891L21461j40078n85605o22277q3015O39167Q83131
38988e795M38746k06872m36552j73452J37437J22849j14547k09392j0629K84623
38978a73584M29702L92116K70375J18362j3098n53J83636L12201J46926j90470
38968A475613l36072j78208K0055L2461o9179j59279k86474m84255n79797m10653
38958i75788q6230J63465K83909L61360M00859L29679J57110k6996j58893j91032
38948B57443p2866J23918J72182m7987l38967m12002k49842o3532M0689J38169
$$ y = [441325, 354193, 147199, 1107, 3521, -62157, -358325, -628159, -499395, -23667, 388311, 488789, 371798, 200379, 50935, 5705, 102144, 150082, -137792, -744133, -1268798, -1336981, -951470, -418579, -97118, -237196, -822801, -1445078, -1528093, -888926, -5795, 432951, 226079, -210473, -383925, -246488, -123639, -238186, -447578, -458207, -173584, 256118, 648234, 918609, 1036971, 1023873, 1023320, 1206956, 1519157, 1666083, 1475613, 1139541, 961333, 981388, 1013849, 944670, 785391, 498917, 14662, -565135, -975788, -1062018, -898553, -614644, -253284, 147575, 477254, 634364, 607368, 448475, 257443, 184577, 308495, 480677, 432690, 93723, -318279, -568121, -631653, -590964, -452795]
38938d52795K58774L06369K40773J58069J22359N1475j48417m10775n39729l95566
38928h09463l5817L19350M80882M51005L50620K25123M3536j29766j62901j01785
38918F30784j51813l03594k41405J69983N53716M68057P700l55896l90076k17670
38908A69786M6014L58035N11135K87625j15841k56605j16630j43409m78349o53356
38898c91595l51632M648j11459m51173l18039L60508Q73013P04759J84526o6899
38888D36657L0205O4355j58015l21228q6451L71028N20897J33728m23650o35736
38878f8210m18841q2581J52810L12194L76871K08612j13871k23231K4424K27177
38868C95354n0952o09159q07041l82705K54298N76212N00059L09590K34761K44490
$$ y = [-452795, -194021, 112348, 353121, 511190, 633549, 685024, 536607, 125832, -413897, -809463, -845280, -525930, -45048, 405957, 756577, 981700, 1025236, 895470, 732569, 630784, 478971, 175377, -66028, 103955, 657671, 1125728, 1133428, 777532, 387456, 169786, 215800, 573835, 1084970, 1372595, 1256754, 1000149, 883519, 740110, 261761, -391595, -743227, -738579, -850038, -1301211, -1619250, -1258742, -385729, 319030, 503556, 436657, 466862, 531217, 373202, 51974, -34477, 336551, 857448, 991176, 567526, -68210, -487051, -569632, -416822, -104628, 272243, 480855, 366984, 143753, 168177, 395354, 344402, -264757, -1071798, -1454503, -1200205, -623993, -123934, 185656, 420417, 664907]
38858F64907J51922j63230n87445q11966o07376p0906M44853O29029M15021j6357
38848D8452l48236l31469K277L67925N18587M23781J48437k33198n16724m36746
38838c56914n5660J76993R628k33720j79924j1753r0136k33504J2226N01644N76127
38827A15007P7383l87352l55840n8768J63754L48185M85479K64721k87935n02545
38817a37911J290N62120L55878l45511n82281j55243J81490l2114l37592j84872
38807f74746K79330N60482M74718J62394j91075l96198l23657j29598j39006l50615
38797g27971l64240L1694N11183O45435M09616O6207j89119k76624j92153j07871
38787a93843k51605n10623m63430j9613L25367J87277r5417K0662M09318M53176
$$ y = [664907, 816829, 653599, 66154, -745812, -1353188, -1424094, -979241, -350212, 64809, 48452, -299784, -631253, -628976, -261051, 257536, 681317, 829754, 596556, 79832, -356914, -412574, -235581, -225953, -459673, -639597, -651350, -741486, -974990, -962764, -461120, 115007, 192390, -194962, -550802, -609570, -445816, -97631, 387848, 652569, 364634, -137911, -136621, 425499, 781377, 435866, -146415, -301658, -120168, -152282, -489874, -674746, -395416, 165066, 639784, 802178, 611103, 214905, -108752, -238350, -377356, -727971, -1092211, -1060517, -549334, 96101, 505717, 571924, 382805, 106181, -85972, -193843, -445448, -956071, -1419501, -1439114, -1113747, -926470, -1021887, -1001225, -591907, -138731]
38777a38731J5824l07172l0044N43807P17293K49285m13796o81359m42577j10065
38767e97535p1463k04963j04666K51883L85714K2616m07902l13040K33513O01573
38757b04270M45558K9939k62144l35860k50677p7366o237k22738n03504l06448
38747a693747M72046J153264J047655L43264j92773k68522l23134o72629r13720
38738a048296n12353L23744Q16104N97919J04714j10787o5336r0928k05324j59971
38728c50514J4875L271k03113j88355J89465M16981K7800o17925p37117j64983
38718a609615M95326P36828O67806N64050L76335l2514m68700n69507k78465Q0307
38708c8149J69001n2115l30550l61700r0271J96873J89816k9331q3368J45903
$$ y = [-138731, -122907, -430079, -460123, 83684, 800977, 1050262, 636466, -44893, -487470, -597535, -668998, -873961, -978627, -726744, -341030, -318414, -726316, -1039356, -805843, -204270, 241288, 271227, 9083, -326777, -577454, -654820, -661057, -883795, -1387299, -1693747, -1221701, -68437, 979218, 1322482, 1129709, 861187, 538053, -134576, -1048296, -1560649, -1236905, -420801, 177118, 281832, 171045, 105709, 14781, -190543, -350514, -335639, -332368, -535481, -723836, -534371, -117390, -89590, -707515, -1444632, -1609615, -1114289, -377461, 290345, 854395, 1230730, 1198216, 729516, 160009, -118456, -38149, 130852, 78737, -251813, -613513, -703784, -506911, -317095, -346426, -429794, -283891]
38698b83891L20091J47998j60573j93952P1805K74575J92642j3369j06655q2072
38688A66599p7634j42253k11351k37217k38580k25380j36336J00189M31835O61912
38678I1784O36566M24151K06823K2229k20170m51719m08733k0440L65779L65529
38668A011799M6486j96220j83533j12307j69159k48666j67165K3175Q9060q2865
38658A0605l43623m21502j71691K68835N61220M68132J05520j71867j56173K3461
38648A72917J27747J15235J24444K11904K44365P8973k35149m90140n21149l38805
38638e09658q6034R5577J62628J67390J68458J44553L1203j35554j83937j3758
38628a59132K00905J72493j07427l06196j75048J27775K92345K83642K78765K73093
$$ y = [-283891, 36200, 184198, 23625, -170327, -98522, 176053, 368695, 355326, 248671, 166599, 88965, -53288, -264639, -501856, -740436, -965816, -1102152, -1001963, -570128, 91784, 728350, 1152501, 1359324, 1381553, 1161383, 709664, 300931, 280491, 646270, 1011799, 1058285, 862065, 678532, 566225, 397066, 148400, -18765, 4410, 93470, 10605, -333018, -754520, -926211, -657376, -96156, 371976, 477496, 305629, 149456, 172917, 300664, 415899, 540343, 752247, 996612, 1075585, 840436, 350296, -170853, -509658, -595692, -500115, -337487, -170097, -1639, 142914, 174117, 38563, -145374, -159132, 41773, 214266, 106839, -199357, -374405, -246630, 45715, 329357, 608122, 881215]
38618H81215N6906l79500o97923o01179j83053K36872M70103N15760M04837J74875
38608H78913n1684j22559j3438J33382J42033l1054k48725l30740k57221j52691
38598e3784k8070K68522O71968P14905J07585o29251o33092J47107Q03482O64143
38588B033515J03317j64205q6360q3340k50738l47670l46567l95993l63981j1825
38578H6153M21990L99925j08315n42401n58091l83954k50416k5849L41122N34051
38568h5785L57684J03956Q7316J69401R1708n5127p8951j00476k86269m11436
38558b07979j70480K30624K96078l94j70277L1962K64938J58752j66640l58620
38548i2036l24268k15461r9734J01419M02517O62207P06417M68355L8872l64781
$$ y = [881215, 938121, 558621, -139302, -740481, -923534, -686662, -216559, 299201, 704038, 878913, 827229, 704670, 691232, 824614, 966647, 935593, 686868, 356128, 98907, -53784, -81854, 186668, 858636, 1573541, 1681126, 1051875, 418783, 565890, 1369372, 2033515, 2136832, 1972627, 1886267, 1802927, 1552189, 1204519, 857952, 461959, 97978, 86153, 508143, 908068, 799753, 257352, -300739, -684693, -935109, -960958, -619836, -85785, 271899, 375855, 463171, 632572, 724280, 669153, 590202, 489726, 203457, -207979, -378459, -147835, 148243, 147849, -22428, 9534, 274472, 433224, 266584, -92036, -416304, -631765, -731499, -630080, -227563, 434644, 1141061, 1609416, 1648288, 1283507]
38538A283507n28527m09637j60271M4258J62126K41976K81455K06059o318k35354
38528H79274l02581j53843P1747J81434J18560j8221j14626j38043j14612r4311
38518C14778j42406k72001l63111k51572M8902L04745L19228J68543J01900K42059
38508D71065M56155N11403L07317m9522l68576n41033n63114m38492j73239J05364
38498b82672J87985O4852J8131K41249M97756M25950R8860n0771J35535L32012
38488A668887K37224l1414j93727j80154r0832j7661m2728j81077k26905M9299
38478I90912M39380M06905j46125o19404n09190q1518J04747k3413j90605l48052
38468B3637n71791o35626k78502K36430L93832J64383o6199j78583l10364k71665
$$ y = [1283507, 754980, 345343, 185072, 229330, 391456, 633432, 914887, 1120946, 1114628, 879274, 576693, 422850, 494597, 676031, 794591, 776370, 661744, 523701, 409089, 314778, 172372, -99629, -462740, -714312, -665410, -360665, -41437, 127106, 229006, 471065, 927220, 1438623, 1745940, 1696418, 1327842, 786809, 223695, -214797, -388036, -282672, -94687, -29835, -11704, 229545, 727301, 1153251, 1252111, 1201340, 1336875, 1668887, 1906111, 1874697, 1680970, 1500816, 1409984, 1392323, 1349595, 1168518, 941613, 990912, 1430292, 1837197, 1691072, 1071668, 562478, 480960, 585707, 562294, 371689, 23637, -548154, -1183780, -1462282, -1225852, -832020, -667637, -733836, -912419, -1222783, -1494448]
38458a494448K68777R62958R61416J55274n13312l50689J69256K57639n1590k21570
38448A43711j60679j47757j43951J02121M33937M41056J64770L7968J31892O2649
38438A065717k74193m54274k10500J19235J23827o1952j6282K96030M51950J48784
38428A188342l76289n95180k99943J27585J48263k63686n85936m59943j62621
38419a279408j32701k86003j97298J78684M41130L94189K86749K88190J81730
38410a24738j81096m95947l98475O398L22231L91219L47018K77030J52084L2319
38400C28043M1406J24114P7716j32568k94038k41893o3938O4726J10074J37185
38390A50827J25562m7392m13902p55708p17693j71137N44051Q79632O55592K41449
$$ y = [-1494448, -1225671, -262713, 698703, 853977, 340665, -10024, 159232, 416871, 365281, 143711, -16968, -164725, -308676, -206555, 227382, 668438, 833208, 871176, 1003068, 1065717, 791524, 337250, 126750, 245985, 369812, 307860, 291578, 587608, 1039558, 1188342, 812053, 216873, -83070, 44515, 192778, -70908, -656844, -1116787, -1279408, -1412109, -1698112, -1895410, -1716726, -1275596, -881407, -594658, -306468, -124738, -305834, -801781, -1200256, -1193858, -871627, -480408, -133390, 143640, 295724, 328043, 369449, 493563, 571279, 438711, 144673, -97220, -161158, -96432, 13642, 150827, 276389, 228997, -184905, -940613, -1658306, -1829443, -1285392, -405760, 249832, 491281]
38380D91281M7299O636k00187n42146o27643l21382K1667J09718J38595L63041
38370e13121N56441L54895l2703k3179M04307N56413N0524n34398m65503P5157
38360D28833L02693O052k34878k2650L00892K96734J02354Q8672K07221J20357
38350A596280k08532m72311m98141m13223l36137k04928L2618K79796M06513L60080
38340E42015J48226j49550l61587l58402k03339m9388P4125K34721M14703N24599
38330H16123N51933N23041L77318Q7902j50423j09398J23837K78238L89085P99010
38320C686666J527509J965403J483970K12317j021025j475930j111570m95486
38312D771854k27741m17329o70458o16533l63829k69401l56164l02164m2578M1105
$$ y = [491281, 538580, 545216, 345029, -197117, -824760, -1146142, -1124475, -1014757, -876162, -513121, 43320, 398215, 365512, 342333, 746640, 1303053, 1353577, 819179, 353676, 428833, 731526, 737578, 502700, 480050, 780942, 1077676, 1180030, 1268702, 1475923, 1596280, 1387748, 915437, 417296, 4073, -332064, -536992, -504374, -224578, 181935, 542015, 690241, 540691, 179104, -179298, -382637, -432025, -357900, -123179, 291524, 816123, 1368056, 1891097, 2268415, 2356317, 2205894, 2096496, 2220333, 2498571, 2887656, 3686666, 5214175, 7179578, 8663548, 8875865, 7854840, 6378910, 5267340, 4771854, 4544113, 4126784, 3456326, 2839793, 2475964, 2206563, 1850399, 1548235, 1505657, 1546762]
38302A546762k54644n32643l56839N6255J66093l9059m0813L50846O46181L78507
38292A920646k14308n02991k63697J22050K06576j1723j77835p4831R9074K0188
38282A123149k67775l69724j28067P1433j55823n50805n18611l205M20772M00126
38272B1470K43965K80408K60317j56720o64265o34150o1036L94488L61096K13178
38262B58751L58489N46619K90671l02662o02896l08073J76003L03160M1327k06015
38252E55374j54399P3326J54178p1069m37492o10215m29560j14493k9086k09307
38242a272743k74200N9454N18862N81073J95080j07474P7175M83855N67610K30474
38232A059166j40948k58982k06725j19221L8610K31556K16260r6606l70777k49576
$$ y = [1546762, 1292118, 759475, 402636, 458891, 624984, 585925, 545112, 895958, 1542139, 1920646, 1706338, 1203347, 939650, 1061700, 1268276, 1256553, 1078718, 1003887, 1102961, 1123149, 855374, 485650, 357583, 429016, 273193, -277612, -796223, -799428, -378656, 21470, 265435, 545843, 806160, 649440, -14825, -648975, -710011, -315523, 45573, 258751, 617240, 1163859, 1454530, 1151868, 548972, 240899, 416902, 720062, 761389, 555374, 400975, 474301, 628479, 557410, 119918, -490297, -919857, -1034350, -1063436, -1272743, -1546943, -1487489, -968627, -387554, -192474, -299948, -222773, 261082, 828692, 1059166, 918218, 659236, 452511, 333290, 371900, 603456, 819716, 723110, 352333, 102757]
38222A02757J07653K37762N2233q2791K3142Q5671j45281m33019m05526j15116
38212e72515Q8834R1232O3915P9039M9695M2458K45116N33367M68433o4939n56931
38201D67704n05668r8359R3295p1626k05261o4600J11195O3291m4847R0445L91028
38190B26597M61711J45625k38625l06558r3470M2113m2729o2496K30789N51896
38180I14853L80634k39799n95067k15792M23871N10515n418m04112k57595M7069
38170E59159J2156k38295k81500j03062l4101j53964k09993j12191r3632k67456
38160i22879l53988o4341M30775O54482M02364k0571j92073p8532j5395j94333
38150c54491l46569r5861M56359P44906M05731k70711o72478n05782J6966M73153
$$ y = [102757, 210410, 448172, 500405, 417614, 440756, 526427, 381146, -51873, -457399, -572515, -483681, -392449, -328534, -249495, -199800, -157342, 87774, 621141, 1089574, 1024635, 467704, -37964, -136323, -43028, -114654, -319915, -384515, -273320, -210029, -254876, -164431, 226597, 688308, 833933, 595308, 288750, 195280, 237393, 194664, 132168, 362957, 914853, 1295487, 1055688, 460621, 244829, 668700, 1179215, 1173797, 769685, 512090, 559159, 571315, 333020, 51520, -51542, -85643, -239607, -449600, -561791, -655423, -922879, -1276867, -1341208, -910433, -255951, 146413, 125842, -66231, -144763, -160158, -354491, -701060, -796921, -340562, 404344, 810075, 539364, -133114, -638896, -621930, -148777]
38140a48777N57173K48568j57422k76610n2891J64132J21861O2831L32616P29581
38130A581062O58673l4887p76433r64122o58398l59498l25755l72920k37697J00954
38120a389021M51145O03823M90629K35758N4460N9998J83408K76609K33943L2235
38110A232987k39077l88635k96669r2582j6899r8353j54128j34276k09523m06357
38100h03512m30416q0845L68214M88610K75115R7995J41064K06181R8458r6218
38090B64646k14386k42344k03226l1105K57486M21802K47204j31645l63864l25755
38080c21187k36636k89467l53624j84745J75034L96978K77921r152j62962j27763
38070h35603o5661k3082J45905M54292N94063K86634k56615m67936q0203N21826
$$ y = [-148777, 408396, 656964, 499542, 222932, 170041, 334173, 456034, 518865, 851481, 1581062, 2239735, 2204848, 1428415, 464293, -194105, -553603, -879358, -1252278, -1489975, -1389021, -937876, -334053, 156576, 392334, 446794, 506792, 690200, 966809, 1200752, 1232987, 993910, 605275, 308606, 216024, 199125, 100772, -53356, -187632, -397155, -803512, -1233928, -1314773, -946559, -457949, -182834, -84839, 56225, 262406, 360864, 264646, 50260, -192084, -395310, -426415, -168929, 252873, 500077, 368432, 4568, -321187, -557823, -847290, -1200914, -1385659, -1210625, -813647, -535726, -544878, -707840, -835603, -901264, -924346, -778441, -324149, 269914, 556548, 299933, -168003, -248206, 273620]
38060B73620P26316L66331j70277m40715l81146k19555j32827j19222j14186o3567
38050b75228J01038L91118O26398N36045R8204l51016m84473l60253k74910l36072
38040c29149l98415l76975l51243l14311j01476K91297N68287N29134L98436M73354
38030C88939N88818L18686k95791o42130l47688J53377K00390j61647k76478J19183
38020D5659M75045K40447k88795l68137J25662N30450L56879p1912j89391j2888
38010H43019J618k78098n07393m49193k83461k19023j43428J26610M62393N29186
38000H2230K05322k52650m48303k07463K50411N06069L71416O9360j10812j84929
37990B80651k74751k16212K12750P25156P07288Q8710m77485n19772l16798k50393
$$ y = [273620, 999936, 1366267, 1195990, 755275, 374129, 154574, 21747, -97475, -211661, -275228, -174190, 216928, 843326, 1379371, 1477575, 1126559, 642086, 281833, 6923, -329149, -727564, -1104539, -1455782, -1770093, -1871569, -1580272, -1011985, -482851, -84415, 388939, 977757, 1296443, 1000652, 358522, 10834, 164211, 364601, 202954, -73524, 45659, 520704, 761151, 472356, 104219, 229881, 760331, 1117210, 1045298, 855907, 843019, 844637, 566539, 59146, -390047, -673508, -892531, -1035959, -909349, -446956, 82230, 287552, 34902, -413401, -620864, -370453, 135616, 507032, 576392, 465580, 280651, 5900, -210312, 2438, 727594, 1434882, 1523592, 1046107, 526335, 209537, -40856]
37980d0856j55146J74740L38336q6934o38074m88446K24237M66883j67555q36852
37970a209667o77924M8467N12674M56912K20368K5022j47066j72526J27022N51195
37960b65523O46028L13054n1492p6086J94061M49122M25974O0959m45744p09052
37950E41301n07270o3474J91907J08344j23888l28677m79040m83159j65854M08423
37940i01387Q42386Q07781L92479o5708l29121l34842j22337J22572J08513k37931
37930B82405n77506n32180k07580o7985k68228m14794j40634L41376N24380L10171
37920g50575J20178L02819O93308Q56651N91053Q4254l11035l75163j96959j03755
37910I10776l04059n83722n40173j54387J36923O4150q9641K1321K22680J23147
$$ y = [-40856, -196002, -21262, 317074, 230140, -407934, -896380, -672143, -205260, -372815, -1209667, -1887591, -1839124, -1326450, -869538, -649170, -624148, -771214, -943740, -816718, -265523, 380505, 693559, 642067, 565981, 760042, 1209164, 1635138, 1696097, 1250353, 541301, 34031, -29443, 162464, 270808, 146920, -181757, -660797, -1143956, -1309810, -901387, -59001, 748780, 1141259, 1075551, 746430, 411588, 289251, 411823, 520336, 282405, -295101, -827281, -1034861, -1102846, -1371074, -1785868, -1926502, -1585126, -1060746, -750575, -630397, -327578, 365730, 1222381, 1813434, 1897688, 1586653, 1211490, 1014531, 910776, 606717, 22995, -517178, -671565, -534642, -470492, -560133, -538812, -316132, -192985]
37900a92985j90663k52423K7325J96847m3578m16585n16660l26149o9107J48051
37890a635927L13606L67711L04996K26856J30199j13542l99198l20157K56707
37881h68749Q15113P46857J20404m45895n50906l17323l4919J42192J61284M6530
37871a85412o0443n0150j4408q0932j68136j26284j0077M7839J06871K57772L31165
37860D7805J43206q5186j0533J95942L3457m62420o35070j94034K82487J93139
37850d91207k13063k81261P1109L50910K74911L4198j61653l11025l49914j04105
37840a181100L37614N56613L22920o9041k01500p3725J4267j2501Q2055L83645
37830A59247N89111M11726K4649j65771r6108p5649k25490k61977j8020J78323
$$ y = [-192985, -383648, -636071, -608746, -411899, -455477, -872062, -1388722, -1714871, -1783978, -1635927, -1322321, -954610, -649614, -422758, -292559, -406101, -805299, -1125456, -868749, -53636, 693221, 813625, 367730, -183176, -500499, -535418, -393226, -231942, -185412, -245855, -296005, -310413, -391345, -559481, -685765, -695842, -648003, -541132, -283360, 47805, 191011, 105825, 95292, 291234, 324691, -137729, -772799, -966833, -684346, -491207, -704270, -985531, -914422, -563512, -288601, -254403, -416056, -727081, -1076995, -1181100, -843486, -286873, 36047, -32994, -234494, -308219, -293952, -306453, -224398, 159247, 748358, 1160084, 1184733, 1018962, 922854, 847205, 621715, 359738, 341718, 520041]
37820E20041p384l11200k16206K32345M82130L37060K01315L25054L82476J10777
37810B056408j45170J4163L38445L25556O3485O9993M11451O12102M77730L96520
37800D620683O22945Q03405N60272J48547R7957M19257N93583K89822k59623o21398
37790G275450o23585l89681j31992k6787j50792m01123n29717l69393l4123J66700
37780D784957L6941l10236n80021n87031l82595j32084L2623K3873j93789m89816
37770B202822n79284l52204j44140m07221j040625j335418q04687J41127O58586
37761a661044M96348J77762J60263K62266J30877j25907j70127m2371n0824j51029
37751i73786K7947M72867O40968K63803j74063j31343J86181J86206j93128m49725
$$ y = [520041, 512657, 201457, -14749, 217596, 699726, 1036786, 1238101, 1563155, 1945631, 2056408, 1911238, 1925401, 2263846, 2589402, 2652887, 2722880, 3134331, 3746433, 4224163, 4620683, 5243628, 6047033, 6607305, 6755852, 6853809, 7273066, 7866649, 8156471, 7896848, 7275450, 6651865, 6262184, 6130192, 6103405, 5952613, 5551490, 5021773, 4652380, 4618257, 4784957, 4821898, 4511662, 3931641, 3344610, 2962015, 2829931, 2862554, 2886427, 2692638, 2202822, 1623538, 1271334, 1127194, 719973, -320652, -1656070, -2460757, -2319630, -1661044, -1164696, -986934, -826671, -564405, -433528, -559435, -729562, -771933, -822757, -973786, -945839, -472972, 167996, 431799, 257736, 126393, 312574, 498780, 305652, -144073]
37741a44073k97514K1872J99438J74877l6882l89022o03947l76308J07940K87525
37731a056094N524k68290j72782O5948J52565K23854M47130N59797K94365q2914
37721A69103j76016j12861k37222l95640j83028K33002K45978j95474m17644l9642
37711a109444M40382L86819j11001m68331l63822N3575M60678N73502K72616k17510
37701h2536m29115j49697L11441N17723M09166K52962K50409L58422L80499J26278
37691A945552l75497p62537o58534j86848J14057R244j33535L5191K95842K66872
37681E49807M9299K2032J93718K40622R9062K9957P9883m4748m35864p26470n90256
37670e32958j92108R6253J90499K38171K36249J3217m26446p82959p60240l60827
$$ y = [-144073, -441587, -419715, -220277, -45400, -82282, -471304, -1075251, -1451559, -1343619, -1056094, -1050570, -1318860, -1491642, -1425694, -1273129, -1049275, -602145, -42348, 252017, 169103, -6913, -119774, -356996, -752636, -935664, -702662, -456684, -652158, -1069802, -1109444, -669062, -282243, -393244, -861575, -1225397, -1171822, -711144, -137642, 134974, -82536, -511651, -661348, -349907, 167816, 576982, 829944, 1080353, 1438775, 1819274, 1945552, 1570055, 807518, 148984, -37864, 76193, 85437, -48098, -12907, 282935, 549807, 599106, 621138, 814856, 1055478, 1154540, 1184497, 1264380, 1219632, 783768, 57298, -532958, -725066, -628813, -438314, -200143, 36106, 49323, -377123, -1160082, -1920322, -2281149]
37660b281149J69768N93203P98291P46523M41524J959l34232l97197k57374j10273
37650f28957j5915J01580K00403Q8974k45486m81001l35125K8408J90997J6387
37640a079735k21964k30990j620K97596N24999N95416M75791K54847J05553Q5678
37630H05571O1359q7015k64736k81694j34135l7396j34898k73893j91525R5831
37620d42531K57560R8548j19671l1315K57933K86438l6082k20837N4776L66200
37610D71019J22889m97634p29273l04864J80203J60599j25353j03396K34767L76929
37600b14114J24064j16503P895K36928J04500l06690m20211M543M82374M65879
37590C68665J06597l5530J05311J3446n07333q90329o04728J9934K60693L5105
$$ y = [-2281149, -2111381, -1518178, -719887, 26636, 468160, 470119, 135887, -261310, -518684, -628957, -644872, -543292, -342889, -253915, -499401, -980402, -1315527, -1287119, -1096122, -1079735, -1301699, -1532689, -1534309, -1236713, -711714, -116298, 359493, 614340, 719893, 805571, 866930, 779915, 515179, 233485, 99350, 61954, -72944, -346837, -538362, -442531, -184971, -86423, -206094, -237409, 20524, 306962, 270880, 50043, 104819, 471019, 593908, 96274, -632999, -937863, -757660, -597061, -722414, -825810, -591043, -214114, -90050, -206553, -198658, 38270, 142770, -163920, -584131, -579588, -97214, 368665, 475262, 439732, 545043, 558489, 51156, -839173, -1443901, -1423967, -1163274, -1128169]
37580a128169r9471J21157L41532K68633J09550R5376M1969k70995o12188n62685
37570a695291q9468M40946O96214O04986K96818K6446J1816J50353N9203m00468
37560A01555q29558p66714k81044J79137L55642K93700O2499k50038l68534q6498
37550a589853L16821L27130q7221m01030k68827N3542J80860J23995J10672J82830
37540a051081K47616L08885L76207L12522L8096k37834k39737M249K28300K81220
37530B68443K12370R6364j2091j7435J10382K19890J57605q630j40217k88801
37520E97880n39909o92389m49608O4826L48965J79345r6928p1916K08008M11645
37510d0081L55114P8330k75043m63762k85882P1207R9672l10832n22600L4696
$$ y = [-1128169, -1227640, -1106483, -764951, -496318, -386768, -291392, -249423, -520418, -1132606, -1695291, -1784759, -1343813, -647599, -42613, 254205, 280651, 292467, 442820, 502023, 101555, -728003, -1494717, -1775761, -1596624, -1240982, -947282, -884783, -1134821, -1503355, -1589853, -1273032, -945902, -1033123, -1434153, -1702980, -1649438, -1468578, -1344583, -1233911, -1051081, -803465, -494580, -118373, 194149, 232245, -5589, -245326, -241077, -12777, 268443, 480813, 577177, 565086, 547651, 658033, 877923, 1035528, 1026898, 886681, 597880, 57971, -634418, -1084026, -1019200, -670235, -490890, -587818, -659734, -451726, -40081, 315033, 393363, 118320, -345442, -631324, -560117, -460445, -771277, -1293877, -1259181]
37500a259181R09018J065971K63537o08257p24094l18561j57631m32710o38623
37491a900531l63833K19992O38315O05421K27831j11098r3003K00247L78085K49655
37481E1081N3721L3239L4183j82817m40946l61838O981K12392O5896j25735j06309
37470g60152l9403j22255j89707k2771J94135J02982k45783m12886j97131P9532
37460a613439N1228j65087j58569J55542L86104K22661r0010q2876K36200L69670
37450f88576R5969j42614R1624M94727M32461o1731k93430J1085K37625j67634
37440I506p65559o78003J52454Q36753P02812R7834j84525N4358K90461R0638
37430F06729l00080l46513j519K21385j0026l64561l57330q8343n6939l44234
$$ y = [-1259181, -350163, 715808, 979345, 371088, -353006, -671567, -829198, -1261908, -1900531, -2264364, -2044372, -1406057, -800636, -572805, -683903, -776906, -576659, -198574, 51081, 104802, 138041, 172224, -10593, -451539, -813377, -806396, -594004, -528108, -653843, -760152, -799555, -921810, -1111517, -1134288, -940153, -837171, -1082954, -1495840, -1692971, -1613439, -1562211, -1727298, -1885867, -1730325, -1344221, -1121560, -1211570, -1294446, -1058246, -688576, -592607, -735221, -643597, -148870, 283591, 221860, -71570, -60485, 177140, 9506, -756053, -1434056, -1281602, -444849, 257963, 355797, 171272, 225630, 516091, 606729, 306649, -39864, -41383, 180002, 169976, -194585, -551915, -640258, -697197, -1041431]
37420a041431m83476k11680J55481K98594L58968N10006N11411J38876k88670
37411e1921l32118j37743j62154l56590k43645K20151M85365K45278j07132q1978
37401e22487K68893N55372N53977K83762j33751m71575m90022k22008K6911P7601
37391g3327M5285K6265p2873k47843k57005K0117L44451M34249K81665Q88l42703
37380A59169n74890m32324P802K60931J02835m2446K38634O35964N52879K1431
37370I29985l63748l11134r8307j998K5831N7591K1555n8899l4745O3171L2136
37359B61438j10746j00390J13297K31257P4356j41320j63954n3916o274p6807
37349B6941k24630l79194l55084J661M45890M53591p3101n44439m10530J25831
$$ y = [-1041431, -1524907, -1736587, -1581106, -1282512, -923544, -413538, 97873, 236749, -51921, -384039, -521782, -683936, -1040526, -1284171, -1064020, -578655, -333377, -440509, -522487, -253594, 301778, 855755, 1139517, 1005766, 534191, 44169, -177839, -150928, -73327, -28042, -1777, -74650, -322493, -579498, -559381, -214930, 219319, 500984, 501872, 159169, -415721, -848045, -840243, -579312, -476477, -518923, -280289, 355675, 908554, 929985, 566237, 255103, 156796, 154798, 180629, 238220, 259775, 200876, 166131, 229302, 261438, 150692, 50302, 163599, 394856, 469212, 327892, 163938, 110022, 103748, 26941, -197689, -576883, -931967, -930306, -484416, -30825, -103926, -648365, -1058895, -933064]
37339i33064M51814L72701K16117K40784L34886K93769Q0061k32715n32466o42397
37329c50510m33951m0240J91206M7827l01899m54879j69333L60236O51907M49997
37319d9639M6497q1348Q6301J18151j79552m51749l58204q7430K390m2153N3471
37308i43265K56090L04725K01830J81564K45217J69591k4890o1159P9514P2276
37298D81493j83515l25388p9389K89537L55061J16366p8192n4328j344j72387
37288C47914n48543q09603o26817m8232M59535N04130K34469Q8681J53875J31452
$$ y = [-933064, -481250, -108549, 107568, 348352, 683238, 977007, 1057068, 824353, 291887, -350510, -784461, -824701, -633495, -585668, -887567, -1342446, -1511779, -1151543, -499636, -49639, -3142, -84490, 1811, 119962, -59590, -511339, -869543, -956973, -954583, -996736, -943265, -687175, -382450, -180620, 944, 246161, 415752, 390862, 329703, 409217, 481493, 297978, -27410, -106799, 182738, 537799, 654165, 575973, 521645, 520301, 347914, -200629, -1010232, -1637049, -1685281, -1225746, -721616, -487147, -398466, -244591, -113139]
$$ [...]
##END NTUPLES=NMR SPECTRUM
##END=
