##TITLE=31Pdec_LR-796-CMK-OST
 CDCl3, 24 sc
 17.1.2025
##JCAMPDX= 6.0         $$ Bruker NMR JCAMP-DX V2.0
##DATA TYPE= NMR SPECTRUM
##DATA CLASS= NTUPLES
##ORIGIN= UXNMR, Bruker Analytische Messtechnik GmbH
##OWNER= root
$$ XWIN-NMR		Version 3.5
$$ Fri Jan 17 13:54:03 2025 Russian Standard Time (UT+4h)  she@DPX200
##.OBSERVE FREQUENCY= 81.013821
##.OBSERVE NUCLEUS= ^31P
##.ACQUISITION MODE= SIMULTANEOUS
##.ACQUISITION SCHEME= undefined
##.AVERAGES= 24
##.DIGITISER RES= 17
##SPECTROMETER/DATA SYSTEM= spect
##.PULSE SEQUENCE= zgpg30
##.SOLVENT NAME= DMSO
##.SHIFT REFERENCE= (INTERNAL, DMSO, 0, 198.062)
##AUDIT TRAIL= $$ (NUMBER, WHEN, WHO, WHERE, WHAT)
$$ ##TITLE= Audit trail, XWIN-NMR		Version 3.5
$$ ##JCAMPDX= 5.01
$$ ##ORIGIN= Bruker BioSpin GmbH
$$ ##OWNER= she
$$ F:/spectra/data/she/nmr/P31/2/pdata/1/auditp.txt
$$ ##AUDIT TRAIL=  $$ (NUMBER, WHEN, WHO, WHERE, WHAT)
(   1,<2025-01-17 13:52:43.06 +0400>,<she>,<DPX200>,
      <created by zg, POWCHK disabled, PULCHK disabled
       configuration hash MD5:
       00 E9 B6 7A A2 85 ED C7 34 08 36 98 17 FE 4E 26
       data hash MD5: 32K
       F7 E8 19 D2 A0 0E 70 5C A5 5D CE 92 71 93 33 5D>)
(   2,<2025-01-17 13:52:45.60 +0400>,<she>,<DPX200>,
      <Start of raw data processing
       efp BC_mod = 2 LB = 1.5 FT_mod = 6 PKNL = 1 PHC0 = 1630.077 PHC1 = 448.0856 SI = 64K 
       data hash MD5: 64K
       84 B8 A1 A6 EB C3 FA 65 98 46 5C 19 79 5A FC 5E>)
(   3,<2025-01-17 13:53:29.75 +0400>,<she>,<DPX200>,
      <pk PHC0 = 116.8284 PHC1 = -284.9998 
       data hash MD5: 64K
       48 F0 65 5C F2 BD 1A 95 56 A7 89 06 04 C4 F0 CD>)
(   4,<2025-01-17 13:53:32.87 +0400>,<she>,<DPX200>,
      <abs ABSG = 5 
       data hash MD5: 64K
       45 AE 9F F0 D3 6E 08 E4 79 39 04 98 71 C4 F2 39>)
$$ ##END=
$$ 
$$ hash MD5
$$ 96 00 41 DB 45 EF B7 1F CE 21 85 ED 74 E9 08 6C
##$RELAX= 
##$RELAX= 
##$RELAX= 
##$RELAX= 
##$RELAX= 
##$RELAX= 
##$RELAX= 
##$RELAX= 
$$ Bruker specific parameters
$$ --------------------------
##$DU= <F:/spectra>
##$EXPNO= 2
##$NAME= <P31>
##$PROCNO= 1
##$TYPE= <nmr>
##$USER= <she>
##$AMP= (0..31)
100 100 100 100 100 100 100 100 100 100 100 100 100 100 100 100 100 100 
100 100 100 100 100 100 100 100 100 100 100 100 100 100 
##$AQSEQ= 0
##$AQ_mod= 1
##$AUNM= <au_zg>
##$AUTOPOS= <>
##$BF1= 81.014009
##$BF2= 200.13
##$BF3= 200.13
##$BF4= 200.13
##$BF5= 200.13
##$BF6= 200.13
##$BF7= 200.13
##$BF8= 200.13
##$BYTORDA= 1
##$CFDGTYP= 0
##$CFRGTYP= 5
##$CHEMSTR= <none>
##$CNST= (0..31)
1 1 145 1 1 1 1 1 1 1 1 1 1 1 1 1 1 1 1 1 1 1 1 1 1 1 1 1 1 1 1 1 
##$CPDPRG= <waltz16>
##$CPDPRG1= <>
##$CPDPRG2= <waltz16>
##$CPDPRG3= <>
##$CPDPRG4= <mlev>
##$CPDPRG5= <mlev>
##$CPDPRG6= <mlev>
##$CPDPRG7= <mlev>
##$CPDPRG8= <mlev>
##$CPDPRGB= <>
##$CPDPRGT= <>
##$D= (0..31)
0 1 0 0 0 0 0 0 0 0.06 0 0.03 2e-05 3e-06 0 0 0.0002 0 0 0 0 0 0 0 0 0 
0 0 0 0 0 0 
##$DATE= 1737107562
##$DBL= (0..7)
120 120 120 11 120 120 24 19 
##$DBP= (0..7)
150 150 150 150 150 150 150 150 
##$DBP07= 0
##$DBPNAM0= <>
##$DBPNAM1= <>
$$ [...]
##$SUBNAM3= <"">
##$SUBNAM4= <"">
##$SUBNAM5= <"">
##$SUBNAM6= <"">
##$SUBNAM7= <"">
##$SUBNAM8= <"">
##$SUBNAM9= <"">
##$SW= 400.765351723535
##$SWIBOX= (0..15)
0 1 3 0 0 0 0 0 0 0 0 0 0 0 0 0 
##$SW_h= 32467.5324675325
##$TD= 32768
##$TD0= 1
##$TE= 0
##$TE2= 300
##$TE3= 300
##$TEG= 300
##$TL= (0..7)
0 120 53 12 22 120 120 120 
##$TP= (0..7)
150 150 150 150 150 150 150 150 
##$TP07= 0
##$TPNAME0= <>
##$TPNAME1= <>
##$TPNAME2= <>
##$TPNAME3= <>
##$TPNAME4= <>
##$TPNAME5= <>
##$TPNAME6= <>
##$TPNAME7= <>
##$TPOAL= (0..7)
0.5 0.5 0.5 0.5 0.5 0.5 0.5 0.5 
##$TPOFFS= (0..7)
0 0 0 0 0 0 0 0 
##$TUNHIN= 0
##$TUNHOUT= 0
##$TUNXOUT= 0
##$USERA1= <user>
##$USERA2= <user>
##$USERA3= <user>
##$USERA4= <user>
##$USERA5= <user>
##$V9= 5
##$VALIST= <valist>
##$VCLIST= <CCCCCCCCCCCCCCC>
##$VD= 0
##$VDLIST= <DDDDDDDDDDDDDDD>
##$VPLIST= <PPPPPPPPPPPPPPP>
##$VTLIST= <TTTTTTTTTTTTTTT>
##$WBST= 1024
##$WBSW= 4
##$XGAIN= (0..3)
0 0 0 0 
##$XL= 0
##$YL= 0
##$YMAX_a= 6351
##$YMIN_a= -5045
##$ZGOPTNS= <>
##$ZL1= 120
##$ZL2= 120
##$ZL3= 120
##$ZL4= 120
##$ABSF1= 198.0616
##$ABSF2= -202.7028
##$ABSG= 5
##$ABSL= 3
##$ALPHA= 0
##$AQORDER= 0
##$ASSFAC= 0
##$ASSFACI= 0
##$ASSFACX= 0
##$ASSWID= 0
##$AUNMP= <proc_1d>
##$AZFE= 0.1
##$AZFW= 0.5
##$BCFW= 0
##$BC_mod= 2
##$BYTORDP= 0
##$COROFFS= 0
##$CY= -3
##$DATMOD= 1
##$DC= 0
##$DFILT= <>
##$DTYPP= 0
##$F1P= 0
##$F2P= 0
##$FCOR= 1
##$FTSIZE= 65536
##$FT_mod= 6
##$GAMMA= 0
##$GB= 0
##$INTBC= 1
##$INTSCL= 9.790993e-09
##$ISEN= 30
##$LB= 1.5
##$LEV0= 0
##$LPBIN= 0
##$MAXI= 10000
##$MC2= 0
##$MEAN= 0
##$ME_mod= 0
##$MI= 50
##$NCOEF= 0
##$NC_proc= -9
##$NLEV= 6
##$NOISF1= 182.463
##$NOISF2= 159.3651
##$NSP= 0
##$NTH_PI= 0
##$NZP= 0
##$OFFSET= 198.0616
##$PC= 4
##$PHC0= 1746.905
##$PHC1= 163.0858
##$PH_mod= 1
##$PKNL= yes
##$PPARMOD= 0
##$PSCAL= 0
##$PSIGN= 0
##$REVERSE= no
##$SF= 81.0140089999434
##$SI= 65536
##$SIGF1= 159.3651
##$SIGF2= -187.1042
##$SINO= 113.3802
##$SIOLD= 16384
##$SREGLST= <1H.CDCl3>
##$SSB= 0
##$STSI= 65536
##$STSR= 0
##$SW_p= 32467.5324675325
##$SYMM= 0
##$S_DEV= 0
##$TDeff= 32768
##$TDoff= 0
##$TI= <>
##$TILT= no
##$TM1= 0
##$TM2= 0
##$TOPLEV= 0
##$USERP1= <user>
##$USERP2= <user>
##$USERP3= <user>
##$USERP4= <user>
##$USERP5= <user>
##$WDW= 1
##$XDIM= 65536
##$YMAX_p= 182631755
##$YMIN_p= -369393228
$$ End of Bruker specific parameters
$$ ---------------------------------
##NTUPLES= NMR SPECTRUM
##VAR_NAME=  FREQUENCY,     SPECTRUM/REAL,   SPECTRUM/IMAG
##SYMBOL=    X,             R,               I
##VAR_TYPE=  INDEPENDENT,   DEPENDENT,       DEPENDENT
##VAR_FORM=  AFFN,          ASDF,            ASDF
##VAR_DIM=   65536,         65536,           65536
##UNITS=     HZ,            ARBITRARY UNITS, ARBITRARY UNITS
##FACTOR=    0.49542278885378, 1,            1
##FIRST=     16045.7642231865, 0,            0
##LAST=      -16421.768244346, 0,            0
##MIN=       -16421.768244346, -369393228,   0
##MAX=       16045.7642231865, 182631755,    0
$$ Real data points
##PAGE= N=1
##DATA TABLE= (X++(R..R)), XYDATA
$$ [...]
8815 -4914120 571492 8233770 12760343 12780052 12572066 15188032 17594596 15898485 11895202
8806 11895202 9575363 7565559 1241866 -8096183 -12706629 -8891692 -2549915 -1073057
8798 -1073057 -3815327 -4540784 -571936 4800886 7746969 7688421 5721358 2682279 -194709
8789 -194709 -1003909 978282 4114055 5916270 5170641 2214507 -2031751 -6475699 -9569304
8780 -9569304 -9535957 -5619391 710247 6256902 8538328 7983722 7343739 8679153 11191453
8771 11191453 12239440 10273123 6494634 3653742 3369898 4757012 5622805 4596595
8763 4596595 1744590 -2166498 -5655425 -6025548 -1192408 6660683 11121514 7659401
8755 7659401 -917838 -7277816 -7521162 -4159495 -1451397 -743980 -1325912 -2991483 -5509872
8746 -5509872 -7189890 -6398284 -3958078 -2203462 -1972130 -2135063 -1893086 -1842744 -2475669
8737 -2475669 -3079034 -2901917 -2535197 -3176422 -4691380 -5129533 -2583126 2540734 7495839
8728 7495839 9735048 9206028 7731463 6592583 5679327 4776942 4237257 3956161 3037717
8719 3037717 1250965 -359602 -1203547 -2210662 -3953852 -5050823 -4284589 -3299537 -4749634
8710 -4749634 -8044944 -9564311 -7583809 -4470959 -2827186 -1808955 671031 3709554
8702 3709554 4025929 440477 -4539073 -7961044 -9514133 -10651249 -11895854 -12098692 -10036176
8693 -10036176 -6124067 -2467497 -1131821 -2159349 -3558425 -3603833 -2689851 -2311469 -2834038
8684 -2834038 -3353630 -3352779 -3075308 -2279647 -147728 3128757 5940257 6971301 6278961
8675 6278961 4395349 1753053 -538407 -1047343 -132957 -136202 -2202694 -4367311 -4262779
8666 -4262779 -2310345 -502836 492495 752516 -1049302 -6140502 -12349776 -15394837 -13963724
8657 -13963724 -10945613 -8951909 -7170093 -3883526 34613 1869277 233672 -3595297
8649 -3595297 -6741785 -6790757 -3928735 -1105183 -590916 -661379 1964838 6453076 7905956
8640 7905956 4090519 -1273707 -3791878 -3627689 -2784359 -369660 5394051 12340897 15890903
8631 15890903 14803007 11721886 8479165 4682970 912109 -855305 -937778 -2262940
8623 -2262940 -5393700 -6702811 -3829162 -80794 -360513 -4493572 -7784102 -7406517 -5233019
8614 -5233019 -4264790 -4947376 -5912585 -6362091 -6327711 -5815527 -5241248 -6021941 -8961721 -12102397
8604 -12102397 -12186517 -9157169 -7319558 -10065725 -14652977 -14915615 -8902138 -899183 4559918
8595 4559918 7396953 9253336 9531853 7291461 4780511 5196569 7725159 8321114 5371905
8586 5371905 1513031 -467629 -711894 -698605 -1115277 -2193541 -4043429 -5674800 -5338394
8577 -5338394 -2646795 915701 3836250 5404705 4726241 1018161 -4564048 -9276594
8569 -9276594 -11643832 -12428343 -12426918 -11121835 -8038516 -3728883 1052783 5486868 7798468
8560 7798468 6268331 1641712 -3255676 -6488954 -7682196 -6140885 -1450997 3702763
8552 3702763 4933612 1784052 -1149221 -308867 2636737 4444066 4856902 5112065 4941108
8543 4941108 3996820 3643074 4190325 2844881 -1980847 -6509338 -5977454 -1772289 239484
8534 239484 -2133139 -5394762 -6568403 -6797580 -7450878 -6685200 -2437766 3589200 7433143
8525 7433143 7212830 4314239 1176729 -683491 -1037227 -613601 -474699 -1199647 -2563136
8516 -2563136 -3892279 -4490394 -3927654 -2318692 -224163 1832102 3455675 4225060 4303804
8507 4303804 4938087 6858104 8287708 6771733 3495541 3016524 7070379 11112248 9370101
8498 9370101 1567462 -7671905 -14411130 -17857267 -18767540 -18289177 -17548179 -16063371 -11681039
8489 -11681039 -4352103 1660904 2328751 -692576 -2251643 -75685 4320777 9562923
8481 9562923 15041334 18501780 17659579 14255438 12232345 11779385 9630760 5488337 3023489
8472 3023489 3348467 2714554 -1055225 -4506762 -3838243 -433232 1850202 1673777 -210914
8463 -210914 -3121296 -5326020 -4071150 16863 1694646 -1971129 -6208601 -4394011
8455 -4394011 2686471 7966682 7390741 3660716 1008973 393539 615132 1031600 1942485
8446 1942485 3961365 7397603 11057426 12165075 9050115 3373431 -1706650 -4604143
8438 -4604143 -5107382 -2812152 1825766 6163823 7900931 8206685 9719808 12110849 12364347
8429 12364347 9033023 3579964 -2051851 -6445266 -7727725 -4792294 208091 3396631
8421 3396631 3653596 3098050 2931650 1682419 -1697123 -5648107 -8007251 -8124529 -6224443
8412 -6224443 -2776902 673805 2094452 1296774 -17254 -1033255 -2627284 -4881063
8404 -4881063 -6132284 -5435632 -3852196 -2410099 -1020654 -358276 -2208218 -6370752 -9600325
8395 -9600325 -9569162 -7860900 -7036351 -6807574 -5653344 -4494418 -5628321 -8746160 -10952054
8386 -10952054 -10706696 -9299455 -8218483 -7322368 -6199037 -5440465 -5645468 -6405264 -7049088
8377 -7049088 -7450992 -7484049 -6584438 -4670648 -2953388 -2987947 -4955734 -7359282 -8497512
8368 -8497512 -7982012 -6707645 -5654788 -5230896 -5809573 -8074856 -11983000 -15695775 -16592281
8359 -16592281 -13656544 -8382241 -3295204 -87127 981467 677647 -17612 -744114 -1619669
8350 -1619669 -2016229 -522694 2743019 4882984 3236471 -963709 -4186666 -5409964
8342 -5409964 -6570182 -8317302 -8856680 -7992082 -8607233 -11897390 -14246279 -11827166 -6059156
8333 -6059156 -1445602 148105 -85107 -1425674 -3846956 -5723934 -5131829 -3112618 -2275271
8324 -2275271 -2593235 -2230527 -2085424 -4976393 -9773158 -11180611 -7186675 -2352166 -1083611
8315 -1083611 -1608992 -101802 2598298 2871229 906637 672154 3806695 7662271 9722072
8306 9722072 10440501 10823417 10071936 6977344 1859651 -3766496 -8071720 -9214414 -6565714
8297 -6565714 -2088714 1200075 2529575 3372965 3975775 2442420 -1597020 -4939153 -4647776
8288 -4647776 -2444611 -2837505 -7388519 -12895514 -15293193 -13791816 -10893709 -9454156
8280 -9454156 -10106450 -10983675 -9817427 -6515976 -3287196 -1973170 -2214320 -3013061 -4889155
8271 -4889155 -8731974 -13024558 -14310234 -10942232 -4966616 232897 2915154 3118965
8263 3118965 1332795 -1717832 -4734637 -6578278 -7280370 -7776850 -8900046 -10869160 -12980210
8254 -12980210 -13273326 -9616667 -2347118 4912820 8586793 8916578 8800748 9190109 7996461
8245 7996461 4278028 978431 1290920 3697774 3416175 -1291974 -6773599 -8700616 -7042045
8236 -7042045 -4991715 -4586954 -5294998 -6008378 -6248841 -5511049 -3524945 -1734355 -2639984
8227 -2639984 -6431321 -9556541 -8262766 -3083415 1586375 2230942 -701915 -4369536
8219 -4369536 -6624260 -6876036 -5217112 -2199945 795795 2390301 2859279 3997751 6589285
8210 6589285 8799113 8375379 6173355 5662205 8098878 9901567 6874139 352548 -3443599
8201 -3443599 -828183 4776960 7103683 4231712 -360364 -2779709 -2320400 -296773
8193 -296773 2187475 4302778 4964554 3652808 1236532 -809552 -1701344 -1602685 -1243571
8184 -1243571 -1591460 -3102002 -4802526 -4911528 -3060599 -1228771 -1572764 -3665146 -4714686
8175 -4714686 -2450257 2729429 8152608 10663893 8307027 1542321 -6440073 -11269306
8167 -11269306 -10461290 -5438658 -171641 2419405 2396757 1191315 -729610 -3401157 -5459980
8158 -5459980 -5017425 -2916952 -2911614 -7172373 -13301662 -17498841 -19027234 -19252349 -17831748
8149 -17831748 -13278283 -6896169 -2584961 -2111561 -3578145 -5172875 -7103263 -8806935
8141 -8806935 -8142197 -5555365 -5347111 -9454264 -13010000 -10349528 -3473495 166712 -2474662
8132 -2474662 -7047064 -8786058 -7921035 -6894182 -6215074 -5302845 -4608834 -4535538 -4078822
8123 -4078822 -2451744 -596852 404735 911899 1298341 557780 -2015820 -5106975 -6970346
8114 -6970346 -7503192 -7147740 -5178759 -1213055 2684761 3967360 3301461 3795738 6339665
8105 6339665 8105287 6556605 2935145 279204 -674216 -1690320 -3507533 -4090551 -1397709
8096 -1397709 3081600 5130484 2528708 -2127187 -4370921 -3056623 -1144010 -1316779
8088 -1316779 -2712847 -3112896 -2771105 -3863600 -6561373 -8123361 -6737887 -4266930 -3427518
8079 -3427518 -3518739 -1463944 2931119 5465650 2738051 -3059047 -6760580 -6600463 -5383281
8070 -5383281 -5639408 -6594659 -6644836 -5926217 -4834371 -2520096 949751 3061614 2079421
8061 2079421 -11748 -685244 -1157991 -3705575 -6130355 -3939836 1903249 4824726 1965794
8052 1965794 -1276205 942837 6670511 9686237 8234180 5689828 4328144 3171754
8044 3171754 1588868 754478 992178 987209 295266 -211187 -955518 -3758962 -8238155
8035 -8238155 -10739959 -8537602 -3342046 796337 1724320 230903 -1627338 -1823750 868033
8026 868033 5788428 10452610 12698956 12484643 11075319 9253821 7101727 4808229 2682649
8017 2682649 692118 -1291796 -3123433 -4821654 -6824969 -9001825 -9860197 -7818271
8009 -7818271 -3253488 1637115 5182444 7552857 9371860 10055467 8638243 5761638
8001 5761638 3369681 2207103 1091720 -580892 -1188384 676619 3399675 4415610
7993 4415610 4536350 7183854 12792224 17111148 16686201 13260543 10365733 7954620 3736115
7984 3736115 -1653925 -4741796 -4404972 -3499345 -4582030 -6904394 -8758293 -10285062 -12348254
7975 -12348254 -14370035 -14898845 -13308707 -9928805 -5574299 -1772368 -151543 -482856
7967 -482856 -360243 1989926 5278511 6545374 4506116 741584 -2063459 -2498192 -1353644
7958 -1353644 -553399 -1089488 -2272858 -3265321 -4329448 -5472741 -5127965 -2355145 499590
7949 499590 304349 -1853192 -1629473 1905030 4352307 2574549 -449345 -332813 2121729
7940 2121729 2852435 1093334 -219241 295907 1012591 1208369 2536433 5567868 7971566
7931 7971566 7607589 5297498 3344186 2998322 4140677 5671891 5480585 1871842 -4043320
7922 -4043320 -8875926 -10464645 -9323595 -6523684 -2631163 548124 151850 -3928886
7914 -3928886 -7751342 -8034902 -6284765 -5901998 -6976950 -6804999 -4358583 -1175994 1569544
7905 1569544 3794516 4455456 1945601 -2817386 -6318749 -6321421 -3706807 -45339 3928733
7896 3928733 6476730 4714774 -1264583 -6403848 -5908862 -1469734 652457 -2396601
7888 -2396601 -6554244 -5857684 905502 9363408 14079622 13040802 8428246 3893042
7880 3893042 1262088 -127302 -1257387 -1750411 -994263 164439 281832 -516472 -579489
7871 -579489 1080646 3711375 5963581 7275415 8141422 9560716 11866219 13720896 13324528
7862 13324528 11363242 11078929 13757140 15966722 13970749 9366344 6644544 5951879
7854 5951879 2943708 -3559478 -8684568 -8429309 -5208042 -3407109 -3038088 -1719524 -192402
7845 -192402 -1248063 -4533121 -6756313 -6596140 -5698838 -5123815 -4405783 -4126086 -5863347
7836 -5863347 -9127764 -11468420 -12107838 -12465005 -12585893 -10290419 -4915008 968154 4781091
7827 4781091 6368674 6180812 3804201 -176457 -3328198 -4178858 -3929050 -3794051 -2605855
7818 -2605855 1128630 6358617 10450677 11925000 11026181 8838293 6904337 6417187 6942328
7809 6942328 7360866 8398201 11801295 16191176 16814277 11407592 3693640 -1360090 -3415976
7800 -3415976 -5161038 -7042437 -7179990 -5401526 -3822794 -3526975 -3398433 -2263954 -28979
7791 -28979 3013689 5862543 6248610 2818767 -2207031 -4828932 -3850364 -1701931 -681119
7782 -681119 -490217 102607 1070680 1427153 629421 -833515 -1749785 -1263647 -78084
7773 -78084 240630 -257274 371120 2567419 3477727 638204 -4140175 -7152989 -7782537
7764 -7782537 -8136619 -8667467 -7598187 -4603352 -1805089 -671173 -670720 -1396151 -3324418
7755 -3324418 -5908966 -7394596 -7158645 -6138527 -4760016 -2769730 -1124408 -1317759 -2641972
7746 -2641972 -2950504 -2290891 -2613200 -3690987 -3145917 -1236550 -1299790 -3724824 -3747707
7737 -3747707 2043970 10534748 16330616 17987826 16858264 12949431 6139612 -523618
7729 -523618 -3035738 -1145091 2305558 5511610 7973730 8151097 4915097 773495 -334949
7720 -334949 1427946 2042849 -297970 -2933483 -3351507 -2657971 -2929906 -3877750 -4054774
7711 -4054774 -3458897 -3039613 -2791840 -1904259 -199193 1557504 2406447 1942611 914474
7702 914474 981220 2814060 4529680 3451291 -326432 -3565133 -3534448 -735870 2490486
7693 2490486 4620162 5304336 4352014 1859967 -921266 -2082984 -939190 952498 1294720
7684 1294720 -52629 -214577 3528258 9719424 13439160 11672377 6320924 877214
7676 877214 -3748919 -8001183 -10349907 -8759482 -4932731 -3447054 -5960900 -9196210
7668 -9196210 -9668177 -7792540 -5982952 -5010899 -3952873 -2021015 1136348 5503730 9632077
7659 9632077 10924562 8534166 4826763 2574612 1856010 1068476 -390269 -2202527 -4589324
7650 -4589324 -7412351 -8478762 -5159454 2051281 9274796 12845096 12009249 8251950
7642 8251950 3598557 -103768 -1812175 -2156023 -2916208 -4905465 -6762176 -6343661 -3139100
7633 -3139100 954435 3225481 2572601 450973 -687954 201838 2299137 4551548 6659749
7624 6659749 8219148 8291395 6748369 4962138 4124931 3902002 3796686 4431284 5766859
7615 5766859 5494789 1835902 -2852952 -4461887 -3185769 -3718960 -8225897 -12424090 -10988851
7606 -10988851 -4368692 2649865 7410566 11079490 14658310 16830593 16338097 13863228
7598 13863228 10696419 7602050 5758549 6684763 9999969 12951590 13449370 12125252
7590 12125252 10276396 7646652 4086092 1675223 2429859 4631245 4351120 725148
7582 725148 -3039862 -4514861 -5026752 -6235158 -6371728 -2802984 2869950 5520430 2641577
7573 2641577 -2733737 -6185885 -6875378 -6838339 -7028576 -6488462 -4973250 -3866122 -3840274
7564 -3840274 -3698317 -2780080 -2650866 -4312190 -5105154 -1491418 5095671 8483754 5285513
7555 5285513 -456356 -2378827 446314 3669891 4208512 3173389 2499855 2220910 2082872
7546 2082872 2858389 4296879 4038377 733969 -3147390 -3716608 -191698 4514574 7114641
7537 7114641 6552383 4028026 1897134 2133610 4580969 6912204 7199465 6071011 5477929
7528 5477929 5993781 6428606 5654880 3823597 2103847 1822412 3185057 4364353 3033002
7519 3033002 -495959 -3247353 -3794326 -4522817 -7827211 -11968968 -13392190 -11753013 -9601364
7510 -9601364 -8070019 -6298904 -4610260 -4445408 -4921294 -3334842 -74639 708431 -2920627
7501 -2920627 -7225304 -7461841 -3451987 1517563 4880994 5675937 3711629 675557 287098
7492 287098 4430198 10169150 12929419 11498064 7800542 3456111 -617215 -2672218
7484 -2672218 -1689672 162362 -138850 -2081743 -2744147 -1831336 -1796758 -2814194 -1932811
7475 -1932811 1450351 3377643 955551 -3219822 -5255038 -5791274 -8002207 -11680263
7467 -11680263 -13533376 -12811615 -12496161 -14152268 -15121676 -12554820 -7740857 -4325351 -3724966
7458 -3724966 -4293677 -4099577 -2585748 134905 3813686 7673980 10734831 12757085 13926489
7449 13926489 13690210 11294183 7752269 5668097 6118195 7018518 5998221 3933308 3786239
7440 3786239 6308112 8943737 9386908 8361262 7886433 8237630 8055434 6694150 5051088
7431 5051088 4315695 4979827 6938919 9564557 11609669 11860128 10124193 7189030 3909316
7422 3909316 874582 -1163922 -1310771 706757 4028786 6931408 7459772 4272108 -2247915
7413 -2247915 -9463918 -13686407 -12627862 -7072129 -311761 4166060 4997844 3590964
7405 3590964 2644162 3820509 6531652 8544315 7593743 3076693 -2921221 -6539613 -5339916
7396 -5339916 -934427 2534699 2817585 1366207 478565 308591 -258271 -1341404 -2399486
7387 -2399486 -3757320 -5748951 -6814865 -4600215 823960 6549180 10037369 11322224
7379 11322224 11679113 11696634 11518240 11752878 12919255 14442121 15082813 14282294 12662630
7370 12662630 11254402 10337828 9007407 6178196 2326163 -289570 151054 2940647
7362 2940647 5716641 6976015 6831878 5892959 4828593 4795751 6635585 9308943 10380318
7353 10380318 8413427 4031387 -1168725 -5480403 -7291258 -6377571 -4991657 -5466925
7345 -5466925 -6505700 -4502635 639434 4120074 2620638 -722642 -694104 2656999 4685062
7336 4685062 3212358 983398 718864 1380810 960595 290192 1746135 5423040 8638285
7327 8638285 8935995 6311374 2608529 -326194 -1745099 -1745472 -334723 2683045 6469405
7318 6469405 8596611 7137831 3225125 22013 -1085230 -1609426 -2758432 -3249434 -1943168
7309 -1943168 -851936 -2786611 -6555294 -7459958 -3339775 2230503 4191579 1712897
7301 1712897 -2041315 -4346610 -4628398 -2445445 2975612 10044503 14155422 12070979
7293 12070979 6022772 1433847 990916 2869372 4571321 6069301 8248666 10294832
7285 10294832 10521126 9015155 7804525 8423817 10311668 11577223 10654430 7392260 3198623
7276 3198623 -67842 -1898833 -3482664 -5710120 -7564389 -7584183 -6302538 -5568630 -5503064
7267 -5503064 -4066150 -457590 2721668 2295105 -1263691 -4080889 -3344361 -193309 2193221
7258 2193221 2268463 1081360 254608 136992 64725 -425435 -1225792 -2114188 -3002348 -3872180
7248 -3872180 -4930638 -6589682 -8588423 -9314839 -7152617 -2905763 232740 27583 -2257469
7239 -2257469 -3664657 -3152676 -1995834 -991864 844774 4230182 7695250 8855994
7231 8855994 7035215 3772183 958638 -916794 -2639252 -4670028 -6000955 -5240444
7223 -5240444 -3149078 -2957984 -6612967 -11196171 -11289164 -5480333 1441309 3899368 1414182
7214 1414182 -2399044 -5000510 -6672854 -7869317 -7596805 -5155443 -1824401 120216
7206 120216 -490967 -2631301 -3486846 -595485 5108993 8942061 6959973 635575 -4825340
7197 -4825340 -6624285 -6375688 -5857529 -4104395 -360060 3063783 3677045 2674454 2937624
7188 2937624 4411129 4580778 2881664 1372002 1076127 940476 935648 2768425 6021448
7179 6021448 6672401 1975782 -5138587 -9168854 -8369246 -5505753 -3127316 -916539 2038130
7170 2038130 4857281 5989053 5351811 4191747 3500962 3504149 4286798 5928337 7840533
7161 7840533 8704409 7776062 6167960 6025143 7957115 9932586 9498343 6546385 2867809
7152 2867809 -392787 -3219123 -5067549 -5019991 -3987348 -4370702 -6457009 -7397141 -5279418
7143 -5279418 -2060478 -483631 -115522 1119689 3280484 5110647 6727453 8264270
7135 8264270 7344206 2148137 -3766929 -4613386 -631895 1926147 311495 -759774 2550073
7126 2550073 6228444 4449716 -1379331 -5226583 -5505518 -5357411 -5144498 -1582587 4671348
7117 4671348 7074869 1973535 -5501078 -8326661 -7037172 -7770936 -12808669 -17854123
7109 -17854123 -18547030 -15356892 -10782100 -5172622 2155631 9506980 13347990 12194348
7101 12194348 8138844 4196657 1532244 -92476 -485660 834880 2990090 3803103
7093 3803103 2216866 -134811 -553273 1825230 5295601 7525045 7738048 7023347 6740249
7084 6740249 6655771 4959652 786908 -3441111 -3546589 1764620 8777688 12333462 10872636
7075 10872636 6978607 3767089 2270058 1997139 2274844 2548833 2440489 1909841 767148
7066 767148 -1707399 -5562980 -8870688 -9271293 -7198890 -5964420 -7700573 -10375851 -9993974
7057 -9993974 -5178191 1363665 5587110 5595583 2682326 -332627 -1639041 -1573932 -1481200
7048 -1481200 -1887019 -2197579 -1775881 -543278 1264521 3070943 3866553 3169169 2011877
7039 2011877 1878332 2702644 3197435 3139972 3640128 4691649 4251301 838548 -4220243
7030 -4220243 -8184376 -9456198 -7898282 -4003289 877675 4545971 5758381 5468022
7022 5468022 5125251 4511036 2529209 -610962 -3457713 -5030352 -5151915 -3711018 -1110636
7013 -1110636 1051380 1403840 695853 828368 2288731 4015232 5392615 6617637 7353206
7004 7353206 6996426 6232657 6170771 5738777 2411892 -3565699 -7995050 -7367843 -3175912
6995 -3175912 3028 -316839 -2635689 -3907889 -2590482 245005 1995149 1222952 -383022
6986 -383022 222425 3426395 6330553 6735847 5633694 4503047 2633904 -486698 -2289186
6977 -2289186 -68492 4241924 5932904 4022661 2261437 3054057 4000240 2058847 -1903298
6968 -1903298 -4906771 -5889583 -5622052 -4454161 -2670623 -1740334 -2582593 -3408484 -1825232
6959 -1825232 1411093 3290021 3010867 2890708 4416459 5960251 5526033 3714626 2447870
6950 2447870 2134737 1682132 527631 -755672 -1553726 -1836513 -1762991 -1346827 -530814
6941 -530814 664371 1934685 2718471 2904884 3262649 4172063 4067392 768214 -4991668
6932 -4991668 -8943216 -7570851 -2167977 2634923 3704836 1570839 -1462121 -3671050
6924 -3671050 -4522198 -4466112 -4517314 -5191937 -5808597 -5560755 -4912280 -4775476 -4591373 -2787458
6914 -2787458 649731 3586742 4302272 3324903 2016634 643448 -1044287 -2381869 -2459274
6905 -2459274 -1818025 -2059477 -3636697 -5073466 -4680704 -2342376 648845 2873035 3550916
6896 3550916 2657092 938091 -395385 -636180 -277134 -156435 207992 2516932 7102018
6887 7102018 11149797 11126724 7231580 3819447 4353114 7186386 7917403 5114041 1693445
6878 1693445 683492 1680561 2244420 1182647 -672590 -1818665 -1004817 2346147 7250235
6869 7250235 11078316 11714618 9898661 8388406 8571417 8866869 7040317 3356061 434698
6860 434698 64642 1158759 1402190 126627 -1548502 -3007822 -4837212 -6738902 -6610960
6851 -6610960 -3309981 881177 2672942 2160674 2516361 5188486 7751150 7330442 4083097
6842 4083097 -53522 -4365916 -9290940 -14174685 -16763662 -14930175 -8405722 501001
6834 501001 7468683 8789603 4699950 -618878 -3297948 -3288689 -3017683 -4008623 -6109082
6825 -6109082 -8617172 -10339487 -9644382 -6566290 -4022456 -4535024 -6186529 -4553631 1037950
6816 1037950 5815846 5169750 -78751 -5357778 -7715616 -7838990 -7563321 -7154122 -5377830
6807 -5377830 -1473253 3489468 7339663 8766680 8116222 6241902 3594959 997193
6799 997193 -109273 331746 -125649 -3436511 -7591920 -8573065 -5687643 -2438047 -1748694
6790 -1748694 -2935102 -4154804 -5118129 -5936035 -5785679 -4680737 -4476808 -5903867 -6449285
6781 -6449285 -3777672 280330 2221298 2379637 4397508 9104931 12485275 11115166
6773 11115166 6961059 4806683 6585121 10193139 12813057 13378196 12160788 9863023
6765 9863023 7543369 6170302 5542880 4304984 1650058 -1343564 -2693908 -1785648 -118472
6756 -118472 430137 -347476 -1146977 -1061781 -514981 -105985 570299 2123200 3839675 4138012
6746 4138012 2853363 2093467 3858055 7109098 8361357 5666943 1173424 -1218681
6738 -1218681 -248531 1976956 3531598 5006763 7277542 8730940 6965337 2603509
6730 2603509 -997432 -2045804 -2118414 -2981652 -3767665 -2732788 -189152 2122749 3575852
6721 3575852 4732132 5442101 4748971 2736593 931773 446511 730030 519758 -735329
6712 -735329 -2677790 -4591052 -5790937 -5926113 -5296182 -4792165 -5305027 -6944706 -8597956
6703 -8597956 -8463827 -5593726 -934001 3617016 6951837 8869718 9126955 8037978 7703933
6694 7703933 10055721 12919914 10926533 2460518 -6548699 -8672576 -3432370 3311457
6686 3311457 7340459 9738937 12616140 15157948 15543794 14016310 12109728 10638171
6678 10638171 10041451 11073495 13389623 14635857 12661886 8039754 3268254 202309
6670 202309 -840317 -429207 374411 539331 178854 397978 1292344 1261520 -597721 -2586582
6660 -2586582 -2352488 19703 2154594 1917776 -1246134 -6303831 -10396478 -9861874 -3830941
6651 -3830941 3651314 7310210 6284039 3998103 2719892 1084314 -2333513 -5898515
6643 -5898515 -7175418 -6330964 -5220534 -4385857 -3083654 -1511731 -802863 -926950 -519575
6634 -519575 947322 2444145 3225727 3847312 4692674 5021961 4604509 4955911 7252765
6625 7252765 9852307 10041340 8158482 7543583 9497754 10710429 7875181 3216701 2203308
6616 2203308 5911680 9052829 6932927 1525537 -1867778 -2034811 -2527326 -5450010 -8212142
6607 -8212142 -7656055 -4666231 -2582307 -2688907 -3591509 -4188096 -4775056 -5216837 -4422781
6598 -4422781 -2532206 -1704089 -3219819 -5043051 -4082176 -322594 3106333 3838845 2369427
6589 2369427 44570 -2829773 -5787602 -7135789 -6016958 -4195227 -3615438 -3224398 -819303
6580 -819303 2663134 4057364 3347550 4280006 8012197 9822794 5236961 -3129830 -8549561
6571 -8549561 -8452779 -5776424 -2879510 1286279 7102438 11519393 11593262 8160432 3917653
6562 3917653 -7235 -3427470 -4970476 -3339201 59425 2074079 1302783 -852747
6554 -852747 -2270913 -1900749 92553 2570903 4012907 3916469 3263404 2781085 1643598
6545 1643598 -868434 -3466546 -4427759 -4347200 -5209517 -7056822 -7906270 -7152685 -6686089
6536 -6686089 -7831312 -9206634 -8783991 -6482810 -3491653 -429145 2331963 3565489
6528 3565489 2168505 -1044550 -3853424 -4946724 -4814203 -4333359 -3295551 -688528 3787729
6519 3787729 8712033 11750029 11777465 9804798 7140565 3345647 -2323836 -7640985 -8201169
6510 -8201169 -2959339 3052101 4045401 711107 -478588 4590291 12506773 16310506
6502 16310506 13059856 6100991 722179 -870886 -240172 307644 436123 1475205 4035321
6493 4035321 6660916 7232383 5474427 3575965 4079372 7208255 10440358 10955186 8610097
6484 8610097 6153770 6111952 7850009 8474780 6418638 3085716 900904 937989 2806150
6475 2806150 5503886 7545173 7378360 4758913 973427 -2962090 -7076980 -10467449
6467 -10467449 -10364800 -5455062 812789 2958595 -285595 -4610087 -5439717 -2678440
6459 -2678440 489960 1627291 632934 -1367374 -3207363 -4082579 -3683400 -2087623 351431
6450 351431 2697716 3676055 3362405 4090065 7860443 12837125 14484480 10854264 4854776
6441 4854776 323660 -2230741 -4477374 -6569862 -6891943 -4931624 -2390777 -1187752
6433 -1187752 -1566109 -2453101 -2954737 -3286120 -4492500 -7134621 -10228789 -12070299 -12252083
6424 -12252083 -12065371 -12625293 -13545912 -13894772 -13422800 -12229963 -10198979 -7504274 -4880838
6415 -4880838 -2799566 -1176990 -209933 -305841 -814876 -380379 820994 966653 -331457
6406 -331457 -752701 1526313 5131145 7582840 8317056 7829813 5759132 2222530 -524230
6397 -524230 -451918 1356515 2612810 3160994 3608392 2352760 -2137998 -7076989 -7828656
6388 -7828656 -4636471 -2554829 -4106300 -6397517 -6748699 -6685476 -8054862 -9150801 -7810746
6379 -7810746 -5374579 -4318588 -4232765 -3318124 -2008555 -1876623 -2365976 -1877611 -1177993
6370 -1177993 -2493272 -5539921 -7397880 -6492695 -4261163 -2503434 -1104202 1120542
6362 1120542 4813807 9684748 14650142 18296227 19948830 19845697 17640431 12153899
6354 12153899 4172758 -2035952 -2694626 564640 2520313 1121388 -378681 1325320
6346 1325320 4973823 6919861 5899989 3709138 2302799 2108978 2691686 3397225 3289609
6337 3289609 1733499 -556488 -1878842 -1467835 -534825 -804779 -2372783 -3881005 -4756844
6328 -4756844 -5960378 -7826723 -8639408 -7086614 -5118327 -5723857 -7902385 -6860789 -381469
6319 -381469 7609767 11590867 10381014 6584919 2382762 -1319498 -3243447 -2701030 -1689211
6310 -1689211 -3034141 -6570293 -9669809 -11152926 -11877653 -11814349 -9880756 -6988033 -5876767
6301 -5876767 -7059885 -8107779 -8049094 -9056167 -11905590 -13082795 -9302052 -2565941 2407781
6292 2407781 4205092 5037637 6205150 6685241 6070854 5671735 5974485 5612916 4042230
6283 4042230 3184594 4806489 7576228 8579990 7352897 6642665 8591223 11315967 10643198
6274 10643198 5301300 -825102 -2624275 541078 4283724 4383370 1185175 -1865589
6266 -1865589 -2891818 -3266829 -4739533 -6331415 -5185618 -310935 5565562 8650798
6258 8650798 8183234 6798562 6789388 7464439 6957290 5142479 3252399 1722634 330952
6249 330952 -263538 671918 1897708 1289089 -896320 -2077552 -1009853 866893 2195896
6240 2195896 3320173 4251731 3653957 1434137 105427 1562693 4156079 4942243 3528037
6231 3528037 1808230 1033478 989404 1164634 1015000 -165539 -2148043 -3321707 -2604830
6222 -2604830 -853040 735631 2273847 4005565 5173754 5670774 6900484 8854399
6214 8854399 8288851 2728093 -5079106 -9770405 -9433451 -5995278 -725008 6567881 13851000
6205 13851000 16624241 12972732 6229059 1275181 113040 1724845 4074549 5386757
6197 5386757 5399463 6064917 9233658 13351749 14626931 11898266 8052042 6026510 5688003
6188 5688003 5259000 3508521 -59795 -4740907 -7796925 -6815786 -3552601 -2421780 -4399683
6179 -4399683 -5902358 -4838195 -3639813 -4176393 -3995288 -1045223 1612187 157970 -3689336
6170 -3689336 -5387119 -4526800 -4154382 -4526747 -2959162 227525 911948 -2434660 -5846484
6161 -5846484 -5180981 -1157982 2630918 4219599 4287091 4790268 7739228 13367794 18609704
6152 18609704 19409441 15387088 10189764 6598275 3784976 401869 -2439038 -3159176
6144 -3159176 -2462876 -1911715 -1335439 245818 2343260 3668918 4196738 4701939 4961409
6135 4961409 4252242 3201950 3307973 4553530 4988510 3106172 -298893 -3128558 -4354979
6126 -4354979 -4882918 -5981687 -7296182 -7211291 -5286279 -3045024 -1516607 499319 4038876
6117 4038876 7328587 8179494 8069699 10485516 15379515 18977531 19583315 19532710 20058141
6108 20058141 18525624 13387395 8073337 6395785 6931660 5732839 2336030 -835864
6100 -835864 -3141897 -5543659 -7036841 -5557834 -1808635 1764001 5130039 9678054
6092 9678054 13643108 13269178 8792695 4634995 2942271 1592494 -345002 -303467 2486275
6083 2486275 4278145 2571907 514937 1925768 5418480 7505161 8517677 10750097
6075 10750097 12833863 11149821 6118060 2234836 1588954 1685033 689491 840114 4499171
6066 4499171 9592853 11730509 9837727 7449948 8176508 11119462 11829179 7965618 2876828
6057 2876828 1899200 5468003 8541233 7650334 5369886 5541274 7078747 6344637 3724485
6048 3724485 2994548 4477266 3815751 -1099958 -6213595 -6720457 -3378945 -719692 -1063043
6039 -1063043 -3070020 -4916601 -6144221 -6686808 -6241005 -4909708 -3271286 -1714928 -453920
6030 -453920 57367 -497812 -1727912 -2993871 -4163931 -5276916 -5723469 -4511141 -1452587
6021 -1452587 2326215 5292366 6896983 7932254 9307336 10643675 10743151 9488503 8157682
6012 8157682 7310719 5744153 2757126 116834 -160769 897857 495160 -1667686 -2848929
6003 -2848929 -1291477 1491424 3164389 3327126 2863660 2111986 753119 -1364495 -3723127
5994 -3723127 -4694958 -2145758 3742482 8696661 7981755 2084996 -3746698 -5950082 -5631931
5985 -5631931 -4542383 -1994156 2058157 4395884 2439384 -1300412 -2004256 1481159
5977 1481159 6298815 9949008 11937776 11947551 9671709 6457804 4305460 2920179 174950
5968 174950 -4048918 -6756208 -5563453 -1990296 121123 -1136357 -3812928 -4508892 -2556518
5959 -2556518 -1087327 -2911157 -6086387 -6010362 -2085237 889314 -596698 -3909750 -4593961
5950 -4593961 -2626961 -947928 -23773 1997513 4945759 6538177 6168934 5170104 3702923
5941 3702923 1016587 -1485821 -1266951 1157987 2794554 3178543 4903487 8484685 10647931
5932 10647931 9022666 5115275 1355965 -1540832 -3116204 -2574232 -1169217 -1857928
5924 -1857928 -4937414 -7215274 -6980446 -6203060 -6083890 -4569176 -946089 1148764 -1113553
5915 -1113553 -5004751 -6579981 -6712229 -8299205 -9984560 -7979154 -2988272 -66370
5907 -66370 -1375702 -3473241 -2607764 752274 3567906 3642014 688387 -3656038 -6357781
5898 -6357781 -5495713 -2444514 94650 1609378 3054236 3493521 774487 -4343343 -7956287
5889 -7956287 -7692529 -4997946 -2099155 629121 3327718 5288398 6342583 7638116
5881 7638116 9693209 11195297 10708498 8187162 4306631 117114 -2143515 -273763
5873 -273763 4613815 8107063 7345450 4244332 2476738 2971435 4209749 5493165 7536836
5864 7536836 10283496 12153012 11765331 9407132 6753320 5694163 7059653 9849259
5856 9849259 11986751 12176163 10619851 8020058 5028807 2878841 2901905 4464518 4852931
5847 4852931 2674795 352457 1498464 6154134 10149226 9391161 3989236 -1885141
5839 -1885141 -3757830 -798046 3470913 4769996 2637858 574967 1259061 3143234
5831 3143234 3175712 1555070 1386544 3777961 5736530 4018982 -469538 -3605139 -2839110
5822 -2839110 128196 1494772 -613728 -4606601 -7550406 -8263997 -7989915 -8210033 -8472921
5813 -8472921 -6883748 -2591563 2645484 5607080 4546481 1265776 -8594 3352639
5805 3352639 9298523 12913153 11743204 8300875 6454515 6514333 5588354 2235275 -1455258
5796 -1455258 -2905114 -2264239 -1479461 -1610802 -2597114 -4711590 -8315210 -12242276 -14117958
5787 -14117958 -12859763 -9916905 -7605933 -6907278 -7088814 -6725501 -4914336 -2281111 -859672
5778 -859672 -1986668 -4288177 -5098004 -4020841 -3259332 -3860145 -4027424 -2677480 -2192301
5769 -2192301 -4910675 -8657188 -9197767 -6261227 -3506240 -2885354 -3074167 -3763646 -6825790
5760 -6825790 -11499502 -12922484 -8572301 -2659025 -448291 -1030639 150452 3836701
5752 3836701 6827757 8072929 9682924 11705080 10855897 5974714 825598 -572518
5744 -572518 1421580 3851134 5023653 4812538 3392476 1654677 1166946 2066359 2633243
5735 2633243 2359469 3340432 6637647 9300065 7818078 3387517 769309 2203862 5197700
5726 5197700 6694425 6907258 7793439 9483085 10014227 8124367 4879568 2294958 1236241
5717 1236241 1227407 1700685 2392532 2555190 1110485 -1662845 -3702313 -3648574 -2950058 -3966052
5707 -3966052 -6552236 -8395097 -8526902 -8343117 -8719765 -8287355 -5745080 -2355564 -710869
5698 -710869 -1732438 -3828293 -4529374 -2529784 1192063 3978616 3970772 2043631 365469
5689 365469 -624561 -2146089 -4079991 -4333571 -2041500 573938 809780 -1496865 -4654456
5680 -4654456 -7373722 -9074899 -9198230 -7625744 -5030169 -1796784 2606613 8307565
5672 8307565 13820446 16928900 16386053 12796850 8693972 7195995 8824151 10022622
5664 10022622 7131064 1553082 -1948524 -1995117 -1732724 -2522602 -1191615 4079177 9462705
5655 9462705 10572569 8362639 6136651 3878841 105567 -3231258 -2955244 -378314
5647 -378314 311801 -1335739 -2006668 -985648 -1493734 -4965952 -8487234 -9135074 -7171685
5638 -7171685 -3991404 -595341 899338 -1889299 -7607718 -11276604 -10016712 -5871346
5630 -5871346 -1895591 1123617 2610107 748202 -4258710 -8481661 -8760854 -6755566
5622 -6755566 -5908139 -6421497 -6077229 -4420503 -3107113 -2916828 -3096674 -3360369 -4296932
5613 -4296932 -5674303 -5999966 -4265229 -1481522 -241312 -2490012 -7138322 -10429676
5605 -10429676 -10011221 -8027382 -8132984 -10062096 -10219583 -7598266 -5163004 -4299687 -2183856
5596 -2183856 2919376 7672779 8445736 6889755 6678677 7227085 5397488 1887267 682093
5587 682093 2324097 2703217 -478350 -4371745 -5775594 -5508365 -5622019 -5281193 -2582005
5578 -2582005 1177024 2279652 -572159 -4657486 -6899405 -7289802 -7703705 -8504499 -7856377
5569 -7856377 -4370980 851439 5496088 8444324 9850520 9542535 7113257 3668587
5561 3668587 1588596 1702667 2169726 1211337 -331852 -474023 858001 1690899 501954
5552 501954 -2218558 -4585988 -4798183 -2487289 776720 2813880 3040565 2763609 3263094
5543 3263094 4575252 5991124 6246102 3545216 -2227455 -7338906 -7445531 -3760302 -2319753
5534 -2319753 -5525621 -8558070 -7026820 -3950116 -4674191 -8279219 -9706266 -8276802
5526 -8276802 -7729676 -8526045 -6858424 -2336011 -342587 -4108416 -9432120 -10559290 -7505400
5517 -7505400 -4174861 -2253526 -609286 1153719 1914141 1027822 -1006288 -3003957 -2982140
5508 -2982140 656276 6254513 9208280 7218943 3614637 3356534 7265369 12342421
5500 12342421 16183430 18336792 18303223 15198055 9537427 3299150 -2017120 -6060423
5492 -6060423 -8639495 -9471156 -8747257 -6863247 -3934059 -478002 2096069 2717630 1732959
5483 1732959 -5907 -2069257 -3649133 -3425991 -1647345 -773515 -2280138 -4302797 -4434858
5474 -4434858 -3183909 -2060217 81899 5109219 10726969 11711850 6778934 695225
5466 695225 -1805583 -1200034 -558965 -501631 737221 3867343 7637787 10523728 11284301
5457 11284301 8511736 1886343 -5869673 -10067102 -8135998 -2206454 2880745 4026881
5449 4026881 2222071 682363 1120670 2319820 2223859 448734 -1829981 -3552128 -4334946
5440 -4334946 -4122197 -3562714 -4146463 -6403476 -8307159 -7195475 -3241907 645651 2343641
5431 2343641 2120850 813459 -1230032 -2820577 -1975781 1423652 4804450 5839328 4593325
5422 4593325 2044448 -1210589 -3620114 -2826064 751273 3010942 1589788 -59067
5414 -59067 2584706 8014975 10466193 8057834 4888560 4656407 6188671 6550932 5285395
5405 5285395 3873435 3405858 4143993 5269142 4211652 -1112126 -8206003 -11037981 -7032085
5396 -7032085 -501811 2843340 2265924 622409 -662768 -2090636 -3637477 -5349501
5388 -5349501 -8911007 -14864796 -19222255 -16979926 -9107499 -2247570 -738257 -2257778
5380 -2257778 -2374420 -195620 2149910 3019181 2197532 39477 -2582166 -4595460 -6098050
5371 -6098050 -8154886 -10437753 -10770233 -8198915 -4888380 -3487760 -3914491 -4215739 -3440773
5362 -3440773 -2045471 -330690 1819737 3986925 5329216 5608012 5429038 5726969 7235289
5353 7235289 9593979 10637653 7925232 1952251 -3251535 -3946155 -523117 3273804
5345 3273804 4281767 2420127 133894 114775 2858138 5922850 6345405 3981624 1377773
5336 1377773 422215 921918 2529075 5392571 7991594 7299561 3077760 -465511 303637
5327 303637 3760135 5754643 5038940 3234017 1291251 -732390 -1722100 -723848 788295
5318 788295 1037966 1300471 3641634 6332638 5709821 2222740 95595 602506 377099
5309 377099 -2346325 -4455269 -3229129 -899089 -878329 -2459620 -2652850 -1307480 -1120790
5300 -1120790 -3605871 -7745482 -11960507 -15108116 -15916346 -13440650 -8280008 -2361483
5292 -2361483 2370350 4738149 4685276 3330257 1720595 -662169 -4706278 -8795604 -9347272
5283 -9347272 -5332908 -369867 1206669 -951606 -3684655 -4337849 -3179627 -2702146 -5077247
5274 -5077247 -9318318 -11201490 -7981445 -2892294 -1861443 -5368090 -7427956 -4140693
5266 -4140693 834176 1954336 -822167 -3872870 -5924004 -7881672 -8896611 -7268338
5258 -7268338 -4133207 -2038833 -701065 1763227 4226201 3695280 893664 78664 2602831
5249 2602831 4830740 3593417 -42308 -3749128 -7051400 -9701623 -10165048 -7933687
5241 -7933687 -5039320 -3432744 -2828011 -2433154 -2443542 -2373070 -527645 2899605 4649261
5232 4649261 2665427 -519781 -1199613 524395 1956119 2418103 3296041 4266905 3127777
5223 3127777 -205081 -2662318 -2128761 -137437 1021925 1881460 4438779 8363937 10833286
5214 10833286 10100190 7464057 5325670 4813669 6031050 9036894 12895878 14639661
5206 14639661 11549513 5018358 347843 1536899 7288112 13124167 16344605 17538346
5198 17538346 18060930 17944088 16582036 14237148 12153770 11379986 11568582 10968133 7983492
5189 7983492 2802200 -2962218 -7855350 -10740035 -10021826 -5092745 1120145 3835296
5181 3835296 1996400 -311367 402223 2694026 3787760 4269414 5570551 5503031 1191129
5172 1191129 -4933714 -7258119 -4892197 -2543273 -3121439 -4358527 -3872881 -2844559 -2758526
5163 -2758526 -2678343 -2026787 -2406036 -4269804 -5146329 -3640782 -2054258 -2499883 -3525235
5154 -3525235 -3302284 -3034490 -4067815 -4613919 -2959515 -1261590 -2051186 -3095531 -247424
5145 -247424 5865923 10426989 11066701 9735744 8158436 5575723 1637492 -1913358 -3415296
5136 -3415296 -2709707 -150298 3281420 4946965 2642034 -1960808 -4858482 -5032841 -5085179
5127 -5085179 -6050007 -5322219 -1450747 2400069 2586787 427176 491531 4405769 8943467
5118 8943467 10141949 7383178 3150772 138870 -785767 -398159 360154 1295309 2455096
5109 2455096 3443137 3928905 4349819 5181262 5858716 5460181 4198601 3170802 2869767
5100 2869767 2981900 3246205 3367157 2738894 1738702 2393977 5546308 8012311 5527454
5091 5527454 -1328513 -7219015 -8737386 -7710946 -6486737 -3674281 2339392 8433304
5083 8433304 9613554 5995653 2998851 4217911 7344272 8137099 5670099 2001397
5075 2001397 -1322870 -4308694 -7021585 -8994021 -10006748 -10175230 -9279323 -7109573 -4642638
5066 -4642638 -3837538 -5623663 -8527750 -9835269 -8040856 -4045951 -356322 582541 -2137588
5057 -2137588 -7047145 -10846676 -10787711 -7197322 -3217743 -1539835 -1874338 -2258478 -2153859
5048 -2153859 -2871419 -4953111 -6744852 -6469584 -4601555 -2887630 -1715225 -113367 1808333
5039 1808333 2432825 1320578 369227 808958 776614 -1689007 -4357490 -2861155 2804836
5030 2804836 7343029 6982896 3906590 1767550 246064 -2406820 -4241491 -1959495
5022 -1959495 2906826 5432591 4810919 5039779 7254204 7174307 2760994 -936168 1217280
5013 1217280 6514889 8306409 5198465 1436706 -264604 -1240347 -2621991 -3070547 -1379456
5004 -1379456 1807817 5164944 7097159 5654265 1105472 -2142570 61190 5527153
4996 5527153 7928218 5153802 1221778 -685954 -2262222 -5319122 -7614975 -6692830
4988 -6692830 -4550718 -4760079 -6968931 -7763334 -5808573 -3027146 -1262152 -450875 -3979
4979 -3979 112679 -106133 -365793 -224073 980559 3488496 5737267 5165469 1760260
4970 1760260 -833592 171800 2450701 1635401 -1987367 -3257469 617810 5784939
4962 5784939 6922887 4625678 4458790 9048604 14343428 15093345 11692422 9093425 9963284
4953 9963284 11763641 10864562 7026831 2837594 819701 2350514 7345306 13120803
4945 13120803 15210745 11541875 4887323 -494929 -3340564 -4667388 -4400698 -1616383
4937 -1616383 2832213 6821393 9497657 10742122 9103146 3525957 -3345317 -6971109
4929 -6971109 -6022048 -2801830 823883 4325651 5831778 3087952 -2199093 -5218317
4921 -5218317 -4518516 -3767243 -5626839 -7653617 -6204990 -1222606 4730373 9434219 11585751
4912 11585751 11134330 10093924 10288762 10060979 6841400 2833841 2965675 6533379 7055750
4903 7055750 2322285 -1983294 -1754011 -787987 -3122017 -5345716 -2424316 3892380 8583808
4894 8583808 10874956 12119458 10507455 4699081 -945326 -1877932 -983426 -3532711 -7551503
4885 -7551503 -7031406 -2398081 369741 -401404 -868711 999869 4338349 9773094 17160575
4876 17160575 21775223 21891434 26207510 40800190 51165068 34457127 -7230933 -42968868
4868 -42968868 -50080043 -39950748 -36347486 -42241754 -43420360 -35162830 -27226078 -25543588
4860 -25543588 -25103727 -21665136 -17468907 -13326420 -6140050 2828920 6610409 2723865
4852 2723865 -3066122 -6046892 -8149972 -11120996 -11507951 -6975151 -1672548 -372931
4844 -372931 -1687643 -1676577 -525150 -1129398 -3821753 -6644088 -8738743 -9849343 -8471059
4835 -8471059 -4212140 -514886 -1369015 -6064711 -10303544 -11858617 -12042490 -11881333 -10218849
4826 -10218849 -6588509 -3458739 -3848246 -7650189 -11613525 -12798607 -11347190 -9709097
4818 -9709097 -9521605 -9845612 -8815198 -6414766 -4488959 -3953629 -3326646 -861719 2692857
4809 2692857 4582633 3081847 -881308 -5200119 -8776433 -11588520 -13108787 -11949137
4801 -11949137 -7772945 -2813991 -312555 -1488466 -4955115 -8818483 -11882936 -12854029
4793 -12854029 -10631272 -6561444 -4460665 -6425910 -9736487 -9878875 -5910732 -936273
4785 -936273 2004868 2265456 307300 -3032864 -5436261 -4024009 936316 5046864 4462306
4776 4462306 524329 -2236653 -2125306 -1987016 -4520407 -8187210 -9505461 -8085839 -6964892
4767 -6964892 -8012044 -9473058 -9046015 -7198986 -5605461 -4022806 -1260220 1810131
4759 1810131 3146256 3047946 3624331 4537396 2720562 -2412439 -6598590 -5673401 -766477
4750 -766477 3397368 3676890 363849 -4228185 -7037916 -5688183 -736877 4365299 6744114
4741 6744114 6282776 3850446 -22276 -3421188 -3214573 616726 3603718 2495676 -442330
4732 -442330 -1956601 -3455829 -7717999 -12507507 -13001220 -9528646 -7435514 -9209052 -11689179
4723 -11689179 -11651414 -9585830 -7015951 -4286850 -2233580 -2309968 -3852510 -4552438 -4423937
4714 -4423937 -5696765 -8073196 -8274383 -5607562 -3739358 -4999858 -6857928 -6296327 -3998187
4705 -3998187 -1774763 484889 2462153 1596706 -2801773 -6451255 -4910268 450769
4697 450769 4638202 5345983 3762565 934119 -2759348 -5431775 -4777594 -1340007 2093476
4688 2093476 4209621 5829240 7181642 7104974 5089460 2057047 -936070 -3029969 -2880247
4679 -2880247 335544 5116157 8516757 9069904 7684784 5822299 4021847 2107984
4671 2107984 -215080 -2824614 -4544404 -3724639 -332854 3407427 5519658 6432143 7418701
4662 7418701 8038128 6829836 3742212 53102 -3564770 -7016679 -9141718 -8168018 -4256080
4653 -4256080 -71153 1930281 1936410 1870057 2563289 2677922 752547 -2284982 -3931849
4644 -3931849 -3736607 -4329312 -7393246 -10456930 -10358392 -8472072 -8724510 -10963845 -10805062
4635 -10805062 -6657538 -2215415 -452406 112076 926746 278164 -1862366 -862361 5575827
4626 5575827 11345825 8972215 251716 -6396945 -7678074 -7933185 -10330929 -12387850
4618 -12387850 -11629697 -9713371 -8330507 -5659972 40142 6545865 10195170 10191922 8389284
4609 8389284 6560611 5343323 4315185 2184799 -1600790 -5230020 -6454480 -5949284
4601 -5949284 -6098487 -6617073 -4842639 -773903 2113132 2322898 2705466 5326352 7535664
4592 7535664 5904068 1268369 -3085472 -6052808 -8549672 -10471997 -10889451 -10274434 -9857456
4583 -9857456 -9370823 -7654261 -4947030 -2550838 -651885 1671049 4563747 7123208
4575 7123208 8724169 9182095 7975544 5001671 2201124 2755627 7635769 13534905 15324987
4566 15324987 11065680 4177434 -135052 -399098 568506 692019 1633550 5005623 8139111
4557 8139111 7080143 2526593 -1091469 -1997346 -2421646 -3391197 -2728029 316140 2628492
4548 2628492 1796252 -242813 -617575 258730 411349 -328347 -1237451 -2613752 -4204651
4539 -4204651 -4019234 -1388315 994943 846844 -200278 36710 -203108 -3817875 -9192677
4530 -9192677 -11631722 -9701862 -6164489 -2989838 464580 4049201 5611513 4403525
4522 4403525 2605429 2102034 2220574 1923314 1930499 3024601 3928070 2721343 -253530
4513 -253530 -2215174 -766740 3391126 6620824 5639734 956116 -3627661 -5247764 -4538885
4504 -4538885 -3390353 -1926364 793567 4545868 8175142 10811124 11287467 8137544
4496 8137544 2338056 -1904180 -2058085 -1211092 -3496423 -7119268 -6646893 -1762891 1607514
4487 1607514 -84138 -3472025 -4632536 -5115171 -7787281 -10332634 -8017003 -1502836
4479 -1502836 3011433 1850220 -1766630 -2669957 -116152 2793992 4131322 4815487 5520728
4470 5520728 4530162 241445 -5408987 -8214698 -6636863 -3664933 -2821320 -3865649 -4076057
4461 -4076057 -2776323 -2475964 -5480374 -10960346 -15753197 -17079871 -14370889 -9398919
4453 -9398919 -4905756 -2568179 -2146773 -2455616 -2306197 -483328 3446129 7457131 8195941
4444 8195941 5307452 2553967 2441719 1979475 -2802510 -9665695 -11909710 -7371897 -1638435
4435 -1638435 -1173329 -6408735 -12947495 -16924782 -17646405 -16910293 -17109762 -18837378 -20006565
4426 -20006565 -18674657 -16180536 -15211617 -15466660 -14463369 -12281574 -11479336 -11965751 -10497620
4417 -10497620 -6546712 -4062785 -5314323 -7425931 -7689205 -7800056 -9308386 -9268118 -5114940
4408 -5114940 -294073 372738 -1688080 -1462955 1358944 2906326 2819209 4767280 9029919
4399 9029919 11142935 9509372 8250781 9875245 10664710 7002685 1601449 -993981
4391 -993981 -1388377 -2821573 -4406905 -2607192 1592108 2675296 -1583346 -7031856 -9339413
4382 -9339413 -9215448 -9251372 -9061853 -6842732 -3604314 -2132096 -2328924 -991067 3088327
4373 3088327 6351373 4342948 -2852962 -10325066 -13024383 -10067992 -4935255 -2182160
4365 -2182160 -3725667 -7645815 -10369608 -10069201 -8004871 -6951070 -8751338 -13028624
4357 -13028624 -17442034 -19287875 -17724565 -14497071 -11807452 -9850182 -7573568 -5280400
4349 -5280400 -4409080 -4696606 -4018001 -1770871 122007 792191 2202945 5285109 7023677
4340 7023677 4530889 117805 -1257146 1467415 4900977 6409043 6265368 4989881
4332 4989881 2410601 -247845 -955464 -376403 -1568475 -5333875 -8994085 -10689233 -11561571
4323 -11561571 -12363799 -11342108 -7606585 -3780527 -2785970 -3854856 -3856843 -1281893 2500808
4314 2500808 4626783 2641343 -3132956 -8602400 -9613482 -7120293 -5709816 -6450011
4306 -6450011 -5188701 399718 6279114 7426229 4265072 487000 -2523023 -5466698
4298 -5466698 -7836514 -8732855 -9355566 -11236932 -13283045 -13507133 -12271267 -11063780 -9685281
4289 -9685281 -7363337 -4875580 -2911338 -478161 2276245 2408029 -1107777 -3864725
4281 -3864725 -1666455 2772482 3773065 1289116 -28922 1125365 1813553 1437028 2689512
4272 2689512 5304065 5250292 1943934 365092 3214146 6012108 3587749 -2397088 -6280384
4263 -6280384 -6236731 -5571867 -7321645 -10426516 -11209600 -7350971 -546215 4623973 5162903
4254 5162903 2531427 -35321 -1738249 -3474686 -4380659 -2795266 -253006 -551408 -4374380
4245 -4374380 -8436452 -10539994 -11697663 -12229611 -9773182 -3354342 3528391 6311651
4237 6311651 4214664 274562 -1941833 -914925 1779343 2406703 -1350876 -7651760
4229 -7651760 -12774895 -15169040 -14981484 -11301270 -3880225 3310585 5046811 1651621
4221 1651621 -1580806 -2107026 -2549598 -4642863 -5922399 -4383788 -2070221 -1799991 -3802855
4212 -3802855 -7162412 -11024364 -13146572 -11197752 -6818450 -4395934 -4744978 -4516086 -2922868
4203 -2922868 -3638140 -8076423 -12374547 -13778975 -14652037 -16874241 -17537891 -14275998 -10341625
4194 -10341625 -9974824 -12245502 -13433401 -12400684 -10242361 -7807344 -6646002 -9107502
4186 -9107502 -14571029 -18811188 -19480473 -18619247 -17896442 -16012261 -13018275 -12013281 -13877963
4177 -13877963 -15553615 -15968971 -17684793 -20160445 -18578220 -12821822 -9826272 -12488762
4169 -12488762 -14303528 -10487309 -6175726 -6980331 -9497396 -8742672 -7368203 -9427141
4161 -9427141 -12285529 -12888041 -14464358 -18532676 -18614237 -11470251 -5810735 -9038086 -14401453
4152 -14401453 -13449130 -11691170 -17633212 -25527358 -25482804 -22453852 -27092088 -35056148 -34999561
4143 -34999561 -30609644 -33539785 -40249668 -38893448 -34068595 -39493134 -50883707 -54543956
4135 -54543956 -58289671 -80053323 -109489228 -124169804 -145718931 -222435811 -333447461
4128 -333447461 -369393228 -258006496 -69786041 57924403 77968885 56653613 56947440
4121 56947440 68163984 60277126 43517099 41686036 47941271 42559590 29882927 27175840
4113 27175840 33167330 33700219 27420618 23755238 23417926 19802210 13844590 11609470
4105 11609470 11950651 10006730 8155039 11262624 15540828 13547535 6471761 1246245
4097 1246245 -778914 -2819588 -4297128 -2910596 -1609614 -4477686 -8624829 -8521736
4089 -8521736 -5357538 -3913349 -3244936 976995 7335429 10430112 10104477 10867108 13298820
4080 13298820 13658445 11321350 9582206 9563680 9714183 10620272 14029160 17816838 18206579
4071 18206579 16440734 17032607 19773124 19825519 15941626 12396140 11867873 11911031 9757274
4062 9757274 6031106 2622890 714017 1326355 4150402 6007006 4361345 1754992
4054 1754992 2348861 4850061 4148599 -226820 -3095025 -1815708 203048 -234211 -1659956
4045 -1659956 -1952721 -1934539 -2170429 -401850 4456935 8904633 8809202 4694084 287741
4036 287741 -2517351 -4734423 -7497569 -10383124 -11989262 -10947126 -6924588 -1257292
4028 -1257292 4108240 8324313 11255640 11937727 9380269 4713962 369751 -2827397
4020 -2827397 -5536464 -7242614 -6684739 -4974360 -4809188 -5796953 -4164122 1294461 6349760
4011 6349760 6726019 3600890 1110195 634074 553455 119029 302210 1239234 1590146
4002 1590146 780470 23791 588492 2070858 2729541 1224506 -1696665 -3172550 -873784
3993 -873784 3942982 7305409 7109023 5322599 4600632 4506416 3045143 593181 -364257
3984 -364257 868565 2087233 1452107 -226586 -1313374 -1615745 -1513321 -304302 2661187
3975 2661187 5823521 6432102 4014255 1218906 486344 1146226 823739 -1282810 -3829087
3966 -3829087 -5362437 -5429346 -3892531 -714872 3284392 6605166 8285949 8200139 6550500
3957 6550500 4429244 4313338 7686150 12011995 12715102 9035796 5275971 4878412 6109198
3948 6109198 5786482 4533307 5099815 7440784 9183406 9812922 10511923 10480925 7672731
3939 7672731 3379644 1632029 2764879 1913114 -3596533 -9057809 -8264691 -2283227 1770381
3930 1770381 -17120 -4100127 -4900988 -1376699 3137122 5468773 5268978 4266953 4473595
3921 4473595 6739504 9928336 11625572 10492080 7782025 5789915 5094796 4450980 3291347
3912 3291347 2723269 3383689 3862544 2633880 505736 -437580 383284 1930270 3501120
3903 3501120 4876415 5101556 3429378 1229967 470557 377466 -1513275 -4750320 -5772263
3894 -5772263 -3229083 -1420 1611006 3074383 5696620 7126761 5118901 1916516
3886 1916516 1040525 1825133 1137933 -1038096 -1935199 -1108555 -1201899 -3606421 -6515031
3877 -6515031 -7380563 -5068980 -366592 3409236 1977399 -4693608 -10535003 -10324403 -6532742
3868 -6532742 -4941299 -5598562 -3942029 328155 2407618 864866 109418 2596097 4888373
3859 4888373 4175829 2952137 3826651 4803468 3621381 2396361 3769174 6078657 6469341
3850 6469341 5581533 5142873 4028593 1057542 -1088054 499406 3472965 3249318 188836
3841 188836 -978733 1684959 5185174 6755977 7298596 8869413 11567367 13844466 14279459
3832 14279459 12821039 11294797 11915862 14162713 14585921 11318805 7029804 5293435
3824 5293435 5724341 5147323 2133180 -2069470 -5667024 -6942849 -4379207 1088969 5402099
3815 5402099 5751887 4242672 4534654 6659495 8301345 9233719 10507141 10685621 7326572
3806 7326572 1629416 -2465254 -3467302 -2900486 -1424185 1305532 3371734 2080286
3798 2080286 -854642 -373130 4538822 8874469 8586272 5638804 4268821 5595956 7815274
3789 7815274 8820859 6999643 2159274 -2911613 -4478142 -2542018 -570119 244033
3781 244033 2570868 7206644 10029922 7730905 3259870 2048454 5110755 9211984
3773 9211984 12006211 13564712 13879220 12004851 7583604 1462101 -4668452 -8369404
3765 -8369404 -8010829 -5629024 -5886731 -10022325 -13166355 -10496120 -3978032 400427 426045
3756 426045 -1261550 -2786462 -5061527 -7857536 -8349902 -5385724 -1847257 -531989 -202810
3747 -202810 1806721 4977076 6441044 5452620 4134055 3817197 3294237 1454540 -614404
3738 -614404 -1570736 -2074517 -3184822 -3871176 -2708848 -1386802 -3266264 -7840537 -9889016
3729 -9889016 -6008166 562272 3998268 2713084 -582245 -3804996 -7010339 -9838119
3721 -9838119 -10979020 -10240336 -8380147 -5125387 -224406 3917275 4083949 886980 -1786441
3712 -1786441 -2171442 -1902477 -1641325 242641 3416482 4377976 1677479 -1375604 -1610105
3703 -1610105 -236793 179312 -400455 -1236191 -2974225 -5039137 -4295080 109536 3759997
3694 3759997 2908839 474715 1479719 4993090 5967244 3500196 1517592 1678347 1328596
3685 1328596 -698936 -1424604 1264738 4858067 5625707 3132229 -263099 -2296742 -2042759
3676 -2042759 -100977 1699883 2356699 3492832 7154618 12024871 14278231 12220870
3668 12220870 7608992 2484341 -2370424 -5640924 -5406899 -1863237 2429421 5810585
3660 5810585 8719738 11322713 12838735 13885801 16390130 19992838 21430040 18894378
3652 18894378 14446749 10830443 8546212 7348189 7617826 8468591 7494691 4726291 4063453
3643 4063453 7939744 12864087 13510126 9661347 5852696 5169440 6675152 8520748 10259697
3634 10259697 11511877 11047540 8584460 6027475 5564905 6951830 7538379 5217400 1081671
3625 1081671 -1475506 -671003 1556565 2447068 2370538 3637818 5798438 5208809 232582
3616 232582 -5757467 -8084676 -5502955 -16084 5770392 9506340 9567231 6905612 4930173
3607 4930173 5600511 6961820 6122138 2991403 -634608 -3744732 -5729163 -5212008 -1827323
3598 -1827323 2161882 4231570 4222110 2833468 -183241 -3833339 -4603854 -1016852 2876847
3589 2876847 2890993 1570901 4398023 10381477 12621491 8537358 3347323 1783586 2138161
3580 2138161 1149298 -464875 -886485 -1187325 -2393293 -2165998 1253736 4731121 4474792
3571 4474792 2304839 2796921 5702146 6392485 3390995 418974 411995 1995243 3020932
3562 3020932 3564472 3835200 2763004 709233 468104 3292753 6645034 8308780 10036831
3553 10036831 14020389 18073492 18329219 15434204 13610900 13653272 11495995 5127825 -1349165
3544 -1349165 -3416259 -2705169 -4090404 -8082204 -10365568 -8487437 -4821165 -2105523
3536 -2105523 46795 2273777 2531258 -763514 -4759069 -5027310 -1687777 748532 -183404
3527 -183404 -1765377 -358107 3787343 7474021 8470481 6955790 4479884 3028899 4054024
3518 4054024 6862405 8595357 7051318 3012928 -1093935 -3875825 -5148714 -4650809
3510 -4650809 -2495691 -323376 40444 -969166 -1326181 -461926 423093 1336157 4195882
3501 4195882 9147522 12386653 10214008 4388306 795387 2505938 6285059 6879026
3493 6879026 3090822 -1757577 -4198941 -3585132 -1060737 2382261 6086415 9293763
3485 9293763 11583526 13044978 13227795 10818855 5601841 57808 -2689074 -2455864 -1854434
3476 -1854434 -2346665 -2363463 -223488 2936599 4767252 4927981 4781412 4750287 4226273
3467 4226273 3832704 5338007 8725365 11395029 11359681 9682177 8500911 7906369 6325089
3458 6325089 3301976 372688 -695442 527389 3158261 5647692 6521681 5359572
3450 5359572 3032804 402634 -2785506 -6746136 -9845041 -9555461 -5578169 -571199
3442 -571199 3063891 5899462 9641080 13391015 13807935 9497159 3555202 250774 -35560
3433 -35560 -612588 -3046941 -4160705 -210271 7254878 12420712 12290090 10152780 10677022
3424 10677022 13643140 14766943 11568919 5928048 1160498 -1035174 -605514 1389513
3416 1389513 2450182 -132750 -6290436 -12643550 -15939734 -15796044 -13370488 -9334138
3408 -9334138 -4727119 -1922334 -2310211 -4108906 -4896002 -5410707 -7969873 -11543457 -11898992
3399 -11898992 -7480163 -1999626 505338 645699 1532530 3706829 4992731 4321451 2872395
3390 2872395 1676184 650267 211376 1373102 3468849 4033830 2358488 1352179 3854814
3381 3854814 8077404 8986439 4274619 -2906862 -7718508 -8603401 -7539514 -6558369 -5582098
3372 -5582098 -3445937 305835 4946202 9005864 10888599 9801757 6503569 2699540
3364 2699540 -416624 -2487287 -3104722 -1934438 -94705 114678 -2061117 -4571868 -5317341
3355 -5317341 -5014309 -5606660 -6767263 -6205955 -3128216 826096 4034110 6007738 6032166
3346 6032166 3468810 168891 -255786 2914185 6014793 5873465 3700981 1936977 -109082
3337 -109082 -4039810 -7696450 -7082275 -2623476 705280 298730 -780389 979241 4227963
3328 4227963 5109271 2777776 -123418 -1409060 -1337446 -992881 -728227 -544533 -733468
3319 -733468 -1563177 -2661964 -2809183 -488104 4573848 10130686 12706924 10983349 7202635
3310 7202635 4416337 3123379 1769885 -57732 -666773 1117624 3645654 3859421 775982
3301 775982 -3289282 -5247849 -4436078 -2721189 -1790722 -1425521 -723052 182254 570565
3292 570565 443349 187439 -454703 -1767987 -2840916 -2301635 -3723 3134044 6276774
3283 6276774 8303261 7505498 3948202 1032716 1548054 2860559 96298 -5834819 -8363318
3274 -8363318 -4846438 -726697 -1046986 -2883008 -1001577 3081678 3893673 1325962 401930
3265 401930 2664177 4571652 4828129 6579934 10563003 12242777 8683474 3074824 -846162
3256 -846162 -4119647 -8524525 -11637473 -10576199 -7166910 -4437121 -1031702 5152734
3248 5152734 10023394 6786129 -3710744 -12330057 -12621165 -7342122 -2510229 -56867
3240 -56867 856091 -377667 -4519622 -9190266 -10596343 -7856074 -3315054 552260 2643269
3231 2643269 2743782 1695840 1413197 2867382 4486393 4045276 1541085 -1303776 -3650903
3222 -3650903 -5840156 -7592902 -8026490 -7547522 -7752370 -8844597 -8814602 -6202450 -2487089
3213 -2487089 -428512 -589617 -840682 570330 2566904 2555732 -413531 -4754617 -8411668
3204 -8411668 -10597838 -11173920 -9788638 -6816505 -4015731 -2635093 -1696051 -15313 967503
3195 967503 -914456 -4205607 -4811060 -1965405 492141 470040 1356259 6215784 11491187
3186 11491187 11051928 4909147 -845886 -2379241 -1791782 -1963494 -2214354 -911495 1041941
3177 1041941 1616909 313772 -2335819 -5861897 -8921161 -9417794 -7269079 -5048414 -4151909
3168 -4151909 -2532922 1473719 5117592 4125717 -1253391 -5941825 -5661981 -810655 5046422
3159 5046422 8540294 8356364 5536775 2399133 355451 -990871 -2118236 -2246664 -1017817
3150 -1017817 -110331 -1134549 -2888340 -3013280 -1724822 -1349226 -2391256 -2766184 -1315944
3141 -1315944 389638 562301 -555920 -1883806 -3184373 -4498948 -5243411 -4885034 -3674611
3132 -3674611 -2189596 -986585 -809110 -1952225 -3254664 -2960816 -786420 1900215 3684776
3123 3684776 3614579 869979 -3892885 -7330939 -6281958 -1956537 1489165 2696420 4092863
3114 4092863 6615923 7541786 5356315 2818772 2402184 2237360 105109 -1683018 238890
3105 238890 4274997 6270905 6538969 9108496 14121878 16401161 12896393 6934621 2953657
3096 2953657 842766 -1809383 -4816655 -5880893 -4336296 -1802191 -40672 -19588 -2082546
3087 -2082546 -5305725 -7558013 -7773650 -7361529 -7910525 -8374599 -6228442 -959214 5098623
3078 5098623 9196063 10283953 9064183 7200642 6408315 7267820 8760591 9440517 8834226
3069 8834226 7318909 5303645 3296254 2133520 2092574 2131566 1069164 -632088 -1267433
3060 -1267433 -148025 1381782 1458580 -233614 -2072818 -1959200 683530 4005910 4959086
3051 4959086 1842871 -4216093 -10217640 -13447886 -12924297 -9609957 -5654854 -2843111
3043 -2843111 -1291488 20996 1472608 2500066 3313447 5452031 9483043 13213536
3035 13213536 13826591 11406137 8777912 7842559 7484002 5425051 968813 -4570193 -9157687
3026 -9157687 -11152056 -9952525 -6447863 -2707656 -768029 -1537892 -4537792 -8205033
3018 -8205033 -10732350 -11516267 -11833459 -13120513 -14446889 -13075444 -8341307 -3620699 -2773307
3009 -2773307 -5247978 -6747964 -4983325 -2687317 -3654908 -7278905 -9055105 -6187840
3001 -6187840 -853334 2449783 1370200 -2947013 -7520658 -9591971 -8242682 -5380193
2993 -5380193 -4522302 -7254278 -11119130 -12113747 -9011099 -4139792 -348286 1257105 758265
2984 758265 -1332639 -3529923 -3706324 -1229563 2078350 4062782 4574330 4827279 5210251
2975 5210251 4895272 3343519 1255534 -77593 -111998 8509 -2060254 -7437785 -13735077
2966 -13735077 -16458118 -13656623 -8246286 -4695512 -4362021 -5360134 -5994379 -6327688 -6639398
2957 -6639398 -6431276 -5526510 -4669573 -4322201 -3927215 -2987636 -1931058 -1231703 -492863
2948 -492863 833538 2454837 3792294 5054181 6792432 8550043 8994489 7718830 6036829
2939 6036829 5239467 4619502 2357165 -1697917 -5504846 -7633461 -9110859 -11149947 -12359485
2930 -12359485 -10497235 -6484526 -3919741 -4138895 -4492207 -2745840 -589624 -778434 -2983001
2921 -2983001 -5055860 -6748836 -9142668 -11388907 -11326055 -9190109 -7657547 -7899482 -8446541
2912 -8446541 -8524450 -9562813 -12167730 -14204051 -13630958 -11307771 -9264790 -7815013 -6121732
2903 -6121732 -4165415 -2153920 940547 6023216 11391264 13596588 11171761 6362649
2895 6362649 2889561 2700334 4944322 7380097 8447243 8157313 7209266 5710192 3271461
2886 3271461 -18967 -3583016 -7011248 -9659581 -9992911 -7004045 -2333350 816137
2878 816137 1183734 104914 -1425904 -3795823 -6170848 -5924447 -2606970 91654 -1060569
2869 -1060569 -4190614 -5011431 -2600643 428696 2228062 2906022 2235139 -251241 -2806133
2860 -2806133 -2357386 1513072 5924842 8265583 7992853 5111090 80034 -4450963 -5390341
2851 -5390341 -3756507 -4125192 -8143275 -11964384 -11884605 -8945844 -5518484 -1083545 4911001
2842 4911001 9182453 8349192 4584027 2564239 1971309 -1490077 -7722366 -10864058 -7929560
2833 -7929560 -3365471 -1962488 -1856649 1179986 5913359 7295541 4319975 1142766
2825 1142766 570144 1023021 692948 472822 1042585 651635 -1566941 -2639035 730910
2816 730910 6848776 10099680 7253870 855482 -3622066 -2670919 2799964 8392390 9751083
2807 9751083 6498550 2593995 1856702 3760451 4972309 4165049 3147939 3543235 4862394
2798 4862394 6337988 8261942 10440892 11361661 10316684 8778811 8200475 7823839 6292165
2789 6292165 4320095 3961850 5793944 8300106 9621859 8759614 5715921 1813138 -625436
2780 -625436 -243550 1963156 4120821 5643869 6905946 7711040 7553178 6697257 5614932
2771 5614932 4129359 2463746 1887337 2409666 1250279 -3548799 -8821924 -8989822 -3184768
2762 -3184768 3535310 6614061 6470805 5708415 5278298 5203526 6148406 7885972 8427836
2753 8427836 7057693 6303475 8349041 11095990 10594504 6358342 1561957 -1317589 -2291080
2744 -2291080 -1659896 958322 4703274 6875365 5584591 1945731 -1198455 -2199289
2736 -2199289 -1885400 -2203711 -3524536 -3384839 1009922 8510165 13780663 12823586 7685351
2727 7685351 3927306 4183214 6119340 6294713 4007426 1271191 578489 2713958 5549765
2718 5549765 5485398 1612019 -2222261 -1496626 3354696 7736904 8962576 8624488 8607528
2709 8607528 8001771 5551507 2638216 1659881 2909094 4869259 6428064 7088431 6008939
2700 6008939 2786256 -1130507 -3400643 -3286781 -2220332 -1831512 -2179264 -2185016 -1494096
2691 -1494096 -1456888 -3624266 -7078680 -8447047 -5793237 -1486388 744907 882000 2057954
2682 2057954 5058664 6762942 5232564 3166352 4029571 7086737 8873530 7971446 5777555
2673 5777555 3820202 2861723 3593158 5501734 5769680 2117492 -3560128 -7142785 -7781411
2664 -7781411 -8518545 -10986097 -12575429 -10425001 -5939908 -3277078 -4440820 -7537862
2656 -7537862 -9333303 -8325790 -5647748 -3826186 -4431857 -6331430 -6461111 -2801320 3491865
2647 3491865 9117373 11693388 11754541 11750251 12982079 13823468 11789003 7344586 4159092
2638 4159092 4704949 7056050 7543502 5359793 2499393 -22056 -3308987 -7847530 -11902058
2629 -11902058 -13390029 -12006751 -9234169 -7418972 -8449885 -11578082 -12959815 -9644381
2621 -9644381 -3821741 -460664 -786616 -1451591 -736209 -1503678 -5931287 -10955560 -12122353
2612 -12122353 -9356346 -5603088 -1997812 1785351 4059033 2535019 -1050515 -1884887
2604 -1884887 1597031 5560686 5780265 2070281 -2927385 -6521538 -6609384 -2479789 3342482
2595 3342482 6248069 4227584 -137126 -3314299 -4354726 -3718561 -1367425 1725087
2587 1725087 2483847 -787818 -5106947 -5989371 -3316843 -1264058 -2676301 -6263684 -9438623
2578 -9438623 -11116709 -11021747 -8807698 -5169494 -1916866 304384 2698321 5542822 6563662
2569 6563662 3863541 -877489 -4124225 -4552217 -3488702 -2068974 -242447 1618395
2561 1618395 2573743 3089003 4966778 8297635 10296053 8543395 4030734 -468633 -3878857
2552 -3878857 -6950583 -9770666 -11269274 -11226089 -10951310 -11396075 -11760013 -10546918 -7304701
2543 -7304701 -3100713 116194 800882 -616251 -1722803 -973133 -263650 -2792891 -8180620
2534 -8180620 -12039868 -11459102 -8712021 -7763543 -9014175 -10007434 -10023096 -10769558 -12615861
2525 -12615861 -13229245 -10977182 -7422211 -5106063 -4498127 -4479582 -4478624 -4565034 -4330483 -3267799
2515 -3267799 -1860908 -978050 -428389 667789 2196506 2960843 2415019 1349700 419034
2506 419034 -1008457 -3687496 -6732107 -8040684 -6588966 -3594878 -1081807 168163
2498 168163 700654 903149 440262 -699016 -1593686 -1466717 -673612 169663 1477703
2489 1477703 4077840 7554066 10282371 11163717 10471984 9045642 7598828 6747643 6471412
2480 6471412 5371109 1867737 -3260701 -6796730 -6424509 -3224813 -40892 1653315
2472 1653315 2292552 2652480 3146392 4166934 5752736 6986417 6678383 4581642 1399845
2463 1399845 -1808894 -3531048 -2171109 1993684 5959779 6906572 5599080 4968131 5543050
2454 5543050 4746281 1178955 -3022852 -5425369 -6518625 -7659311 -7739632 -4795820 -89923
2445 -89923 2441607 1003115 -2378066 -5510756 -8663524 -12049429 -13086110 -8968386 -1313714
2436 -1313714 4288684 3916257 -888919 -5305627 -5973886 -3080403 1082936 4565522 7014100
2427 7014100 9090790 10850573 11153245 9305065 6763286 5807610 6485612 6539343 4813699
2418 4813699 2714232 1127604 -1763981 -7080223 -11356455 -9710594 -2715307 3533730
2410 3533730 5085361 4421455 5353778 6989302 5929417 2282135 -384176 -429162 30773
2401 30773 -1103213 -3342921 -5514506 -7522614 -9030721 -8631705 -5883712 -2562700 -445907
2392 -445907 772417 1940330 2241405 441405 -2482602 -3987036 -3156305 -1713696 -1759825
2383 -1759825 -3732612 -6644040 -9056883 -9565660 -7587550 -4426512 -2751655 -4080995
2375 -4080995 -6912273 -7931192 -5229504 -225169 3546943 3448472 -313209 -5300736 -8865873
2366 -8865873 -9500210 -7108713 -3121984 -196620 -337509 -2617370 -3882094 -2710039 -1630199
2357 -1630199 -3885107 -8658128 -11598657 -10326184 -7331536 -6246643 -6857210 -5816469
2349 -5816469 -1767584 2375187 2846085 -733299 -5498428 -8670935 -9384790 -7786147 -4280610
2340 -4280610 -381547 1191193 -1087817 -5278820 -7433162 -5678069 -2110797 -375339
2332 -375339 -1968554 -5110136 -6583331 -4454291 327218 4663127 6160988 5340124 4198514
2323 4198514 2715274 -1471646 -9072831 -16664380 -20036830 -18849362 -15779107 -11960847
2315 -11960847 -6282026 666376 5316305 5454258 3279638 1870718 587302 -3023796
2307 -3023796 -7854617 -9347065 -5419027 690904 4694586 6009089 6681233 7564474 7710083
2298 7710083 6394266 3664224 -373748 -4779671 -6940878 -4924916 -671003 1495838
2290 1495838 -40014 -2687213 -3661722 -3016593 -1759904 226392 2468497 2630043 -250887
2281 -250887 -3047063 -2231723 927853 2345562 1591628 2404308 6416526 10403649 11159998
2272 11159998 9556705 7760970 5606299 2358168 -481427 -1158944 -605065 -382151 759625
2263 759625 4966865 10841782 14293686 13639939 10862912 7759297 3854178 -1229161 -5953426
2254 -5953426 -8543172 -8803576 -7645758 -6253780 -5870009 -6685906 -6810679 -4134824 681222
2245 681222 4829277 6690363 6418789 3818251 -1104369 -5345492 -4530288 1269481 6633585
2236 6633585 7387793 4991594 2590106 362534 -2244438 -2968897 404210 5509984 7813327
2227 7813327 6572115 4813321 4243507 3895695 3315409 3161057 2464318 -909617 -6245296
2218 -6245296 -9761511 -9556602 -7875048 -7264864 -7329688 -6862795 -6562543 -7496448 -8757095
2209 -8757095 -8768810 -7603478 -6130219 -4025197 -600953 3101648 5010693 4765430 4301928
2200 4301928 5368908 7265043 7469854 4458454 -174230 -2807741 -1584229 1271851
2192 1271851 1873068 -840863 -4238163 -5533921 -4775351 -4036870 -4912067 -7141175 -8643705
2183 -8643705 -6855150 -1433405 4152681 5288070 1075021 -4537614 -6765737 -4160894
2175 -4160894 934482 4561070 3998486 232231 -2624551 -2138523 -962393 -2846888 -6415474
2166 -6415474 -7065883 -4670440 -3956220 -6153812 -6392586 -2351114 604169 -2123019 -5930976
2157 -5930976 -3608588 3254279 6866580 5193409 3360972 3535340 1719978 -3577326
2149 -3577326 -7163487 -5337409 -2105953 -2568611 -4786192 -3569554 714349 2743448
2141 2743448 510935 -1935682 -500188 3629709 5761560 3020510 -2910461 -7662398
2133 -7662398 -8553140 -7005296 -6020822 -5905249 -4485023 -1407718 685126 140808 -1476520
2124 -1476520 -2542596 -3722335 -5137578 -4299374 93450 4728999 5576357 3540426 2675220
2115 2675220 3972895 4672955 3173880 916755 -669706 -1626696 -1372745 1544251 6400006
2106 6400006 9596422 8537300 4557083 897905 -838604 -1319519 -1814393 -2918678 -4337736
2097 -4337736 -5341833 -5534869 -4958771 -3428200 -1001202 338298 -2411227 -8811377 -13436696
2088 -13436696 -11736398 -6148641 -2957520 -3828647 -4405158 -1403539 3011362 5044957
2080 5044957 3919453 1282827 -884840 -422009 3646195 8257888 8365390 3996256 1488214
2071 1488214 4567856 7995595 4760833 -3146902 -6971782 -3225370 2533850 4684862
2063 4684862 4489574 5435083 6444593 4130536 -732363 -3646196 -2745552 -772031 -174996
2054 -174996 298948 2443474 4653643 3875798 343310 -2511090 -2903303 -2719568 -3667142
2045 -3667142 -3935608 -990484 3836618 6521967 5855688 4869806 6076422 7960664 7901903
2036 7901903 6632139 7381587 11212325 15275883 15957620 12504027 7218878 2930577 779890
2027 779890 251345 860481 3055443 6874130 10379845 10907721 8059432 4153543 1341206
2018 1341206 -358559 -1654754 -2266232 -1728253 -653751 67831 373905 208958 -1349122
2009 -1349122 -4759985 -8583646 -10743398 -10736989 -9553560 -8107706 -6896311 -6463481 -6902004
2000 -6902004 -7376720 -7145328 -6404469 -5364599 -3752858 -2367609 -3425268 -7438565 -11378402
1991 -11378402 -12605760 -13307269 -17471260 -23878630 -26271092 -21638390 -14626189 -11398544
1983 -11398544 -11968943 -11762410 -9083333 -7263825 -9221762 -13032208 -14532881 -12641044
1975 -12641044 -10047310 -9009003 -8417653 -5931544 -1809984 957286 142724 -3550171
1967 -3550171 -7972771 -11645925 -13816059 -13996330 -12573441 -10651883 -8230826 -3917268
1959 -3917268 2272735 7481891 9286386 8944137 9081108 9537091 8499730 6806665 7390219
1950 7390219 10285066 11867535 10169936 7791479 7919175 10099422 11849886 12289923 12075108
1941 12075108 11400010 10279209 9799849 11099150 13501091 14988449 14172777 11100125 6949222
1932 6949222 3665889 2858482 4165826 5620337 6263558 7178230 9147383 10730829 9929861
1923 9929861 6765062 3079766 614200 128991 1438451 3363441 4454460 4397541 3808303
1914 3808303 2448597 -719717 -5196698 -8610028 -9629215 -9257129 -8197580 -5280659
1906 -5280659 -212697 4255133 5118667 2602468 -950341 -3974942 -5672943 -5255934 -3649071
1897 -3649071 -3915945 -7078504 -9400877 -7251966 -3009420 -1989021 -4478627 -5515143
1889 -5515143 -2732144 257891 -354682 -3407829 -5404786 -5254516 -4211994 -3371473 -3160896
1880 -3160896 -3510911 -3008080 213180 5274849 8354361 7492117 5603137 6464248 9393976
1871 9393976 10650326 9126242 7650264 8527115 10401759 10580424 8779843 7165812 7301182
1862 7301182 8279258 8095534 6195493 3975141 2732081 1870920 -211610 -3901531 -7926689
1853 -7926689 -10975203 -12722578 -13062598 -11331963 -7057733 -1273072 3353515 4106900 588725
1844 588725 -4278827 -6419557 -4397290 -367425 3191791 6311367 9924072 12972871
1836 12972871 13323181 10801291 7018732 2578130 -3014799 -8556649 -10896379 -8405509
1828 -8405509 -2880277 2712858 6740958 8717946 8629787 7431980 6693540 6821845 6777811
1819 6777811 5984620 5170163 5020166 5509290 6734119 8611635 9606808 7973704 4727618
1810 4727618 3047751 3990983 5125905 4250874 2006841 -154688 -1845673 -2252479 248871
1801 248871 4932983 7816313 6359625 2929374 1186629 1226077 1053772 797453 1991402
1792 1991402 3910185 4141588 2516229 1581348 3130129 6459525 9889017 11996381 11604956
1783 11604956 8496471 4158372 573989 -1312808 -1158475 1263986 4714934 6415702
1775 6415702 5277920 3603638 3608024 4233157 3817218 3601150 5233778 6753825 5034091
1766 5034091 910834 -2168323 -3465899 -4531367 -4429322 -586683 5508964 8700054
1758 8700054 7283997 4998632 4561094 3945085 1054574 -2327238 -3832617 -4020049 -4009511
1749 -4009511 -3033746 -992511 -178051 -1578817 -2461996 -671506 1442921 658774 -1971269
1740 -1971269 -3002842 -1666938 224190 1670501 2539696 1893345 -349257 -1460346 928153
1731 928153 4784090 6185797 4916153 4067215 4870196 5736771 6149554 7438493 9075602
1722 9075602 8014750 3316452 -1384271 -1925772 1527952 5060026 5235090 1852606 -2457465
1713 -2457465 -4575930 -3435374 -566339 2132350 4538597 7450079 10558337 12655356
1705 12655356 13108546 11780482 8504687 4283884 1761860 2297430 3638982 2983519 1238987
1696 1238987 1207958 2450763 1748256 -1419203 -3846085 -3734221 -3020238 -3406869 -3879411
1687 -3879411 -3966921 -5753710 -9957474 -13065817 -11592642 -7017866 -3356485 -1616469 -31160
1678 -31160 1515178 1093928 -1328150 -2833506 -1232555 2319981 4955848 4698242 1217954
1669 1217954 -4214424 -8967922 -10689030 -9429582 -7348755 -6146366 -5756590 -5575592 -5623309
1660 -5623309 -6002668 -6317260 -6335244 -6478444 -6933162 -6792377 -4926450 -1686774 945048
1651 945048 1382975 389190 278634 1852616 2942715 1051544 -3012710 -5669000 -4900024
1642 -4900024 -2486697 -1289911 -1838542 -2701591 -2928352 -2656019 -2227590 -2102070 -3042101
1633 -3042101 -4856331 -5509931 -3133812 1238649 4426569 4656716 3201155 2564187 4223474
1624 4223474 7977502 12074347 13901386 12048512 8150480 5527132 5592358 6649226 6480031
1615 6480031 4803520 2602485 362778 -1937963 -3900266 -4864317 -4715110 -3913991 -3155286
1606 -3155286 -3485672 -6000384 -10344117 -13772767 -12894001 -6840763 1699836 8811998 12307268
1597 12307268 12316405 9884013 6085077 2391947 472662 667327 1467973 1619721 1957304
1588 1957304 3498834 4378144 1427748 -4602172 -8354036 -6260808 -1264825 1349443
1580 1349443 783354 80106 174228 -1032614 -3645567 -4341815 -1562238 1495526 1403845
1571 1403845 -744408 -1705738 -1044841 -862659 -1977285 -3177006 -3513740 -2910505 -1074182
1562 -1074182 1899292 4277652 4325884 2997634 2879055 4568103 6233299 6752685 6950762
1553 6950762 7286645 6648673 4531556 2610395 2762099 4593504 6100632 6120380 5265068
1544 5265068 4843477 5361514 5794571 4346414 523587 -3732710 -5867767 -5428002 -3840666
1535 -3840666 -1879519 838642 3637940 4092516 638508 -5326550 -10808778 -13741020
1527 -13741020 -13747259 -11801152 -9850651 -9428077 -9765185 -8489085 -4857715 -785599 2134535
1518 2134535 4667159 7566682 9152965 7484659 3669576 678795 -270408 104036 1674219
1509 1674219 4794058 7884147 8063047 4879619 1128906 -845445 -1632110 -2674882 -3728004
1500 -3728004 -3704216 -2587226 -1212985 -258997 -428937 -2324756 -4941697 -5618593 -3099228
1491 -3099228 290911 1253330 -333288 -1766689 -1769912 -2159551 -4501880 -6908846 -5867824
1482 -5867824 -734061 5076157 7536039 5619917 1245333 -3083388 -5559664 -5131131
1474 -5131131 -2327018 -26862 -1233894 -5225085 -7922983 -7447583 -7048074 -10029733 -13741938
1465 -13741938 -12576570 -6422666 -1561190 -1880377 -3442561 -612660 5629891 9387408
1457 9387408 8169222 5425303 4930093 6238374 6732533 5608168 4279706 4167605 5321972
1448 5321972 6646677 6822964 5346219 2871696 398537 -1445933 -1916663 58097 4369175
1439 4369175 8627457 10017771 8058994 4444195 712434 -2495641 -4447149 -4447648 -2892071
1430 -2892071 -657753 2197048 5376586 6644868 3884358 -1009678 -3231216 -1063567
1422 -1063567 1788112 1250714 -2014905 -4272384 -3521023 -702942 2395682 4489441 5127783
1413 5127783 5386060 7272216 11059897 14362539 15112807 13870158 11671706 7688732 1421410
1404 1421410 -4625585 -7534962 -8009897 -8614380 -9033619 -6858039 -2697163 -345829 -1189394
1395 -1189394 -2301369 -1440129 -482840 -2073745 -5759745 -9353802 -11510757 -11048073 -6472623
1386 -6472623 1280772 7843725 9795449 8370237 6573167 4747136 1882663 -583108
1378 -583108 148501 4213458 9145576 13077223 15031382 13347032 7536834 1031274 -1866640
1369 -1866640 -1633770 -2313002 -4796583 -5743652 -3655133 -1139113 272403 2482665 5516255
1360 5516255 4909604 -1520265 -8274407 -8471686 -2964150 1734783 2703462 2574366 3276174
1351 3276174 3354138 2040592 1239404 2129067 3464219 4437614 5888835 7529989 7275731
1342 7275731 4713660 2164200 920948 -316873 -1599140 103495 6125297 12383805
1334 12383805 13737801 10176464 5622210 2260068 -626535 -3379303 -5138471 -6052135
1326 -6052135 -7200835 -8175750 -7423236 -5213640 -3633594 -3128398 -1600826 2105779 6018474
1317 6018474 7539032 6381349 3772367 366365 -3360621 -5730656 -4921046 -1457207
1309 -1457207 1710962 2062889 -292764 -3576143 -6628595 -9199424 -10206991 -7511244
1301 -7511244 -837100 6116981 8819959 7264782 5789520 6816747 7547848 4792078
1293 4792078 454049 -1045251 725647 2081064 1125271 -211141 -687238 -2364180 -6610287
1284 -6610287 -10362749 -9267176 -3353496 2730964 4792992 2974926 926641 2147746
1276 2147746 6918758 12313407 15488451 16723494 18174532 20020039 19890037 16468166
1268 16468166 11403323 6739751 2744929 -405220 -1359807 -310001 -819080 -5739394
1260 -5739394 -12248903 -14081581 -8711824 42798 6534562 8205759 6159115 3348851
1252 3348851 2628511 4343749 5233971 1787092 -4660402 -8407000 -6082918 -766523 2146346
1243 2146346 1329310 -261848 -141305 1319253 2736845 3313695 2158308 -1725547 -7550892
1234 -7550892 -12312347 -13681594 -12545679 -11342759 -10516932 -8364355 -4426904 -1095551
1226 -1095551 -693484 -2180886 -2354937 86108 3188348 4472351 3603606 1982821 1017397
1217 1017397 1531127 3722672 6568565 7964422 6709700 4198750 3218146 5068747 8484941
1208 8484941 11216884 11986272 10987367 9229013 7620180 6320339 4808339 2675870 268360
1199 268360 -1515675 -1882148 -710498 1069938 1805477 603631 -1488918 -2728878 -3069516
1190 -3069516 -3874809 -4963645 -3981527 -40688 3814077 3922344 801176 -1595646 -894751
1181 -894751 1627722 3763221 4772337 4728996 3749036 2840641 3778688 6947763 10463494
1172 10463494 12362193 12625791 12232155 11345684 9577171 7267041 5362788 4346768 4058813
1163 4058813 4280464 4882989 5643374 6341035 6803089 6687259 5698438 4241301 3328989
1154 3328989 3565189 4610079 5674777 5951137 4641321 1555412 -2026182 -3976266 -3289791
1145 -3289791 -907776 1495059 2753721 2282249 179309 -2251554 -3169976 -2016050 123004
1136 123004 2202124 4071788 5292103 4806129 2944325 2309173 4951877 9371023 11851795
1127 11851795 10420613 6267891 1791793 -1342958 -2568570 -2475461 -2666535 -4262728 -6330704
1118 -6330704 -6913619 -5790715 -4934980 -5721575 -6882771 -6226287 -3701207 -1588428 -1619574
1109 -1619574 -2734892 -2145349 1631574 7131688 11255788 11846565 8880531 3766040 -1613769
1100 -1613769 -5166478 -5156387 -1717740 2331187 3329704 228210 -3999530 -5041677 -1529306
1091 -1529306 3827827 7585294 9139843 9952560 10134039 8245695 4968585 4101564 7660502
1082 7660502 11957347 11653643 6738822 2109886 558210 11240 -1625465 -2945918 -2302766
1073 -2302766 -1122927 -1217462 -1444308 -133683 1212492 -29806 -3255647 -5626808 -6498019
1064 -6498019 -7660841 -9765885 -11559658 -12242286 -11623346 -8568556 -2799825 2087685 1548070
1055 1548070 -3328376 -6195906 -3764831 119237 593487 -1863570 -4023486 -5472433
1047 -5472433 -7705819 -9815131 -9290197 -6338212 -3684939 -2169605 144955 4033483
1039 4033483 7220684 7461218 5336298 2860384 907124 -922774 -3060896 -5531809
1031 -5531809 -7932488 -9233969 -8354573 -5396777 -1674382 1644743 4069129 4958410 3593512
1022 3593512 727375 -1202249 -573556 1366392 1995200 404578 -2035618 -3828260 -4706000
1013 -4706000 -4641630 -2906378 791888 4859910 6810236 5801563 3155428 93922 -3712299
1004 -3712299 -8383675 -11918931 -12076920 -9885806 -8973010 -10674410 -11837231 -8864556 -2296421
995 -2296421 4431375 9384477 12845100 14461473 12831080 8551374 5019042 4648757 5981882
986 5981882 6065784 4339220 2424513 1018827 -1008880 -4582573 -9085838 -13221397 -16013831
977 -16013831 -16839844 -15596477 -13142809 -10722455 -8773395 -7117229 -6256945 -7146373 -9182846
968 -9182846 -9746704 -6843059 -1502774 3473738 6653938 8774180 10758100 12261754 12445459
959 12445459 11207519 9219323 7416912 6768970 7745328 9441658 9930570 8318881 6054050
950 6054050 5328297 6502430 8204930 9873667 12602169 16594094 19088929 16663439 9571640
941 9571640 2272262 -950353 132366 2783571 5102183 7371672 10063470 12103728
933 12103728 11752053 8507214 3683903 -471777 -2003471 -214626 3881650 8050853
925 8050853 10124177 9210774 6171933 3159828 2133929 3138521 4319224 4242024 3628027
916 3628027 3786843 4030871 2430338 -1011464 -4035756 -5371471 -6091589 -6887208 -6377149
907 -6377149 -3678250 -438592 1743459 3878134 7040877 9215603 7957175 4809027
899 4809027 3278893 3213610 1466953 -1850089 -2537579 972762 4494893 4086511 1555560
890 1555560 1037433 2916967 4415284 4243770 3476971 3014911 2866014 2994027 2732439
881 2732439 596256 -3245139 -5807314 -4885324 -2267794 -954353 -924531 -558851 -495188
872 -495188 -2416298 -5105540 -5597255 -3849870 -2630557 -2903696 -2873673 -1631500 -280247
863 -280247 637210 1296925 179599 -4485610 -10424895 -12766947 -10860473 -9397218 -11214954
854 -11214954 -13284630 -11972718 -8047508 -3678557 1434587 7268132 10294145 7518257
846 7518257 1471351 -2995034 -5230052 -8120582 -12338944 -15498738 -16413161 -16248168 -15621921
837 -15621921 -14149805 -12797673 -13081622 -13690291 -11555482 -7039748 -4470360 -6008011 -8121621
828 -8121621 -6359996 -1371079 2290482 2015244 -606459 -2901142 -4296969 -5801295 -7543440
819 -7543440 -8009851 -5915371 -2294739 13720 -828643 -3852383 -6373269 -6215375 -2830750
810 -2830750 2514105 7062083 8359186 6746861 5115448 5370208 6395252 6495311 6236436
801 6236436 7235893 9471366 11621030 12895623 12622751 9335918 2793431 -3880181 -6632830
792 -6632830 -4749360 -636710 3732390 7453778 8636669 5503488 176323 -1909067
784 -1909067 2162965 9648052 15730190 18056179 16796657 12729240 7184739 2443608
776 2443608 260739 205354 130795 -1951488 -6164864 -10043731 -10189039 -6136980 -1742477
767 -1742477 -638388 -1327148 167375 3445061 3656430 -1173812 -7080199 -10101302 -11239547
758 -11239547 -12894843 -13937717 -11836809 -7215239 -2774844 533470 3039960 3829311
750 3829311 2293923 965580 2980616 7210751 9447171 8268052 6329268 5753126 5779582
741 5779582 5680647 6572683 8865757 10648484 10302233 8616555 6848307 4828534 2745151
732 2745151 2696245 5946844 9862073 10222141 6268421 1233016 -2056170 -3795268 -4965070
723 -4965070 -4868107 -2602274 391276 1478329 451623 145508 2702994 6463127 7699864
714 7699864 4936376 477651 -2239819 -1942716 -23389 1535118 2205069 2882389 4060914
705 4060914 4695850 3686858 2067288 1963539 2897630 1370434 -4044980 -9074382 -8160101
696 -8160101 -1672421 4601693 7158854 8344550 11163715 14136755 13854745 10273191 6555644
687 6555644 4884871 4946881 5755188 6572985 6342800 4329221 1465454 -457077 -1011958
678 -1011958 -1367678 -2395819 -3689017 -4478527 -4642827 -4707992 -5187499 -5628954 -4372701
669 -4372701 -432322 4062886 5027529 1142147 -4098209 -6451402 -5559543 -3805018 -2118486
660 -2118486 459383 3711929 5560114 4971407 3689199 4287689 7415546 11252211 13139684
651 13139684 11951094 9302071 7836478 7987190 7678449 5833075 4271612 4672023 5505676
642 5505676 4181012 942111 -1609193 -1916165 -415034 1751916 2972267 1643639 -1192301
633 -1192301 -1453372 2765290 7385014 7467238 4478479 3806201 6164457 7161249 5591609
624 5591609 5978203 10891619 16249182 17369767 15278383 13532304 12521976 10691373 8358025
615 8358025 6405983 3639329 -626577 -3360814 -1301518 3700488 6739364 6346677 5174289
606 5174289 4819003 3842445 1061294 -2677430 -6573602 -10732711 -14164813 -14527360 -11003022
597 -11003022 -5739578 -1761283 -749912 -2729536 -5969775 -7173883 -4085843 1471890
589 1471890 5100240 4919159 3192798 2265853 1288022 -1447846 -4834397 -5975547 -4225419
580 -4225419 -2091620 -1899920 -3147362 -3924190 -3868774 -4295020 -5439449 -5136283 -1462382
571 -1462382 4033692 7481507 7218691 5562064 5501488 7190068 8605715 8187957 5673376
562 5673376 1838435 -1124252 -531885 3491187 6886629 6140993 2972090 1988792 4292106
553 4292106 6345436 5241069 2033714 -942907 -3183077 -4869064 -4953533 -2579863 826143
544 826143 2939111 3546674 4593278 7294020 10407166 11672574 10388318 8261407 7743326
535 7743326 9557264 12070916 13206503 12413310 10327319 7353559 3755111 660171 -504196
526 -504196 282522 1554056 2026719 1414033 -244837 -2877471 -5943053 -8681516 -10746468
517 -10746468 -11864337 -11528813 -10147456 -9421074 -9755788 -8472285 -3384932 2577426 4034940
508 4034940 763484 -1381096 1400914 5717012 6521737 4249051 2709002 2442113 764638
499 764638 -2544364 -4176695 -2436835 229231 1070204 592038 786814 1899786 2656014
490 2656014 2461807 1916246 1727401 2075525 2773194 3670653 5123773 7778018 11189456
481 11189456 13189854 11945474 8395698 5102062 2800305 34831 -3500615 -5569502
473 -5569502 -4550880 -2119100 -1040337 -1529802 -1608491 -236137 1858008 4087785 6712048
464 6712048 9290996 10135909 8222558 4759034 2008983 934999 530096 -731549 -3106010
455 -3106010 -5173657 -5225128 -3197423 -931584 -28407 211435 1828202 5241143 8335382
446 8335382 8902375 7021798 4370479 2068340 208513 -1116092 -1616791 -1547468 -1553599
437 -1553599 -1691115 -1479151 -919874 -432585 297519 2145716 4838652 6717738 6909849
428 6909849 6498036 6601604 6576858 5507651 4372975 4861239 6603061 7527053 6750139
419 6750139 5170361 3247386 424967 -2809903 -4627653 -4667851 -5028600 -6912043 -8116457
410 -8116457 -5904280 -1109800 2803633 4044994 3732195 3302583 2928366 2541358 2342102
401 2342102 1884774 473617 -1033613 -661548 1584906 2764126 496991 -3708307 -6061957
392 -6061957 -4796655 -1624101 700184 1056241 272731 -189397 482682 2011658 3559414
383 3559414 4640733 5314796 5562567 5155727 4476391 4752508 6708558 9277748 10399556
374 10399556 9128493 6511619 4373132 3570868 3504762 3155059 2461425 2423314 3608818
365 3608818 4994366 5061867 3858097 2867299 2731791 2472088 1540159 1139449 2272154
356 2272154 3692741 3497816 2030755 1367443 2221629 3220702 3274021 2802728 2301353 1525860
346 1525860 747153 1014053 2163213 2184975 -87932 -2945458 -3915532 -2876516 -1549704
337 -1549704 -886292 -834571 -2021050 -5324101 -9527917 -11444076 -9344019 -5126022 -2264422
328 -2264422 -2329917 -4025346 -4937339 -3751165 -1275594 369549 -55293 -1567492 -2368201
319 -2368201 -2262042 -2552399 -3598610 -3966671 -2530985 -113758 1787696 2870699 3732560
310 3732560 4579038 5203892 5639841 5970444 6010013 5845821 6033130 6546378 6344597 4866718
300 4866718 3127821 2241157 1652400 196120 -1722919 -2605814 -2264886 -2167160 -3294043
291 -3294043 -5022766 -6286698 -6585289 -5703707 -3774431 -1930332 -1577438 -2512716 -2941294
282 -2941294 -1942470 -811410 -1231248 -3036388 -4546277 -4389978 -2364723 752792 3506680
273 3506680 4477087 3445905 1541082 -127964 -1450999 -2672926 -3543367 -3557240 -2365546
264 -2365546 327508 4297079 7822695 8488407 5938355 2830482 1947106 3184431 4490662
255 4490662 4837151 4775227 4688225 4162200 2952316 1233320 -940245 -3147893 -3864925
246 -3864925 -1742124 2378326 6148796 8405090 9681795 10142757 8983598 6359817 3938653
237 3938653 2627018 1502862 46092 -418019 1006063 2807364 3367639 3819177 6141063
228 6141063 9329868 10346879 8720207 7242015 7505548 7640187 5882545 3873871 4199852
219 4199852 6271948 7026096 4884445 981868 -2847338 -5209591 -4860606 -1735366 1710980
210 1710980 2611680 1590940 2236674 5964996 9939390 11467523 11896622 13749499 15953738
201 15953738 15138739 10906786 6554891 4369331 3191950 1511137 162054 188078 87124
192 87124 -2456544 -7005702 -10595354 -11218497 -9456362 -6851554 -4372592 -2723617 -2525711
183 -2525711 -3313563 -3451320 -2154545 -976320 -2043431 -4961016 -6822810 -5808270 -3577600
174 -3577600 -2939126 -3926247 -3931682 -1693928 835158 1386436 279351 -1021571 -2608077
165 -2608077 -5191361 -7581906 -7891334 -6968168 -7666193 -10190729 -11147465 -8551418 -5106062
156 -5106062 -4426874 -6030988 -6519222 -4396530 -1228729 1216737 2639760 3405035 4088164
147 4088164 5466343 7114301 6651373 2697674 -1868439 -2434460 1288216 4542023 3714561
138 3714561 581220 -1006935 -152004 1430397 2770172 4053473 4830536 4514042 4290309
129 4290309 6019708 9008764 10090153 7627428 3701026 1440733 1641723 3021360 4449089
120 4449089 5449275 5387827 3907431 2001502 1181136 1487531 1680527 1580452 2614542
111 2614542 5281194 7598537 7453440 5414930 3554220 2247389 222486 -2439123 -3682367
102 -3682367 -2420843 -34988 1996919 3980838 6167359 6999426 5379959 3423265 4405158
93 4405158 8376900 12116332 13355993 12731700 11179734 7867898 2121946 -4156873 -7714523
84 -7714523 -7153094 -3952458 -649122 1280120 1991016 2386498 2825953 2786728 1945951 1154802
74 1154802 1625818 3347394 5071635 5712560 4966234 2886406 26870 -2115480 -2170698
65 -2170698 -639993 617107 820680 885207 1321155 1053748 -905683 -3821234 -6080698
56 -6080698 -6695467 -5306437 -1881384 2583341 5936794 6568790 4935261 2918679 2182306
47 2182306 3303430 5500338 6816223 5721320 3112187 1614989 2379734 3843007 4208627
38 4208627 3536303 2546790 1251611 117865 670809 3002178 4354096 2594309 -180916
29 -180916 -285015 2121356 3312679 1614561 -440967 -356833 749150 337068 -1817671
20 -1817671 -3900643 -4877267 -5337111 -6012882 -6716013 -6679103 -5321139 -2772071 117679
11 117679 2531190 4480498 6519954 8845894 11107635 12680295 12571172 9961102 5994249
2 5994249 3925986 5410775
0 5410775
$$ Imaginary data points
##PAGE= N=2
##DATA TABLE= (X++(I..I)), XYDATA
65535 -8265982 -11153758 -8901314 -2615853 1788719 1205223 -1550705 -2868970 -2975143
65527 -2975143 -3532397 -3743140 -1948774 655878 1243289 -283207 -1123701 63041 1242616
65518 1242616 212970 -2350449 -4241077 -4651590 -4415284 -4225163 -4019001 -3860027 -4210175
65509 -4210175 -5035542 -5346719 -4135851 -1609180 894405 2340339 3064867 3972349 4787173
65500 4787173 3973116 940401 -2420021 -3504184 -2034935 -128514 694554 1117520 2106550
65491 2106550 2914219 2342739 987422 472193 838240 540410 -841427 -1807824 -1559320
65482 -1559320 -1553575 -2992222 -4153357 -2338309 1972835 5053327 4458090 1975162 1181109
65473 1181109 3184725 5894846 6909597 5964335 4474135 3538670 3039557 2612720 2810674
65464 2810674 4449818 6742847 7218848 4511626 606053 -1017568 636386 3195202
65456 3195202 4039565 2961413 1423795 569135 604335 987858 508725 -1750829 -4821046
65447 -4821046 -6330268 -5358458 -3575187 -2617417 -1822479 -20270 1839536 1928954 526974
65438 526974 -534588 -1017459 -2452328 -5010676 -6580473 -5772947 -3926058 -3018926 -3061113
65429 -3061113 -2702791 -1311844 679102 2654312 4046011 4355034 3815650 3514582 4165985
65420 4165985 5254092 5831504 5517370 4419051 3094002 3031615 5754359 10382112 13352444
65411 13352444 12085221 8145182 5260082 4852342 5235313 4823404 4118249 4212117 5055996
65402 5055996 5953468 6575445 6768460 6251107 5097951 3787154 2351555 277225 -2397043
65393 -2397043 -4820244 -6633866 -8501087 -10653667 -11944320 -11297256 -9239362 -6931369
65385 -6931369 -4511767 -1741832 387270 446351 -1131434 -2251416 -1988959 -1677860 -2567167
65376 -2567167 -3860720 -4134157 -3585557 -3566007 -4524482 -5735388 -6732539 -7671161 -8239638
65367 -8239638 -7555271 -5746750 -4718122 -6331357 -9929046 -12406707 -11201489 -7100137
65359 -7100137 -3626908 -3327160 -4972806 -5108728 -2297907 1145982 2120171 522982 -874643
65350 -874643 93308 2674246 4331015 3361448 265586 -2838569 -3907616 -2460586 344108
65341 344108 2965144 4451621 4224418 1876436 -2074330 -5896554 -8025787 -8392445 -7775621
65332 -7775621 -6554497 -4958599 -3656145 -2789648 -1180095 1976156 5283980 6782704
65324 6782704 6786728 6996339 7262912 5833925 2801977 458994 -285054 -926624 -1973825
65315 -1973825 -1704467 154891 697817 -1865095 -4945531 -5456093 -4532547 -4973827 -5848880
65306 -5848880 -3684546 1729139 6577822 8083128 6968509 4652355 1322094 -2344069
65298 -2344069 -4428728 -4073961 -2576880 -1330958 -414973 308991 644006 1045060 2109229
65289 2109229 2677465 749307 -3087007 -5573773 -5050939 -3404778 -2698527 -2477149 -1987641
65280 -1987641 -2412690 -4475963 -5825743 -3653115 1104514 4716388 5316477 4490754 4512937
65271 4512937 5855346 7366156 7440154 5114412 1211690 -1840806 -2428764 -1632143 -1657273
65262 -1657273 -2972912 -4325677 -5131844 -6221898 -8077612 -9658020 -9515370 -7481860
65254 -7481860 -4960130 -3690291 -4034455 -4439445 -3238745 -1078560 -427991 -2232656 -4451382
65245 -4451382 -4835062 -3722551 -2704405 -1866430 -293580 1559141 2178369 1414581 621706
65236 621706 372522 -101248 -933095 -878898 751697 2703703 3034360 951238 -2903786
65227 -2903786 -7030606 -9592745 -9423044 -7173117 -4815681 -3485809 -2323181 104339
65219 104339 3652131 6399257 6594697 4582663 2531813 2010285 2154426 1023619 -1415298
65210 -1415298 -3060349 -2798483 -2128118 -2566910 -3161917 -2378814 -1007943 -789930 -1177785
65201 -1177785 -377490 813574 -449871 -4175706 -6522095 -5100645 -2376240 -1736941
65193 -1736941 -2733587 -2962749 -2665776 -3878472 -5798962 -4834120 21876 4979148 6196944
65184 6196944 4514721 3511012 4341537 4761846 2756622 -895988 -3847641 -4459164 -2574933
65175 -2574933 596391 2797572 2111964 -1005309 -3691957 -3431488 -487912 2742114
65167 2742114 4094979 2964370 333544 -1682394 -1376091 359960 434535 -2470997 -5526924
65158 -5526924 -5316922 -2675523 -1233665 -1700035 -971185 2653874 6867093 9254337 10537073
65149 10537073 11984863 12687066 12097264 12613149 16114374 19639588 18231531 11391931
65141 11391931 3500810 -1686217 -3901966 -4223478 -3478279 -3005774 -3883471 -4806492 -3428978
65132 -3428978 -261765 1590325 1183666 1168393 3287620 5391692 4819767 2434833 1085688
65123 1085688 1562838 2112638 1073316 -1547913 -4435531 -5824008 -4765665 -2373518
65115 -2373518 -942719 -1181598 -1312461 482962 3784510 6606216 7279132 5407389 2250612
65106 2250612 259340 597899 1112028 -1131774 -5201360 -6941730 -4827205 -1985059
65098 -1985059 -1117860 -830137 813639 2319226 1400637 -967078 -2447350 -3159136 -4081087
65089 -4081087 -3617085 94724 4740388 6180511 4726526 4550060 6757288 7816856
65081 7816856 5960893 4520944 6650966 10503020 12432771 12059092 11177385 10041405
65073 10041405 7993737 6090071 5617079 4857068 800047 -5793868 -10021322 -8388521
65065 -8388521 -2662395 2672986 5087245 5153132 4466777 3825481 3025050 1592261 -249357
65056 -249357 -1336123 -866758 213847 412775 562688 3684759 10519241 16600075 16300755
65047 16300755 9724163 3125058 1646954 3809958 4783409 3221428 2113760 3431911
65039 3431911 4949149 3431561 -985406 -5195152 -6962315 -6865204 -6514775 -5973301 -3683387
65030 -3683387 948131 5480907 6226413 2744773 -769738 -226833 3150999 4651789
65022 4651789 2713870 756663 1680864 3633948 3235473 714249 -756238 469884
65014 469884 3177346 5672062 7235534 7594911 6946149 6317705 6235376 5349699 2095518
65005 2095518 -2597528 -6029785 -6978969 -6512666 -5804331 -5041562 -4425128 -4203710 -3507034
64996 -3507034 -1179746 1818196 2949567 1790494 1109252 3022676 5881674 6722368
64988 6722368 5620468 5592787 8422085 12204467 13448885 10815203 6451179 4006318
64980 4006318 5472337 9707017 13739006 15277368 14040616 11316250 8831411 7727337
64972 7727337 7884805 8153230 7526596 5958250 3973988 2148125 1196292 1506083 1917461
$$ [...]
##END NTUPLES=NMR SPECTRUM
##END=
