##TITLE=31Pdec_LR-796-C1-K2
 CDCl3, 24 sc
 20.1.2025
##JCAMPDX= 6.0         $$ Bruker NMR JCAMP-DX V2.0
##DATA TYPE= NMR SPECTRUM
##DATA CLASS= NTUPLES
##ORIGIN= UXNMR, Bruker Analytische Messtechnik GmbH
##OWNER= root
$$ XWIN-NMR		Version 3.5
$$ Mon Jan 20 16:31:59 2025 Russian Standard Time (UT+4h)  she@DPX200
##.OBSERVE FREQUENCY= 81.013821
##.OBSERVE NUCLEUS= ^31P
##.ACQUISITION MODE= SIMULTANEOUS
##.ACQUISITION SCHEME= undefined
##.AVERAGES= 24
##.DIGITISER RES= 17
##SPECTROMETER/DATA SYSTEM= spect
##.PULSE SEQUENCE= zgpg30
##.SOLVENT NAME= CDCl3
##.SHIFT REFERENCE= (INTERNAL, CDCl3, 0, 198.062)
##AUDIT TRAIL= $$ (NUMBER, WHEN, WHO, WHERE, WHAT)
$$ ##TITLE= Audit trail, XWIN-NMR		Version 3.5
$$ ##JCAMPDX= 5.01
$$ ##ORIGIN= Bruker BioSpin GmbH
$$ ##OWNER= she
$$ F:/spectra/data/she/nmr/P31/2/pdata/1/auditp.txt
$$ ##AUDIT TRAIL=  $$ (NUMBER, WHEN, WHO, WHERE, WHAT)
(   1,<2025-01-20 16:31:00.32 +0400>,<she>,<DPX200>,
      <created by zg, POWCHK disabled, PULCHK disabled
       configuration hash MD5:
       00 E9 B6 7A A2 85 ED C7 34 08 36 98 17 FE 4E 26
       data hash MD5: 32K
       C1 A0 AF 7A 86 90 6A EB F6 FF F5 BE CA 2A 64 92>)
(   2,<2025-01-20 16:31:02.70 +0400>,<she>,<DPX200>,
      <Start of raw data processing
       efp BC_mod = 2 LB = 1.5 FT_mod = 6 PKNL = 1 PHC0 = 1758.16 PHC1 = 87.4864 SI = 64K 
       data hash MD5: 64K
       55 C3 73 88 AC ED B6 BF 35 F7 0A ED 42 F2 D5 CC>)
(   3,<2025-01-20 16:31:18.34 +0400>,<she>,<DPX200>,
      <pk PHC0 = 12.17321 PHC1 = 0 
       data hash MD5: 64K
       4E 7C FC 42 F6 6A D0 56 81 0B E6 08 03 18 DD 45>)
(   4,<2025-01-20 16:31:25.45 +0400>,<she>,<DPX200>,
      <abs ABSG = 5 
       data hash MD5: 64K
       1C CB 04 5B B6 D8 1C 3E BA A3 D5 F7 F7 7E E6 64>)
$$ ##END=
$$ 
$$ hash MD5
$$ 0C 9B 7C A6 05 4E 90 5B 4C 05 04 01 DE 13 69 B1
##$RELAX= 
##$RELAX= 
##$RELAX= 
##$RELAX= 
##$RELAX= 
##$RELAX= 
##$RELAX= 
##$RELAX= 
$$ Bruker specific parameters
$$ --------------------------
##$DU= <F:/spectra>
##$EXPNO= 2
##$NAME= <P31>
##$PROCNO= 1
##$TYPE= <nmr>
##$USER= <she>
##$AMP= (0..31)
100 100 100 100 100 100 100 100 100 100 100 100 100 100 100 100 100 100 
100 100 100 100 100 100 100 100 100 100 100 100 100 100 
##$AQSEQ= 0
##$AQ_mod= 1
##$AUNM= <au_zg>
##$AUTOPOS= <>
##$BF1= 81.014009
##$BF2= 200.13
##$BF3= 200.13
##$BF4= 200.13
##$BF5= 200.13
##$BF6= 200.13
##$BF7= 200.13
##$BF8= 200.13
##$BYTORDA= 1
##$CFDGTYP= 0
##$CFRGTYP= 5
##$CHEMSTR= <none>
##$CNST= (0..31)
1 1 145 1 1 1 1 1 1 1 1 1 1 1 1 1 1 1 1 1 1 1 1 1 1 1 1 1 1 1 1 1 
##$CPDPRG= <waltz16>
##$CPDPRG1= <>
##$CPDPRG2= <waltz16>
##$CPDPRG3= <>
##$CPDPRG4= <mlev>
##$CPDPRG5= <mlev>
##$CPDPRG6= <mlev>
##$CPDPRG7= <mlev>
##$CPDPRG8= <mlev>
##$CPDPRGB= <>
##$CPDPRGT= <>
##$D= (0..31)
0 1 0 0 0 0 0 0 0 0.06 0 0.03 2e-05 3e-06 0 0 0.0002 0 0 0 0 0 0 0 0 0 
0 0 0 0 0 0 
##$DATE= 1737376259
##$DBL= (0..7)
120 120 120 11 120 120 24 19 
##$DBP= (0..7)
150 150 150 150 150 150 150 150 
##$DBP07= 0
##$DBPNAM0= <>
##$DBPNAM1= <>
$$ [...]
##$SUBNAM3= <"">
##$SUBNAM4= <"">
##$SUBNAM5= <"">
##$SUBNAM6= <"">
##$SUBNAM7= <"">
##$SUBNAM8= <"">
##$SUBNAM9= <"">
##$SW= 400.765351723535
##$SWIBOX= (0..15)
0 1 3 0 0 0 0 0 0 0 0 0 0 0 0 0 
##$SW_h= 32467.5324675325
##$TD= 32768
##$TD0= 1
##$TE= 0
##$TE2= 300
##$TE3= 300
##$TEG= 300
##$TL= (0..7)
0 120 53 12 22 120 120 120 
##$TP= (0..7)
150 150 150 150 150 150 150 150 
##$TP07= 0
##$TPNAME0= <>
##$TPNAME1= <>
##$TPNAME2= <>
##$TPNAME3= <>
##$TPNAME4= <>
##$TPNAME5= <>
##$TPNAME6= <>
##$TPNAME7= <>
##$TPOAL= (0..7)
0.5 0.5 0.5 0.5 0.5 0.5 0.5 0.5 
##$TPOFFS= (0..7)
0 0 0 0 0 0 0 0 
##$TUNHIN= 0
##$TUNHOUT= 0
##$TUNXOUT= 0
##$USERA1= <user>
##$USERA2= <user>
##$USERA3= <user>
##$USERA4= <user>
##$USERA5= <user>
##$V9= 5
##$VALIST= <valist>
##$VCLIST= <CCCCCCCCCCCCCCC>
##$VD= 0
##$VDLIST= <DDDDDDDDDDDDDDD>
##$VPLIST= <PPPPPPPPPPPPPPP>
##$VTLIST= <TTTTTTTTTTTTTTT>
##$WBST= 1024
##$WBSW= 4
##$XGAIN= (0..3)
0 0 0 0 
##$XL= 0
##$YL= 0
##$YMAX_a= 6039
##$YMIN_a= -7108
##$ZGOPTNS= <>
##$ZL1= 120
##$ZL2= 120
##$ZL3= 120
##$ZL4= 120
##$ABSF1= 198.0616
##$ABSF2= -202.7028
##$ABSG= 5
##$ABSL= 3
##$ALPHA= 0
##$AQORDER= 0
##$ASSFAC= 0
##$ASSFACI= 0
##$ASSFACX= 0
##$ASSWID= 0
##$AUNMP= <proc_1d>
##$AZFE= 0.1
##$AZFW= 0.5
##$BCFW= 0
##$BC_mod= 2
##$BYTORDP= 0
##$COROFFS= 0
##$CY= -3
##$DATMOD= 1
##$DC= 0
##$DFILT= <>
##$DTYPP= 0
##$F1P= 0
##$F2P= 0
##$FCOR= 1
##$FTSIZE= 65536
##$FT_mod= 6
##$GAMMA= 0
##$GB= 0
##$INTBC= 1
##$INTSCL= 9.790993e-09
##$ISEN= 30
##$LB= 1.5
##$LEV0= 0
##$LPBIN= 0
##$MAXI= 10000
##$MC2= 0
##$MEAN= 0
##$ME_mod= 0
##$MI= 50
##$NCOEF= 0
##$NC_proc= -9
##$NLEV= 6
##$NOISF1= 182.463
##$NOISF2= 159.3651
##$NSP= 0
##$NTH_PI= 0
##$NZP= 0
##$OFFSET= 198.0616
##$PC= 4
##$PHC0= 1770.333
##$PHC1= 87.4864
##$PH_mod= 1
##$PKNL= yes
##$PPARMOD= 0
##$PSCAL= 0
##$PSIGN= 0
##$REVERSE= no
##$SF= 81.0140089999434
##$SI= 65536
##$SIGF1= 159.3651
##$SIGF2= -187.1042
##$SINO= 113.3802
##$SIOLD= 16384
##$SREGLST= <1H.CDCl3>
##$SSB= 0
##$STSI= 65536
##$STSR= 0
##$SW_p= 32467.5324675325
##$SYMM= 0
##$S_DEV= 0
##$TDeff= 32768
##$TDoff= 0
##$TI= <>
##$TILT= no
##$TM1= 0
##$TM2= 0
##$TOPLEV= 0
##$USERP1= <user>
##$USERP2= <user>
##$USERP3= <user>
##$USERP4= <user>
##$USERP5= <user>
##$WDW= 1
##$XDIM= 65536
##$YMAX_p= 537109694
##$YMIN_p= -218686314
$$ End of Bruker specific parameters
$$ ---------------------------------
##NTUPLES= NMR SPECTRUM
##VAR_NAME=  FREQUENCY,     SPECTRUM/REAL,   SPECTRUM/IMAG
##SYMBOL=    X,             R,               I
##VAR_TYPE=  INDEPENDENT,   DEPENDENT,       DEPENDENT
##VAR_FORM=  AFFN,          ASDF,            ASDF
##VAR_DIM=   65536,         65536,           65536
##UNITS=     HZ,            ARBITRARY UNITS, ARBITRARY UNITS
##FACTOR=    0.49542278885378, 1,            1
##FIRST=     16045.7642231865, 0,            0
##LAST=      -16421.768244346, 0,            0
##MIN=       -16421.768244346, -218686314,   0
##MAX=       16045.7642231865, 537109694,    0
$$ Real data points
##PAGE= N=1
##DATA TABLE= (X++(R..R)), XYDATA
$$ [...]
47011 7905533 7734680 8652215 8001531 6617642 6348335 6162235 4304004 2415428 3587803
47002 3587803 7036925 8283083 4867049 -711837 -4151668 -3614912 -674925 1604367
46994 1604367 1516655 479978 1444433 5050392 8799825 10778938 11863739 12576798 10562799
46985 10562799 4330584 -2592862 -5214326 -3744854 -2700617 -3792685 -4071641 -1772752
46977 -1772752 191190 -1606342 -6514329 -11305628 -13914408 -13888672 -11242159 -7017527
46969 -7017527 -3759501 -3535776 -5859912 -8356336 -8855174 -6700806 -3319762 -1716384
46961 -1716384 -3724915 -7315002 -8357990 -5466359 -1031643 2985547 7503498 13138984
46953 13138984 17314428 17096556 13346196 9546820 7410683 5880460 3931774 2209689
46945 2209689 1763375 2561272 3463593 3071249 1015624 -1086727 -750335 2718709 7522330
46936 7522330 11584435 14006326 14015815 10826158 5825380 2586372 2740800 3796911 3120847
46927 3120847 1900371 2395120 3323958 1722012 -1749655 -3367678 -2051033 -783298
46919 -783298 -1943637 -4550791 -6771312 -8027737 -7826284 -5601908 -2897377 -2866436 -6216997
46910 -6216997 -10045752 -11852716 -12224359 -12396779 -11934829 -10408172 -8747368 -7216629 -4694490
46901 -4694490 -1869279 -2180689 -6826916 -11374371 -10654660 -5271055 -28917 2492060
46893 2492060 3257307 2901166 574147 -3361271 -6884432 -8985812 -10186158 -10414861 -9088513
46884 -9088513 -7239947 -6577052 -6188959 -3310343 1966819 5774139 5304754 1836682 -2157135
46875 -2157135 -6036668 -9547831 -11083786 -9708331 -7171967 -5888802 -6185296 -6995382
46867 -6995382 -7682286 -7677886 -6121499 -3660870 -2868872 -4842345 -7053170 -6806343 -5099415
46858 -5099415 -4308244 -3680422 -790604 3228445 3988049 9907 -4938455 -7034737 -6999582
46849 -6999582 -7701662 -9586292 -10818051 -10453305 -9090333 -7067819 -4114727 -687485
46841 -687485 1949066 3141978 3270696 2726790 1510087 5896 -796291 -396018 348622
46832 348622 -44927 -2035457 -4305907 -4889776 -3261001 -1112316 -584039 -1826754 -3091666
46823 -3091666 -3408713 -4139532 -6978750 -10988811 -12893615 -10664761 -6087281 -3081990
46815 -3081990 -3516035 -5208762 -4568544 -1019685 2109317 1600950 -1735202 -4413356 -4837756
46806 -4837756 -4507653 -4614287 -3937538 -1410716 1347658 2148581 1438749 1101686 1241682
46797 1241682 928300 1314080 4482543 8984687 10241939 6681407 2056505 -262125
46789 -262125 -1876340 -5255167 -8080883 -6008189 552326 6990799 11235605 15169157
46781 15169157 18915525 18783417 13100378 6082739 2831677 3228077 3794910 3308559 3171223
46772 3171223 3726163 3706387 2798725 1842637 803362 -861007 -2138254 -1375751 878277
46763 878277 2487385 3128193 4408542 6378367 6748677 4404903 1271833 -273341 271296
46754 271296 2501967 5937418 8784319 8440957 4928806 1612714 578770 -597312
46746 -597312 -5011813 -11028931 -13711032 -11049115 -6075284 -2728553 -1851942 -1708736 -703729
46737 -703729 1170638 2720515 3017970 2781448 3668272 5455105 5080529 259389 -6552059
46728 -6552059 -9966753 -7643187 -2576360 1063604 2493973 3597927 5162825 5784103
46720 5784103 4406790 2450709 2539509 5446205 8991302 10186718 8046256 3919609
46712 3919609 -340286 -3499982 -4517398 -2644863 1272731 4717158 5667073 4227092
46704 4227092 1689409 -818329 -2059968 -741586 2538374 4562636 2697345 -1729361
46696 -1729361 -4997068 -5414841 -4302430 -3021404 -1401971 543953 1583769 1086205
46688 1086205 508302 1810381 4876977 7240990 6302574 1824634 -3582697 -6898675
46680 -6898675 -7972972 -9523082 -13211977 -17056796 -18085667 -16158391 -13068956 -9109775
46672 -9109775 -3529915 1949080 3426534 -450084 -6467818 -10459788 -10895934 -8280540
46664 -8280540 -3427911 2391063 7428076 10693611 11794499 9407432 2553289 -5812931
46656 -5812931 -9668836 -6472922 -541105 2218684 867997 -1393473 -2368824 -2275406 -1530012
46647 -1530012 -151478 1338415 2852890 5805933 10947170 16022272 18030802 17016392
46639 17016392 15144223 12986943 9777491 6759318 6684794 9469095 11463409 10108204
46631 10108204 6905373 4826127 4956573 6647488 8868366 10240912 9479464 6962178
46623 6962178 4551377 3171702 2042582 764221 203801 454065 -101841 -2397770 -4914262
46614 -4914262 -5513754 -3735039 -423632 3227391 5290998 3859484 -108730 -2416896
46606 -2416896 -105887 4913016 8455289 8938734 7688727 5804702 3366113 1002004
46598 1002004 -487662 -1901026 -4474739 -6841510 -5686310 -94379 6858000 11576765
46590 11576765 13084030 11984356 8597125 3802440 230817 503187 4433956 9035680
46582 9035680 11190240 9998256 7182819 5550390 6168337 6741546 4045022 -1542042
46574 -1542042 -5650947 -5176554 -2089008 -160971 409805 2265471 5591694 6982980
46566 6982980 4265064 -366249 -3370030 -3886679 -3236638 -2250276 -1001105 65874 731319
46557 731319 2031931 4978605 8734282 11491070 12469202 11544822 7955071 1745937 -3999959
46548 -3999959 -5277427 -2049466 1468025 2289524 1952982 2906412 4068203 2541830 -1612632
46539 -1612632 -5134126 -5840604 -4809585 -4026328 -3885144 -3804936 -3792308 -4202176 -4645603
46530 -4645603 -4155691 -2354381 1224 1538206 1114538 -1569461 -5664109 -9246979
46522 -9246979 -10112091 -7386515 -2912818 -390820 -2024467 -5999304 -8192008 -6388093
46514 -6388093 -1890929 2693072 5527758 5364236 1792851 -3009780 -4936706 -2450507
46506 -2450507 973357 1037583 -1906330 -3897676 -2857345 -270887 2074870 3936359
46498 3936359 4984346 4338169 2563519 1522998 1244346 -464878 -3955513 -5983956
46490 -5983956 -4151646 -919607 -460573 -2781053 -3782037 -726380 4835232 9584822
46482 9584822 11625538 10737498 7495649 3225714 -373854 -2694480 -4763087 -7547740
46474 -7547740 -10129821 -10428589 -7777159 -4002696 -1377376 83126 2232569 5470398
46466 5470398 7064970 4007221 -3101664 -10374484 -14417613 -14286197 -10294396 -3467206
46458 -3467206 3317577 6345690 4947627 2618650 2547764 3542028 2334241 -1361828 -4495725
46449 -4495725 -4819610 -3143408 -1464719 -647386 -172603 1045621 3557508 6151351 6380273
46440 6380273 3605341 580910 113980 988737 -215132 -3566616 -5156029 -2791080
46432 -2791080 536229 560946 -2879920 -6274787 -6946091 -5343436 -3599699 -3333613 -4539923
46423 -4539923 -5651099 -5063267 -3166580 -2065331 -2686388 -3384077 -2527329 -1303957 -2278459
46414 -2278459 -5716980 -9011311 -9696439 -7724122 -4763398 -2533760 -1998335 -2939394 -3742102
46405 -3742102 -2442645 1276112 5438401 7581252 7071440 5315254 3732663 2003694
46397 2003694 -1091810 -5127297 -7461282 -6336151 -3834013 -3836098 -6894398 -9282784 -8101453
46388 -8101453 -5153456 -3882627 -4263424 -3452690 -570049 2274027 3685544 4591282 5309813
46379 5309813 3979315 -264822 -4691754 -5788701 -3410137 -131942 2414756 4292163
46371 4292163 5076995 3689672 813238 -807537 392068 2730655 3611947 2850731 2415188
46362 2415188 3549448 5585163 7515611 9345503 11189695 11862374 9556293 4162777
46354 4162777 -1799816 -5187471 -4979690 -2647522 -185352 1395270 1835656 1266801 634794
46345 634794 1271942 2979823 3477799 1244041 -1567074 -810493 4697544 11207764 13641122
46336 13641122 10435404 4516877 295200 104441 2872730 5696693 6867250 7250960
46328 7250960 8344223 9687860 9569929 8033508 7347160 8983158 11761284 13772606
46320 13772606 14552559 14231837 12075907 7590996 2275539 -1273380 -1616423 1068084
46312 1068084 5803509 10794609 13573354 12911916 10190634 7581147 5630571 4061090
46304 4061090 3741584 5534579 7918632 8511876 7833227 8685149 11454383 13040814 11426926
46295 11426926 8320102 5641517 2339031 -2687446 -6795991 -6268770 -1926955 1240376
46287 1240376 219227 -3018253 -5226496 -6021445 -6920752 -8187775 -8652283 -7905721 -6838047
46278 -6838047 -6001030 -4896760 -3327808 -2325227 -2918258 -4644567 -6144198 -6720625 -6264880
46269 -6264880 -4105314 417147 6071672 10238669 11996295 12916106 13748664 12499192
46261 12499192 7840318 2489130 174659 379057 -512412 -3313445 -5007387 -3880874
46253 -3880874 -1846089 -568356 964787 3166045 3669812 1135881 -1580002 -1256040
46245 -1256040 590071 -351913 -5103405 -9889785 -10191635 -4704383 3539325 8586918
46237 8586918 6134417 -1291289 -5891074 -3709570 334528 -419198 -5134141 -7932673
46229 -7932673 -7364953 -7533135 -10248621 -12117444 -10608541 -7723841 -5584726 -2920842
46221 -2920842 1422654 5218289 5991625 4583963 3010839 1329220 -902088 -2536620
46213 -2536620 -2873921 -3580576 -5839452 -7523761 -6106038 -2839961 -1164069 -2130751 -4127313
46204 -4127313 -5954995 -7213139 -6492914 -2550627 2602442 4695602 2070325 -2406599
46196 -2406599 -4847484 -4073852 -1435906 1266747 2663821 1824564 -1217574 -4914186
46188 -4914186 -6856377 -5662877 -2614891 -917015 -2352873 -4959465 -5409847 -3468724
46180 -3468724 -1954668 -2042128 -1479113 1149880 3290052 2033282 -1387524 -3701722 -4401319
46171 -4401319 -4968564 -4640570 -1199377 4113502 6829143 5624998 4736686 7899046 12800987
46162 12800987 14293300 11190011 6905720 4260051 2692808 909760 -361104 180602
46154 180602 1530893 929087 -2552431 -6342871 -7171718 -4796007 -1813920 -168267 634844
46145 634844 1643617 2540941 2620043 2402425 2946432 4235771 5302789 5304821 3688676
46136 3688676 334444 -3409463 -5068008 -3900129 -2318692 -2779281 -4426596 -4994610
46128 -4994610 -4951723 -6742108 -10039302 -10962814 -7077185 -725945 4043780 6007284 6556484
46119 6556484 6344771 4285761 -74021 -4625414 -6127287 -3735117 -635758 -1175528
46111 -1175528 -5984255 -11004161 -12119422 -9518440 -6292509 -4274357 -3412035 -4028880
46103 -4028880 -6624512 -9560733 -10052359 -8254807 -7748642 -10721763 -14800985 -16163973
46095 -16163973 -14207500 -11584327 -10659528 -11366453 -12166913 -12195562 -12284603 -13618343 -15208897
46086 -15208897 -14014746 -8927726 -3239821 -799103 -853198 144972 2402729 2604815 83930
46077 83930 -1476885 -63848 1369121 147766 -1596584 -987083 493184 29730 -1078459
46068 -1078459 405099 3671544 4651747 2038584 -1674652 -4768196 -7760508 -10260593
46060 -10260593 -10488290 -8670788 -7272788 -6946950 -5806340 -3905705 -4699734 -9795540
46052 -9795540 -15223723 -15783958 -11364714 -6436146 -4421237 -4815614 -5192219 -4036316 -1649102
46043 -1649102 513852 1382517 1555088 2386940 3546838 2911336 -215292 -3313028 -3640282
46034 -3640282 -1902499 -1062038 -2159089 -3458180 -3793848 -4634753 -7806938 -12467669 -15660383
46025 -15660383 -15500069 -12888085 -10153804 -8718982 -8266648 -7686800 -6390008 -4711600
46017 -4711600 -3239583 -1926185 -152124 2034813 3074847 1292913 -2487683 -4922005
46009 -4922005 -3944977 -1649156 -1407803 -2609704 -1149370 3996572 7761780 5059005
46001 5059005 -2158381 -7133198 -6716911 -4082809 -2884049 -2300965 349544 4596092
45993 4596092 6982909 5407258 1298266 -2415819 -4162905 -4412976 -4456925 -4983774 -5722246
45984 -5722246 -6291068 -7071073 -8828011 -11601752 -14456106 -16249069 -16210279 -14068281 -10425017
45975 -10425017 -6984413 -5639372 -7091057 -10560090 -14433517 -16757429 -15962948 -12279935
45967 -12279935 -7946799 -4820396 -2269344 1199964 4797814 5796234 2977609 -1935925
45959 -1935925 -6305335 -8466323 -7934991 -5840131 -5075073 -7580294 -11175300 -11637145 -8402938
45950 -8402938 -5311735 -4803129 -4714691 -2625941 -65418 427068 -254408 281470 1399929
45941 1399929 538887 -2194523 -4091747 -4097702 -3742837 -3952503 -4022978 -3888717 -4414831 -5122287
45931 -5122287 -4608347 -3794812 -5680995 -10723608 -15201757 -15644369 -12602085 -8671352 -5178479
45922 -5178479 -2561552 -1690304 -2348525 -2018041 1171163 5129151 5943308 3107687 475786
45913 475786 1690550 6121554 9674257 8729791 3297903 -2923079 -5780658 -4692943
45905 -4692943 -3105535 -4249384 -7207069 -8434361 -6550564 -3806861 -2695626 -2870029
45897 -2870029 -2268106 -109041 2358020 3583759 3211155 1952245 841055 890422 2751360
45888 2751360 5812271 7773913 6357186 2179970 -1050787 -499323 2333463 3742768
45880 3742768 2774340 1537550 624002 -2256152 -7456244 -10686554 -8442467 -3817245
45872 -3817245 -2798492 -5974421 -8408199 -7450245 -5591599 -4436741 -1226972 5336271
45864 5336271 10081463 7151087 -1173173 -6299717 -3622545 3098951 7838821 8776569
45856 8776569 7467055 5110279 2168109 -194076 -767588 61210 731766 343569 -534601
45847 -534601 -415889 1916361 5819108 8216312 6009699 -303145 -6649735 -9680091
45839 -9680091 -9773020 -9072336 -8147825 -5985650 -2148268 2574282 7002773 9917608 10378972
45830 10378972 8850862 7127518 5958554 3881041 25061 -3057637 -1710142 3958024
45822 3958024 9649399 11473778 9228564 5118244 1279310 -863563 -629334 1397987
45814 1397987 3751615 5521385 6693698 7142727 6596176 5769718 6105253 7912454 9905096
45805 9905096 10869963 10660039 9451973 7423822 5339378 3968167 2772435 779055
45797 779055 -1209926 -1296596 426684 1834990 2277362 3389855 5478902 6148451 4232257
45788 4232257 2124295 1844687 1564823 -913292 -3568193 -2746930 1110627 4071817 4282028
45779 4282028 3488611 3529138 4713463 7387789 11537746 14642094 13352112 7962002 2315290
45770 2315290 -1147215 -3276766 -4863551 -4850751 -2846673 -237607 2330606 5602993
45762 5602993 8867665 9723772 7908026 5907442 4338317 624215 -5596741 -9872254
45754 -9872254 -8912074 -5516589 -3793466 -2771738 739977 5629092 7921903 7035522
45746 7035522 5465288 3405735 -926628 -6067334 -7999709 -6512610 -5421547 -5454277
45738 -5454277 -2684694 3686181 7601744 4153726 -2839338 -5838830 -3446377 -674950
45730 -674950 -1033261 -2904526 -3410577 -1967736 387167 2205422 1750575 -1371993 -4096738
45721 -4096738 -2038450 4907886 10977177 10217433 2913444 -4934247 -8041512 -6558841
45713 -6558841 -4436006 -4371865 -5449755 -5450534 -3922992 -1873541 552050 4099691 8094237
45704 8094237 10057787 8472198 4615471 1014897 -593423 630512 4478332 8494661
45696 8494661 9119591 6038201 3670083 5869152 10396286 11477323 7202897 1442184
45688 1442184 -1497279 -1070109 1195223 4498307 8114045 9927542 7783785 1845711
45680 1845711 -5392411 -10993499 -13181259 -12125162 -9710975 -7625821 -5314724 -987411
45672 -987411 4968475 9073836 8157532 2613373 -4288356 -8905563 -8447900 -2030279 7346267
45663 7346267 13306119 11367172 3649757 -3576130 -6739912 -7172237 -6696441 -4347850
45655 -4347850 745637 5694165 6206915 2174036 -1792180 -1945774 573133 2333519
45647 2333519 2264070 1683560 830566 -1802839 -6202326 -9309735 -8361075 -4438313 -1103825
45638 -1103825 -346124 -1415399 -2859429 -3692449 -2824181 412319 4637868 7168610 7131038
45629 7131038 6280168 6016876 5388149 3225803 543303 -916857 -1206764 -1289162 -689737
45620 -689737 1566350 4098064 3889969 432330 -2948189 -2811744 952578 6287627 11833727
45611 11833727 17054030 20646396 20883450 17634611 12827594 8705745 6376386 5924739
45603 5924739 6828015 7900312 7746265 6010854 3835437 2507776 1839439 451641 -2243886
45594 -2243886 -4855863 -5309239 -3365227 -1394451 -2075267 -5227147 -7494430 -5747556
45586 -5747556 -580404 4287844 6129571 5849724 6067016 7492606 8374384 7203367 4625021
45577 4625021 2397507 1589770 2311195 4122819 5847726 5883624 3960784 2237265 3481095
45568 3481095 8089476 13564865 16758859 16067108 12018224 6838221 3168020 1999486
45560 1999486 1869887 1030963 48186 839354 3333002 4950396 3920237 1521960 250419
45551 250419 980026 2629973 3478651 2234055 -898630 -3559952 -3029544 558061 4157282
45542 4157282 5595706 5648733 5552564 4827668 3216320 2389839 3248813 3547611 1289661
45533 1289661 -1095164 351156 4914095 7957401 7787499 7427447 8586706 8248193 3686425
45524 3686425 -2481668 -5337800 -3580269 432402 4691565 8444648 10355556 9271442
45516 9271442 6776587 6091268 7989108 10109627 10745462 10967340 12057850 12907958 11517350
45507 11517350 7914285 4223069 2518695 3528241 6512725 9197095 8637364 3929551
45499 3929551 -1954648 -4627356 -3085372 -800207 -1283097 -3705909 -4150417 -533333
45491 -533333 5163626 9446077 10693205 9691940 8002837 6539060 5215009 3539896
45483 3539896 1774623 1180888 2275960 3344563 2409456 700026 1930476 7298815
45475 7298815 13395018 16414839 16262245 14675885 11713972 7001373 2611709 1032628
45467 1032628 1122333 -201864 -2640409 -2914740 -829751 -615633 -4602190 -9220239 -9620670
45458 -9620670 -5518732 -208546 3732778 5367389 4388730 2101897 1781660 5110523
45450 5110523 9173978 9501665 5360553 -175209 -4517164 -7447618 -9317147 -10054504
45442 -10054504 -10192127 -10751365 -11574961 -11233554 -9013612 -5985640 -3890905 -3656512 -4920376
45433 -4920376 -6490289 -7536847 -8498391 -9969572 -10611585 -7851300 -1541725 4594787
45425 4594787 6321958 2606932 -4378136 -10951846 -13087152 -8923669 -1840897 1843984
45417 1843984 386450 -1172374 1205888 4289352 3127980 -558832 -1151077 1789825
45409 1789825 3417262 1814332 -7074 -669765 -2724552 -6826941 -9298328 -7872050
45401 -7872050 -5087017 -3568780 -2540200 -1679269 -3735781 -9650067 -14928007 -14900988 -10708868
45392 -10708868 -6465769 -3402159 -729651 410067 -1477983 -4302584 -4455213 -2088269
45384 -2088269 -592807 -1412311 -2837437 -3518313 -3874293 -4150509 -3959339 -3651960 -3683362
45375 -3683362 -3055387 -854596 1378418 1585652 787170 1618294 3744316 4240497 2720620
45366 2720620 2569548 6109436 11457630 15367697 16731453 16034514 13552108 9641289
45358 9641289 5373648 1582412 -1853476 -5151773 -7932526 -9630044 -9727258 -7806534
45350 -7806534 -4542493 -2165047 -2344634 -4008181 -4894133 -4615631 -4191735 -3477201 -1867427
45341 -1867427 -922730 -2790656 -5947121 -6296583 -3285602 -1037314 -1957988 -3183083 -1751830
45332 -1751830 373687 -218659 -2792146 -4179522 -4120043 -4871172 -6644495 -7401380 -6788416
45323 -6788416 -6535624 -6833565 -5907088 -3849199 -3481117 -6065981 -8996299 -9393315 -7691021
45314 -7691021 -5913929 -4533675 -3196605 -2908327 -4939249 -8329839 -10718249 -11211155
45306 -11211155 -10471826 -8569103 -5268931 -2408895 -3011080 -6898170 -9697514 -8060481
45298 -8060481 -3983275 -1705352 -1772652 -979712 2446213 6671381 9545256 11176757 12185182
45289 12185182 11917412 10110046 8415649 8251190 8372879 6615875 3349414 1371138
45281 1371138 2577891 5965734 8640861 8127987 4664472 2068656 4765924 12384259
45273 12384259 18861156 19021639 14594745 11069291 9949596 7845593 3062480 -890358
45265 -890358 249479 6243718 12952115 16236156 14419739 9025739 4125689 3071282
45257 3071282 4980997 6207196 5511321 5065815 5695477 4709915 511971 -3795264 -4373958
45248 -4373958 -2043051 -654841 -1638413 -3117499 -3294818 -1849010 1120644 4724265
45240 4724265 6578574 5260675 2884485 2427811 3056890 1280408 -3444719 -7769201
45232 -7769201 -9578118 -10474391 -11856603 -11942117 -9011131 -4995025 -2905330 -2287993 -378688
45223 -378688 2803086 3705188 307254 -4579782 -6777111 -6070937 -5910927 -8051354 -9828699
45214 -9828699 -7918756 -3055209 1159602 3341055 5446735 8492409 10122131 8153750
45206 8153750 4263724 1774966 1302332 1108871 645493 944258 2093616 3126220 4201778
45197 4201778 6183237 8137634 8149762 6765961 6524901 7636088 7608875 6183460 6744823
45188 6744823 10674971 13909597 12340071 7849126 5187034 4885627 3576764 268896
45180 268896 -2339239 -2984097 -3864044 -6224496 -7676831 -6125343 -3592445 -3504936 -5857406
45171 -5857406 -7540998 -6524914 -3604352 -611566 1207272 1371016 454195 141167 1545699
45162 1545699 3460268 3551653 1307876 -1460665 -3085058 -3610139 -3661008 -3250517 -2457166
45153 -2457166 -2078887 -2652434 -3703907 -4859853 -6733339 -9483600 -11353078 -10424964 -7688406
45144 -7688406 -6502708 -8407576 -10910892 -10451762 -6621966 -2319158 -246733 -437012
45136 -437012 -1148220 -1111474 -401535 403538 1301073 2874821 5289105 7644364 8861041
45127 8861041 9194551 10176884 12655301 15397432 16217080 14299449 11028237 8634681 8206532
45118 8206532 8828565 8712466 7580611 7607851 10825487 15468273 16554834 11129543 1668794
45109 1668794 -6882296 -12054727 -14221952 -13695663 -10468341 -6444725 -4658184 -5383228
45101 -5383228 -5568846 -3232375 -38599 1855422 3025124 4705732 5632326 3890200
45093 3890200 722695 -662783 212417 574494 -1154962 -3236375 -3857014 -3913029 -4901003
45084 -4901003 -5911478 -4747288 -1100958 3064343 5758245 6302103 5070093 3266756
45076 3266756 2470816 3012012 3206200 1686590 90046 1405763 5380045 7707570 5014937
45067 5014937 -844124 -4964969 -4830448 -1917213 1383068 4243739 6549264 7623632
45059 7623632 7090281 5902945 5140905 4242720 1712935 -2429896 -6005801 -6874629 -5188288
45050 -5188288 -3111569 -2646368 -3846550 -4761038 -3082942 1520903 6493006 8579549
45042 8579549 7576616 7188827 11003054 17739086 21778969 19010172 11403325 5122129
45034 5122129 4535090 8677867 13131381 14410494 12478346 9897271 9204079 10955735
45026 10955735 13800590 15965252 16366522 14556616 10564771 5465173 1509582 628020
45018 628020 2677173 5735646 8061767 9252531 9834310 10601033 12135841 13962175 14356578
45009 14356578 12243031 9148123 7725524 8269859 8573289 7621095 7131092 8323859 9502047
45000 9502047 8735458 7039244 6540634 6894769 6001232 3236255 -455831 -4622230 -8764102
44991 -8764102 -10806693 -9369885 -6955144 -7279020 -9566932 -9349509 -5305911 -1195078
44983 -1195078 64509 -33180 234332 -676709 -3961362 -6936695 -6713681 -4743101 -4076532
44974 -4076532 -4267623 -2779126 201879 2261722 3029344 4225363 6051206 6971518 6700038
44965 6700038 6195049 5098150 2431397 -505217 -1373701 -832729 -1739491 -4072919 -4480722
44956 -4480722 -1898670 53434 -1760257 -5196352 -5566738 -1662698 2868489 3557556
44948 3557556 -470329 -5799234 -8340491 -7866330 -7814042 -9735967 -10268923 -6267107 -841174
44939 -841174 -95267 -4640389 -8779290 -8187125 -4077715 630611 4651201 6814720 5903074
44930 5903074 3716205 4027598 6692516 7187040 3997172 1599869 3309512 6159321
44922 6159321 6632146 6587511 8592505 9683433 5906050 156825 -1058447 2709267 5622845
44913 5622845 4580255 2689457 3226259 5148597 5745481 3798553 -791295 -7042462
44905 -7042462 -11858186 -12203994 -9006682 -6151541 -5511850 -5812358 -5972356 -5988898 -4732805
44896 -4732805 -977300 3005506 2991913 -1257393 -5513350 -7292426 -8317437 -9665907
44888 -9665907 -9215137 -6227896 -4241474 -6329880 -10784159 -14403706 -16916586 -18967294
44880 -18967294 -18827051 -15159454 -10951597 -10410395 -12904733 -13782121 -10797563 -6352359
44872 -6352359 -3449640 -2618397 -3147578 -4302520 -4357705 -1072607 5195196 10559455 11602480
44863 11602480 9382191 7694786 7801533 7059064 3489056 -450374 -916314 1627588
44855 1627588 3033614 1993366 2021284 4952852 6408677 1828277 -5602966 -8257517
44847 -8257517 -4294167 657468 1937504 552962 -1334134 -3899245 -6516011 -6365042
44839 -6365042 -3236522 -1278631 -2691695 -3919935 -1784220 853680 105837 -2095813
44831 -2095813 -1634296 257670 -760044 -4044186 -4398818 -228109 4471671 6620978
44823 6620978 7330090 7830037 6969445 4226881 1251099 -1009124 -3340084 -5471984 -5681251
44814 -5681251 -4073915 -2831163 -2411572 -1184618 397948 -488592 -3837453 -5743613
44806 -5743613 -4466040 -3073388 -3495978 -2575569 2269671 7572661 8701315 7161587
44798 7161587 7942672 11618910 14286407 14204976 13302891 12344440 9688062 5610040 3362493
44789 3362493 4419461 6221070 6162796 4732532 3193415 1135323 -1841256 -4564572
44781 -4564572 -6284117 -7906831 -9400465 -8443022 -4113233 208449 623179 -2025602
44773 -2025602 -3782549 -3519857 -3821692 -6054153 -8019721 -7482419 -5241127 -3288703 -2107474
44764 -2107474 -1359067 -1411541 -2363708 -2984555 -2609013 -3078809 -6693037 -12726556 -17938341
44755 -17938341 -20267761 -20109175 -18114389 -14090010 -8695021 -4096273 -1649198 -374244
44747 -374244 1011091 1870517 1060339 -336743 388252 4194037 8840863 11076081 9473655
44738 9473655 5164103 739913 -1356777 -305602 2506620 4534789 4112030 1716585
44730 1716585 -489089 -375023 2310355 5353963 5754128 2627907 -1621829 -3423754
44722 -3423754 -1234597 3503375 8070496 10573240 10675618 9052504 6491643 3479462
44714 3479462 511722 -1639931 -2482770 -2337784 -1557804 497230 4480856 9068246 11551938
44705 11551938 11013469 9399053 8592800 7977028 6148752 3555387 1612235 197535
44697 197535 -1954101 -4732131 -6306142 -5371655 -2578273 199212 1237959 118651
44689 118651 -1753474 -2549286 -2474239 -3293401 -4587393 -3037918 2355333 6901260 5656412
44680 5656412 589474 -1939232 -70572 1905179 995343 -472567 30239 624097 -1577860
44671 -1577860 -5715569 -8914634 -10505067 -11683099 -12641118 -12517429 -10954185 -7912366
44663 -7912366 -3502591 459487 930495 -2260347 -5008964 -4070946 -1396159 -495346 -741534
44654 -741534 941408 4257453 5764319 4582728 3773909 5461163 8060407 9317444
44646 9317444 9125137 8169059 6420583 4471449 4223065 6388098 8459793 6761390 318861
44637 318861 -7822346 -12904699 -12325658 -7968374 -4465692 -4533273 -6685809 -8164686 -8498464
44628 -8498464 -8554839 -7842369 -5492327 -2878287 -2237201 -3216898 -3792817 -4112665 -6001389
44619 -6001389 -8820437 -9660067 -8041621 -6446063 -5396634 -2432895 2416132 4735444
44611 4735444 2074448 -1829288 -2589885 -1407659 -1808593 -3269247 -2884550 -1264530 -1537298
44602 -1537298 -3390126 -3204404 -195850 2292660 2423818 2553458 4892363 8086335 9883848
44593 9883848 10295704 10292887 9816537 8953034 9121637 11240845 14007563 15237031 13716698
44584 13716698 9195825 2488862 -3578409 -5608864 -3471437 -828653 -487773 -1213307
44576 -1213307 -657270 778480 1141293 140275 -1152971 -2239715 -2498055 -232934 4720316
44567 4720316 8801930 8412556 4963522 2849182 2975471 2286908 -103630 -837769 1952073
44558 1952073 4838035 3972635 987396 603570 3895748 7267259 7594133 5460135 3110410
44549 3110410 1603889 722103 44770 -805034 -2139759 -3746775 -4689270 -3795009 -587315
44540 -587315 3612951 5627464 2984271 -2725633 -6645872 -6087683 -3592302 -2870476 -3532800
44531 -3532800 -2722653 -738725 -1144041 -5032936 -8930361 -9719717 -8490149 -7652895 -7107791
44522 -7107791 -5785147 -4665635 -5109009 -5520916 -2923777 2561103 7577041 9766970
44514 9766970 9599006 7965810 4759146 549098 -2858014 -4859228 -7123291 -10768005
44506 -10768005 -14026089 -14354107 -11751247 -8313550 -5257408 -2167294 1033912 3103132
44498 3103132 3004148 1455135 317018 686527 1823205 1970550 401975 -1400336 -1143709
44489 -1143709 1603388 4941629 7094605 8090451 8160244 5964720 431793 -6295258 -10220669
44480 -10220669 -10226562 -9282094 -9990244 -10939732 -9099772 -4302005 711496 3722047 4272899
44471 4272899 2115136 -2787026 -8279840 -10695028 -8906374 -5945980 -5167450 -6332133
44463 -6332133 -7075433 -6760628 -6683120 -7287478 -7555813 -7044711 -6431922 -5805798 -4241139
44454 -4241139 -1487628 1480575 3945201 5950211 7084181 6550679 4958920 4153785
44446 4153785 4462398 4027416 1988723 385580 1295237 3717616 5164179 5049512 4602603
44437 4602603 4569298 5069668 6752948 9800370 12383876 12342196 9944898 6873202 3173503
44428 3173503 -2006068 -6947611 -7944657 -4145581 958866 3943648 4819009 4884808 4050757
44419 4050757 2270901 1270180 2260627 3475669 2525733 138923 -956300 -122968 843987
44410 843987 1211220 2472761 5542693 8971229 10799734 10563662 8676600 5309804 851702
44401 851702 -3631443 -7258969 -9723226 -10253979 -7703445 -2957763 147912 -1412322
44393 -1412322 -5525347 -6732077 -2941408 1739351 2174320 -1550401 -5030929 -5503114
44385 -5503114 -4231198 -3155459 -2061840 -26214 2776251 6119254 10291174 13745350
44377 13745350 12657951 5948487 -1003343 -1719080 2772081 4962671 1075571 -4182766
44369 -4182766 -4897649 -1691338 1172290 3065225 6622536 11508213 13517636 10563299
44361 10563299 5813936 3463961 4073132 5635921 7062148 8626241 10277026 11403673
44353 11403673 11729548 11067110 8722843 4587258 516179 -1067858 -340279 -241042 -2318814
44344 -2318814 -3642473 38711 8164477 14768345 15143791 11158427 8080775 7825630
44336 7825630 8174846 7666348 7408420 7502285 5476262 279630 -4999655 -6882070 -5964591
44327 -5964591 -5236908 -5617486 -5719289 -4798654 -3405292 -1975540 -965829 -1368699 -2967433
44318 -2967433 -3432754 -1683930 -693316 -3838196 -9703202 -14099240 -16215633 -18373712
44310 -18373712 -19918135 -16454178 -6656319 4379976 10744761 11520811 9300313 6316658
44302 6316658 4258975 4670813 6578771 6099154 1294397 -4416629 -6304320 -4070975
44294 -4070975 -1015307 836656 1922078 2692837 2836269 2416361 1716985 682414 167016
44285 167016 2355091 7864310 13798081 16856112 16930567 15425572 12071153 6561939 1502818
44276 1502818 -348344 -814835 -4075728 -10090014 -14511143 -15183857 -14149731 -12516902
44268 -12516902 -8332392 -1590896 3175203 2504846 -1085060 -3069863 -3089352 -3657883 -4898932
44259 -4898932 -4578332 -2372717 -355080 591147 1634087 3098548 3607237 2715025 1966535
44250 1966535 2505609 3618202 4442550 5260149 6161672 6248134 5438884 5448490 7191515 8328602
44240 8328602 5564241 -856417 -6961235 -9674769 -9748741 -9241988 -8003958 -4649547 14148
44231 14148 3205417 4122200 5198116 8023825 9928235 6890502 -903408 -8636595 -11960276
44222 -11960276 -10614738 -6811769 -2227879 2196556 5082669 5236950 3375041 2007581
44214 2007581 3154015 6425383 9417543 9856604 7383675 3360185 -735483 -4111776
44206 -4111776 -5939986 -5153086 -2009067 1056869 1647315 97124 -1428611 -2043360 -2495318
44197 -2495318 -2596570 -666506 3623454 7730380 8814060 6671760 3234984 328321
44189 328321 -1285789 -2010550 -3622295 -8052635 -14591266 -19261031 -18403200 -12410206 -5010659
44180 -5010659 362230 2563868 2179214 527689 -1033237 -1831840 -1830182 -698195 2006581
44171 2006581 5244694 6622314 5320348 3573178 3715075 4863482 4265795 1132852
44163 1132852 -2587724 -4601951 -3784689 -81409 5071209 8552226 7783302 3346470
44155 3346470 -1845784 -5556489 -7004059 -5597553 -1345770 3520413 5672247 4004535
44147 4004535 329198 -3149635 -5186815 -4646390 -1028571 3642283 6145964 6298690
44139 6298690 7268147 10270988 11728428 8159509 1785711 -1990358 -1796228 -1672098 -4997259
44130 -4997259 -9947221 -12267769 -10534888 -6891743 -3723568 -1674681 -854918 -1965375
44122 -1965375 -4998572 -7808415 -7652240 -4378429 -967481 -415479 -2857533 -6174709
44114 -6174709 -8485438 -9286917 -8941010 -8002002 -6641345 -4165098 181632 5389715 8861014
44105 8861014 9452336 9162443 10417019 12784437 13983025 13070857 10822139 8019975 5447230
44096 5447230 4467250 5207577 5259688 2919079 440158 561745 1035973 -2588023 -8980749
44087 -8980749 -11509468 -8023908 -4417368 -5551653 -7941326 -5799447 -65609 3949853
44079 3949853 4926738 5578246 5892734 2647247 -3883336 -8299419 -7236540 -4250471 -4939005
44070 -4939005 -9526161 -12884996 -11104213 -6085935 -3160219 -4736404 -7399134 -6414276
44062 -6414276 -2309722 -199117 -2110067 -3757708 -1274399 2524033 2632929 -86933
44054 -86933 -529391 2202324 3469347 524343 -3736538 -5669199 -5234778 -3816982 -1468510
44045 -1468510 1567186 3514261 3264411 1795994 213405 -1308105 -1869742 -80047
44037 -80047 3078656 4823791 5146091 7069306 10622609 10844478 4966350 -2123685 -3808117
44028 -3808117 -577270 1571384 -9008 -2065011 -1412098 894664 2205122 1825033
44020 1825033 657754 -496281 -1086088 -600247 982016 3216021 5694641 7861784
44012 7861784 8891264 8796475 8988760 10434849 11862522 11194509 8256135 4679586 1635947
44003 1635947 -889637 -2999170 -4536446 -5605624 -6207853 -5681963 -3642957 -1085068
43995 -1085068 517589 789912 326534 -193824 130561 2240333 5463936 7242525 6112644
43986 6112644 3896288 3200924 3796934 3401429 1141015 -1751924 -3851358 -4226974 -2303002
43977 -2303002 794531 1983218 -35933 -1979891 -153614 3509529 3497460 -1353727
43969 -1353727 -6221801 -7301806 -6156133 -5401361 -4185367 -907658 2623149 3329007
43961 3329007 1498309 55173 119055 211743 -483565 -785014 228041 1733699 2725798
43952 2725798 3670362 5690559 8757413 11440238 12333446 11319024 9339051 7254402
43944 7254402 5365504 3892714 3074507 2586364 1926366 1760753 3284436 5269504 3847877
43935 3847877 -2585806 -9984126 -13111196 -12150558 -11309838 -11708100 -10279652 -6244414 -3670430
43926 -3670430 -5337522 -8169484 -7906248 -5167503 -3401354 -3261238 -2860050 -2070357 -2680157
43917 -2680157 -4804096 -6486679 -6812094 -6568254 -5729452 -2947875 1871882 6550210 8944485
43908 8944485 9051535 8453130 8480852 8808145 7344622 2440427 -4022005 -7288214 -5011055
43899 -5011055 -333388 2215442 2185613 1992928 2006180 614045 -1559860 -1745343 222740
43890 222740 1209038 15514 -458511 1667569 3280758 398178 -5832841 -10398387 -10716297
43881 -10716297 -8967729 -8489738 -10192611 -12815857 -14906698 -15711134 -14963543 -12683302
43873 -12683302 -9462778 -6851369 -6610870 -8541784 -9568484 -6763714 -1425557 1840581
43865 1840581 705002 -2422626 -4644509 -6725132 -10551468 -14358259 -14025747 -8946917
43857 -8946917 -3495067 -1851983 -3629437 -5554989 -5522024 -3634586 -714198 2560401
43849 2560401 5585324 8104012 10326824 12144533 12705059 11429806 8961931 6427012
43841 6427012 4190090 1982441 -244021 -2358579 -4524918 -6793740 -8512499 -8923430
43833 -8923430 -8041923 -6170773 -3088335 1050663 4361557 4440912 1241638 -2665623 -5116160
43824 -5116160 -6212960 -6703690 -6379837 -5372913 -5386381 -7636086 -10425400 -10724936 -7730072
43815 -7730072 -3161557 1341708 5034721 6726023 5297353 1982627 -316843 -786700
43807 -786700 -1465134 -3320115 -4236307 -2716108 -1060557 -2072766 -4373964 -4430157 -2444545
43798 -2444545 -2448265 -6061184 -9756276 -10015990 -8289787 -8131465 -9237073 -7713694 -2071297
43789 -2071297 4150872 6768319 5658915 3521712 1814262 302422 -452395 684772
43781 684772 2419836 1369007 -3044373 -6552789 -5200582 -631142 2523593 3015699
43773 3015699 3293925 4221021 3575513 454588 -2568058 -3188192 -2218006 -1048147 773701
43764 773701 3347691 4592153 3316882 1997539 3621992 7328588 9875152 10051358
43756 10051358 8915063 6921712 3767335 289208 -2196353 -3841002 -5244729 -5561947
43748 -5561947 -4209235 -3169283 -4409227 -6047185 -4676892 -802931 1931326 2523088
43740 2523088 3253750 4389471 3098151 -977507 -3673246 -2229854 526592 726728
43732 726728 -1000611 -1630956 -800026 -337561 -478222 88856 1277252 1663014 1154354
43723 1154354 1211550 2431877 3708423 3834467 2737739 1290205 709977 1649767 3223939
43714 3223939 3716089 2780715 1812985 1594612 1128789 -325367 -1799493 -2438945 -3079064
43705 -3079064 -4410403 -5024792 -3106540 856585 4466851 5634395 3558760 -808217
43697 -808217 -4036829 -2144007 4534541 10102651 9327492 3918708 13010 473510 2684118
43688 2684118 3434546 2609467 1428033 -111331 -2537377 -5281203 -7129401 -7663040 -7529858
43679 -7529858 -7583009 -7945829 -7838087 -6688700 -5450429 -5763299 -7454349 -8405124 -7784085
43670 -7784085 -7581963 -9331396 -11034699 -9661314 -5545044 -1817171 -202726 103193
43662 103193 -143076 -1183920 -2466389 -2405660 -674859 1049291 1248436 92862 -1531012
43653 -1531012 -3195552 -4760069 -6016189 -6682671 -6187665 -4018067 -1067677 470977
43645 470977 -131450 -799884 145624 1011611 -386660 -2167658 -320412 5049744 9151138
43636 9151138 8827317 5970203 3434735 985910 -2498568 -5503104 -5518705 -2980518 -1004082
43627 -1004082 -1477746 -3145805 -3528979 -1577515 1639550 4177869 5032209 4868155 4868127
43618 4868127 5122152 4657710 2753198 -429031 -4129532 -7200433 -8594042 -8449132 -7945241
43609 -7945241 -7328566 -5501511 -2863811 -2556367 -6314769 -10639949 -10466231 -5894440 -1747904
43600 -1747904 -768784 -1101836 -737319 -287218 -312734 34808 25974 -3022103 -8659586 -11407806
43590 -11407806 -7253213 516331 5329574 5230416 3328662 1921045 241616 -2008871
43582 -2008871 -2660692 -194870 3122767 3111936 -1481798 -6950418 -8053703 -3526790 2636738
43573 2636738 5924780 6002897 5214074 4048083 1211683 -2398893 -3611263 -1571245 997283
43564 997283 2261312 3741934 6889697 10405866 12677882 13792046 13409139 10062155
43556 10062155 4718126 1442351 1783549 2017351 -889997 -4257491 -4514207 -3374736
43548 -3374736 -4111367 -4539119 221339 9271285 16044683 16598887 12617271 6368766 -1729021
43539 -1729021 -9707257 -13613929 -12592476 -10409357 -9946182 -9550724 -6738246 -2431605
43531 -2431605 623804 1390944 701916 -309711 -653709 14435 501379 -731617 -3157550
43522 -3157550 -4800207 -5239444 -5724558 -6389405 -6043199 -4677402 -3119409 -292777 5316707
43513 5316707 11032992 11426268 6099654 1675387 3312242 8010708 9613881 7139519
43505 7139519 4135672 2236012 24327 -2618515 -3385174 -1209911 2003965 4022405
43497 4022405 4504542 4095058 3093914 1723967 661477 789821 2681730 5909053 8497083
43488 8497083 8066217 4415357 100640 -2425934 -3179140 -3160436 -2044983 732399 3563954
43479 3563954 3818947 1548158 -41619 1370872 4193904 5163749 3781086 2914175 4788733
43470 4788733 7888221 9113624 8100586 7262767 7537531 6775795 3657047 642624 651511
43461 651511 2755121 4033503 4063536 4190921 3772580 1380911 -876882 1031391 6674782
43452 6674782 10803870 10263209 7030033 3538144 -157800 -3048312 -2279846 1808715
43444 1808715 4704273 4799768 6342609 11496596 14862086 11386846 5209085 4003006
43436 4003006 7764910 10352107 9989505 10474607 12478108 11409895 5303520 -1602060
43428 -1602060 -5099445 -5532076 -4372913 -1502527 1919840 2712226 514077 -650575
43420 -650575 1724585 4805125 5048615 3162350 1715820 1071967 617611 1052920 2280100
43411 2280100 1582724 -2755697 -8023674 -10398007 -9887905 -8923189 -7856489 -5481692 -2902886
43402 -2902886 -3071531 -6438643 -10057821 -11333345 -10303990 -8000594 -4895439 -1751421
43394 -1751421 -236718 -1464165 -4413663 -6391841 -5221638 -1342266 2313703 3322038
43386 3322038 2561440 2770838 4556405 6033362 6672319 8333936 10938996 10489590 4583098
43377 4583098 -2511370 -4348519 -828149 1855025 -249232 -4224009 -5107548 -2029796
43369 -2029796 2046594 4205239 3399489 286395 -2812518 -2962761 521680 4750767
43361 4750767 6112219 4125435 1454832 500561 1122732 1677614 1166009 -134360 -1420936
43352 -1420936 -1871430 -568492 2972968 7497638 9987343 8299598 3887140 708434
43344 708434 1135209 3985218 6704050 7880765 7125948 4622271 2302761 3506064 9014571
43335 9014571 14547683 14849936 9861016 4378251 1927601 1803680 2303409 3437845 4848112
43326 4848112 3921250 -1208739 -8032991 -11564832 -9582655 -4262385 973629 4273481
43318 4273481 5047015 3168194 -99189 -1587751 1368648 7574720 12139585 11023971
43310 11023971 5234036 -320576 -2123438 -1190751 -589893 -1192721 -1303789 144828 1836719
43301 1836719 1802144 -380897 -3540923 -6035864 -6573693 -5032808 -3000582 -2424590 -3060226
43292 -3060226 -2344474 1259236 5761891 7718258 6178016 3320164 1560692 1377757
43284 1377757 1901231 2290969 2228893 2091736 2924067 5213209 7359008 6606810 2362544
43275 2362544 -2385233 -4112823 -2682997 -1059115 -1501810 -3451927 -5163003 -5813299
43267 -5813299 -5338380 -3534428 -501835 2798298 5531947 7904541 9943367 10063281
43259 10063281 6554677 459315 -4716079 -6609566 -5988278 -4723193 -3396732 -1912511
43251 -1912511 -1032546 -1622934 -2907473 -2947260 -860579 2355503 5128824 6686948 7284159
43242 7284159 7761795 8815103 10247765 11167959 11145648 10517574 9201163 6356689 2224428
43233 2224428 -790944 -480055 2228984 4289751 4285606 3578467 3733418 4480139 4699927
43224 4699927 4085752 3167197 2592950 2804161 3585218 3697629 1924074 -1203061 -3656881
43215 -3656881 -4288674 -4105537 -4754186 -6355751 -7120574 -4747001 1389498 8517750 11549677
43206 11549677 7686717 96774 -4762952 -3948682 -460039 1623169 2185559 3653879
43198 3653879 6206782 6842178 3185785 -3277531 -8207826 -8242130 -3962245 737562 2525966
43189 2525966 1717091 867927 1015330 1072869 670583 928002 1637872 502343 -3043442
43180 -3043442 -5735396 -4742937 -2118872 -1972946 -4446683 -5814914 -4092781 -1169468
43172 -1169468 902538 2514057 4328635 5180262 3820227 1145922 -704953 -417907
43164 -417907 2093813 5918170 8830510 8286312 4313019 613800 1196679 5891399 10147083
43155 10147083 9482498 3791178 -2803323 -6219880 -6378676 -6507439 -8556108 -10532088
43147 -10532088 -9384737 -5427533 -2101559 -1796606 -3797116 -6222273 -7917490 -8147158
43139 -8147158 -6534945 -4077510 -2444683 -1526281 507608 3840592 5753450 4212860
43131 4212860 1032821 -337411 1024855 3353711 5226138 6738856 7933951 7806384
43123 7806384 5366950 1127837 -2540998 -2792454 822304 4780686 4763902 1146592 -924470
43114 -924470 1559088 4934040 3929237 -651844 -2973762 -161524 4648711 7651753
43106 7651753 9029431 10742196 12698009 13431654 12712243 11181113 8538441 4233498
43098 4233498 -576185 -3603506 -3955173 -2898842 -2285487 -3220257 -5965240 -9863451 -13231973
43089 -13231973 -14390449 -13193094 -10950350 -8712185 -6376428 -3778589 -1776061 -1312471
43081 -1312471 -1671631 -764036 2344510 5884668 7225072 6019859 4524339 4629485 5678905
43072 5678905 5915751 5175814 4909209 5797895 6633513 5972123 4086027 2541373 1994115
43063 1994115 1060393 -2073848 -6963367 -10673642 -11010269 -9348819 -8925938 -10682936 -12741296
43054 -12741296 -14138881 -16445487 -20292785 -22794106 -20902724 -15705127 -10668378 -6897710
43046 -6897710 -3212437 47567 1110650 674500 1783881 4860841 6536336 5008712
43038 5008712 3015950 3128443 3340149 653517 -3316125 -4193231 -1149320 2321779 3583218
43029 3583218 3452697 3477084 3799609 4512549 6297420 8370006 8084641 4404343 277127
43020 277127 -346698 2834942 6387328 7346112 6003473 4363894 3311881 2439086 2055564
43011 2055564 3644712 7424771 10560437 9620376 4910363 711979 578079 3825893
43003 3825893 7440186 9639568 10026943 7973458 3506315 -877599 -2115124 -594752
42995 -594752 150263 -1525041 -2941808 -1039775 3099658 5631316 4930828 3245191 3453138
42986 3453138 5764748 8136638 8918036 8200618 6825396 4914208 1903570 -2165204
42978 -2165204 -5992881 -7942967 -7371868 -4919087 -1809219 1026893 3569846 6533436
42970 6533436 10041651 12651813 12811031 11312733 10619688 11226346 10882962 8783793 7997466
42961 7997466 10983637 14665734 13899453 9154755 6421323 8921681 13196398 15026265
42953 15026265 15061649 15632615 15495185 12063341 7019656 5125393 7674631 11051580 12256542
42944 12256542 12206724 12287484 11056453 6977922 2315844 1121819 3766505 6113852 4743351
42935 4743351 1125838 -585191 1145892 3658590 3690403 1155221 -1374373 -2086834 -1638382
42926 -1638382 -1569460 -2196201 -2593210 -1990175 -615281 513043 363787 -1042018 -2106167
42917 -2106167 -954641 2190299 4702306 4472301 2529359 1617740 2545456 3495838 3296112
42908 3296112 3734707 7126879 12180743 14220219 10377913 3385630 -1304834 -1787008
42900 -1787008 -1287901 -3159482 -6427982 -7963966 -7413400 -7250806 -8424424 -8924969 -7241469
42891 -7241469 -4495548 -1949060 997984 4449014 6042461 4078302 986857 513317
42883 513317 2284481 2522935 7684 -2243897 -2007059 -1075387 -1670871 -2631878 -1904629
42874 -1904629 -733216 -2045071 -5604181 -8177073 -8642975 -9717909 -13396332 -17224749
42866 -17224749 -17043496 -11924788 -4572671 1935299 5676337 5090853 -411176 -8489276
42858 -8489276 -14805441 -17090519 -16732886 -15420280 -12273957 -6253312 262800 3246502
42850 3246502 2066328 46726 -356659 -320765 -1613849 -3326452 -3624589 -3067463 -3694204
42841 -3694204 -5394154 -5502711 -2359388 2312648 5237712 4964438 2962218 1851076
42833 1851076 2877984 5016848 6498339 6990262 7631288 8917073 9686079 8803051 6786367
42824 6786367 4843352 3266501 1959226 1609214 2704872 3908712 3248837 992988
42816 992988 -261698 1272412 4574870 7246283 7790397 6222756 3673718 1949474
42808 1949474 2470594 4938267 7561396 8793743 8172231 5630247 1467946 -2503185
42800 -2503185 -3367611 -52072 4779512 6997160 5054985 1124982 -1440375 -1031762
42792 -1031762 1484501 3979194 4844624 4163040 3331048 3319210 3447098 2316130 -139275
42783 -139275 -2191735 -2231086 -686753 512549 271703 -500751 -236959 1379604 3346016
42774 3346016 4706714 5204748 4779924 3341504 1151057 -1339754 -4088773 -7034093
42766 -7034093 -9105365 -8977670 -7149873 -5794857 -5805409 -5510787 -3482760 -1145780 -934167
42757 -934167 -2920844 -5073371 -6029470 -5716511 -3924028 -485231 3331582 5705632 6548267
42748 6548267 7055286 7228743 6104279 4397780 4285364 6078678 7783877 8705177 10473322
42739 10473322 13032934 12809338 7623951 1077964 -1398331 417677 1999668 1057712
42731 1057712 237165 2039789 4499140 4033138 416279 -3567604 -6258382 -8326005
42723 -8326005 -10076786 -10095994 -7527688 -3978281 -1758348 -1277287 -1605378 -2658870 -4727607
42714 -4727607 -6107647 -3788195 2555436 9332177 13188282 14590528 15559862 15686294
42706 15686294 13023411 7848526 2570670 -1756754 -5908689 -9364996 -9700253 -5942723
42698 -5942723 -150030 5143277 8748820 9530621 6286733 435435 -3863490 -4327035
42690 -4327035 -3208798 -3446572 -4417415 -3956339 -2519077 -2231748 -3133386 -3611209 -3811620
42681 -3811620 -5237467 -7027302 -6046794 -1608096 2656220 3095333 328039 -2195292
42673 -2195292 -2485678 -1337150 -206323 689427 2170531 4874976 8461490 11781933
42665 11781933 13857905 14736616 15160010 15293941 14172179 10983462 7040972 5650106
42657 5650106 8750768 13654038 14864746 10282866 4008417 1115099 1179513 -43866
42649 -43866 -3533921 -5723850 -4719073 -3385233 -4334475 -5729685 -4888984 -2763165 -1400494
42640 -1400494 290467 4218136 8490067 9413044 7114961 5223775 5594293 7085419
42632 7085419 8902175 11084665 12002784 9764447 6439353 6433846 9703168 10974489 7398434
42623 7398434 2837797 2122245 4562700 6077249 4991113 2694588 690404 8733
42615 8733 1867593 5808489 8244159 5900290 403371 -3041522 -1589281 2545037 5349770
42606 5349770 5224717 3572688 2557632 3083375 4639295 6536776 8584303 10099965
42598 10099965 9317349 5507698 1217943 -24306 1495152 1863162 -635187 -2969678
42590 -2969678 -2557136 -1944968 -4958877 -10104988 -11916841 -8579673 -4443896 -4068251 -6732818
42581 -6732818 -8381524 -6840093 -3173443 898669 4849903 8670359 11789450 13305484
42573 13305484 12891948 11181160 9423135 8890256 10321044 13486732 17261095 20531286
42565 20531286 23102002 25137884 25760448 23525451 19012017 15367744 14553013 14196790
42557 14196790 10584069 4257385 -108242 403002 3974904 7620975 10665242 13085648
42549 13085648 13247890 10086200 6059410 5190896 8528384 13360294 16527695 17024488
42541 17024488 15816190 14575822 14407181 14805160 14195116 12118140 10107298 9766781 11078356
42532 11078356 13321476 16165237 18712995 19105024 16774203 13849385 12612896 12755228
42524 12755228 12899141 13429631 15438634 17875307 18513224 17506193 17418782 19448703 21757717
42515 21757717 22068322 20251715 17839182 16238196 15755623 15431086 13920270 11497375
42507 11497375 10672021 13403880 18031715 20477622 18416484 13099063 7566978 4510337
42499 4510337 5223775 8708192 12004043 13237186 14103536 17428600 22655360 26304678
42491 26304678 27131057 28050128 31820965 37067438 40136448 39279362 35432985 30211979
42483 30211979 25028698 21577436 21262390 23693568 26686016 28273084 28460472 28783410
42475 28783410 30364031 32862890 35515083 38546370 42640782 47314355 51186591 54003938
42467 54003938 56897227 60397748 64192192 69416034 78454011 90790327 101848512 108762708
42459 108762708 115066232 126198016 142136122 158655845 174762836 193801683 216689263
42452 216689263 238807900 255263389 265255231 269208202 265425548 252913249 235234543
42445 235234543 218219244 204626101 193115164 181508889 169153189 156809275 145957055
42438 145957055 137964174 133010861 130284422 129645587 132159797 138586503 148381626 160270018
42430 160270018 172451826 182681405 190682141 200674060 218364400 244282005 273081535
42423 273081535 300990951 330772674 366966229 409076118 452217330 491554262 522214020
42416 522214020 537109694 530266568 503002669 463570134 420245423 377178587 336305148
42409 336305148 299228268 266015391 235321288 207514582 185497710 170740686 160310767
42402 160310767 149733506 137694108 126273087 117452170 111245170 106979366 104510057
42395 104510057 103466774 102500646 100512066 98389510 98384674 101333956 105392603 108377867
42387 108377867 110686467 114627887 121287968 129791800 139788768 152573590 168619888 185508112
42379 185508112 199659812 209078523 213218827 211480573 203734629 191788346 178551395
42372 178551395 165747156 153609927 142473840 133090762 125213119 117298428 108440491
42365 108440491 100066149 95106286 95415555 100024223 105908725 110489478 113221732 114885546
42357 114885546 116404560 119151619 125086842 134631545 145113829 153782502 162186510 174797310
42349 174797310 193085846 214239145 236609781 262579880 293629354 325653322 352146077
42342 352146077 369663013 377182046 372652652 354541426 326039245 294044462 263826198
42335 263826198 236840289 212725513 190599248 169239350 148921674 132377106 121250307
42328 121250307 112875154 103786171 94882852 88870793 83840788 74935011 62597433 53326595
42320 53326595 50455716 49465494 45254819 39457673 36824858 37911588 39615939 40664411
42312 40664411 42250644 44224443 44384389 41597603 37131505 32851858 29781270 28135165
42304 28135165 27422462 26938589 26971059 28429452 30484329 30359865 26918109 22708091 20679796
42295 20679796 20492414 20020371 18829461 17809613 16866625 15688644 15616352 17741601 19875300
42286 19875300 18596187 14195879 10535082 9716670 9908326 9214787 8785826 10506563 13772830
42277 13772830 16436756 17660128 18222847 18856171 19644348 20547622 21374179 21447528 20052819
42268 20052819 17135692 13336469 9755316 7826737 8675961 12065643 16330926 19594184
42260 19594184 20722873 19331669 15907479 12242885 10667011 12038849 15014212 17746698
42252 17746698 19594296 20642074 20590688 19303506 17836828 17479164 17855479 17378537 15850134
42243 15850134 15252557 17228435 20834759 23734844 24791685 24439709 23303099 21918496
42235 21918496 21355462 22324265 23593772 23061118 20781201 19083170 18919505 18125952 14810777
42226 14810777 10757408 9394541 11488645 14971362 18173338 20835591 22395302 21979565
42218 21979565 20472518 20344719 22790567 26759817 31101129 35696893 40135163 43513343
42210 43513343 46295944 50147217 54954111 58313950 59362466 60889120 65736280 72884583
42202 72884583 79314002 84526378 91012738 100877137 113817563 128017065 141578469 153454606
42194 153454606 163998804 174081504 183212455 189957330 194904153 201003039 209350613 216903824
42186 216903824 220768167 222715160 226405752 231849469 236451309 240705858 248592049 261835317
42178 261835317 277298316 290800951 300383520 305156587 304469763 299656250 293501766 286369577
42170 286369577 275757974 261273306 246575522 233815320 219496223 199697330 177069039
42163 177069039 158106099 144452049 131444036 115461942 98537922 84625612 75050674
42156 75050674 69474556 68041421 69662924 70208749 65687027 56868778 48563588 44486693
42148 44486693 44501423 46415966 48247311 48367559 45478063 39762538 33328783 28710888
42140 28710888 27181071 28420416 30827538 31928474 29723675 24460913 18464000 13806281
42132 13806281 10946099 9821103 10721922 13113969 15093924 15605447 16092668 18106933
42124 18106933 20162140 19270677 15291899 11346003 9714383 9681666 9972003 10860004 12671324
42115 12671324 14267655 14521269 13679291 11961738 8665389 4403254 2398029 5031290
42107 5031290 10078672 12846657 11678682 9259914 8779823 10851363 14053413 16420481
42099 16420481 16238994 13283526 9635587 7736698 7495247 6881317 5239114 3878633
42091 3878633 3179665 1693803 -770216 -1548538 1426127 6101297 8424477 7264982
42083 7264982 5173347 4417101 4265953 2866818 364935 -1136943 -356657 1575407 2699258
42074 2699258 2704263 2997031 4534983 6740368 8896515 11310530 14007018 15322750 13567770
42065 13567770 9849470 7520358 8423408 10869733 11659905 9098247 3893114 -1648432
42057 -1648432 -4919571 -4703581 -2191743 433675 2548200 5106141 8109102 9890586
42049 9890586 9781144 9791852 12059626 15549639 16941340 14573897 10353451 7744886 8479279
42040 8479279 10952883 11388730 7148226 -461550 -7243616 -10575032 -11978994 -14315894
42032 -14315894 -17400393 -18127975 -14717531 -9013205 -4056551 -816068 1692443 4012879
42024 4012879 5403403 5369152 4900915 5459454 7069402 8177685 7569310 5771346 4011636
42015 4011636 2329516 -198402 -3352294 -5178302 -4281902 -1881607 -517483 -1080415
42007 -1080415 -2159750 -2199859 -1168704 148920 1423751 2683853 3722818 4458659 5405067
41998 5405067 6899284 8228854 8586062 8648614 9792634 11561711 11589180 8819310 5136273
41989 5136273 2464920 -34507 -3716942 -6814574 -6206242 -2474514 236804 13489
41981 13489 -586288 596247 1688048 437225 -1487499 -1112190 1064082 2489569 3251783
41972 3251783 5449896 8666127 10178434 9803912 10544120 13439781 15316894 13300460
41964 13300460 8857338 5586807 5014136 6055459 6871103 5939912 2983878 93994
41956 93994 386622 4325597 8727473 10375531 9222455 7244798 5804927 5127302 4793017
41947 4793017 3743897 1225051 -1579295 -2533961 -1760755 -1766973 -3595962 -5261661 -5151124
41938 -5151124 -4368914 -4061047 -3025180 -218014 2548969 2853365 847435 -1991535 -5356532
41929 -5356532 -8885207 -10385919 -8320710 -4749437 -2868273 -2630768 -1582978 936545
41921 936545 3246293 4074489 3074635 -395223 -5845179 -9788293 -8826023 -4438871 -1380824
41912 -1380824 -1315649 -1495296 -46184 1187157 238395 -1915032 -3705774 -5739324 -9026575
41903 -9026575 -12184273 -12492635 -9037110 -3624453 803174 2105329 222157 -2887722
41895 -2887722 -5154350 -6224453 -6715304 -6355655 -4352308 -1108474 2141475 5009329
41887 5009329 7490493 8453428 6862078 4112024 2685619 2738099 2618315 2417045 3767758
41878 3767758 6007113 6110540 3291667 331215 -730921 -914830 -1140571 -379720 1281491
41869 1281491 1387493 -686156 -1721171 232564 1951714 -154731 -3984908 -4610284
41861 -4610284 -1388093 2016431 3561453 4450763 5218340 4521216 2516997 1788853 3558532
41852 3558532 5625421 5371238 2789031 -572698 -3929548 -7336086 -10566745 -12833919
41844 -12833919 -13171282 -11196377 -8262502 -7158823 -9110558 -11569977 -10912893 -7120356
41836 -7120356 -3666299 -2710456 -2779966 -1828048 -251082 436480 185773 124403 678970
41827 678970 1213327 950632 -412190 -2271273 -2912642 -902433 2660706 4465738 2483579
41818 2483579 -1773094 -5261056 -6628780 -6516401 -5832632 -5182902 -5278420 -6326587 -7211703
41809 -7211703 -6549948 -4437268 -2039555 312139 3267349 6689009 9143767 9468107
41801 9468107 7614264 3753269 -1744965 -6740959 -7893168 -4859147 -2560945 -6358187
41793 -6358187 -14938498 -20703143 -18174833 -9897237 -2733308 -315257 -1038683 -1895571
41785 -1895571 -1631282 -570041 264356 -416975 -2867224 -5234820 -5282148 -3145074 -765894
41776 -765894 1249422 4091855 7868021 10646115 11205319 10570256 9809691 8617549 7511167
41767 7511167 8905590 13493845 17425077 16296614 11220175 7714639 8399831 9827839
41759 9827839 7747574 3095212 632016 2659607 6236806 6968473 4230956 1637122
41751 1637122 2641969 6733141 10378031 10793185 7706973 2130683 -4647828 -10530929
41743 -10530929 -13061514 -11726693 -8720356 -6243455 -3922972 -8272 5724177 11481113
41735 11481113 15232923 15911823 13561249 9575008 6332292 5358653 5980557 6538294 6459934
41726 6459934 6364038 6701184 7152014 6895689 4939453 1067555 -2896836 -3977844 -1210970
41717 -1210970 3103328 6127865 7071940 6152431 3063642 -1640196 -5433698 -6462181
41709 -6462181 -5947509 -5645381 -4521472 -1003240 2774886 2810199 -931686 -4182246 -4214013
41700 -4214013 -2637908 -1814626 -1958573 -2907864 -5345431 -8387192 -8794258 -4939498 297961
41691 297961 2594662 704175 -3540910 -7942892 -10780582 -10488660 -6864191 -2165926
41683 -2165926 654985 818074 110104 805152 3451953 5951449 4917354 -537231 -6240721
41674 -6240721 -6233402 640723 9288920 14296156 15112874 14168562 12363247 8839187 3799875
41665 3799875 -880392 -3451382 -3302487 -964565 1697703 2352006 635534 -1142263
41657 -1142263 -774000 1596127 5027437 9734145 15557609 19952900 19946545 15630660 9942241
41648 9942241 5498809 3112206 2527357 2775083 2330221 601066 -1108317 -1390637 -814063
41639 -814063 -989883 -2453894 -4663306 -6893067 -7847296 -6020914 -2176771 373304 140378
41630 140378 81017 2985393 6319543 5625306 1710445 -220986 1680900 3874673 3789307
41621 3789307 3356318 4432313 5166659 3742390 2199053 3197623 5503178 6063442 4837920
41612 4837920 4309984 5347514 6623416 7475813 8438964 9172293 8615179 7453499 7885277
41603 7885277 10017613 10485472 6170330 -1599945 -7930892 -9377168 -7182428 -5160744
41595 -5160744 -5061446 -5258023 -4227982 -3582325 -5842414 -10128431 -12626162 -11535774 -9010781
41586 -9010781 -7284675 -5410773 -1658113 2826918 5175157 4683753 3427665 3386352 4642739
41577 4642739 6192380 7171479 7412290 7614901 8446421 8893649 6805627 2189210 -1577934
41568 -1577934 -1588219 858757 2400555 2189382 1742555 1255283 -697474 -3964290 -6577717
41559 -6577717 -8113559 -10133211 -12472193 -12377864 -8928036 -5284109 -4273740 -4264517 -2223983
41550 -2223983 1119844 2562637 1799601 1875929 4137595 6017864 4921467 1672976 -1597235
41541 -1597235 -5042756 -10216535 -16305336 -19635673 -17705308 -12463226 -8489561 -8262935
41533 -8262935 -10111701 -10788745 -8994511 -5772436 -2418652 625384 3090904 4647250
41525 4647250 5699351 7122056 8684744 9002598 7686111 6117030 5161828 3751611
41517 3751611 1307686 36917 2394432 7011124 9807361 9173276 7520782 7262544
41509 7262544 7881962 8174272 8945159 11311526 13768532 13445368 10055504 6640826 5968699
41500 5968699 7433116 8117001 6213279 2722489 -64386 -1047802 -630060 1180650 5416255
41491 5416255 11701252 16374184 15424001 9390051 3172986 442125 384027 817049 1950352
41482 1950352 5059661 9302139 12341400 13292394 13085382 12677936 12614871 13326016 13964854
41473 13964854 12182293 7429361 3273784 3343808 5674575 4731765 -793002 -6034355
41465 -6034355 -6868197 -5045452 -4267688 -4291377 -2178930 2278627 5733567 5627079 2949096
41456 2949096 462853 -103498 1199900 3214426 4421407 3719520 1218484 -1540996
41448 -1540996 -2427393 -508917 2527827 3445309 790864 -3431756 -6282388 -7060422 -6699732
41439 -6699732 -5495217 -3714736 -3183119 -5226726 -7970922 -9131182 -10356967 -14029779
41431 -14029779 -16497121 -11315755 -736698 3552804 -4605157 -16663282 -20991963 -17973968
41423 -17973968 -15992089 -16951650 -15469562 -10693694 -8566222 -10906404 -11524360 -6756583
41415 -6756583 -2173022 -3892650 -9090171 -10614237 -6970949 -2475097 -340262 -426196
41407 -426196 -1818669 -3350238 -3065838 -886215 -322935 -3972824 -8717094 -9100827 -4477448
41398 -4477448 771638 3301663 3448526 2311281 9016 -2744112 -4468238 -5034725
41390 -5034725 -5632937 -6404276 -6433058 -6077607 -6609605 -7255378 -5527068 -1443674 1234462
41381 1234462 -515614 -5210630 -8999350 -9954986 -8846914 -7135465 -5914575 -5885620 -6599142
41372 -6599142 -6049002 -2564988 2691169 6205981 5594890 2090934 -865863 -1200656 197202
41363 197202 1335027 1574601 1482751 1077911 -125430 -1317875 -504454 2750604 6231268
41354 6231268 7923045 8643175 10283321 12393676 12292519 8253793 1299884 -5741026
41346 -5741026 -9837943 -9215392 -4825403 -21971 2554978 3325740 3899815 4008746 2317518
41337 2317518 -496629 -2030083 -1502770 -454060 193837 1391196 3510865 4778234
41329 4778234 3408471 -69432 -3574242 -5359109 -4481808 -858362 4146187 8310607
41321 8310607 10648764 11923065 12436281 10786892 6189896 1033040 -661775 2550814
41313 2550814 7791521 10481967 8310324 2737349 -2790245 -5660120 -5193720 -1837277
41305 -1837277 3272731 7624151 8034240 3781145 -1807043 -4677103 -4463530 -3826018 -3997035
41296 -3997035 -3423851 -1041710 1426951 1362340 -1917682 -6539897 -9052142 -6455144 624148
41287 624148 6971912 7531859 3260131 -390880 -786928 -333731 -846773 -268842 2726440
41278 2726440 5098992 4037562 1971615 2800924 5503527 6117908 4571370 4551319 6932465
41269 6932465 8199071 6208239 3321284 2293900 2454437 1829264 462970 -322036 -176677
41260 -176677 388805 1106408 1836075 2423375 3239984 4667827 5891596 5797525 5071837
41251 5071837 5309333 5937583 4711566 1898818 943040 3468173 6390496 6058981 2911925
41242 2911925 -313636 -2829842 -5377805 -7215244 -6903742 -5512377 -5895301 -8564434
41234 -8564434 -10751218 -9996975 -6729305 -2949757 -135056 1197856 1383893 1367104 1261917
41225 1261917 -713552 -6114060 -12989883 -16750781 -15031196 -10220912 -6590589 -6280658
41217 -6280658 -8471123 -10761639 -10678786 -7520140 -3542950 -1650272 -1137005 2037970 9301326
41208 9301326 16176280 17440353 13840408 10605719 10264974 10374560 8282538 4616835
41200 4616835 1164742 -1499418 -2697766 -890972 3301221 5449892 1745613 -5804018
41192 -5804018 -11303526 -11716165 -9188041 -6804905 -4931081 -2724184 -840833 -667219
41184 -667219 -1949112 -2965070 -2830606 -2426201 -2945948 -4286699 -5182628 -4726846 -3498306
41175 -3498306 -2816551 -2737675 -1535446 1937623 5930525 7288512 5261677 2251567 367768
41166 367768 -1067602 -3605434 -6757938 -8532692 -8074441 -6373185 -4828932 -4292728 -5040793
41157 -5040793 -6507987 -7461404 -7547171 -8075528 -9918272 -11285204 -9521038 -4987488 -1034488
41148 -1034488 394517 1116037 3630827 7471188 10261741 11231288 11627112 12014175 11287146
41139 11287146 8933770 6542530 5724499 5575438 4032764 1534002 1092997 3706907
41131 3706907 5757870 3419310 -1398248 -2769590 1236005 5678391 5527933 2186152
41123 2186152 397162 1168898 1680971 799623 100417 -494843 -3353628 -8104971 -10238635
41114 -10238635 -7141217 -2258050 -466803 -1831581 -2758680 -1188926 2320551 6814069
41106 6814069 11050722 12896834 11883221 11092987 13007957 14660753 11136451 3443903
41098 3443903 -1798088 -1178707 1605117 2203790 1452186 1998404 2959939 1882807 -287105
41089 -287105 -248182 2605501 5538881 6370241 5081559 1943031 -2904144 -7673973 -9380220
41080 -9380220 -6902487 -1923287 3500641 8519344 12384948 13808025 12298955 8823730
41072 8823730 4628349 705754 -1454893 -554308 2325716 4041812 3042772 1250578
41064 1250578 1197996 2814086 4458760 5665550 6853246 7195031 5041984 509274 -4077536
41055 -4077536 -6615454 -6865321 -5522445 -2936291 775787 5182437 9455972 12367286
41047 12367286 12698017 10739209 9132995 10553504 14083787 15511124 12244997 6613084
41039 6613084 2885009 2100742 1729333 -114201 -2486261 -4025670 -5139439 -6268865
41031 -6268865 -5838013 -2423141 1781638 2559478 -712798 -3584174 -2023694 2776603
41023 2776603 7063120 9956823 13093856 15922849 15421611 11190846 7107385 6019233
41015 6019233 5815523 3255451 -917672 -3919621 -5950484 -9244360 -13018216 -13709576
41007 -13709576 -10543894 -6818344 -4666836 -2519539 495851 1650468 -783366 -3177307
40999 -3177307 -878392 4836058 8352492 7644433 6391682 7637315 9264984 7767419
40991 7767419 3775926 1086620 1273714 1819814 -74128 -3472299 -4722811 -2272939
40983 -2272939 739037 -186802 -5272618 -9640595 -8611034 -2455324 4736778 9084459
40975 9084459 8647111 3555963 -2932816 -5280049 -1149248 4544985 4665469 -1111811
40967 -1111811 -6059807 -5664778 -2844826 -2218738 -3367079 -3003805 -818472 691563 511871
40958 511871 -375056 -1789073 -4323291 -6989040 -7976747 -7688218 -8198190 -9521787 -9090483
40949 -9090483 -5545729 -815502 2394439 3482775 3678559 4281480 5664877 6973373
40941 6973373 6783160 5107915 4193751 5721823 7899311 7561883 4762926 2575276 2249232
40932 2249232 1544437 -1364975 -5174462 -7830685 -8968203 -8487021 -5356221 20625
40924 20625 4331118 4614325 1622374 -1908099 -4674254 -6490707 -6455001 -4142302 -1261353
40915 -1261353 688079 3124003 7450309 10452649 6990351 -2112572 -8966266 -7381749
40907 -7381749 194077 6712701 8982540 9176196 9521490 9213408 7034812 4187955 2822089
40898 2822089 3047872 3166709 2581187 2818593 4938414 7092982 6236671 2096346 -2261713
40889 -2261713 -4440643 -5664759 -8356633 -11994227 -13359590 -10481525 -4424115 2732879
40881 2732879 9623557 14877679 16738437 14684934 10317392 5606504 1147314 -3024071
40873 -3024071 -5941519 -6351449 -4448123 -1914649 -266086 292618 514861 1047040 1655436
40864 1655436 1526531 683351 758581 3277186 7129325 9200585 8193451 6491035 7060424
40855 7060424 9458744 10335029 7504765 2305940 -1973635 -3103282 -1519678 229622
40847 229622 -207532 -2556969 -4083026 -2869766 -405518 204224 -1711281 -3467608 -2311048
40838 -2311048 1538698 5465892 7022828 5455581 1789239 -1636111 -2419844 -199442
40830 -199442 2409602 1932299 -2407746 -7681183 -10171916 -8902583 -5800028 -2919638
40822 -2919638 -682412 1063664 1808802 1463948 1731274 4509270 8868982 11335326 9855570
40813 9855570 6193942 3574793 3135066 3772270 4403262 4766696 4418673 2597421 -558585
40804 -558585 -3680188 -5515419 -6102207 -6363254 -6867953 -7145525 -6180531 -3754318 -1177972
40795 -1177972 4413 137136 1123259 3339840 4265702 1700727 -2612429 -4748760 -3876788
40786 -3876788 -3442404 -6175016 -9893461 -10211250 -6558478 -3260594 -4084971 -7361266 -8023306
40777 -8023306 -3978308 1293202 3054689 788645 -2031233 -2762436 -2173660 -2172516 -3064426
40768 -3064426 -4002631 -4510112 -4228841 -2378798 1042473 4328951 5723548 5404491 4645685
40759 4645685 3810148 2654976 2010251 3450524 7313420 12151324 15944202 17114283
40751 17114283 15228183 11897476 9984016 10337063 10260845 7028914 1928491 -1449646
40743 -1449646 -2184248 -2675310 -4674023 -7349598 -9279018 -9687224 -7646543 -3011145 1341009
40734 1341009 1254029 -3545615 -8488370 -9387790 -6328972 -1694291 2700871 5256152 4542099
40725 4542099 1723077 511851 2531406 4937672 4774321 3356658 3745753 5870020
40717 5870020 7071103 6134636 4048201 1774105 -255211 -1261785 -888028 15747 1059653
40708 1059653 3296068 6635515 8297289 6559615 4214890 4952098 7691239 8227109
40700 8227109 5600270 2799937 1389765 -302068 -2879451 -3649958 -362316 5590338
40692 5590338 11245334 15133684 16924730 16078916 12581737 7975994 4560996 4041750
40684 4041750 6807146 11195631 13629695 11367581 5644407 813588 154172 3503300
40676 3503300 8530646 12810988 15006339 15504510 15453499 14148117 9111504 808044 -5016662
40667 -5016662 -3346642 3214421 7712325 7920532 7297259 7458570 5712206 1286419 -1851345
40658 -1851345 -1097372 683980 312517 -576963 995754 4289542 6888692 8882134 11346015
40649 11346015 13062624 12247733 9575714 6515745 2905703 -902849 -2229456 6687
40641 6687 2120563 528105 -2506057 -2611866 -946545 -2718270 -8741434 -13841424 -14255125
40632 -14255125 -11939560 -10294654 -9623556 -8615464 -7227377 -6066040 -4811731 -2771340
40624 -2771340 51220 2898776 4285838 2605413 -1582263 -4556638 -3053768 1376190
40616 1376190 3810004 1505710 -3950374 -9308172 -12064302 -11069265 -7692057 -5910087
40608 -5910087 -8265532 -12199500 -13485552 -12472762 -12916485 -15056013 -14795094 -10550094
40600 -10550094 -5938568 -3857023 -2600966 -540997 -268333 -4260973 -9621944 -11383406
40592 -11383406 -9195930 -6901651 -6675109 -7176159 -6884515 -5938266 -4673637 -3143092 -2396359
40583 -2396359 -3841913 -6619368 -7374187 -3613039 3519283 10209018 13095235 11359748
40575 11359748 6612653 1468940 -1729825 -1507364 2103867 6820549 9143788 7588487
40567 7588487 4254112 1777677 -236490 -3556341 -7107721 -7728392 -5115651 -2460383
40559 -2460383 -1444783 -367311 1317454 673100 -3647817 -7363743 -5414490 1213790
40551 1213790 7273875 10395119 12440936 14406853 14242547 10658893 5815159 2531581
40543 2531581 801417 -1330403 -4561431 -7486216 -8702453 -8692449 -8936148 -9226303 -7026051
40534 -7026051 -926783 5797512 7507467 2817286 -3325646 -5517157 -3774896 -1743846
40526 -1743846 -1097895 -507998 899927 2090836 2258675 2146045 2576260 2998839 2116212
40517 2116212 -476431 -3362967 -4204945 -2394061 -501351 -1342488 -3719014 -3790594 -1164789
40508 -1164789 42848 -2032953 -3212417 447683 6070988 8151020 6748229 6303136
40500 6303136 7874782 8268450 6460647 5127647 5156102 4143084 1741647 1175243 3237531
40491 3237531 3797856 314865 -3640512 -4088798 -2967372 -4252475 -6770189 -6138099 -2339855
40482 -2339855 11299 -1041455 -2116694 -361590 1932314 806263 -3803840 -8356504
40474 -8356504 -10169568 -9498496 -7858305 -6245226 -5131437 -4692176 -4360870 -3111687 -1058875
40465 -1058875 -79925 -1510807 -3428626 -2106843 2933944 6976438 4956704 -2622678
40457 -2622678 -10432080 -14249898 -14008689 -11428970 -7582235 -3601715 -1243828 -1101427
40449 -1101427 -1826185 -2483513 -4199727 -7920808 -11749264 -12348232 -8566735 -2411011 3125502
40440 3125502 6115352 6192207 4437511 2892429 3330359 6169355 10462008 14346647 15464448
40431 15464448 12205035 5563155 -845900 -3629685 -2421620 492097 2863403 4265108
40423 4265108 5536295 7072571 7936003 6948146 4755850 3913113 5939014 9021757 10084791
40414 10084791 8593161 6509626 4913764 3109453 1239199 951128 2384368 3043787
40406 3043787 1316961 -1004738 -1552650 -830705 -738828 -1283704 -1183961 -588280 -648525 -1095685
40396 -1095685 -820045 -651533 -3013279 -8264201 -13294828 -14617928 -11788058 -7270726
40388 -7270726 -3770462 -2090271 -1116784 397624 2191200 3089683 2989966 2908268 2861519
40379 2861519 1641329 -394285 -529872 2501097 5912417 6503082 5229653 5180175 6315266
40370 6315266 5922521 3827798 3057574 4650071 5706828 4202984 2293131 2494982 3425328
40361 3425328 2323137 -111528 -647796 1667940 4650685 6500998 7272209 6786231 4178687
40352 4178687 557102 -541197 2784102 7956095 10999207 11098620 10014614 8178007
40344 8178007 4355852 -854992 -4322865 -4316730 -2657573 -1395720 302399 3711453 7018545
40335 7018545 7263021 4626830 1630537 -1125627 -4778169 -8010785 -7301953 -2401962
40327 -2401962 2331480 3759426 3497557 3605817 2747236 1266 -1004107 3454840 10391328
40318 10391328 12530245 7165687 -1245210 -7074013 -8396216 -5927351 -1092382 3700855
40310 3700855 5839389 4973711 3078550 1847625 1845308 3644513 6948203 8812314 6114444
40301 6114444 264803 -3693627 -3253153 -536978 2223612 5419059 9006659 10754210
40293 10754210 9803659 8595394 8717758 7956306 4270767 -274716 -2832920 -4349118
40285 -4349118 -7023230 -9397457 -8395263 -5072888 -3811147 -5906842 -8064850 -7759688
40277 -7759688 -6405550 -6181824 -6928017 -7651582 -8526893 -9713867 -10099486 -8836139 -6813564
40268 -6813564 -5304505 -4181757 -2462761 340291 4179272 8709003 12742785 14486474
40260 14486474 13289017 10485570 7761087 5356027 2602694 -443625 -2806641 -3743518
40252 -3743518 -3464328 -2796605 -2397464 -2116303 -1123614 956754 3184247 4237942 4108406
40243 4108406 3894108 3833403 2810200 420995 -1719900 -2006478 -1500826 -3012292 -7345503
40234 -7345503 -11705452 -12599961 -9749428 -6297378 -5300187 -6847948 -8889576 -9974140
40226 -9974140 -10199188 -9912008 -8960456 -7606492 -6771480 -6387286 -4710218 -843769 2870160
40217 2870160 3146047 495491 -593163 2791785 8090646 10494982 8718605 5521884
40209 5521884 3185115 901271 -2891994 -7626283 -11243126 -12509197 -11496026 -8583068
40201 -8583068 -4233717 689187 5491436 10176235 14356612 16156214 13768931 8112168
40193 8112168 2288652 -1985790 -5763399 -9922996 -12660295 -11610571 -7433725 -3342269
40185 -3342269 -1311274 -396360 1121284 3383677 5158957 5376738 4076413 2519987
40177 2519987 2485482 4687103 7709179 9087066 7511192 3593997 -1075948 -4807345
40169 -4807345 -6204638 -4950499 -2248947 331988 2233992 3401049 3313204 2140373
40161 2140373 2166375 5711201 11434639 14912868 13579953 9284870 5362266 3196191
40153 3196191 2601926 3452304 5202959 6148043 4827849 1584521 -2084857 -4797716 -5503530
40144 -5503530 -4101646 -2657263 -4086001 -8346161 -11834519 -12179880 -11686252 -13797060
40136 -13797060 -17764987 -19615884 -17606936 -13983823 -11400265 -9916005 -7917470 -4368355
40128 -4368355 239256 4196947 5942960 5846999 5964710 7170083 7710891 5958871 3328572
40119 3328572 2630472 4476463 7148102 9071362 9500002 7801135 4307806 1060147
40111 1060147 -454302 -1294224 -2560035 -2430494 1121094 5918274 7848090 6948821 6869303
40102 6869303 8179466 7064799 1960170 -3137969 -4274586 -2582994 -1125299 -217979
40094 -217979 930557 900577 -1867041 -5537327 -6891822 -5623652 -3596031 -1074058 3021144
40085 3021144 7836771 10883674 11615264 11918123 12753107 12738748 10599204 6965931 2999792
40076 2999792 -1205214 -5935042 -10405328 -12692666 -11162802 -6344233 -1391803 553846
40068 553846 45854 750316 4101340 6631121 4836638 851201 -98500 2877894 5289258
40059 5289258 4219069 2654370 4858727 10002284 13192073 11800716 8157169 5792313
40051 5792313 5025361 3387170 -492144 -4865389 -7038331 -6565576 -5319778 -4827323 -4817170
40042 -4817170 -4438392 -3500811 -2125816 -630812 -281645 -2324538 -5260222 -5194213 -773927
40033 -773927 4009285 4320129 365684 -3851624 -6280973 -7836086 -8367136 -5944139 -1196770
40024 -1196770 1323326 -1704929 -8065374 -12654187 -12785047 -9559096 -5769545 -3888837
40016 -3888837 -4551494 -5722328 -4847739 -2692145 -2863246 -6348220 -9317155 -8501512 -5994887
40007 -5994887 -5654611 -7173449 -7703904 -7564496 -9388017 -12163914 -11575213 -7263010 -4487428
39998 -4487428 -6147909 -7865177 -4715672 881870 2732102 -106807 -3119511 -4101757
39990 -4101757 -5548473 -8676027 -10350931 -8247338 -4913780 -3583704 -2989477 22377
39982 22377 4647710 6756942 4704859 1117715 -1182050 -2153275 -2973399 -3953433 -4838584
39973 -4838584 -5446858 -5476099 -5178257 -6222557 -9769540 -13417796 -12659459 -6508168 535462
39964 535462 3554867 2313108 -197202 -2155048 -3607064 -4369378 -4000130 -3310615 -3579854
39955 -3579854 -4450540 -4497111 -3629475 -3073421 -3171169 -3109404 -2764323 -2853763 -3093184 -2156870
39945 -2156870 51442 1832024 2011396 1339779 992945 1088296 1244325 1217960 478034
39936 478034 -1295963 -2704862 -1538739 1646215 2804157 -734810 -5931345 -6999125
39928 -6999125 -2410905 3287173 5049620 2801185 314878 29146 718540 189134 -1306467
39919 -1306467 -1520831 286370 1726388 117632 -3702500 -5881373 -4217137 -1080110
39911 -1080110 -655545 -3912729 -7579684 -8157079 -5810508 -3615494 -3603442 -4613641 -4157352
39902 -4157352 -1436063 2208032 5194561 6862559 6852165 4798479 1288916 -1970700
39894 -1970700 -3745473 -4077794 -2844381 912831 6675802 11001603 10939059 8174305 6845606
39885 6845606 7326185 5628966 17646 -5355925 -5924592 -3102919 -1743211 -2714191 -2067980
39876 -2067980 2250180 6585814 6103581 740431 -5282891 -8370115 -8004362 -5324051
39868 -5324051 -1654038 1334299 1974004 277957 -1589884 -1520452 294977 2147459 3342009
39859 3342009 4676208 6424378 7418369 6941355 6254284 6886992 8247933 8594177 7951767
39850 7951767 8076800 9266580 9271198 6476288 2616858 745247 1360511 2269849 2138736
39841 2138736 2553932 5796370 11300693 15355341 14694491 9987290 4986532 2144444
39833 2144444 298497 -2421855 -4890271 -4476844 -1692940 -378843 -2500912 -5483771
39825 -5483771 -6234771 -5333146 -4963229 -4765912 -2792771 546183 2733417 3105198 3576188
39816 3576188 5124964 6335507 6181497 5740747 5979904 5943700 4500078 2175260 -38756
39807 -38756 -2092339 -3788263 -4038679 -2977328 -3246226 -6856947 -11692287 -13590652 -11599187
39798 -11599187 -8807970 -7885695 -8130035 -7556648 -5735534 -3387505 -918688 1126266
39790 1126266 1405689 -737771 -3809420 -5617719 -5659808 -4742861 -3018259 -323416 1919104
39781 1919104 1654585 -339023 -318195 3581904 8152223 8742591 4937400 423326 -2119101
39772 -2119101 -3474245 -5129385 -6561287 -6401800 -4659874 -2532819 -1034305 -719420
39764 -719420 -1699444 -2972741 -2858707 -1309874 -792868 -3335323 -7328542 -8950179 -6596645
39755 -6596645 -2319315 1257545 3820046 6445808 9008524 9770932 7528233 3543620
39747 3543620 994232 2213177 6304986 9821385 10157942 7894767 5310655 3298990
39739 3298990 999064 -1730447 -3190262 -2113126 10452 333250 -1702934 -3387602
39731 -3387602 -2067636 1265466 2799572 363937 -3935830 -6132731 -4701811 -1612696
39723 -1612696 201065 -909543 -5091907 -10978844 -15452022 -15456961 -11387394 -7309144 -6433221
39714 -6433221 -7488693 -6984220 -3803108 357532 4063194 7132751 8872021 8037891
39706 8037891 5244698 3255282 3768924 5381342 5689202 4177489 2138196 929718
39698 929718 1366716 3849978 7849607 11638235 13375074 12290476 8600382 3017468
39690 3017468 -3096363 -7734219 -9138539 -6694893 -1146883 5416526 10116384 11212285
39682 11212285 9801860 8438647 7825769 6289336 2852520 -1029508 -3699993 -5381298
39674 -5381298 -6608930 -6357247 -3756495 -389153 1508983 2469959 5011721 9591568
39666 9591568 13596879 14600310 12645563 9027578 4862575 1431917 -142516 -589146
39658 -589146 -2042991 -4735216 -5960030 -4036791 -1644507 -2681513 -6511813 -8184944
39650 -8184944 -4975277 -386470 -94615 -5109157 -10692938 -11865015 -8534659 -4676052
39642 -4676052 -3405136 -4056085 -4122072 -2804712 -1472718 -1077441 -790954 239557 1324743
39633 1324743 1725126 2489373 4768523 6851232 5470947 623659 -3376774 -3105546 -328382
39624 -328382 862926 -328099 -1165580 69435 2063500 2928971 2014695 -1091461 -6596134
39615 -6596134 -12490314 -15091787 -13289794 -10179866 -8655478 -7486977 -4255138 -291664
39607 -291664 821778 -989941 -1784753 514116 2995258 2109583 -1320424 -3601414 -3200481
39598 -3200481 -1998456 -2068007 -3294308 -4540124 -5656444 -7339020 -9546585 -11124186
39590 -11124186 -11305731 -10883899 -11076672 -11607906 -11190710 -9957799 -9603966 -10273521 -9373389
39581 -9373389 -5446404 -1529810 -1699633 -5013303 -6271333 -3115772 945229 1783980
39573 1783980 -74500 -1426502 -1349900 -1673774 -3673525 -6497101 -8399722 -8104095 -5540449
39564 -5540449 -2362204 -881506 -1405737 -1628093 283774 3294960 5438857 6496655
39556 6496655 6874949 5431329 1165592 -3710691 -5364268 -3143501 -301015 516326
39548 516326 214541 880370 2429791 2901097 1003936 -2561370 -5684709 -6406907 -4692665
39539 -4692665 -2725662 -2455083 -2989144 -1888124 922974 2495353 889759 -1907715
39531 -1907715 -2458737 -38340 3156124 5147277 5940417 6420232 6952851 7428584 7871806
39522 7871806 8575399 9766264 11019601 10936402 8104502 3062957 -1254987 -2164277 -303874
39513 -303874 922058 -836001 -4585721 -7840600 -9483248 -9750948 -8450817 -5113839
39505 -5113839 -896344 1595860 1230262 -218912 -464183 674416 2059625 3285034
39497 3285034 4381553 4593878 3321893 1448806 -202036 -2724138 -6937999 -10357787
39489 -10357787 -9910956 -7532226 -8823366 -14971010 -20089303 -18802031 -12826122 -7194811
39481 -7194811 -3363508 153449 3001116 3416642 2106009 1477298 1740918 1586596 1951922
39472 1951922 4914102 9113515 10685980 9152537 8072044 8919381 8650515 5110117
39464 5110117 983076 -21962 2117085 5102625 7538051 8337565 5669110 -366110
39456 -366110 -5779944 -6481290 -3065847 445399 1411214 -247026 -4214688 -9819657 -14164396
39447 -14164396 -13530427 -7865100 -1933131 -586834 -3704079 -6797591 -6248149 -3033901
39439 -3033901 -1043648 -2360117 -5232632 -6816510 -6485063 -5350577 -3858082 -1843082
39431 -1843082 -201225 -94841 -688427 -134549 1055935 196399 -3512058 -7538211 -9298245
39422 -9298245 -8572873 -6146509 -2557985 1268166 4830013 9724676 17053788 22838853
39414 22838853 20840148 11700019 4233046 4585000 8927167 10817853 10755480 12654520
39406 12654520 14998043 13068069 8122374 6566523 9782209 11806837 8636937 3746832
39398 3746832 2021632 3272598 4485187 4336808 2729379 -610635 -4286851 -4993759
39390 -4993759 -1816990 1725165 2284796 836065 -101126 -720463 -2423151 -4128700 -3500286
39381 -3500286 -938921 537170 -844780 -3897827 -6308852 -6591387 -4643395 -1751727
39373 -1751727 352353 1459821 3268040 6926704 11138389 13758994 14378643 14169291
39365 14169291 13897971 13133754 10959093 7017470 2686969 1228622 4876047 10999533
39357 10999533 13298539 8505285 411843 -4488741 -4047911 -1314529 345800 477988
39349 477988 238604 268324 555190 1113482 2058033 3363876 4656892 5110027 3943551
39340 3943551 1309868 -1730899 -4188847 -5520067 -5319322 -3840784 -2631082 -2922642
39332 -2922642 -3286054 -1001624 3650122 6801685 5879024 2894226 1344132 1878796 2942330
39323 2942330 3900066 5269947 7042710 8726739 10014892 9929137 7025094 2414343 612195
39314 612195 4487034 10617612 12699246 8896434 3091381 -434400 -576930 1814288
39306 1814288 5364625 7961778 7889026 5865932 3977529 2575725 572048 -1328989
39298 -1328989 -688506 2698194 5589658 5182726 2180691 -827623 -2035968 -746293
39290 -746293 2762450 6528171 7770881 5483785 927812 -4566997 -10236066 -14110847
39282 -14110847 -13493803 -8566141 -3248929 -889425 -858290 -709327 240342 1029878 984408
39273 984408 -105969 -2248356 -4258001 -4031190 -1195869 2003526 3581120 3647558 2300505
39264 2300505 -1442744 -6368625 -7629401 -2215582 5796646 9267307 6504533 2265514
39256 2265514 771691 1471646 1998092 1675331 917596 -12600 -296772 1187014 3761823
39247 3761823 5045445 4113356 2674084 2200068 1890870 557411 -1416764 -3166623 -4463635
39238 -4463635 -4492633 -1639809 3742282 8272086 9343230 8396365 8147663 8115938 5780198
39229 5780198 1226669 -2586541 -4082081 -4484253 -4572355 -3149389 -92468 1708994 -377180
39220 -377180 -4954301 -8007199 -7323186 -4214978 -1755439 -2544229 -7122476 -12935765 -15652781
39211 -15652781 -13342227 -8941982 -6885900 -7731003 -8215387 -6547187 -5081953 -6757440
39203 -6757440 -10892785 -14096166 -14178253 -11795658 -9067049 -7801786 -8444912 -9695057 -9711834
39194 -9711834 -8415265 -7558800 -7634366 -6328536 -1933169 3086151 4692093 2931641 1942374
39185 1942374 4032933 6950522 8218202 9025494 11435988 14152688 14271237 12007707
39177 12007707 10359579 10380586 10069357 8519982 8086324 10756944 14488170 15146516 11009185
39168 11009185 3843890 -3381651 -8244441 -9360483 -7281496 -4684540 -3847350 -3944636
39160 -3944636 -2511334 564987 2721014 2789529 2894539 4932838 7364330 7541490 5483781
39151 5483781 2815574 -627921 -5825172 -10760619 -11424839 -7416241 -3131152 -1930866
39143 -1930866 -2337047 -1995368 -1986197 -3870036 -5233982 -2734281 1768222 3024927 356163
39134 356163 -1023646 2173098 6617334 7756400 6102010 5023980 5203389 5030927 4696831
39125 4696831 5878605 7965638 8289419 6418738 5072114 5808535 6348503 3686766 -1681777
39116 -1681777 -6129639 -6830614 -4368810 -1672542 -843251 -1149680 -417279 1707344 3112676
39107 3112676 2581949 2230044 4695328 8895272 11054122 9736970 7311408 6076195
39099 6076195 5552106 4600349 3725973 3462417 2290280 -1559079 -6993732 -10627683 -10207985
39090 -10207985 -6295551 -1143393 2724858 3409853 928006 -2256440 -3496632 -3212099
39082 -3212099 -4618958 -9450334 -14893946 -16001766 -11021339 -3331923 2238305 4136434
39074 4136434 4264200 4133216 2757287 -849201 -4716859 -5370604 -1776869 3788585 8520026
39065 8520026 10970777 10389538 6580576 1271557 -2270606 -2174109 641557 4375286 7725118
39056 7725118 8792838 5463529 -1088693 -5523537 -3648063 2732913 8540048 11294427
39048 11294427 11514957 9215047 4227732 -667293 -1578829 849092 1729958 -976745
39040 -976745 -3709669 -3355319 -1876308 -2063493 -2432209 -359902 2356559 1742549 -1795349
39031 -1795349 -3645455 -1546654 1984857 4074823 4633860 4287513 2641580 89033
39023 89033 -1461161 -1368149 -1607760 -3864503 -7332252 -10801480 -14585042 -18388232 -19511826
39014 -19511826 -16059512 -10706120 -8316802 -10147418 -12919914 -13602836 -12645505 -11965086
39006 -11965086 -11921508 -11461450 -9950547 -7765545 -5768959 -4899670 -5739040 -7963137 -10527235
38997 -10527235 -12443669 -12910992 -11052658 -6795049 -2166532 -232206 -1804609 -4198532
38989 -4198532 -4359186 -2551370 -1625322 -2867986 -4121161 -2664683 1048914 3711676
38981 3711676 3097739 688310 -131772 2038333 5218567 6348006 4241595 221491
38973 221491 -3295622 -4334127 -2247146 1911777 5897386 7754875 6989510 4299086
38965 4299086 706255 -2608499 -4276114 -3558144 -1155509 1490353 3615044 5243050
38957 5243050 6186751 5914164 4476770 2725440 1441371 884046 1084427 1668632 1440546
38948 1440546 -669809 -3968248 -6480427 -7511638 -8450630 -10231118 -11255399 -9244384
38940 -9244384 -4554244 -288797 788842 -1458861 -5042425 -7538709 -7457757 -5261776
38932 -5261776 -3428173 -4429278 -7900015 -10462348 -9213455 -5109117 -2025344 -2405745
38924 -2405745 -4704054 -5654613 -4362361 -3040425 -3783241 -5912701 -7179010 -6563208 -4822429
38915 -4822429 -3006968 -1821735 -2001713 -3586958 -4749651 -3160041 881910 4368054
38907 4368054 5575428 6461051 9520230 13579689 14883566 11985737 7567776 5184965
38899 5184965 5807697 7961187 9743545 9871938 7941928 4934993 3035615 3774987 6145268
38890 6145268 7211038 4988577 536170 -3042362 -3589120 -1729308 106957 87064 -1570946
38881 -1570946 -2864073 -1422782 3418865 9061825 10982856 7241735 1416233 -778789
38873 -778789 1947368 5188896 4773743 1791622 169166 1088922 2185496 1382153 -974376
38864 -974376 -3763584 -6651378 -9306612 -10547462 -9276785 -5818747 -1887859 757272
38856 757272 1934459 3429718 6953599 11355682 13155952 10676146 6122887 2245707
38848 2245707 -1262481 -5757351 -9574588 -9295978 -4871528 -373580 912198 -343299
38840 -343299 -1748211 -2104552 -1365063 -60718 305233 -1557024 -4335220 -5156046 -3751708
38831 -3751708 -2927392 -3852107 -4076972 -2155277 -967759 -3351172 -6949410 -7247704 -4245942
38822 -4245942 -2069313 -2443178 -2579416 -157596 3044937 3908828 1912559 -1163124 -3685274
38813 -3685274 -4875488 -4312420 -2128903 806534 3680981 6357175 8973173 11481362
38805 11481362 13634684 14799563 14001708 11099537 7703047 5790185 5544423 5733843
38797 5733843 5862065 6220843 5964090 3488642 -506240 -2590725 -782564 2527212 3713639
38788 3713639 2768348 2747425 4840556 6408641 4600440 282665 -2723253 -1614935 2887673
38779 2887673 7507681 9296293 7877329 5317135 3765973 3296117 2460668 754636
38771 754636 -598622 -768252 -1018292 -3032421 -6172775 -7949290 -7155442 -5069816 -3384654
38762 -3384654 -2544858 -2605317 -3898906 -5766484 -6334612 -5104070 -4195060 -5027736 -5239004
38753 -5239004 -1667468 4399137 8098859 7099447 3797463 1108188 -642592 -1610939
38745 -1610939 -588752 2664511 5721424 6267731 4687342 2198395 -1238169 -5080700
38737 -5080700 -6860506 -5586869 -4398313 -6487213 -10033645 -10880243 -9060944 -8508492
38729 -8508492 -10526059 -11701918 -9036386 -3602304 2008646 6810709 10582635 12455651
38721 12455651 11999960 10073788 7536937 4621084 2136498 1412523 2215406 2372803 250812
38712 250812 -3596889 -7272530 -8500715 -5367924 1329369 6774539 6420755 1927546
38704 1927546 -637581 826411 1916336 -904203 -4742472 -5086105 -2626526 -1422851
38696 -1422851 -2592365 -3714289 -3092933 -1126101 1521219 3928221 4098342 1330324
38688 1330324 -1376455 -521401 2824017 4382294 2769709 781538 434811 310465 -1125698
38679 -1125698 -2637688 -2305937 -307588 2013001 4255170 6657718 8836683 10165108
38671 10165108 10750126 11101509 11297440 11091380 10488659 9835992 9487006 9351225 8717880
38662 8717880 7082901 5344192 5097946 6174622 6334586 4529165 2812032 3260297 4647205
38653 4647205 4644129 3974160 5194703 7957782 8950879 6810350 3853790 2163387 970367
38644 970367 -818038 -2143074 -1533069 519793 2327523 2794348 1729032 47420 126520
38635 126520 3749668 8956258 11363017 9664062 7279422 7233123 8160722 7250891 4369518
38626 4369518 770435 -3724340 -9043159 -12297539 -10603924 -5631246 -2000429 -1522122
38618 -1522122 -1990842 -1361405 18833 1447136 3022040 4078225 3158879 522437 -1555309
38609 -1555309 -1923345 -1954926 -2894078 -3933194 -4234850 -4950682 -7463996 -10853353 -12818352
38600 -12818352 -12492925 -11051572 -9998514 -9855068 -10155139 -10051379 -9334531 -9075791 -10249879
38591 -10249879 -11383308 -9232574 -3045323 3269973 5089656 2399505 -807536 -2026310
38583 -2026310 -2733100 -4845177 -6947146 -5837255 -939375 4590708 7286500 6734851
38575 6734851 5016617 3553552 1558715 -2129711 -6490018 -8734966 -7535185 -4865661
38567 -4865661 -3792184 -4967608 -6414675 -6543755 -6008122 -6223308 -7333378 -8444280 -8857512
38558 -8857512 -8056358 -5387619 -1221741 2097602 2309250 479866 494410 4479067 10026568
38549 10026568 13046834 12338901 9998278 8071837 6607714 5008552 3552547 2784904
38541 2784904 2559805 2692272 3805009 6301952 8742222 8574383 4999973 205816 -3074362
38532 -3074362 -4656063 -6478925 -9346960 -11620304 -11687220 -10245315 -8868397 -7483187
38524 -7483187 -5077530 -2179726 -422953 130040 795933 1297146 -123629 -2856949 -3522166
38515 -3522166 -1183391 488274 -752378 -884449 4483142 11578887 11970702 4652700
38507 4652700 -1538661 335103 6524738 9096268 6962341 5513956 7530876 9721047
38499 9721047 8319955 4088511 624077 192517 2289296 4750034 5450788 3773114
38491 3773114 796302 -2182849 -4726363 -6456780 -6575897 -5344882 -4534424 -4620719 -3013508
38482 -3013508 2387835 8853600 11101006 7845523 3215623 1240179 1648950 1929748
38474 1929748 907073 -1065152 -3235405 -4141558 -1983287 2889289 7239359 8498988
38466 8498988 7979591 8746939 11261625 13220396 13170556 11876486 9869524 6091978 400400
38457 400400 -4158020 -3695290 1977432 8680855 12129786 11716738 9506662 6854574 3587725
38448 3587725 -118975 -3131141 -4943675 -6044376 -6000693 -3196944 2003983 5565459
38440 5565459 3598018 -2803166 -8639274 -10545330 -9304027 -7318020 -6051140 -6147365
38432 -6147365 -7595792 -8934481 -8261279 -5893195 -4231206 -4220793 -3958349 -1864460 902678
38423 902678 2742074 4209518 6101990 6662694 3707282 -1031310 -2693371 1001508
38415 1001508 7038338 10915322 11332858 9920307 7847158 4717501 612987 -2634414
38407 -2634414 -3323737 -2391257 -2722492 -5636203 -9082513 -10226199 -9079971 -8161408 -8777102
38398 -8777102 -9439658 -8573742 -7143871 -7208745 -8813962 -9975821 -9608712 -8995047 -9752391
38389 -9752391 -11179845 -10667137 -6958624 -2257596 -20199 -673497 -1086551 711468 1936957
38380 1936957 -1562287 -9122982 -15303961 -16298610 -13574558 -10555736 -8789594 -8807068 -11474239
38371 -11474239 -15697339 -17214482 -13137119 -6379703 -2227335 -1356362 151705 4008552
38363 4008552 6741348 4679734 -970146 -5743317 -6806700 -4765256 -1832248 472666
38355 472666 2274387 4515124 6937626 7591836 5564497 3175204 3043795 3481052 107151
38346 107151 -7351945 -13466461 -14125801 -11928084 -11694476 -13224031 -12462632 -8544730 -5097819
38337 -5097819 -4061307 -2433713 2659449 8639743 10350422 6917818 2571725 697075
38329 697075 64374 -1890541 -4598945 -5597515 -4830448 -4559785 -4962251 -3151187 1881571
38320 1881571 6239750 5886674 2588516 1490216 3438086 3779541 -420344 -5859504
38312 -5859504 -7841276 -6592029 -5718610 -6334051 -6255423 -4426359 -2763807 -2973745 -3955422
38303 -3955422 -3418259 -562984 3652004 7667498 9929449 9286011 5688948 285071
38295 285071 -5298019 -9360301 -10324471 -7888658 -4115029 -1891420 -1664817 -998797 1707507
38286 1707507 4322942 3338571 -1462765 -6311638 -7522974 -5037432 -1672606 -6182
38278 -6182 -546856 -2050481 -2798255 -1998219 -537719 35797 -267652 632586 4348511
38269 4348511 9535930 13021050 13017199 10046696 5227916 -416116 -4941928 -6211611 -4649107
38260 -4649107 -3155443 -2905905 -1502925 2539221 5759878 3698150 -2290925 -6188631
38252 -6188631 -5310171 -3157201 -3368916 -4820757 -4765861 -3273632 -1507618 1614015 7174292
38243 7174292 12233422 12171010 6953395 1631487 24059 747801 492453 -1194825 -2010574
38234 -2010574 -418274 2448548 4081258 3162464 1011345 420079 2663498 6089087
38226 6089087 8273543 8699789 8079008 6020488 1571016 -4038520 -7483522 -6997804 -4435350
38217 -4435350 -2932448 -3640734 -5286124 -5801424 -3820850 407062 4949597 7680275
38209 7680275 8091247 7082514 5384449 3414023 2283436 3121889 5225844 6519744
38201 6519744 5974760 3879566 -68102 -6344186 -12831660 -15459783 -13099601 -9359294
38193 -9359294 -7759489 -7446203 -5803954 -3086875 -1642876 -2030317 -2771551 -2982735 -2544844
38184 -2544844 -543451 3530870 7509938 8461480 6830817 5840458 6619054 6862793 4898379
38175 4898379 2141169 402370 -604696 -1585423 -1820868 -883066 -440347 -2337238 -5936717
38166 -5936717 -9015846 -10448645 -10630811 -10108216 -9132370 -7921567 -6372177 -4367505 -3123272
38157 -3123272 -4673729 -8645405 -11234450 -9565681 -5818884 -4414186 -5914898 -6838351
38149 -6838351 -5440882 -4145254 -4976670 -5741035 -3152491 2298802 7385834 10880163
38141 10880163 14240113 17730145 18830292 15609542 9672434 4358680 1354759 407590
38133 407590 1084179 2873638 4166512 3350616 1227215 481178 2059828 3826814 3978207
38124 3978207 4060086 6425666 9608668 9073524 3185542 -3883551 -6746621 -4899435 -2454846
38115 -2454846 -2511303 -3796799 -3223284 -240265 2376646 1621443 -2504455 -6836899 -8058589
38106 -8058589 -5971154 -3453352 -2735948 -2413771 390406 5003061 6639501 2404963
38098 2404963 -3868848 -5541412 -1521455 2407679 1540772 -1556185 -1270333 2854775
38090 2854775 5815154 4489714 1485339 747211 2599659 4966671 6844540 8006630
38082 8006630 7153068 3429920 -1009955 -2865655 -2031820 -1606712 -3393570 -5752444 -6457798
38073 -6457798 -5504177 -4108383 -2645549 -727260 1721251 4193620 5610767 4565542
38065 4565542 895978 -3001748 -4176152 -2546922 -341770 1842647 5443431 9642469
38057 9642469 10296540 5522290 -508684 -2420010 -231680 2031829 2474308 2283005 1728226
38048 1728226 -484625 -3796071 -5604716 -5175760 -4359358 -3674633 -1196940 3367094 6908382
38039 6908382 7104487 5386757 3621562 830078 -3951752 -8142060 -8577919 -6470680
38031 -6470680 -5714840 -7059645 -7645619 -6151511 -4586906 -4195168 -3121176 100348 3520845
38022 3520845 4538047 3778858 3766762 4889027 5230313 3979331 2525810 1875942 1194292
38013 1194292 -132588 -824659 262658 1579109 518812 -2385056 -2982078 1627554
38005 1627554 8915515 13115954 11323439 6215717 2694693 2936582 5110053 6011377
37997 6011377 4173933 715079 -2234344 -3706925 -4388985 -4960967 -4753828 -3028106 -1063559
37988 -1063559 -1299328 -4115428 -7130153 -8412148 -8639461 -8795906 -7609220 -3719731 663349
37979 663349 1462322 -1512681 -3410541 -453986 4918932 7149259 4558691 915823
37971 915823 371128 3096213 6398734 8204934 8228989 6908261 4735278 2407320 535518
37962 535518 -899089 -2194268 -3140862 -3236560 -2582036 -1821280 -1168660 -278457 778573
37953 778573 1265124 854341 125767 -561721 -1899321 -4491781 -7415868 -8880580 -8199229
37944 -8199229 -6402524 -5004516 -4743269 -5356678 -5949473 -5616933 -4207188 -2512800 -1594636
37935 -1594636 -2158033 -4357431 -7175535 -8004022 -4728741 836861 3712792 1859904
37927 1859904 -453107 1697852 6436786 7407713 3267921 86351 2658477 7678906
37919 7678906 8687958 4900193 1339969 1608518 4112171 5290771 3770339 855256
37911 855256 -1262855 -1310143 44491 913077 357910 -974508 -2867627 -6445349 -11602617
37902 -11602617 -15184058 -13992736 -8787665 -3309221 -91043 894062 457647 -528430
37894 -528430 -659089 822645 2629387 3232137 3468162 5063169 7236199 7611079 6255405
37885 6255405 5734692 6857454 7437814 6145342 4812534 5623767 8125728 10120486 9710492
37876 9710492 5839038 -919106 -7183440 -8777284 -5368369 -1253984 -250958 -1627144
37868 -1627144 -2372707 -1506236 -286871 418697 1003065 1934460 3013099 3520874 2646225
37859 2646225 374264 -2035783 -3451519 -4382033 -5595859 -5941640 -3975465 -1249609
37851 -1249609 -704431 -1687492 -421670 3650697 6117043 4069507 458881 -531369 1111564
37842 1111564 3346502 6029421 9025199 9440365 5240673 -257084 -1761497 1406267
37834 1406267 5793484 9239875 11614527 11542253 7390018 1423159 -1613542 -802030 -206142
37825 -206142 -2891830 -7004592 -8720719 -6537991 -2047707 1406921 895538 -3004197
$$ [...]
##END NTUPLES=NMR SPECTRUM
##END=
