##TITLE=31Pdec_LR-796-C1-K
 CDCl3, 24 sc
 17.1.2025
##JCAMPDX= 6.0         $$ Bruker NMR JCAMP-DX V2.0
##DATA TYPE= NMR SPECTRUM
##DATA CLASS= NTUPLES
##ORIGIN= UXNMR, Bruker Analytische Messtechnik GmbH
##OWNER= root
$$ XWIN-NMR		Version 3.5
$$ Fri Jan 17 14:04:37 2025 Russian Standard Time (UT+4h)  she@DPX200
##.OBSERVE FREQUENCY= 81.013821
##.OBSERVE NUCLEUS= ^31P
##.ACQUISITION MODE= SIMULTANEOUS
##.ACQUISITION SCHEME= undefined
##.AVERAGES= 24
##.DIGITISER RES= 17
##SPECTROMETER/DATA SYSTEM= spect
##.PULSE SEQUENCE= zgpg30
##.SOLVENT NAME= DMSO
##.SHIFT REFERENCE= (INTERNAL, DMSO, 0, 198.062)
##AUDIT TRAIL= $$ (NUMBER, WHEN, WHO, WHERE, WHAT)
$$ ##TITLE= Audit trail, XWIN-NMR		Version 3.5
$$ ##JCAMPDX= 5.01
$$ ##ORIGIN= Bruker BioSpin GmbH
$$ ##OWNER= she
$$ F:/spectra/data/she/nmr/P31/2/pdata/1/auditp.txt
$$ ##AUDIT TRAIL=  $$ (NUMBER, WHEN, WHO, WHERE, WHAT)
(   1,<2025-01-17 14:03:21.14 +0400>,<she>,<DPX200>,
      <created by zg, POWCHK disabled, PULCHK disabled
       configuration hash MD5:
       00 E9 B6 7A A2 85 ED C7 34 08 36 98 17 FE 4E 26
       data hash MD5: 32K
       C3 4A BC B5 0C A1 59 87 8E 20 A4 E5 13 E5 3E 3A>)
(   2,<2025-01-17 14:03:23.35 +0400>,<she>,<DPX200>,
      <Start of raw data processing
       efp BC_mod = 2 LB = 1.5 FT_mod = 6 PKNL = 1 PHC0 = 1746.905 PHC1 = 163.0858 SI = 64K 
       data hash MD5: 64K
       48 93 9D 6F 77 92 3A D1 2B 0D 54 29 9D CF 7E 17>)
(   3,<2025-01-17 14:04:01.25 +0400>,<she>,<DPX200>,
      <abs ABSG = 5 
       data hash MD5: 64K
       F6 67 8E 21 AE B4 DC 7F E4 40 EF DA 5C 6A D4 FE>)
(   4,<2025-01-17 14:04:10.25 +0400>,<she>,<DPX200>,
      <pk PHC0 = -7.513428 PHC1 = 0 
       data hash MD5: 64K
       31 51 58 13 5A 21 FC 4E 4D 35 1D 52 F1 7D 0D 0E>)
$$ ##END=
$$ 
$$ hash MD5
$$ 7D 97 4A 7E DB FC 2D A9 62 C1 C2 51 A1 C2 7D F8
##$RELAX= 
##$RELAX= 
##$RELAX= 
##$RELAX= 
##$RELAX= 
##$RELAX= 
##$RELAX= 
##$RELAX= 
$$ Bruker specific parameters
$$ --------------------------
##$DU= <F:/spectra>
##$EXPNO= 2
##$NAME= <P31>
##$PROCNO= 1
##$TYPE= <nmr>
##$USER= <she>
##$AMP= (0..31)
100 100 100 100 100 100 100 100 100 100 100 100 100 100 100 100 100 100 
100 100 100 100 100 100 100 100 100 100 100 100 100 100 
##$AQSEQ= 0
##$AQ_mod= 1
##$AUNM= <au_zg>
##$AUTOPOS= <>
##$BF1= 81.014009
##$BF2= 200.13
##$BF3= 200.13
##$BF4= 200.13
##$BF5= 200.13
##$BF6= 200.13
##$BF7= 200.13
##$BF8= 200.13
##$BYTORDA= 1
##$CFDGTYP= 0
##$CFRGTYP= 5
##$CHEMSTR= <none>
##$CNST= (0..31)
1 1 145 1 1 1 1 1 1 1 1 1 1 1 1 1 1 1 1 1 1 1 1 1 1 1 1 1 1 1 1 1 
##$CPDPRG= <waltz16>
##$CPDPRG1= <>
##$CPDPRG2= <waltz16>
##$CPDPRG3= <>
##$CPDPRG4= <mlev>
##$CPDPRG5= <mlev>
##$CPDPRG6= <mlev>
##$CPDPRG7= <mlev>
##$CPDPRG8= <mlev>
##$CPDPRGB= <>
##$CPDPRGT= <>
##$D= (0..31)
0 1 0 0 0 0 0 0 0 0.06 0 0.03 2e-05 3e-06 0 0 0.0002 0 0 0 0 0 0 0 0 0 
0 0 0 0 0 0 
##$DATE= 1737108200
##$DBL= (0..7)
120 120 120 11 120 120 24 19 
##$DBP= (0..7)
150 150 150 150 150 150 150 150 
##$DBP07= 0
##$DBPNAM0= <>
##$DBPNAM1= <>
$$ [...]
##$SUBNAM3= <"">
##$SUBNAM4= <"">
##$SUBNAM5= <"">
##$SUBNAM6= <"">
##$SUBNAM7= <"">
##$SUBNAM8= <"">
##$SUBNAM9= <"">
##$SW= 400.765351723535
##$SWIBOX= (0..15)
0 1 3 0 0 0 0 0 0 0 0 0 0 0 0 0 
##$SW_h= 32467.5324675325
##$TD= 32768
##$TD0= 1
##$TE= 0
##$TE2= 300
##$TE3= 300
##$TEG= 300
##$TL= (0..7)
0 120 53 12 22 120 120 120 
##$TP= (0..7)
150 150 150 150 150 150 150 150 
##$TP07= 0
##$TPNAME0= <>
##$TPNAME1= <>
##$TPNAME2= <>
##$TPNAME3= <>
##$TPNAME4= <>
##$TPNAME5= <>
##$TPNAME6= <>
##$TPNAME7= <>
##$TPOAL= (0..7)
0.5 0.5 0.5 0.5 0.5 0.5 0.5 0.5 
##$TPOFFS= (0..7)
0 0 0 0 0 0 0 0 
##$TUNHIN= 0
##$TUNHOUT= 0
##$TUNXOUT= 0
##$USERA1= <user>
##$USERA2= <user>
##$USERA3= <user>
##$USERA4= <user>
##$USERA5= <user>
##$V9= 5
##$VALIST= <valist>
##$VCLIST= <CCCCCCCCCCCCCCC>
##$VD= 0
##$VDLIST= <DDDDDDDDDDDDDDD>
##$VPLIST= <PPPPPPPPPPPPPPP>
##$VTLIST= <TTTTTTTTTTTTTTT>
##$WBST= 1024
##$WBSW= 4
##$XGAIN= (0..3)
0 0 0 0 
##$XL= 0
##$YL= 0
##$YMAX_a= 1889
##$YMIN_a= -5480
##$ZGOPTNS= <>
##$ZL1= 120
##$ZL2= 120
##$ZL3= 120
##$ZL4= 120
##$ABSF1= 198.0616
##$ABSF2= -202.7028
##$ABSG= 5
##$ABSL= 3
##$ALPHA= 0
##$AQORDER= 0
##$ASSFAC= 0
##$ASSFACI= 0
##$ASSFACX= 0
##$ASSWID= 0
##$AUNMP= <proc_1d>
##$AZFE= 0.1
##$AZFW= 0.5
##$BCFW= 0
##$BC_mod= 2
##$BYTORDP= 0
##$COROFFS= 0
##$CY= -3
##$DATMOD= 1
##$DC= 0
##$DFILT= <>
##$DTYPP= 0
##$F1P= 0
##$F2P= 0
##$FCOR= 1
##$FTSIZE= 65536
##$FT_mod= 6
##$GAMMA= 0
##$GB= 0
##$INTBC= 1
##$INTSCL= 9.790993e-09
##$ISEN= 30
##$LB= 1.5
##$LEV0= 0
##$LPBIN= 0
##$MAXI= 10000
##$MC2= 0
##$MEAN= 0
##$ME_mod= 0
##$MI= 50
##$NCOEF= 0
##$NC_proc= -10
##$NLEV= 6
##$NOISF1= 182.463
##$NOISF2= 159.3651
##$NSP= 0
##$NTH_PI= 0
##$NZP= 0
##$OFFSET= 198.0616
##$PC= 4
##$PHC0= 1739.392
##$PHC1= 163.0858
##$PH_mod= 1
##$PKNL= yes
##$PPARMOD= 0
##$PSCAL= 0
##$PSIGN= 0
##$REVERSE= no
##$SF= 81.0140089999434
##$SI= 65536
##$SIGF1= 159.3651
##$SIGF2= -187.1042
##$SINO= 113.3802
##$SIOLD= 16384
##$SREGLST= <1H.CDCl3>
##$SSB= 0
##$STSI= 65536
##$STSR= 0
##$SW_p= 32467.5324675325
##$SYMM= 0
##$S_DEV= 0
##$TDeff= 32768
##$TDoff= 0
##$TI= <>
##$TILT= no
##$TM1= 0
##$TM2= 0
##$TOPLEV= 0
##$USERP1= <user>
##$USERP2= <user>
##$USERP3= <user>
##$USERP4= <user>
##$USERP5= <user>
##$WDW= 1
##$XDIM= 65536
##$YMAX_p= 277944689
##$YMIN_p= -233345192
$$ End of Bruker specific parameters
$$ ---------------------------------
##NTUPLES= NMR SPECTRUM
##VAR_NAME=  FREQUENCY,     SPECTRUM/REAL,   SPECTRUM/IMAG
##SYMBOL=    X,             R,               I
##VAR_TYPE=  INDEPENDENT,   DEPENDENT,       DEPENDENT
##VAR_FORM=  AFFN,          ASDF,            ASDF
##VAR_DIM=   65536,         65536,           65536
##UNITS=     HZ,            ARBITRARY UNITS, ARBITRARY UNITS
##FACTOR=    0.49542278885378, 1,            1
##FIRST=     16045.7642231865, 0,            0
##LAST=      -16421.768244346, 0,            0
##MIN=       -16421.768244346, -233345192,   0
##MAX=       16045.7642231865, 277944689,    0
$$ Real data points
##PAGE= N=1
##DATA TABLE= (X++(R..R)), XYDATA
$$ [...]
6592D894608L733639k71848n351406o35427R433354J0367599N36349o672884m314240
6583A1719744q72460m130204r037539q058920l534363j989551l073528k029619
6575b1006440J001543J464155j532129l648654k091841M35068L64742n96548K678805
6566b2931299R977792J2432937K830909j1838242j5448796l178416J0275796Q840649
6558i038670m256316j1922120n795425N516642R887250N078632k335610n053988
6550a7919605o58154O356014Q011776K132842l568200j554316M314027M696819
6542A811203n44617k685205J393382M879855K762018j420833l519934m876788
6534b200919o499711n051194K76115L648594J176003j754614K079065J0549392
$$ plain form
6592 4894608 8628247 8356399 3004993 2369566 11802920 22170519 22706868 16033984 11719744
6583 11719744 10847284 6717080 -2320459 -10379379 -13913742 -15903293 -18976821 -21006440
6575 -21006440 -20004897 -18540742 -20072871 -23721525 -25813366 -25378298 -25013556 -25610104 -22931299
6566 -22931299 -12953507 -520570 2310339 -9527903 -24976699 -28155115 -17879319 -9038670
6558 -9038670 -13294986 -25217106 -31012531 -25495889 -15608639 -10530007 -12865617 -17919605
6550 -17919605 -18577759 -12221745 -4209969 -2077127 -5645327 -7199643 -2885616 1811203
6542 1811203 1266586 -1418619 -25237 4854618 7616636 6195803 2675869 -2200919
6534 -2200919 -8700630 -13751824 -13475709 -9827115 -8651112 -10405726 -8326661 2222731
6526B222731J4207818P719251m756727j4192664j4196984n888935K746972M346108
6518g792430j72096m040911m180895l326053k594506J009471P221645R683876
6510d191899M981108j132992j655664K089475M053203K758834J379662J258725
6502I540452Q32870l95076j192904j008337r7950J286850J771776m81750l889864
6493F366067l828843L24502K759339k97664l920620j437075N322883Q565609N223829
6484A9078027n37252m212724n082540m173425k840880k911268m205106l030322
6476g915490K493241P125984M179393l974929p374790j707357N796621O422499
6468E045172R81490l184765k632482k55132J214361K815095N334559N951130K184153
$$ plain form
6526 2222731 16430549 24149800 19393073 5200409 -8996575 -14885510 -12138538 -7792430
6518 -7792430 -7964526 -12005437 -16186332 -19512385 -22106891 -21097420 -13875775 -4191899
6510 -4191899 789209 -343783 -1999447 90028 4143231 6902065 8281727 9540452
6502 9540452 10373322 9978246 8785342 7777005 7679055 8965905 10737681 10255931 6366067
6493 6366067 2537224 2861726 5621065 5323401 1402781 -34294 5288589 13854198 19078027
6484 19078027 18540775 14328051 9245511 5072086 2231206 -680062 -4885168 -7915490
6476 -7915490 -5422249 1703735 5883128 1908199 -5466591 -7173948 -1377327 5045172
6468 5045172 6026662 2841897 209415 -45717 1168644 3983739 9318298 15269428 17453581
6459A7453581k989846m201309j731915j951377p820581j3285266j1144444l332310
6451b9003467K056212K230659J861382L929495N254897L089790J02202m67751
6443a0946581J94820j51248m82493P90428K155554J563522j12399j220239k208342
6434a0416978l623927m064220k690345q92870O71416L191927N881961N569939
6426f373097K638650K038332M916831N270834q3641m410946q87206N749062N958415
6417A4817234J60655k879351p94796n71928n630096r306449n127351L117075O461288
6408B46281K208415l912639n401455j807218K067547K487229J177647K198349
6400g35844N433157O811489N253396M081459L577406j252085j1032048j6863172
$$ plain form
6459 17453581 14463735 10262426 8530511 6579134 -1241447 -14526713 -25671157 -29003467
6451 -29003467 -26947255 -24716596 -22855214 -18925719 -13670822 -10581032 -10478830 -10946581
6443 -10946581 -10751761 -10903009 -11385502 -10595074 -8439520 -6875998 -6988397 -8208636 -10416978
6434 -10416978 -14040905 -18105125 -20795470 -21688340 -21016924 -17824997 -11943036 -6373097
6426 -6373097 -3734447 -1696115 3220716 8491550 8407909 3996963 3109757 8858819 14817234
6417 14817234 14977889 12098538 11303742 10731814 5101718 -4204731 -9332082 -6215007 246281
6408 246281 2454696 -1457943 -6859398 -8666616 -6599069 -4111840 -2934193 -735844
6400 -735844 4697313 11508802 16762198 20843657 24421063 23168978 12136930 -4726242
6392d726242j1839920k303811Q55787k072631k154969K889552O635184O272326
6384f444724O053715P326655N447453o69484n065458m213323j943543j433384
6376i42093L5532M309608P409547N879217K286453M08101K57772J145633L888958
6367B4678728O658937M738655j845262o439764n257837k539738k394170k453572
6359A5145977m62033J63420k408908k663363L080665P889932L573039n858990
6351A8459739r639909n967928k527317l186626m175137l302813l216929m004660
6343a7561580j554341L881569N507171L46427m985533l740125J128579K149199
6335a4828634j443614l715315j488702K029154L362896L630344N136047O214590
$$ plain form
6392 -4726242 -16566162 -18869973 -18014186 -20086817 -22241786 -19352234 -12717050 -6444724
6384 -6444724 -391009 6935646 12383099 11713615 6648157 2434834 491291 -942093
6376 -942093 -906561 3403047 10812594 16691811 18978264 19386365 19644137 20789770 24678728
6367 24678728 31337665 36076320 34231058 27791294 22533457 19993719 17599549 15145977
6359 15145977 14683944 14847364 12438456 9775093 12855758 20745690 24318729 18459739
6351 18459739 8819830 2851902 324585 -2862041 -7037178 -10339991 -13556920 -17561580
6343 -17561580 -19115921 -15234352 -9727181 -9380754 -14366287 -18106412 -16977833 -14828634
6335 -14828634 -16272248 -19987563 -21476265 -19447111 -16084215 -12453871 -7317824 -1103234
6327a103234K908912m592641j0127620p858758P65622Q318412R489497N988948
6319C789138L045407L040004L840106K201349k414394o897706p035717j866608
6311b298421M615791P454201N992337L145253K03001m090305q998364j0604602
6303d581109p056189j512850K343468M555011O319920O554206M141964Q61789
6295A1626210j198529k782168m818453n089013j358831L864240N549434K303656
6287H096546k674581n864103o055780l891006j267859j68914k43449R01602L722342
6278g445202N720236N743688N371540M086843j459182r707619j1995211m234645
6270a3919552M832136M997278n28695j215304L391941M069049j322849m183204
$$ plain form
6327 -1103234 1805678 -2786963 -12914583 -20773341 -20007719 -11689307 -2199810 3789138
6319 3789138 6834545 9874549 13714655 15916004 13501610 6603904 -431813 -2298421
6311 -2298421 2317370 9771571 15763908 18909161 19112162 15021857 6023493 -4581109
6303 -4581109 -11637298 -13150148 -10806680 -6251669 68251 6622457 10764421 11626210
6295 11626210 10427681 7645513 2827060 -2261953 -3620784 243456 5792890 8096546
6287 8096546 5421965 -442138 -6497918 -10388924 -11656783 -11825697 -12069146 -11167544 -7445202
6278 -7445202 -1724966 4018722 9390262 13477105 12017923 2310304 -9684907 -13919552
6270 -13919552 -9087416 -4090138 -4618833 -5834137 -2442196 1626853 304004 -3879200
6262c879200m24034K812697L63790k101441Q15989L787867j92862p569072r865919
6253a6252185o149119j373173K887560P219839Q205281L382732o54445M123032
6245A389522J2919147J2976524L193325l373899J1360L020120m821808j6639142
6237H675149j8005168p949691J176436K230544N98107K310607M762703L167412
6229c033901o83414j342300K115434N086148L215509l015830q304704o668147
6221a2631205J966915R231176O375561m110120r791487l628652P036060J0762511
6213E210759O380861J228906j157783l807399p880589r431864o237213j690510
6205a7384832N37508R49113J083827L89493j158806j217742J251565L611911L512920
$$ plain form
6262 -3879200 -4303234 -1490537 -1126747 -3228188 -2412199 1375668 1182806 -6386266 -16252185
6253 -16252185 -22401304 -23774477 -20886917 -13667078 -5461797 -2079065 -2733510 1389522
6245 1389522 14308669 27285193 30478518 27104619 27115979 30136099 25314291 8675149
6237 8675149 -9330019 -17279710 -16103274 -13872730 -13274623 -10964016 -6201313 -3033901
6229 -3033901 -3717315 -5059615 -2944181 2141967 5357476 2341646 -5963058 -12631205
6221 -12631205 -10664290 -1433114 4942447 832327 -8959160 -12587812 -5551752 5210759
6213 5210759 11591620 12820526 11662743 7855344 -25245 -9457109 -15694322 -17384832
6205 -17384832 -16847324 -15898211 -14814384 -14424891 -15583697 -16801439 -15549874 -11937963 -8425043
6196h425043K438751K880906M665002O412881P967277Q953823P470716K716016
6188C5080329l035598o800398p179247l777951J986502M865151L1711q510164
6180A2660335j0028506j417083O956370N315085j838538l712196L21977J968220
6172A0225664j224264l076980p54807O82382j963301m390784k505972J231939
6164a776123L078216L846582N533905O858314N914525L393958J68709m319559
6156B2698527q457370p762053j483901M025116K763345k966292n939384k997556
6148a19568K865571P172950P093642J650780p420075j5416943j7740950j3273336
6140c5187929m368720M738810R337789P404685K715462J452382M234149N412176
$$ plain form
6196 -8425043 -5986292 -3105386 1559616 7972497 15939774 24893597 32364313 35080329
6188 35080329 32044731 25244333 18065086 14287135 16273637 21138788 21170499 12660335
6180 12660335 2631829 1214746 8171116 13486201 11647663 7935467 8257444 10225664
6172 10225664 9001400 5924420 5169613 5851995 3888694 -502090 -3008062 -1776123
6164 -1776123 1302093 5148675 10682580 17540894 23455419 26849377 27018086 22698527
6156 22698527 14241157 6479104 4995203 9020319 11783664 8817372 2877988 -119568
6148 -119568 2746003 9918953 17012595 18663375 11243300 -4173643 -21914593 -35187929
6140 -35187929 -39556649 -34817839 -25480050 -18075365 -15359903 -13907521 -9673372 -4261196
6132d261196K046599j416087o19781J757928J331243m20948p0885J52196l687187
6123e188118p975084n032514L922101P967227J388099p882817r061111k155101
6115b4017318M403729N824876M699396M343495M023932J536345k929839o550208
6107h665592n913719K22195Q271854J1006179M621603n506570r619702m792107
6099a0375859K217430M566833L412905L237725L312126l13748o080938p015189
6091g038715o79797O628339P973973L545320k097192o048161p356253n661953
6083a0734439l066587l215049m989286k182503O051404J0734029O066935N12567
6075h22929M597747J2503660R288140m982287j3518295q008855m21871k724200
$$ plain form
6132 -4261196 -2214597 -3630684 -4250465 -2492537 -1161294 -1582242 -1653127 -1500931 -5188118
6123 -5188118 -13163202 -18195716 -14273615 -6306388 -4918289 -12801106 -21862217 -24017318
6115 -24017318 -19613589 -13788713 -9089317 -4745822 -721890 814455 -2115384 -8665592
6107 -8665592 -14579311 -14357116 -6085262 4920917 9542520 4035950 -5583752 -10375859
6099 -10375859 -8158429 -3591596 -178691 3059034 6371160 6057412 -23526 -7038715
6091 -7038715 -7718512 -1090173 6883800 10429120 8331928 2283767 -5072486 -10734439
6083 -10734439 -13801026 -17016075 -22005361 -24187864 -18136460 -7402431 -1335496 -822929
6075 -822929 3774818 16278478 25566618 20584331 7066036 -942819 -1364690 -4088890
6067d088890q511461n652514L220814N983527M89471m282580l512336j076416
6059a7430385J39777J761059L323694J441742l117837n176435l105222l79809
6051b2543416J278754L504929N582447M212965J1059k445580k048716k025466
6043a4473024k685051p59893K706423J994685l149725n165146l02508N161618
6035a6672621N163763K803408K886968K428780l318348j0150469r177251J66611
6027b5869159R138104J1103027P511058K862718k64056r45754J9788n93600m372937
6018a410811o688524j764339P142083R061410m66930j2002781j3363379m425706
6010b3918977M196918N199788J924959J489502N249369Q391088O573572M63205
$$ plain form
6067 -4088890 -12600351 -18252865 -15032051 -9048524 -8559053 -12841633 -16353969 -17430385
6059 -17430385 -17290608 -15529549 -12205855 -10764113 -13881950 -19058385 -22163607 -22543416
6051 -22543416 -21264662 -17759733 -12177286 -7964321 -7953262 -10398842 -12447558 -14473024
6043 -14473024 -17158075 -17917968 -15211545 -13216860 -16366585 -21531731 -21834239 -16672621
6035 -16672621 -11508858 -8705450 -5818482 -3389702 -6708050 -16858519 -26035770 -25869159
6027 -25869159 -16731055 -5628028 1883030 4745748 4481692 3535938 3555726 2962126 -1410811
6018 -1410811 -8099335 -9863674 -2721591 6339819 5872889 -6129892 -19493271 -23918977
6010 -23918977 -19722059 -14522271 -12597312 -11107810 -5858441 2532647 9106219 9569424
6002I569424n585006p577928m829616k90184J836244k10239m001524n340659k541932
5993a8971420K079719M750490L661288L49093j326530J727968Q062333J1544405
5985A1877346P493450j033494o007265l948451O92840K538871J399772n45303
5977A2467766k791236m230614j692353M241214O395745L32524p328652p540735
5969a46341k543180j624829n206927m457108K586202O605356K365703k985036
5961e406160k841349j686329m823352p202991k500617M434639N491784L632886
5953a0901489O995008J2917464J1346572K480904k754221o09637O03756l541095
5945A6537262n955012j956484J159699l296472q912294o210915J553292L232029
$$ plain form
6002 9569424 3984418 -3593510 -8423126 -8713310 -6877066 -7087305 -11088829 -16429488 -18971420
5993 -18971420 -16891701 -12141211 -8479923 -8130830 -9457360 -7729392 332941 11877346
5985 11877346 19370796 18337302 12330037 8381586 9074426 11613297 13013069 12467766
5977 12467766 9676530 5445916 3753563 7994777 14390522 14723046 7394394 -146341
5969 -146341 -2689521 -4314350 -9521277 -13978385 -11392183 -4786827 -2421124 -5406160
5961 -5406160 -8247509 -9933838 -14757190 -21960181 -24460798 -20026159 -14534375 -10901489
5953 -10901489 -3906481 9010983 20357555 22838459 20084238 19474601 20078357 16537262
5945 16537262 10582250 8625766 9785465 6488993 -2423301 -8634216 -7080924 -3848895
5937c848895l286809q986137p332206j439741K647215K986530J169482j1385K268627
5928a5833319P671128J0809979P079226J4298k301187J606848M619691J573224
5920A5239888l647487m349853l5253M380235N406246L555780J020550q5613J500170
5911B2984663M363601M441577l65357o448943q340351n926365m437115o594050
5903c22340q350297m835428K010211N385165K481988k377940m226969l444631
5895a3680241k948528k396760P57309N537522P278825M018206o54823k777124
5887d865614k861726l308406l733916k014894J628362M668725N555629M404777
5879e27063J312497l250190o874266o830167l370627N75945K771184L060212K369462
$$ plain form
5937 -3848895 -7135704 -16121841 -23454047 -24893788 -22246573 -19260043 -18090561 -18101946 -15833319
5928 -15833319 -8162191 2647788 9727014 9741312 7440125 9046973 13666664 15239888
5920 15239888 11592401 7242548 7207295 11587530 16993776 20549556 21570106 21484493 22984663
5911 22984663 27348264 31789841 31424484 24975541 16635190 10708825 6271710 -322340
5903 -322340 -8672637 -13508065 -11497854 -6112689 -3630701 -6008641 -10235610 -13680241
5895 -13680241 -16628769 -19025529 -18268220 -12730698 -5451873 -1433667 -2088490 -4865614
5887 -4865614 -7727340 -11035746 -14769662 -16784556 -15156194 -10487469 -4931840 -527063
5879 -527063 785434 -2464756 -9339022 -16169189 -19539816 -18963871 -16192687 -13132475 -10763013
5870a0763013K269340L982335N397401J612626p482912j2981602o860160N233141
5862a9592844R371815K370986l869714m21207O167469O261298K908881M569315
5854G765999Q426091M378120o402495j0962762m650726J373686k033122q193400
5846a0298609o722724k48885J326305k593625l602203J238557N568661M534886
5838a0797637Q15808j475817j830264o98938J972613L897484J809694k726310
5830i033367m388526k342825j218692k084369J46643O678935R910731M702109
5822B370639j897971k77129O845940Q354911J423275n269402n231307j984728
5814D334228r14877j377614r37812r11147k595756k808901J369568O606795P226135
$$ plain form
5870 -10763013 -8493673 -4511338 886063 2498689 -4984223 -17965825 -24825985 -19592844
5862 -19592844 -10221029 -7850043 -11719757 -12140964 -5973495 287803 3196684 7765999
5854 7765999 16192090 20570210 14167715 3204953 -1445773 -72087 -2105209 -10298609
5846 -10298609 -17021333 -17270218 -15943913 -18537538 -22139741 -20901184 -15332523 -10797637
5838 -10797637 -9981829 -11457646 -13287910 -13986848 -12014235 -8116751 -6307057 -9033367
5830 -9033367 -13421893 -15764718 -16983410 -19067779 -18921136 -12242201 -2331470 2370639
5822 2370639 472668 195539 7041479 15396390 16819665 11550263 6318956 4334228
5814 4334228 3419351 2041737 1103925 192778 -2402978 -5211879 -3842311 2764484 9990619
5805I990619L076045r77796j816050k58519J929205K986295L70093o392553j2462988
5796c555649j1691021m237761L377859O012594M256891J328568k08949J569609
5788c147859O515723R907831O323130k012065n732306l53740O831523O237043
5780B4569280j439472p491855p435595m750595l275233k271959l84138P69227
5772a710340l20057j787691j019872J525986L456247M018838M450111N311995
5764A3925217N074370J708695m454558r570194r061560k771169L563070L870081
5756B283952j572130o856765p471711m450122j586509q27214j031617J84134L678082
5747a7649900P089250O932401L561781J740766L666500M400483r60514p957948
$$ plain form
5805 9990619 13066664 12088868 10272818 10014299 11943504 14929799 15299892 8907339 -3555649
5796 -3555649 -15246670 -19484431 -16106572 -10093978 -5837087 -4508519 -4717468 -3147859
5788 -3147859 3367864 13275695 19598825 17586760 11854454 11500714 18332237 24569280
5780 24569280 23129808 15637953 8202358 3451763 176530 -2095429 -2479567 -1710340
5772 -1710340 -2030397 -3818088 -4837960 -3311974 144273 4163111 8613222 13925217
5764 13925217 18999587 20708282 16253724 6683530 -2378030 -5149199 -1586129 2283952
5756 2283952 711822 -6144943 -13616654 -18066776 -19653285 -20480499 -21512116 -21327982 -17649900
5747 -17649900 -10560650 -3628249 -66468 1674298 5340798 9741281 8780767 822819
5739H22819p607723j90903L882948p37494o119625k723679O921119J2272593Q414672
5730A4934727j95385o770761p781717l887397L0517j833111q534427j1038283
5722b5075837l435706P860032J2067856Q062558L404970J866850L74004k285945
5714B838782k579886M10987K471134J571702J050519K717344K962451q87750n650440
5705D904843p284286o352060n208622l850423j795854l64401o136J218280L793664
5696a4944995M922289L127418R87152O40746M77094q63712j409169k16959n67380
5687g847516m398766p079406k843649O503243J2787529J0529284J981767n610245
5679D022241n985026O52219O668161M706559k547899n200343m48433K881076j780257
$$ plain form
5739 822819 -6784904 -6975807 -3092859 -3830353 -9949978 -12673657 -5752538 6520055 14934727
5730 14934727 14739342 7968581 186864 -3700533 -3670016 -5503127 -14037554 -25075837
5722 -25075837 -28511543 -20651511 -8583655 -521097 2883873 4750723 5124727 2838782
5714 2838782 258896 669883 3141017 4712719 5763238 8480582 11443033 10555283 4904843
5705 4904843 -2379443 -8731503 -13940125 -17790548 -19586402 -19950803 -19956939 -18738659 -14944995
5696 -14944995 -10022706 -6895288 -5908136 -5267390 -4790296 -5654008 -7063177 -7280136 -7847516
5687 -7847516 -12246282 -19325688 -22169337 -15666094 -2878565 7650719 9632486 4022241
5679 4022241 -1962785 -1310566 5357595 10064154 7516255 2315912 1867479 4748555 2968298
5670B968298p927796o328729J16997J460586l186683n155871n97786M869490O634886
5661g146608O730643O767924L959297j955839n024818j216443M910326O388737
5653A3413219K900344p07343k058801k959352m745340n705896l718089K18591
5645c362667K240589J76176k568662l82212O107046Q800939K571268p035453j1370952
5636d823928r960919p564565l870202M370409J2746722J2105939L458983j241039
5628E221400L131160P179275K802361l665443k574019L180977L679161k192979
5620A6761893o846237o563990m155824j225067K608214L896681j498064r035393
5612f057787q552738J337605J0075586R070538J483891m887879p190174n780425
$$ plain form
5670 2968298 -4959498 -11288227 -11171230 -9710644 -12897327 -18053198 -18650984 -13781494 -7146608
5661 -7146608 -415965 6351959 10311256 8355417 3330599 2114156 7024482 13413219
5653 13413219 16313563 15606220 13547419 10588067 5842727 136831 -3581258 -3362667
5645 -3362667 -1122078 -945902 -3514564 -3896776 2210270 11011209 13582477 6547024 -4823928
5636 -4823928 -14784847 -22349412 -26219614 -21849205 -9102483 3003456 6462439 5221400
5628 5221400 8352560 15531835 18334196 14668753 12094734 15275711 18954872 16761893
5620 16761893 9915656 3351666 -804158 -2029225 578989 4475670 2977606 -6057787
5612 -6057787 -14610525 -13272920 -3197334 5873204 7357095 2469216 -4720958 -10501383
5604a0501383L8739Q242557J1119328L623117p574955j0466734k832895N270848
5596c081378N186826k9063k008656P49160K262232q95503m408519k693340L231871
5587a686370P399980O362995J718374l564536p473548p982909m308830j81282
5579i716126j250107o915034r171559l084075N728773Q812101O439644N139898
5571d016485O034811L568534l788891r420445q042011l034218l30145j5457J205837
5562a7838470K989816K314424n22349j989983o90188J558576L443779M964477
5554e769918M896628J743266k451942l564839j734558j857558n621866p380963
5546b1741750j859184P024349J0011438M189479l982990p627617o694065m520918
$$ plain form
5604 -10501383 -10462644 -2220087 8899241 12522358 4947403 -5519331 -8352226 -3081378
5596 -3081378 2105448 2076385 67729 816889 3079121 2183618 -2224901 -4918241 -1686370
5587 -1686370 5713610 12076605 13794979 10230443 2756895 -5226014 -9534844 -9716126
5579 -9716126 -10966233 -17881267 -27052826 -30136901 -24408128 -15596027 -9156383 -4016485
5571 -4016485 2018326 5586860 1797969 -7622476 -15664487 -18698705 -19028850 -19044307 -17838470
5562 -17838470 -14848654 -12534230 -13056579 -15046562 -15736750 -14178174 -10734395 -5769918
5554 -5769918 -873290 869976 -1581966 -5146805 -6881363 -8738921 -14360787 -21741750
5546 -21741750 -23600934 -16576585 -6565147 -2375668 -6358658 -13986275 -20680340 -25201258
5538b5201258j640584L061253P495704P467020K665895k100533k679924M6870
5530a0885557K566325K949888J134572k526416o403165o942998k291490L678612
5522a8720229M444458q72572n322925k732975L682944N128319q41347o735193
5514b1969520n376017L48722K252074r84157k326426K501514Q452515Q856346
5506h244949N031877L377360N630211P434252N556542J304157l285370p621087
5498I182993r935472p259187j70144O042816P134811L977995m43200m361844n734750
5489a565982k044320M777373P209523R44285p700354q627523r97153O090740N788944
5480C875533P34843l173007m748955n989108o527504m264318q7009K358567K007987
$$ plain form
5538 -25201258 -26841842 -23780589 -16284885 -8817865 -6151970 -8252503 -10932427 -10885557
5530 -10885557 -8319232 -5369344 -4234772 -6761188 -13164353 -20107351 -22398841 -18720229
5522 -18720229 -14275771 -15148343 -20471268 -23204243 -19521299 -14392980 -15234327 -21969520
5514 -21969520 -27345537 -26996815 -24744741 -25728898 -28055324 -25553810 -17101295 -8244949
5506 -8244949 -3213072 164288 5794499 13228751 18785293 20089450 16804080 9182993
5498 9182993 -752479 -8011666 -8181810 -2138994 4995817 8973812 8530612 4168768 -1565982
5489 -1565982 -3610302 1167071 8376594 9320879 1620525 -7006998 -8004151 -1913411 3875533
5480 3875533 4610376 1437369 -3311586 -9300694 -15828198 -20092516 -20179525 -17820958 -15812971
5471a5812971K059788M686631O592557K924509m932039q946644l688459O154108
5463a0962520J0419607N084306l617159p001960l166264K665160M646129J395035
5455e37666l918129o747973n043618j034106J227031K80987j683197j996388j96296
5446a9649355K252635L079739N63051l721401m325927K068027J0394880J1928821
5438B590470N941547Q32341J735010L648018Q18555l686136m001827j635703j744485
5429D497790k851821Q27333Q026412J0157981L455115n847338j0306142r266402
5421a307072o170407l324792j760878j966694k502566j142599J504438K862948
5413a3807622K998568L997377M728986J874748k821023k676584L932311R618095
$$ plain form
5471 -15812971 -13753183 -9066552 -2473995 450514 -4481525 -13428169 -17116628 -10962520
5463 -10962520 -542913 4541393 924234 -6077726 -9243990 -6578830 -1932701 -537666
5455 -537666 -4455795 -11203768 -16247386 -17281492 -16054461 -15773474 -17456671 -19453059 -19649355
5446 -19649355 -17396720 -14316981 -13753930 -17475331 -21801258 -19733231 -9338351 2590470
5438 2590470 8532017 9364358 11099368 14747386 15565941 11879805 7877978 6242275 4497790
5429 4497790 1645969 2473302 10499714 20657695 24112810 18265472 7959330 -1307072
5421 -1307072 -7477479 -10802271 -12563149 -14529843 -17032409 -18175008 -16670570 -13807622
5413 -13807622 -10809054 -6811677 -2082691 -207943 -3028966 -5705550 -1773239 7844856
5405G844856P887737K044605m75483J127414J200339l299896q692088r485867
5397a848383m649933J313895K827930n40973k865885Q18574O913718P269164P95964
5388A0034071m522533k843332K211448M570560M315592M443800L667791j378363
5380B0499034r032141j3269004j0748956l428785M612642R576919Q881682L528959
5372A0620350j478592k273009n50268j93910j378915j397257K66356J344069L57358
5363E316182k214382n257841o875750m529703J636847P073953P422283L529081
5355F100670n86119k670869k380764O62239N005759O069776J403003m522414n477427
5346C603854j884215Q99777J240157K310683M872985N120701J086335l760174
$$ plain form
5405 7844856 15732593 17777198 17301715 18429129 19629468 16329572 7637484 -1848383
5397 -1848383 -6498316 -5184421 -2356491 -2897464 -5763349 -4944775 1968943 9238107 10034071
5388 10034071 5511538 2668206 4879654 9450214 13765806 18209606 21877397 20499034
5380 20499034 11466893 -1802111 -12551067 -15979852 -11367210 -1790291 7091391 10620350
5372 10620350 9141758 6868749 6318481 6124571 4745656 3348399 3614755 4958824 5316182
5363 5316182 3101800 -2156041 -9031791 -13561494 -11924647 -4850694 2571589 6100670
5355 6100670 5514551 2843682 462918 1125157 6130916 12200692 13603695 9081281 3603854
5346 3603854 1719639 2619416 3859573 6170256 11043241 16163942 17250277 13490103
5338A3490103n262631l356674o58051O61629m76431l680642o365811n725530k010871
5329a3384909J936408M005564L754447J441193j133329o18653L439310N993610
5321E433641K694220l154513n074771l137895k676976m147573k100919M543701
5313g621085Q997411O521291J335663l39167J203697J869736O11188q68945k038472
5304I671317l164253l385872k279485j241008j149083j105678q73474j069482
5296d597018K86148O348915J4094729J4274240L494169q471518r610176r13158
5288A4906331N662986K964805l953739o523676l312086K95076J22541j835752
5280H326486p40716L724795N509541m6082q473354j0906650o165382k008318l034688
$$ plain form
5338 13490103 8227472 4870798 4212747 4874376 4397945 717303 -5648508 -11374038 -13384909
5329 -13384909 -11448501 -7442937 -3688490 -2247297 -3380626 -3999279 -559969 5433641
5321 5433641 8127861 4973348 -101423 -3239318 -5916294 -10063867 -12164786 -7621085
5313 -7621085 1376326 7897617 9233280 8894113 10097810 11967546 12578734 11709789 9671317
5304 9671317 6507064 3121192 841707 -399301 -1548384 -2654062 -3527536 -4597018
5296 -4597018 -4310870 2038045 16132774 30407014 33901183 25429665 15819489 14906331
5288 14906331 20569317 23534122 19580383 13056707 9744621 10039697 10162238 8326486
5280 8326486 7585770 11310565 16820106 16774024 8300670 -2605980 -8771362 -10779680 -13814368
5271a3814368m346812p32588M743523O747772O329123O963342O898120K933732
5263A5721844j995048l005965k153437m726535q629622o461195K122714Q733403
5255c93841P869692K718367j605414l430601k229716J717003M153205O80139n129875
5246D348959n442527j169392j617506q327070j0177137n33049J1041542J2799765
5238I23585P783977O153714P473946L557315m663953p104910j816209P64584n347950
5229G724099j1730230q734140m6349L840097J026994j431101K72481K463366J848450
5220d766333M88265J008033K157381J924593J232164J433017J086735j185260
5212C378595k767996k39174M411508N299163P84081m220922n213588k986758J79860
$$ plain form
5271 -13814368 -18161180 -18893768 -14150245 -7402473 -1073350 5889992 12788112 15721844
5263 15721844 13726796 10720831 8567394 3840859 -4788763 -11249958 -9127244 -393841
5255 -393841 7475851 10194218 8588804 5158203 2928487 4645490 8798695 9478834 4348959
5246 4348959 -1093568 -2262960 -3880466 -12207536 -22384673 -22917722 -11876180 923585
5238 923585 8707562 14861276 22335222 25892537 21228584 14123674 12307465 13072049 7724099
5229 7724099 -4006131 -12740271 -12786620 -8946523 -7919529 -9350630 -9078149 -6614783 -4766333
5220 -4766333 -4278068 -3270035 -1112654 811939 2044103 3477120 4563855 3378595
5212 3378595 610599 371425 4782933 10082096 10866177 6645255 1431667 -1555091 -1375231
5203a375231M060742O857834L512788o452282j3590458q748244L387971R052657
5195c294223L163194n861816r284852p010780j724570N945316J2265208J0079672
5187D277149J21723n732571k64709P400686M800126n669332j1812213r695384
5179a6574525n205646j248727L985166P523530L603191l862802l476606O175859
5171i080560J3067509R638286K638707j04713j250065m924028o711112k256306
5163A017718K438478q5973n670835n169737K75392J666570k611254m874078j177668
5154a4191387L364962L497463L04874k626761l350969j139546K592999L202384
5146h345981j574973n799296j901507P452608J1698299O962428L43397j750143
$$ plain form
5203 -1375231 2685511 9543345 13056133 6603851 -6986607 -15734851 -12346880 -3294223
5195 -3294223 -131029 -5992845 -15277697 -22288477 -24013047 -18067731 -5802523 4277149
5187 4277149 4398872 -1333699 -1598408 5802278 10602404 4933072 -6879141 -16574525
5179 -16574525 -21780171 -23028898 -19043732 -11520202 -7917011 -11779813 -15256419 -9080560
5171 -9080560 3986949 13625235 16263942 16159229 14909164 9985136 3274024 1017718
5163 1017718 3456196 3370223 -2300612 -7470349 -7194957 -5528387 -8139641 -13013719 -14191387
5154 -14191387 -10826425 -7328962 -7024088 -9650849 -13001818 -14141364 -11548365 -8345981
5146 -8345981 -9920954 -15720250 -17621757 -10169149 1529150 8491578 8834975 7084832
5138G084832j283930j823009j906748N02149L217229L916758L900829L950517
5130A7558627J636095l234755n582470j930469M134477P484116P767491O099463
5122C3932575R85762o873777j0972374p162997j286792j042896l762220j213873
5114B603408N428212N770720l465332j1970519r804510n27134M897253K242325
5106d825577l565453p001717p123811n067288j329319L135324N833969M738348
5098a5205524J037619j214722Q22755N033769O321653L475744J818738N921383
5090H011415J1376164R049074j766189j0180261p212119K050996N304765n75693
5082A6058152o879373o631996l072864j379033P05862O743954J0766383K931749
$$ plain form
5138 7084832 5800902 3977893 2071145 2573294 5790523 9707281 13608110 17558627
5130 17558627 19194722 15959967 10377497 8447028 12581505 20065621 27833112 33932575
5122 33932575 34918337 28044560 17072186 9909189 8622397 7579501 3817281 2603408
5114 2603408 8031620 13802340 10337008 -1633511 -11438021 -11965155 -7067902 -4825577
5106 -4825577 -8391030 -15392747 -22516558 -27583846 -28913165 -25777841 -19943872 -15205524
5098 -15205524 -14167905 -15382627 -14559872 -9526103 -3204450 271294 2090032 8011415
5090 8011415 19387579 28436653 26670464 16490203 9278084 11329080 16633845 16058152
5082 16058152 9178779 2546783 -526081 -1905114 -1199252 5544702 16311085 19242834
5074A9242834j3622327k1944557j2153200M891156J1930971P123660K257398L178603
5066I04538L666563p42226m245445p86687N755202P535512L602861p03485j356210
5057A3630623J926196P338056J0968308Q485719N91327o536764r224015j0257155
5049A6922295j1712867r977134l171872K567482J439905k368820j508336K165879
5041e643468J223337m059060n857558j404051L773247N343957M486354K451246
5033C14004q98285k698204M08157M815443L621838j685063k702823J649390L133089
5024E957546r41924k397966L304090Q339565N266652j362403m161128m663208
5016I341224o819385p049878j470248L724907Q81236n126547l956055K532613
$$ plain form
5074 19242834 5620507 -16324050 -28477250 -23586094 -11655123 -4531463 -2274065 904538
5066 904538 4571101 3828875 -416570 -1203257 4551945 12087457 15690318 14986833 13630623
5057 13630623 15556819 22894875 33863183 42348902 42940229 36403465 27179450 16922295
5049 16922295 5209428 -4767706 -7939578 -5372096 -3932191 -6301011 -7809347 -5643468
5041 -5643468 -4420131 -8479191 -14336749 -15740800 -11967553 -6623596 -2137242 314004
5033 314004 -584281 -3282485 -2874328 1941115 5562953 3877890 1175067 2824457 5957546
5024 5957546 5015622 2617656 5921746 14261311 19527963 18165560 14004432 9341224
5016 9341224 2521839 -4528039 -5998287 -2273380 -1392144 -6518691 -10474746 -7942133
5008g942133K946075m400408q576975m124164R86878l2241j759479K913069J0283692
4999i705686J2217537Q733212N579333L399703j623323p954906q568074k057289
4991B0507L576605J856831k906933k256668M001359Q183601O470182L434401K996311
4982B5376196J487768n077742j1634110r816772j598230J506286n130425j1438056
4974a6325085o192191P160702J4672050R331566j778354p493936m844334P9221
4966e390361P11318k627472l994417K59721O603152Q968720O403489K619509n77122
4957A2976537m101298o131639k581103M972560Q268161K902520n259480p861916
4949C184342l542837L604579R608719J0682912L580234q636403j5979712j2429801
$$ plain form
5008 -7942133 -4996058 -9396466 -17973441 -22097605 -21110727 -21142968 -22902447 -19989378 -9705686
4999 -9705686 2511851 11245063 16824396 20224099 18600776 10645870 2077796 20507
4991 20507 3597112 5453943 2547010 290342 4291701 12475302 18945484 22379885 25376196
4982 25376196 26863964 21786222 10152112 335340 -1262890 243396 -4887029 -16325085
4974 -16325085 -22517276 -15356574 -684524 8647042 6868688 -625248 -5469582 -5390361
4966 -5390361 -4679043 -7306515 -11300932 -11041211 -4438059 4530661 10934150 13553659 12976537
4957 12976537 8875239 2743600 162497 5135057 13403218 16305738 11046258 3184342
4949 3184342 -358495 3246084 12854803 23537715 27117949 18481546 2501834 -9927967
4941i927967l570107J565642J703838J128593J420107J906745L938327P801513
4933E966691R018860M229027k808702o971981q979597j0682378q983504k232147
4925b1443731L188648J767443j163451J652172O056794L551392l246443n095131
4917a4732307k136823j507070k027969L324432J1031568R596034l36854m582201
4909a371190K698472J0813920J0380004N064163Q16065k881441n791198m049445
4901A5679350L22233k26852m519540k630798N388546O549468k983571r471143
4893H107693l900970L673609K592532j371927N00678M080981L035987J538605
4885A8257188L372835K197612m098833m219219O937232J5416703J1004559N387700
$$ plain form
4941 -9927967 -13498074 -11932432 -10228594 -9100001 -7679894 -5773149 -1834822 5966691
4933 5966691 14985551 19214578 16405876 9433895 454298 -10228080 -19211584 -21443731
4925 -21443731 -18255083 -16487640 -17651091 -15998919 -9942125 -6390733 -9637176 -14732307
4917 -14732307 -16869130 -18376200 -20404169 -17079737 -6048169 3547865 3211011 -1371190
4909 -1371190 1327282 12141202 22521206 27585369 28401434 25519993 19728795 15679350
4901 15679350 16001583 15774731 11255191 8624393 14012939 20562407 17578836 8107693
4893 8107693 4206723 7880332 10472864 9100937 9601615 13682596 16718583 18257188
4885 18257188 21630023 23827635 19728802 15509583 22446815 37863518 48868077 54255777
4877E4255777Q948621R520401j413760k923516K0976351L8732707P125251n6416829
4869G8805003q4824827n1049736k108988J1380971k016950o336635L125533O286517
4861d6739112L7294j259946M489033O221416K531785J541824K641190q61738n099239
4852c6497493j138526O316397M481302n354633r111336k552115M269252N497605
4844c4089547O220284Q925554Q288088K897177q03425j58566n93013m513414o202320
4835b0029182j805601M515386Q052113R100024Q062289L215625l249119m850813
4827C010722m96166K476788r05843n808336n457739q91071K150701J903421J275531
4818b741992K432968M541157N322939K546333m100222j0739619j1117868l056068
$$ plain form
4877 54255777 63204398 72724799 71311039 68387523 89363874 128096581 135221832 78805003
4869 78805003 -6019824 -57069560 -59178548 -47797577 -49814527 -56151162 -53025629 -46739112
4861 -46739112 -46701818 -47961764 -43472731 -37251315 -34719530 -33177706 -30536516 -31398254 -36497493
4852 -36497493 -37636019 -31319622 -26838320 -32192953 -41304289 -43856404 -39587152 -34089547
4844 -34089547 -27869263 -18943709 -10655621 -7758444 -8561869 -8720435 -9313448 -13826862 -20029182
4835 -20029182 -21834783 -17319397 -9267284 -167260 7895029 11110654 7861535 3010722
4827 3010722 2514556 4991344 4085501 -1722835 -7180574 -8071645 -5920944 -4017523 -2741992
4818 -2741992 -309024 4232133 9555072 12101405 8001183 -2738436 -13856304 -16912372
4810a6912372P877171J2756674P485029l124500r121342m675934N476179J0816599
4802A0577504P272309J292202j72979J186485J97709k425080k566646j190530
4794A4170974k515377n379494m437103L45431L190650K112118J448830L359042
4786A2295071M089608J225206j796441j542437K35049J97120j957552m475874
4778H269750n333258k274127M270277Q055139K739592q470385j5309078j3551713
4770b1603803q432953l926891K157097R177456R909052K228833m106048n26375
4762a5123632P500139R665065O782059O886036R421910N543449n954360j4157195
4754A0563471j0452189O88063Q736371Q755868K897283m409947r130768r116470
$$ plain form
4810 -16912372 -9035201 3721473 11206502 8082002 -1039340 -5715274 -239095 10577504
4802 10577504 17849813 19142015 18969036 20155521 20353230 17928150 15361504 14170974
4794 14170974 11655597 6276103 1839000 2184431 5375081 7487199 8936029 12295071
4786 12295071 16384679 17609885 15813444 14271007 14506056 14703176 12745624 8269750
4778 8269750 2936492 662365 4932642 12987781 15727373 7256988 -8052090 -21603803
4770 -21603803 -30036756 -33963647 -31806550 -22629094 -12720042 -10491209 -14597257 -15123632
4762 -15123632 -7623493 2041572 8823631 15709667 25131577 30675026 24720666 10563471
4754 10563471 111282 799345 9535716 18291584 21188867 16778920 7648152 -1468318
4746a468318o026291l564996k476314j67755L715261N176368J510767l994352
4738g295630n627780j732933M230498P563857N971326J011807k872706k340956
4730a092517R10721J891830j282956m918936m793969j354044J941553L488710
4722e209608M347780N245605N178324L019054r38500n131109p662844p423574
4714h574872m963771j889601Q94798L389301M674887K875170j512575m182760
4706i289423j856189K345928K120732k888946n341351q6705P729433Q884604K583172
4697D201255k683700r92784L894398N429655L070973J13002l059134p711735j0987037
4688h725107q023294o8397N386159M196753N51108L10973L482196N807810M537782
$$ plain form
4746 -1468318 -7494609 -11059605 -13535919 -13703674 -9988413 -4812045 -3301278 -7295630
4738 -7295630 -12923410 -14656343 -10425845 -2861988 3109338 4121145 1248439 -1092517
4730 -1092517 -181796 1710034 427078 -4491858 -9285827 -10639871 -8698318 -5209608
4722 -5209608 -861828 4383777 9562101 12581155 11642655 6511546 -1151298 -8574872
4714 -8574872 -13538643 -15428244 -14533446 -11144145 -6469258 -3594088 -5106663 -9289423
4706 -9289423 -11145612 -8799684 -6678952 -9567898 -14909249 -14995954 -7266521 1618083 4201255
4697 4201255 1517555 524771 4419169 9848824 12919797 13032799 9973665 2261930 -8725107
4688 -8725107 -16748401 -16816798 -11430639 -7233886 -6682778 -6371805 -2889609 2918201 7455983
4679G455983J70867m721874o333939k264119M529304P425531L943717j358918
4671H846552l851860m557990n867699o075480k856374J436701L160268L092131
4663f673751L487562K665345j122284l474074N14866O224560M401803l894277
4655B129750p259751j158247M926757K335288m140481n650544l382770l841833
4647a6041831n604579j941962N435759O613960j017399p234079k950518P652701
4639a5087948J3965178J2382834P220647K005950l600050r144882j1319305q011017
4631a1588593j526144L388433L438923j006870n897392o274374j234672M325342
4623a6375347N246607K663732J704368L048100J782703l657898o956276k782357
$$ plain form
4679 7455983 7626850 2904976 -3428963 -5693082 -1163778 6261753 10205470 8846552
4671 8846552 4994692 436702 -5430997 -11506477 -14362851 -12926150 -9765882 -6673751
4663 -6673751 -3186189 -520844 -1643128 -5117202 -4602336 1622224 6024027 2129750
4655 2129750 -5130001 -6288248 -1361491 973797 -3166684 -8817228 -12199998 -16041831
4647 -16041831 -21646410 -23588372 -18152613 -11538653 -12556052 -19790131 -22740649 -15087948
4639 -15087948 -1122770 11260064 18480711 20486661 16886611 7741729 -3577576 -11588593
4631 -11588593 -13114737 -9726304 -6287381 -7294251 -13191643 -19466017 -20700689 -16375347
4623 -16375347 -11128740 -8465008 -6760640 -3712540 -1929837 -5587735 -12544011 -15326368
4615a5326368M092969N051035O54359m02095M520353P267459J442707p729243
4607d28824j1349730q871376n818662l996046j384376J140767J049817Q12432
4599b8845998N136510J1517950J1826303M799627j213096r17461M29602l102634
4591c69197p676297n642650K613126R391388R667295M897885j018783m616622
4583G246145l562466P74834K919049l86082n134535n385210j551206J191989Q45751
4574c041731j15381J0488P33905K213046M485673M745445N92834m577604m748991
4565B97684L43049N025098N493372K664825j943328o987698q332398k489943O044157
4556A14818P996576J560055n361003o823919n227071l665795n03320M120958M811194
$$ plain form
4615 -15326368 -11233399 -6182364 -5528005 -5930100 -1409747 5857712 7300419 -428824
4607 -428824 -11778554 -20649930 -26468592 -30464638 -31849014 -30708247 -29658430 -28845998
4599 -28845998 -23709488 -12191538 -365235 4434392 3221296 2303835 2733437 -369197
4591 -369197 -8045494 -13688144 -11075018 -1683630 7983665 12881550 11862767 7246145
4583 7246145 3683679 4458513 7377562 6991480 1856945 -3528265 -5079471 -3887482 -3041731
4574 -3041731 -3157112 -3146624 -2412719 -199673 4286000 9031445 9624279 5046675 297684
4565 297684 640733 5665831 11159203 13824028 11880700 4893002 -3439396 -5929339 114818
4556 114818 8111394 9671449 4310446 -2513473 -7740544 -11406339 -11909659 -7788701 -2977507
4547b977507M2745k840547R82302M497926k23478p907460p608224l30621K874645
4538a3490219q70121k359905L474877Q859800N528587l112548q245279p522298
4530a7737106m375130l88235M741913Q336277O541090Q59243k080007J593830
4522b508125Q188565J0579077N641587l076805r337686j0279948q271858o867042
4514a5932235o322551m374047n8387N368148J0137933J2023233Q213597q73049
4506H182642q431591o980096J936657Q541464O883591J322795j332168j042445
4498I080849j787486l623599k945244J006908M711238N153675K676390o25609
4490A3647122k686062k251175k15198P23373k11514j39911K941837N990782M825685
$$ plain form
4547 -2977507 -2934762 -5775309 -4793007 -295081 -518559 -8426019 -16034243 -16364864 -13490219
4538 -13490219 -14360340 -16720245 -13245368 -4385568 1143019 -1969529 -10214808 -17737106
4530 -17737106 -22112236 -22500471 -17758558 -9422281 -2881191 -2021948 -4101955 -2508125
4522 -2508125 5680440 16259517 21901104 18824299 9486613 -793335 -9065193 -15932235
4514 -15932235 -22254786 -26628833 -26687220 -21319072 -11181139 842094 9055691 8182642
4506 8182642 -248949 -7229045 -5292388 3249076 10132667 11455462 10123294 9080849
4498 9080849 7293363 3669764 724520 1731428 6442666 11596341 14272731 13647122
4490 13647122 10961060 8709885 8494687 9218060 9006546 8866635 11808472 17799254 22624939
4481B2624939M60189k651479l347824l902297m248788j762392K776479M939855
4473A4888682L904171L884381N691828L369096n942916j4596358j3841660o596644
4465i239420k577474k980339J79724Q782274J3111807O422682l518697m930171
4457E250386J574823N587519K714010j365199k065525k096809m328775o030190
4449g59760m128493p30980O57587J87585p02156k543130m802182l776239J661511
4440a4936257N935083M061198O865J112057O178361O808913N30326n348452n031207
4431f83113k114475k180208l470679q15249M522346N416624q57737p954128p977469
4422a6114088j124400M633730L170367k599113m821829j030379L005361J904144
$$ plain form
4481 22624939 23085128 20433649 17085825 13183528 8934740 7172348 9948827 14888682
4473 14888682 18792853 22677234 28369062 31738158 25795242 11198884 -2642776 -9239420
4465 -9239420 -11816894 -14797233 -14617509 -5835235 7276572 13699254 10180557 5250386
4457 5250386 6825209 12412728 15126738 13761539 11696014 9599205 5270430 -759760
4449 -759760 -4888253 -5619233 -4961646 -4774061 -5476217 -8019347 -12821529 -16597768 -14936257
4440 -14936257 -9001174 -4939976 -4933111 -3821054 2357307 9166220 9696546 4348094 -683113
4431 -683113 -2797588 -4977796 -8448475 -9263724 -4741378 675246 -182491 -8136619 -16114088
4422 -16114088 -17238488 -12604758 -9434391 -12033504 -16855333 -17885712 -14880351 -12976207
4414a2976207j748368k008786J315515L434367K813944K485610L210520J812755
4406a660650k191805m420760k648597m96980r68934j527088N34614K729635K107839
4397h542726J114640L306753O459183N663976J089227k827545m156236m037612
4389a930340k172416K113765N122785J874245n182553o964718K57562Q911076
4381B029406R544488K278030m934297o609576m014783n92706K235123L890001
4373C825686K927674q13824l816670j669022N151493J0435598Q697537J268724
4365B6007196n468654o717327k624558L135573N547321R09275q780322j5183703
4357c175199j1855914k511787L879434N422570P850446J2394302J2044623L684503
$$ plain form
4414 -12976207 -14724575 -16733361 -15417846 -11983479 -9169535 -6683925 -3473405 -1660650
4406 -1660650 -3852455 -8273215 -10921812 -11418792 -12387726 -13914814 -13380200 -10650565 -8542726
4397 -8542726 -7428086 -4121333 2337850 8001826 9091053 6263508 2107272 -1930340
4389 -1930340 -4102756 -1988991 3133794 5008039 -174514 -7139232 -6881670 2029406
4381 2029406 11573894 13851924 8917627 2308051 -1706732 -2299438 -64315 3825686
4373 3825686 6753360 5939536 2122866 453844 5605337 16040935 24738472 26007196
4365 26007196 20538542 13821215 11196657 14332230 19879551 20788826 12008504 -3175199
4357 -3175199 -15031113 -17542900 -13663466 -8240896 -390450 12003852 24048475 27732978
4349B7732978m552143m582758l70191q16032n726410p632377m493212j586381
4341b026526j847986k555450j773879r65583n07189J246294L741989M468713L704041
4332C484424L913134M579909K958893l17879j948837j932127k970410m268820
4324C498287k344635J914877L747190K577870K637925M575471L721274j511065
4316A8817194o567064q264722q387814p419906k285208O004049R761631M746544
4308F404704k937912n113866j828486J263383J242444q85807l138308k564108
4300g557956L290478J0878509J1538671K635775p035954q357173l669911j250608
4292D71831k416037j875848J686423L670348J938119q0215J40412M25199j426872
$$ plain form
4349 27732978 23180835 18598077 18227886 17411854 11685444 4053067 -440145 -2026526
4341 -2026526 -3874512 -6429962 -8203841 -9169424 -9676613 -8430319 -4688330 -219617 3484424
4332 3484424 7397558 11977467 14936360 14618481 12669644 10737517 7767107 3498287
4324 3498287 1153652 3068529 6815719 9393589 12031514 16606985 20328259 18817194
4316 18817194 12250130 3985408 -4402406 -11822312 -14107520 -8103471 1658160 6404704
4308 6404704 3466792 -1647074 -3475560 -2212177 -969733 -1855540 -4993848 -7557956
4300 -7557956 -4267478 6611031 18149702 20785477 13749523 5392350 1722439 471831
4292 471831 -1944206 -3820054 -2133631 1536717 3474836 3394621 3535033 3960232 2533360
4283B533360l476369k615059P66181L161234K103870j086718k717250r87033J670654
4274f47130J863585K63273O68121L884688N820794K832921l738222r295955r779047
4265h126972l893595M779826Q240878J726882q592805j1295326m149006L420730
4257a7889388L819056j47342k907973m133436m382986o73545O978931J1120951
4249h215732O374515j700744m431715k106101r79191k520965l363695k612373
4241a9556001j828041o10230J203697N15835l162782l407263L584246R969465
4233a3291074O504581k254512m238010J410245M522876K077251K424655Q864438
4225F020450J2306082O324729j347482n62451N601892N904698k297152r564154
$$ plain form
4283 2533360 -943009 -3558068 -2791887 369347 2473217 1386499 -1330751 -2317784 -647130
4274 -647130 1216455 1479728 2147849 6032537 11853331 14686252 10948030 1652075 -8126972
4265 -8126972 -12020567 -7240741 1000137 2727019 -5865786 -17161112 -21310118 -17889388
4257 -17889388 -14070332 -14217674 -17125647 -21259083 -25642069 -26315614 -19336683 -8215732
4249 -8215732 -1841217 -3541961 -7973676 -10079777 -11058968 -13579933 -16943628 -19556001
4241 -19556001 -21384042 -21994272 -20790575 -20274740 -23437522 -26844785 -23260539 -13291074
4233 -13291074 -6786493 -9041005 -13279015 -11868770 -7345894 -5268643 -2843988 6020450
4225 6020450 18326532 24651261 23303779 22741328 28343220 34247918 31950766 22386612
4217B2386612p216556J832286O560333L74155j0784083j3911582l669839J0325284
4209E896610J4023904N097095n736093q612885m593694j190836k514068n990599
4201c620566o473026k060498L678017N836821M504708M023906N216559L491875
4193A4597796k423419n789044j211407O218405P482490J501368n686088r688890
4185E001211r365151l950574M170121P659444K660743m397150n199937k92623
4177c713916N358416J1115150J6203809J3695167M36112j2940645j4376881p476183
4169H301029l406828j841657M691352J2598480J1002955J274759m553212l436489
4161B4630389k443775k130649L043452R112671O641933n03282l39354M550532
$$ plain form
4217 22386612 15170056 17002342 23562675 23936830 13152747 -758835 -4428674 5896610
4209 5896610 19920514 25017609 19281516 10668631 6074937 4884101 2370033 -3620566
4201 -3620566 -10093592 -12154090 -8476073 -2639252 1865456 5889362 11105921 14597796
4193 14597796 12174377 6385333 5173926 11392331 18874821 20376189 14690101 5001211
4185 5001211 -4363940 -8314514 -4144393 3515051 6175794 1778644 -3421293 -3713916
4177 -3713916 1644500 12759650 28963459 42658626 43094738 30154093 15777212 8301029
4169 8301029 4894201 3052544 7743896 20342376 31345331 32620090 28066878 24630389
4161 24630389 22186614 20055965 23099417 32212088 38854021 38350739 38011385 42561917
4153D2561917J375510p134614o216795J899959M21807q805355n728293R506275
4145B7880411J2722963r11805n978230P501517J5272745L695489n383899K957644
4137E7756835R359335K123668M099573K4683670L1334900J1749667J3012386N7073898
4129B11193932O6750757l4904791j78811917k08440455q9132718M2345614O5372763
4122a25626815J7425197j375328J9850585K3215699k203249j2382684O577382
4115g4519213K1154298J4256957O010543P981927O483483k449214l460386N391156
4107a9150449O446231l542118n827961N739446J2563212L520714p375350o400851
4099a4027126L0430J934643J785949L135382J109310n298865p098577p71819M537146
$$ plain form
4153 42561917 43937427 36802813 30586018 32485977 32907784 24102429 18374136 27880411
4145 27880411 40603374 39691569 33713339 41214856 56487601 60183090 54799191 57756835
4137 57756835 67116170 69239838 73339411 98023081 129357981 141107648 154120034 211193932
4129 211193932 277944689 243039898 64227981 -144212474 -233345192 -190999578 -125626815
4122 -125626815 -108201618 -109576946 -89726361 -66510662 -68713911 -81096595 -74519213
4115 -74519213 -53364915 -39107958 -33097415 -25115488 -18632005 -21081219 -24541605 -19150449
4107 -19150449 -12704218 -16246336 -22074297 -16334851 -3771639 -250925 -7626275 -14027126
4099 -14027126 -13996696 -12062053 -10276104 -7140722 -6031412 -11330277 -18428854 -19200673 -14663527
4090a4663527L402177L042279P417341P182431l938282j5313787j3411121m54801
4082b6737290J0694108J2612989O394559l465709r838912o184412M097814Q772429
4074c654424L057003l464640k194398J833281N93632l055635k300482M97269r83842
4065i672236m122454j551625M875489O064723Q64681j671176L263935Q824518
4057F875855O846609j399216q706385j1210430j0049838o921093k256002K883246
4049b3937254O108106N749362K633020p25470k330599j661662J020808M748721
4041h394968O902178M559701j349289n342559l620584P59446K331239J034419
4033c120417R82445K619089J980637j781187m182719k585564o5190N46131J205456
$$ plain form
4090 -14663527 -11261350 -8219071 -801730 6380701 2442419 -12871368 -26282489 -26737290
4082 -26737290 -16043182 -3430193 2964366 -501343 -10340255 -16524667 -12426853 -3654424
4074 -3654424 -597421 -4062061 -6256459 -4423178 -3829546 -6885181 -9185663 -8688394 -9672236
4065 -9672236 -13794690 -15346315 -10470826 -4406103 -3541422 -5212598 -1948663 6875855
4057 6875855 13722464 12323248 3616863 -7593567 -17643405 -24564498 -26820500 -23937254
4049 -23937254 -17829148 -12079786 -9446766 -10172236 -12502835 -14164497 -13143689 -8394968
4041 -8394968 -1492790 3066911 1717622 -3624937 -7245521 -6486075 -4154836 -3120417
4033 -3120417 -2137972 481117 2461754 680567 -3502152 -6087716 -6152906 -5606775 -4401319
4024d401319L612550M402629K26147n728801p343131l520916K069915P139504
4016c543422J1378137J2152446N864058n167319j2427746j0652070m156279q46566
4008g398761k557012m756311l992270j275561J746260N403382R087315R593580
4000E850622N455977J93412k292949l192335n392762o933913l884195J246142
3992h950001J322411m192655p522438m678547j217591j457047l65413O480105
3984b0581176J2214577P958213j997662n363539k3907M130140J461717k269667
3976d471304j220014J723598J154949l240581q528795j1625255q571317K053436
3968c2725283J2865366J2929205K454390n871136l917757K172099L916464K550757
$$ plain form
4024 -4401319 -788769 3613860 3840007 -1888794 -9231925 -12752841 -10682926 -3543422
4016 -3543422 7834715 19987161 25851219 20683900 8256154 -2395916 -6552195 -7398761
4008 -7398761 -9955773 -14712084 -18704354 -19979915 -18233655 -12830273 -3742958 5850622
4000 5850622 11306599 11500011 9207062 6014727 621965 -6311948 -10196143 -8950001
3992 -8950001 -7627590 -11820245 -19342683 -24021230 -25238821 -26695868 -27061281 -20581176
3984 -20581176 -8366599 -408386 -2406048 -7769587 -7793494 -3663354 -2201637 -4471304
3976 -4471304 -5691318 -3967720 -2812771 -6053352 -14582147 -26207402 -34778719 -32725283
3968 -32725283 -19859917 -6930712 -4476322 -10347458 -14265215 -12093116 -8176652 -5625895
3960e625895K206618L00706n722511r480349m496407L437549M355891N99372K505716
3951a1919310R637798J0234103P77037p384256n511789K51109Q28820j652818
3943d739306n86785J821000j389425q387982r540110j632759P357735R072001
3935h025631L824963k830620o910667o957956k971887K378862M685136K909220
3927a3898580J193053L072076O276067O096884J897865k798182n148299m860160
3919h169276k713639n84354j512615n662189p276032p60591J0136686J4875304
3911a666706R330767R28752j970587k63150K89811j536244l092092m168897o073996
3902h222342o499518k126672M133191M973359j208750p312923o288813R97366
$$ plain form
3960 -5625895 -3419277 -3118571 -8841082 -18321431 -22817838 -19380289 -15024398 -14425026 -11919310
3951 -11919310 -2281512 7952591 8729628 1345372 -4166417 -3915308 -3086488 -4739306
3943 -4739306 -5326091 -3505091 -4894516 -13282498 -22822608 -24455367 -17097632 -8025631
3935 -8025631 -4200668 -7031288 -13941955 -20899911 -23871798 -21492936 -16807800 -13898580
3927 -13898580 -12705527 -9633451 -3357384 2739500 4637365 1839183 -3309116 -8169276
3919 -8169276 -10882915 -11467269 -12979884 -18642073 -25918105 -26678696 -16542010 -1666706
3911 -1666706 7664061 8592813 6622226 6359076 6648887 5112643 2020551 -2148346 -8222342
3902 -8222342 -14721860 -16848532 -12715341 -7741982 -8950732 -16263655 -22552468 -21555102
3894b1555102P915067Q910374L521124l496815n870343k340186J350778K08673
3886a1356430k319095L73644O708379Q037421J517007n570546o561181l658793
3878a2829594k072974j844726J58535M347394Q360720R761682O503459j346954
3870A1037542q487140q039869q13831M519486L265570M22020Q34410R17364l598240
3861E7312q013299n006165L185086P140304L024160l944683p547842o141952j438109
3852a8685188K962231L217927k0656r99491K513105M185122j006970o698087l911975
3843a8443982L700678M491951k583585o130010o57946N220137L383479j646805
3835a2666083j800654J769228K870088J201253J093141L131422M268741L822949
$$ plain form
3894 -21555102 -13640035 -4729661 -1208537 -4705352 -10575695 -12915881 -11565103 -11356430
3886 -11356430 -13675525 -13301881 -6593502 1443919 2960926 -2609620 -9170801 -12829594
3878 -12829594 -14902568 -16747294 -16588759 -12241365 -3880645 5881037 12384496 11037542
3870 11037542 2550402 -5489467 -6303298 -1783812 1481758 1903778 2738188 3655552 57312
3861 57312 -7955987 -12962152 -9777066 -2636762 387398 -3557285 -11105127 -17247079 -18685188
3852 -18685188 -15722957 -12505030 -12525686 -13525177 -11012072 -6826950 -7833920 -14532007 -18443982
3843 -18443982 -14743304 -10251353 -12834938 -18964948 -19622894 -14402757 -11019278 -12666083
3835 -12666083 -14466737 -12697509 -9827421 -8626168 -7533027 -4401605 -132864 3690085
3827C690085L097241J029663l791836q138995p030101j326425K684521J708148
3819h077699r39410j093988N42688K55346l155273o415447n142153J055365P171356
3810a5799215P829352L771225R22936K209236L682251J106861l086378l523905
3802b887637k03946K029566J480597J522304L631698L868793p81926o492227p031567
3793d864345k063095K968493M370946L734948L721827M104497L561653K414029
3785A7948953J234531r89870m402574n751475k205874K848471K343350m872182
3777F153330j1026917q723557k69436N641297M584747P755k826170k493772o04805
3768i557528J285882K464509K689802K367919K168012K020324J508042J270097
$$ plain form
3827 3690085 6787326 7816989 4025153 -4113842 -11143943 -12470368 -9785847 -8077699
3819 -8077699 -9017109 -10111097 -9568409 -9313063 -12468336 -18883783 -24025936 -22970571 -15799215
3810 -15799215 -7969863 -4198638 -3275702 -1066466 2615785 3722646 636268 -2887637
3802 -2887637 -3091583 -1062017 418580 1940884 5572582 9441375 8659449 2167222 -4864345
3793 -4864345 -6927440 -3958947 411999 4146947 7868774 11973271 15534924 17948953
3785 17948953 19183484 18193614 13791040 8039565 5833691 8682162 11025512 6153330
3777 6153330 -4873587 -13597144 -13866580 -8225283 -3640536 -3632781 -6458951 -8952723 -9557528
3768 -9557528 -8271646 -5807137 -3117335 -749416 1418596 3438920 4946962 6217059
3760F217059K424006M030632K719461l556236j1601191j4410938q119314K443104
3752a9853417P246561J916930o594138q215555k350064K363233Q87858j596541
3744b6195133J515798Q331179J1722632Q602969J475344n770908r060824n003292
3736a4382235L820452Q025950K448492n245037m585906K044714L386369k543133
3728g030334n734320j279817K654150p49207m824924m6051J0136045J3452759
3720F578301N694882m615111p545680j770109O544755J0406409P376101J068064
3712B3737612k802474k733785j884413j891386n91968K161754J721780m179017
3704A3538103r916065q970815l317201k65103k095837m463180l921084j575234
$$ plain form
3760 6217059 8641065 12671697 15391158 11834922 233731 -14177207 -22296521 -19853417
3752 -19853417 -12606856 -10689926 -17284064 -25499619 -27849683 -25486450 -24598592 -26195133
3744 -26195133 -24679335 -16348156 -4625524 3977445 5452789 -318119 -9378943 -14382235
3736 -14382235 -10561783 -2535833 -87341 -5332378 -9918284 -7873570 -4487201 -7030334
3728 -7030334 -12764654 -14044471 -11390321 -12139528 -16964452 -17010503 -6874458 6578301
3720 6578301 12273183 7658072 112392 -1657717 4887038 15293447 22669548 23737612
3712 23737612 20935138 18201353 16316940 14425554 13833586 15995340 17717120 13538103
3704 13538103 3622038 -5348777 -8665978 -8931081 -11026918 -15490098 -19411182 -20986416
3696b0986416O62930K749908M758113N805684N238534K680712k437701q921771
3688a0450007j2392291q913045O5212Q507142J1236396P390722k0761o251609
3680a0828241q008217o145641l831021j629589K503721P654585R101909N357931
3672e824563J254845P50204J368027m44040l416480n328123p388167r367314o116036
3663c4511647M016109J2510690J0799346K897213q99101R14788K120414J504957
3655f47231L003394M853146J024201o195813p347611j265436K675721M36878r88894
3646d451645K180827L433706n60587j773112N151525J1465971P340319k323610
3638B0463394o118658l248348j074437j064156R62410M128342L644465P71653
$$ plain form
3696 -20986416 -20323486 -17573578 -12815465 -7009781 -1771247 909465 -1528236 -10450007
3688 -10450007 -22842298 -31755343 -31690131 -23182989 -11946593 -4555871 -4576632 -10828241
3680 -10828241 -18836458 -24982099 -28813120 -30442709 -27938988 -20284403 -11182494 -5824563
3672 -5824563 -4569718 -3819514 -2451487 -2895527 -6312007 -11640130 -19028297 -28395611 -34511647
3663 -34511647 -30495538 -17984848 -7185502 -4288289 -5187390 -4272602 -2152188 -647231
3655 -647231 2356163 7209309 8233510 2037697 -5309914 -6575350 -3899629 -3462751 -4451645
3646 -4451645 -2270818 1162888 602301 -1170811 3980714 15446685 22787004 20463394
3638 20463394 14344736 11096388 10021951 8957795 9920205 14048547 17693012 18464665
3630A8464665R67724L164591R95747n711979j0252512r707651p004813k641028
3622a1725256N262564J1785849P521707o214555j4772109q523938M333436R660201
3614b672101N220960m38602j720802o38607k55431o24932j083313j602208j540447
3605e355483l13299Q29892K89748r43164l6776M092971R287977J1926828R716734
3596B9495428L854894j299892k517066j937281m473603j0329005j3435887r186805
3588i829217o76214N319203O078829L792153R29323j553344k459985o43572K499245
3579C456421L552248J006972l065667n936586p162040p398087n515784O46436
3571b0416087R715810J5067632J0935419M15443o351097m100909R15041j36803
$$ plain form
3630 18464665 19432389 22596980 23592727 17880748 7628236 -2079415 -9084228 -11725256
3622 -11725256 -6462692 5323157 12844864 6630309 -8141800 -16665738 -12332302 -2672101
3614 -2672101 2548859 2110257 389455 -249152 -504583 -1129515 -2212828 -3815036 -5355483
3605 -5355483 -5668782 -4838890 -4549142 -5492306 -5529082 -1436111 7851866 19778694 29495428
3596 29495428 33350322 32050430 29533364 27596083 23122480 12793475 -642412 -9829217
3588 -9829217 -10505431 -5186228 892601 4684754 5614077 4060733 1600748 957176 3456421
3579 3456421 7008669 8015641 4949974 -986612 -8148652 -15546739 -21062523 -20416087
3571 -20416087 -10700277 4367355 15302774 15718217 9367120 5266211 6181252 6044449
3563F044449o261123q836457m582717P91081K574966L247325N551857O097676
3555D627057J285583m960463n632049n17896L913743L328972o63093m815102p606781
3546a1040029q051595n238952k53121L959642N402658M270149J862308k7249L58930
3537h757259K646152L729637J557817j520158j606713J568035M722144N122687
3529G462342K336185k354938n636265l785664J566638K146344o696507j6199385
3521b1161250j2262720N656936K1009352J8950388L229487r929489j0721216l608057
3513h836569J435524M06355k500570j335289M328556Q745466O971751J253391
3505A0468615j905380k58686K178030J694983q21415l234587n232557n907284
$$ plain form
3563 6044449 -216674 -9053131 -13635848 -12844767 -10269801 -7022476 -1470619 4627057
3555 4627057 5912640 952177 -4679872 -5197768 -1284025 2044947 1381854 -3433248 -11040029
3546 -11040029 -19091624 -24330576 -24583697 -20624055 -15221397 -10951248 -9088940 -9116189 -8757259
3537 -8757259 -6111107 -2381470 -823653 -2343811 -3950524 -2382489 2339655 7462342
3529 7462342 9798527 7443589 1807324 -1978340 -411702 1734642 -4961865 -21161250
3521 -21161250 -33423970 -27767034 -6757682 12192706 15422193 5492704 -5228512 -8836569
3513 -8836569 -7401045 -6994690 -9495260 -10830549 -6501993 2243473 9215224 10468615
3505 10468615 8563235 8304549 10482579 12177562 11356147 8121560 2889003 -3018281
3497c018281k762642L468652O727612K530807n438149r539921p169416j986962
3489a7188300K055098M040569M549651M556073N538585P739047Q656308N753585
3481B5700616J33154m651877o589478n983259l627743p03536Q13193L35241J53319
3472E579630K185617M541935M068048R74023j962206l389807l504068j770595
3464F722577J841006M635692M010979J418795k03828j378390l896975n354770
3456G795086j982550L391202L126584l812713q738628m956681K647763M373214
3448A843277j304422o473912m384764K808146P594717O169777K264298J562868
3440A0079985L650258K753001k559371n283761m4929O946229N348448l908507
$$ plain form
3497 -3018281 -5780923 -2312271 4415341 6946148 1507999 -8031922 -15201338 -17188300
3489 -17188300 -15133202 -11092633 -6542982 -1986909 3551676 11290723 19947031 25700616
3481 25700616 25833770 21181893 14592415 8609156 4981413 4277877 5091070 5426311 5579630
3472 5579630 7765247 12307182 16375230 17349253 15387047 11997240 8493172 6722577
3464 6722577 8563583 13199275 17210254 18629049 18425221 17046831 13149856 7795086
3456 7795086 5812536 9203738 12330322 8517609 -221019 -5177700 -2529937 1843277
3448 1843277 538855 -5935057 -10319821 -7511675 83042 6252819 8517117 10079985
3440 10079985 13730243 16483244 13923873 8640112 8595183 15541412 20889860 16981353
3432A6981353r452585o064465j222669k347253o297446o394355k512696J545902
3424a5764214M539150N768050K438406m514027p505399k485782L084425P99573
3416a3639818m669416k237461P424037J1582044L974772o563097r013264l517128
3408a6659331K242448L784973K435458J001439N45970j54988k976662o666771
3400a6447464o283799n6014N678445M369592p5929J269451P176580O878917k299845
3391B09934r074967n034345K959492M805304K584019L847594O283439J439634
3383H020104r052051j3387221o760502J735317K505943k372732m525782p68489
3375b4605413N356764R569680J0138284P326622K735966j630526m846258o475783
$$ plain form
3432 16981353 7528768 1464303 241634 -2105619 -8403065 -14797420 -17310116 -15764214
3424 -15764214 -11225064 -5457014 -3018608 -7532635 -15038034 -17523816 -14439391 -13639818
3416 -13639818 -18309234 -20546695 -13122658 -1540614 2434158 -4128939 -13142203 -16659331
3408 -16659331 -14416883 -10631910 -8196452 -7195013 -6649043 -6804031 -9780693 -16447464
3400 -16447464 -22731263 -22787277 -17108832 -12739240 -12815169 -11545718 -4369138 2509779 209934
3391 209934 -8865033 -13899378 -10939886 -6134582 -3550563 297031 6580470 8020104
3383 8020104 -1031947 -14419168 -21179670 -19444353 -16938410 -19311142 -23836924 -24605413
3375 -24605413 -19248649 -9678969 459315 7785937 10521903 8891377 4045119 -2430664
3367b430664m806383J492791R544534J3330700R891336K139326n132343r410699
3359A4618598j0253661q302952n639286m162074k757446P47709M452118L808018
3351g488976m77555j473271L943804R405621P995842K167552j133189j301834
3343A1637994k736373n194526l949155P65296L003142J292837J322280N421586
3335A1563081P469232L373274o54022K423246Q074132O093324l735407j0802341
3327B3804519q347345r72340L738080L774268M66539n449769j1347672j1559571
3319e893291l995938N035065P335490K446248l098736m653592l544440k785478
3311i154672k619855j415841J258543L904271M982030M907065N437580O402087
$$ plain form
3367 -2430664 -7237047 -5744256 3800278 17130978 27022314 29161640 24029297 14618598
3359 14618598 4364937 -3938015 -9577301 -13739375 -16496821 -15749112 -11296994 -7488976
3351 -7488976 -7966531 -9439802 -5495998 3909623 11905465 14073017 12939828 11637994
3343 11637994 8901621 3707095 -242060 523236 3526378 4819215 6141495 11563081
3335 11563081 19032313 22405587 21751565 24174811 32248943 38342267 34606860 23804519
3327 23804519 15457174 14484834 18222914 21997182 22463721 17013952 5666280 -5893291
3319 -5893291 -9889229 -4854164 2481326 4927574 1828838 -2824754 -6369194 -9154672
3311 -9154672 -11774527 -13190368 -11931825 -8027554 -3045524 1861541 7299121 13701208
3303A3701208M461500k153314q458880o799719K643708J0173270Q338097J053538
3295B2959408l265568l739135o004570j1201000j3210306p925900N86456N745736
3287a6054879O220241N186056M615785L465521N94708k806446m067583j876778
3279d723375J757151K933616j10745n099280q394361q187947m365244K147324
3271b4042861P957662Q294861L112191n82318K703395Q045318N862814l960557
3263G390505j0571971o371967L577693R602476R564450Q318131Q554928P641770
3255C7706015K842461m404165j0150504j1843369r992532o877701m066478j439919
3247h226192J319662L553463M910597O091456O656266M483987J54153j163910
$$ plain form
3303 13701208 18162708 16009394 7550514 750795 3394503 13567773 21905870 22959408
3295 22959408 19693840 15954705 9950135 -1250865 -14461171 -22387071 -21800615 -16054879
3287 -16054879 -9834638 -4648582 -32797 3432724 4027432 1220986 -2846597 -4723375
3279 -4723375 -2966224 -32608 -143353 -5242633 -13636994 -21824941 -26190185 -24042861
3271 -24042861 -16085199 -7790338 -4678147 -5260465 -2557070 5488248 11351062 7390505
3263 7390505 -3181466 -9553433 -5975740 3626736 13191186 21509317 30064245 37706015
3255 37706015 40548476 36144311 25993807 14150438 4157906 -2719795 -6786273 -8226192
3247 -8226192 -6906530 -3353067 1557530 7648986 14305252 18789239 18943392 17779482
3239A7779482L212917P276410L641094m626729p417573k686672Q45886k048066
3231A5976749n732690m840270l376847n823245p212915j213392P507561Q990372
3223D275323K873332k178519k272617j703187k519295n59989N382974Q759688
3215A2057710M283662l744600o770715k240317N099300R468931Q391047K774394
3207B9319412m108395q325546q053907m721627r22451J986826L767176L951222
3199A2892710J824511k137333n358920m806728n74791L151424K904447R65708
3191H861028K100637N402306M526909k137973p243290m555832J541798K350297
3183A0845880k627420n842522k724096L531334P591959O991732J752632n866197
$$ plain form
3239 17779482 20992399 28268809 31909903 27283174 19865601 17178929 18024815 15976749
3231 15976749 10244059 5403789 2026942 -3796303 -11009218 -12222610 -4715049 4275323
3223 4275323 7148655 4970136 2697519 994332 -1524963 -2084952 3298022 12057710
3215 12057710 16341372 12596772 5826057 3585740 8685040 18153971 26545018 29319412
3207 29319412 25211017 16885471 8831564 4109937 3187486 5174312 8941488 12892710
3199 12892710 14717221 12579888 7220968 2414240 1839449 4990873 7895320 8861028
3191 8861028 10961665 16363971 20890880 18752907 11509617 6953785 8495583 10845880
3183 10845880 8218460 2375938 -348158 3183176 10775135 17766867 19519499 13653302
3175A3653302j1004545j0089127n426457k181945j244582P16164M553481O665707
3167d358002M121832j928206p975117j0228844o240334J777074O916489N238870
3159a2676238J458782J977506M936361L957595m38746j626057J535375K988496
3151B113074M22780j117197Q95186J615284k095737n136398j734912N816372J0429289
3142A1207741Q274508Q15818p123789r798306n854026j833684m392925r257360
3134a7962023o370960L486347Q137772K902695j950205J749077P478717O616342
3126D087762K595919K240101K580191j805688o182427l249046K732347K536686
3118E535845k109282k653350J40963j542353o566395n937758O82641M335771L325725
$$ plain form
3175 13653302 2648757 -7440370 -12866827 -15048772 -16293354 -15577190 -11023709 -4358002
3167 -4358002 -236170 -2164376 -10139493 -20368337 -26608671 -24831597 -17915108 -12676238
3159 -12676238 -11217456 -9239950 -4303589 -345994 -784740 -2410797 -875422 2113074
3151 2113074 2535854 1418657 2313843 3929127 1833390 -3303008 -5037920 778452 11207741
3142 11207741 19482249 20298067 13174278 3375972 -2478054 -4311738 -8704663 -17962023
3134 -17962023 -24332983 -20846636 -12708864 -9806169 -11756374 -10007297 -2528580 4087762
3126 4087762 6683681 8923782 11503973 9698285 3515858 266812 2999159 5535845
3118 5535845 3426563 773213 914176 -628177 -7194572 -13132330 -12449689 -8113918 -4788193
3109d788193N327718J0639406Q959080k080690j0001571o472980O3319l44821
3101A301268l308791k98377N313340M791704l28847j657490J272574J379145l019753
3092E444773o164117m951385k028782Q15653M157020N965653K941336k720641
3084C459510n011864l216994k581979n067746o312707l469832M32663K335887
3076a9433062L426600M719881L930463M00893j684954O78225M000897L703798
3068b57259J652600K820428O299958N761939q13766p367460p776404l462194K9079
3059c113079J009301K161180M312481M133466q04821p696135j1248069r244993
3051b0490669l786272J709283N014380N629652M688154L859709L084796M55784
$$ plain form
3109 -4788193 539525 11178931 20138011 18057321 8055750 1582770 1646089 1301268
3101 1301268 -2007523 -2305900 3007440 7799144 7470297 5812807 7085381 8464526 5444773
3092 5444773 -719344 -5670729 -7699511 -6883858 -2726838 3238815 6180151 3459510
3084 3459510 -1552354 -4769348 -7351327 -12419073 -18731780 -22201612 -21768949 -19433062
3076 -19433062 -16006462 -11286581 -7356118 -6955225 -8640179 -7961954 -3961057 -257259
3068 -257259 1395341 4215769 10515727 16277666 15463900 8096440 320036 -3142158 -3113079
3059 -3113079 -2103778 57402 4369883 8503349 7698528 2393 -11245676 -20490669
3051 -20490669 -24276941 -22567658 -17553278 -11923626 -7235472 -3375763 -290967 164817
3043A64817m132597o956056m826120r9089K376827K606552N072024J0351413J2197740
3034A6755511N660815n725359j4102474j5648352j1580284l991939M754045J0427183
3026a3450854R887022N479467K303356J165029j394010n691219o711595j719441
3018a0132245M250306M468767l86621l477482j181511L045101M706707M230849
3010E523871M634318N818708M528791n40393o505230r756607r461576o762459
3002a2520577k837269M84331M14204l353549o020464k366641N666064J0041372
2994a0492529O838843J580675J382147M994074N274356J33563m344909k666800
2986B699420K682221N140537K432907j997186m305420l915553k231193k93826
$$ plain form
3043 164817 -3967780 -10923836 -15749956 -15849045 -13472218 -10865666 -5793642 4557771 16755511
3034 16755511 22416326 16690967 2588493 -13059859 -24640143 -28632082 -23878037 -13450854
3026 -13450854 -3563832 1915635 4218991 5384020 3990010 -1701209 -8412804 -10132245
3018 -10132245 -5881939 -1413172 -1799793 -5277275 -6458786 -3413685 1293022 5523871
3010 5523871 10158189 15976897 20505688 19965295 13460065 3703458 -5758118 -12520577
3002 -12520577 -15357846 -14873515 -14459311 -17812860 -23833324 -26199965 -20533901 -10492529
2994 -10492529 -3653686 -2073011 -690864 4303210 9577566 9711129 5366220 2699420
2986 2699420 5381641 10522178 12955085 10957899 6652479 2736926 505733 211907
2978B11907J596039L323955M629985M812898L077427J5909j947722j134862P77345
2969A5362881P00674j345234k163658n92188O1404l067703p282856p302927k427327
2960h056934K509984L343671P60749k253784m310188n621280o126940n045491
2952b4800213j380282N173960J2268288J4690905R556106J768229j79129M715712
2944B1813576P995703L675164l094480m224949j097961j682077p427237j0940214
2936E017525p306855p91063J975150O1522l159167n126658m969364k547058Q74403
2927a5971565L355310M957594O936245P906142N044717p7602k261883j145826
2919H743132k609128q126137r553233j053726R211355Q209730l558531j2169821
$$ plain form
2978 211907 1807946 5131901 9761886 14574784 17652211 17668120 15720398 14585536 15362881
2969 15362881 16063555 14718321 12554663 11962475 12023879 8956176 1673320 -5629607 -8056934
2960 -8056934 -5546950 -2203279 -1442530 -3696314 -8006502 -13627782 -19754722 -24800213
2952 -24800213 -26180495 -21006535 -8738247 5952658 15508764 17276993 17097864 21813576
2944 21813576 29809279 33484443 30389963 26165014 25067053 23384976 15957739 5017525
2936 5017525 -2289330 -3080393 -1105243 -1043721 -4202888 -9329546 -14298910 -16845968 -15971565
2927 -15971565 -12616255 -7658661 -722416 7183726 12228443 12150841 9888958 8743132
2919 8743132 6134004 -1992133 -11545366 -12599092 -3387737 4821993 1263462 -10906359
2911a0906359r204578j666194N9978l414438l727244K210223Q874660J0581314
2903g192638P978232N147313L698400J915471j462990m731979n140900k377380
2895b166471J123166L187260L688306L023665R16301j904174k855128p09457J657560
2886E961028N09778l348168n294366l153143j9725J06146k483591l765956j005787
2877a2493784L744596N612068K830698j39162K137247P708239Q436126J710170
2869A9546198m256756k019386K865379l43274r648258j1001730J005634J3767522
2861I915329J3776269M168348l152973n614168q937837j2197264p514173M156482
2853e399987R635800J513419j0005350j0756185j311782O420192O619460M063856
$$ plain form
2911 -10906359 -20110937 -21777131 -21717153 -25131591 -28858835 -26648612 -17773952 -7192638
2903 -7192638 785594 5932907 9631307 11546778 10083788 5351809 210909 -2166471
2895 -2166471 -1043305 2143955 5832261 8855926 9772227 7868053 5012925 4303468 5961028
2886 5961028 6470806 3122638 -2171728 -5324871 -5344596 -5238450 -7722041 -11487997 -12493784
2877 -12493784 -8749188 -3137120 -306422 -445584 1691663 9399902 17836028 19546198
2869 19546198 15289442 13270056 16135435 15792161 6143903 -4857827 -3852193 9915329
2861 9915329 23691598 27859946 24706973 19092805 10154968 -2042296 -9556469 -5399987
2853 -5399987 4235813 5749232 -4256118 -15012303 -16324085 -9903893 -3284433 779423
2845G79423L123377K043361m56625j318471O74754J386588j731550m466978k627562
2836b593683K86622j689109o778299p464940k287150J316165j946581o989166
2828b8146141n262851L326320J0032684Q080199J69554n602549m883641m05630
2820b2692055K850023L555431L865135M646424L772625J36091l309564l122549
2812a0298439m42841O39167r20535k133739j052927N69625M85102j194494l297458
2803a7646539m895372m433115q12384L435270L748787K47402j134438K773326
2795a8717063O615411L887528k805488m532590J893397J0067076J2593851Q772061
2787A7774183K560151k715391n370234m424772p00740K566628K441891q55278
$$ plain form
2845 779423 3902800 5946161 5489536 4171065 4845819 6232407 4500857 33879 -2593683
2836 -2593683 -2307061 -3996170 -10774469 -18239409 -20526559 -19210394 -21156975 -28146141
2828 -28146141 -33408992 -30082672 -20049988 -11969789 -11800235 -17402784 -22286425 -22692055
2820 -22692055 -19842032 -16286601 -12421466 -7775042 -4002417 -3866326 -7175890 -10298439
2812 -10298439 -10741280 -10102113 -11022648 -13156387 -14209314 -13639689 -13154587 -14349081 -17646539
2803 -17646539 -22541911 -26975026 -27787410 -24352140 -20603353 -20355951 -21490389 -18717063
2795 -18717063 -12101652 -8214124 -11019612 -15552202 -13658805 -3591729 9002122 17774183
2787 17774183 20334334 17618943 12248709 7823937 7123197 9689825 12131716 11276438
2779A1276438m711241o780730o127347k883320J970395O670976R010071O925980
2771A5351222N753q397077j1867799o537838L727006J0150549Q014297J049998
2763A1496111l870084m285729k781489j835498q18827J617015M216015L913641
2755G651155k6720m016466l738506L37862K899841M35159l648137k897673L615528
2746F12043R324767P897185J132010k887223O39594P258451Q206725Q84600p763252
2737B5304900r754958n958937l945343o497425p484161j758112N534798N021431
2729D62193l433386r421762n075796N308505J1036235P302636r12954n532609
2721b66938l392603K210150O164294O478732M396710J140675k705745m511638
$$ plain form
2779 11276438 6565197 -215533 -6342880 -9226200 -7255805 -584829 8425242 15351222
2771 15351222 15356975 6959898 -4907901 -11445739 -7718733 2431816 10446113 11496111
2763 11496111 7626027 3340298 558809 -1276689 -2095516 -478501 3737514 7651155
2755 7651155 7624435 3607969 -130537 207325 3107166 3542325 -105812 -3003485 612043
2746 612043 9936810 17833995 18966005 16078782 16718376 23976827 32183552 33068152 25304900
2737 25304900 15549942 9591005 5645662 -851763 -8335924 -10094036 -4559238 462193
2729 462193 -2971193 -12392955 -17468751 -12160246 -1124011 6178625 5265671 -266938
2721 -266938 -3659541 -1449391 4714903 11193635 15590345 16731020 14025275 9513637
2713I513637n97235P311717J0598726L686559p111587j0675134n615080q22311
2705F289292j655371l688178k401939p47886k059701k553758J976601P061161
2697B220221N402200j074119l598168J9341K942536R72705j938109k422596l594924
2688a070913p297954p792412n55762P733220O984914q66117l840131K216859P481976
2679B993680L519591l942320m333531J967414N768559L553498M96824l24267k360166
2670G339282p032362q899646l781344M074209P614360N603776J632025j520223
2662E030077k530994m23800K984381L131361p94108l534798k167169j498528n220453
2653e024031p539461k094615N608995N329605j186653k625096L250394O200933
$$ plain form
2713 9513637 8916402 16228119 26826845 30513404 23401817 12726683 7111603 6289292
2705 6289292 4633921 945743 -1456196 -2204082 -4263783 -6817541 -4840940 2220221
2697 2220221 7622421 6548302 2950134 2969475 5912011 6884716 4946607 2524011 -1070913
2688 -1070913 -8368867 -16161279 -16717041 -8983821 -1998907 -2865024 -6705155 -4488296 2993680
2679 2993680 6513271 2570951 -1762580 204834 5973393 9526891 10023715 9699448 7339282
2670 7339282 306920 -8592726 -12374070 -8299861 -685501 4918275 6550300 5030077
2662 5030077 2499083 2075283 5059664 8191025 7396917 3862119 1694950 196422 -5024031
2653 -5024031 -12563492 -14658107 -9049112 -3719507 -4906160 -7531256 -4280862 1920071
2645A920071J066723l996116k021343J507242n36438m229520j738782N522179
2637b505984R742836Q003558K919096l689754j0198936j2203978p797381k543649
2629a8274192j985083k738397J286204P498355Q408814M113692J352367J529529
2621A191289l08627m637876n726846k154835N52887J67712J219097M687851L586028
2612a423320n452324j3801499j1074239J239930J2509433J5444922J0541591J949972
2604I934466n316889o869715l068415K19082q71190k598193J90632N612008Q009213
2595E240999O800645N564526M222593m35202o746434q418384m366852j242426
2587F19465l187944n516027k991704J111853L78657l769859l503616L639732J0716711
$$ plain form
2645 1920071 2986794 -1009322 -3030665 -1523423 -2059861 -6289381 -8028163 -2505984
2637 -2505984 7236852 15240410 18159506 14469752 4270816 -7933162 -15730543 -18274192
2629 -18274192 -20259275 -22997672 -21711468 -14213113 -5804299 -1690607 -338240 1191289
2621 1191289 882662 -3755214 -9482060 -11636895 -11084008 -10916296 -9697199 -5009348 -1423320
2612 -1423320 -6875644 -20677143 -31751382 -30511452 -18002019 -2557097 7984494 9934466
2604 9934466 4617577 -2252138 -5320553 -5101471 -5972661 -8570854 -8380222 -2768214 5240999
2595 5240999 12041644 17606170 21828763 21393561 14647127 6228743 1861891 619465
2587 619465 -2568479 -8084506 -11076210 -9964357 -9585700 -13355559 -16859175 -13219443 -2502732
2578b502732J0579436M442792j045204j969363L15576K661234L194582J619827
2570A7296148j101941k940769k004586J565850M976756M663964j51013n459228
2562A6845181n632369r5186M803297L208990k333839m242413m60147L409564L138586
2553A8641664J136462M01195n28164k435952j429768L735316N831336j019340
2545B4332749r668699q224581J617938N697263j881878j0193637p911740J280273
2537d952312O081329L196378j605720l299661j690535J471129L958786L425877
2529F585271L2678l059797l743342k470443J037184P152074J1134319O144526
2521B2812470n306166j1257664o658990j146059l724587q747419o604504k60526
$$ plain form
2578 -2502732 8076704 12519496 11474292 9504929 9820505 12481739 15676321 17296148
2570 17296148 16194207 13253438 11248852 12814702 17791458 22455422 22304409 16845181
2562 16845181 11212812 11117626 15920923 19129913 16796074 12553661 12093514 15503078 18641664
2553 18641664 19778126 20179321 19651157 17215205 15785437 19520753 25352089 24332749
2545 24332749 14664050 6439469 8057407 13754670 11872792 1679155 -6232585 -4952312
2537 -4952312 1129017 4325395 2719675 -579986 -2270521 -799392 3159394 6585271
2529 6585271 6617949 3558152 -185190 -2655633 -1618449 5533625 16667944 22812470
2521 22812470 17506304 6248640 -410350 -1556409 -5280996 -14028415 -20632919 -20893445
2513b0893445Q46653k447808j624652L575689N289594K456728K519075P419801
2505b858365R924702N949946o402l834537o344450o945140k736371L741783N426456
2496B317622J772129n16235L66766j020693n054575m105826L557157Q386635M330778
2487A0033758j397791n28740L642695L725142J76308k331753l528500m776615
2479E014504l964051l84038J327874j195177k888686j20899K499935J097420K99807
2470A686689L928775O227533K044749k299615L53095L856894j627278j1611582
2462B559260j3287348n974982p00257r43165R51507P298267R922320N082262M35780
2453E343644J863876M382621K159129j732261k014104j21111R7228k75438J539941
$$ plain form
2513 -20893445 -20046792 -22494600 -24119252 -20543563 -15253969 -12797241 -10278166 -2858365
2505 -2858365 7066337 13016283 13009881 9175344 2830894 -4114246 -6850617 -3108834 2317622
2496 2317622 4089751 3573516 3940282 2919589 -2134986 -6240812 -2683655 5702980 10033758
2487 10033758 8635967 8107227 11749922 15475064 15651372 13319619 9791119 5014504
2479 5014504 1050453 666415 1994289 799112 -2089574 -2210473 289462 1386882 1686689
2470 1686689 5615464 11842997 13887746 11588131 11941226 15798120 14170842 2559260
2462 2559260 -10728088 -16703070 -17403327 -18346492 -17394985 -10096718 -174398 4907864 5343644
2453 5343644 7207520 11590141 13749270 12017009 10002905 9881794 9979022 9703584 11243525
2444A1243525L677128K365347j409586k689038P47098N127222M404713k672008
2436B0794401r104843o109761N013879J1958436O612308l974756q331245o649989
2428A0208430o589940p816752l673266L479319L130022n254912r038941j974966
2420a7531006N907040M422346k274693m995426l106527l75918L537081Q217840
2412f199263P499341m50715n357749J455891J1371064R065663m544035j3049765
2404b09568p940357J110764K073595l591218o001284r61158O569022R793763O687043
2395G530602N15922l748848l527439R8795M320565O383917M185929j547257n458658
2386H753528k482385M203902N496871j248425q325531r209606o608507m269599
$$ plain form
2444 11243525 14920653 17286000 15876414 13187376 13934474 19061696 23466409 20794401
2436 20794401 11689558 5579797 10593676 22552112 29164420 25189664 16858419 10208430
2428 10208430 3618490 -4198262 -7871528 -4392209 -1262187 -6517099 -15556040 -17531006
2420 -17531006 -11623966 -7201620 -9476313 -14471739 -17578266 -17954184 -14417103 -6199263
2412 -6199263 1300078 849363 -4508386 -3052495 8318569 17384232 12840197 -209568
2404 -209568 -8149925 -7039161 -4965566 -8556784 -14558068 -15519226 -8950204 843559 7530602
2395 7530602 8046524 4297676 770237 869032 5189597 11573514 15759443 14212186 8753528
2386 8753528 6271143 10475045 15971916 14723491 6397960 -2811646 -9420153 -13689752
2378a3689752N90578Q640278J0507042o35329j3894776j1955483M082414J5025861
2370a329167R923023j353942n517208l032344j228494j026211N10497J861984
2362a191862M71419n09190K630181N994416L369211k931186m924559j511368L04967
2353A702029k586888m339024q83O321567P889661N147543L238587K306230k804374
2344A6874448j2407751j7854993j1673137J656520J0269508R231043N036101N149849
2336F281588Q402569Q583393L293516m730699j1941870j5271648j1853845k773307
2328b0010303M597904L791616j842401l199697J735756N593892L228703j301988
2320g406518k249416k53503J444552L279171O092017N896740r54494r322958r315940
$$ plain form
2378 -13689752 -13099174 -4458896 6048146 5412817 -8481959 -20437442 -16355028 -1329167
2370 -1329167 8593856 7239914 1722706 -1309638 -2538132 -3564343 -3053846 -1191862
2362 -1191862 -720443 -1229633 1400548 7394964 10764175 7832989 2908430 1397062 1702029
2353 1702029 -884859 -5223883 -5224766 1096801 8986462 14134005 17372592 19678822 16874448
2344 16874448 4466697 -13388296 -25061433 -23404913 -13135405 -3904362 1131739 6281588
2336 6281588 14684157 23267550 26561066 21830367 9888497 -5383151 -17236996 -20010303
2328 -20010303 -15412399 -11620783 -13463184 -16662881 -14927125 -9333233 -6104530 -7406518
2320 -7406518 -9655934 -9909437 -8464885 -5185714 906303 6803043 5848549 -3474409 -12790349
2311a2790349O15358J0544990J0942943L135197m581518p531966p579673p214349
2303a4459367n187161M13976P187203R738224O489532K421125K536645M393186
2295A3533363J317913o929938j1851659p156467K361835P240670N443573K389373
2287F348663P30349k658808q342992j0140536l745890N189529P445907K530821
2279b642957j329817Q20138M576470L789492r51952n075904p369738r393588r536581
2270b7114437l922958N886612J1780570Q810584K043117k51881K525197L891546
2262C648350K53217m842904o651549m803369j630812J191912K449442J065659
2254i320054j784179k784478p61832J533976J826536J616871K582005K844634
$$ plain form
2311 -12790349 -12174991 -1630001 9312942 12448139 7866621 334655 -7245018 -14459367
2303 -14459367 -19646528 -19232552 -12045349 -2307125 4182407 6603532 9140177 13533363
2295 13533363 14851276 7921338 -3930321 -11086788 -8724953 -1484283 3959290 6348663
2287 6348663 7079012 4420204 -3922788 -14063324 -17809214 -12619685 -5173778 -2642957
2279 -2642957 -3972774 -3152636 1423834 5213326 4261374 -814530 -8184268 -17577856 -27114437
2270 -27114437 -31037395 -25150783 -13370213 -4559629 -2516512 -2768393 -243196 3648350
2262 3648350 3901567 -941337 -7592886 -12396255 -14027067 -12835155 -10385713 -9320054
2254 -9320054 -11104233 -13888711 -14650543 -13116567 -11290031 -9673160 -7091155 -4246521
2246d246521O19766j082642J573851N992160N611137j07027l983206j399612L014640
2237E992546K614019j424268k457240J538084N547907N117843J672101j180415
2229A7420577k945381n243166p656335p573675l875656J219698M301660L767168
2221e85110O79687k542279m272113m967673n937078o479768l715032K955555Q466215
2212a6397596O703645q08084m710494Q11597R372146R737235Q07037o275397k460018
2203c219929P800951J3060582R136184J803851k994121n589962q138719r025910
2195B832927n479872O94646L960199J569813l231591n049568j895385L666974
2187b931857P841996Q982576P664482M500142n10418o017121q693942o789036
$$ plain form
2246 -4246521 -3626755 -4709397 -3135546 2856614 8467751 8360724 4377518 2977906 5992546
2237 5992546 8606565 7182297 4725057 6263141 11811048 16928891 18600992 17420577
2229 17420577 14475196 9232030 1575695 -5997980 -9873636 -8653938 -4352278 -585110
2221 -585110 94577 -2447702 -6719815 -11687488 -17624566 -24104334 -27819366 -24863811 -16397596
2212 -16397596 -9693951 -10502035 -15212529 -14400932 -5028786 4708449 5515486 -759911 -3219929
2203 -3219929 4581022 17641604 26777788 28581639 25587518 19997556 11858837 2832927
2195 2832927 -2646945 -1952299 2007900 3577713 346122 -4703446 -6598831 -2931857
2187 -2931857 4910139 13892715 21557197 26057339 25546921 19529800 10835858 4046822
2179D046822l263855k398734l512237j830157L473986O518813K881373l227228
2171B688783m313351L04170M635348M752599K042643j611969n924036q767412
2163f193225o659949o30771L914787N460002Q385452J3344166J2705246J939195
2155C2264903j0330183j2306004n554301k016276n939654r093470n132880J482111
2147a6625754M640328N507041O628632M925691j923588p807270n363188K427950
2139g590158N962127K531785j628107j997569o98723k64708N2586n1866l164194
2130f848827q209036r215896l604241L241435N415830L956703K757033J598102
2122a0908897j235999l000488K6219M742215M057547k074434n190324q8779P659403
$$ plain form
2179 4046822 782967 -1615767 -5128004 -6958161 -3484175 3034638 5916011 2688783
2171 2688783 -1624568 -1320398 3314950 8067549 10110192 8498223 2574187 -6193225
2163 -6193225 -12853174 -13483945 -9569158 -4109156 4276296 17620462 30325708 32264903
2155 32264903 21934720 9628716 4074415 2058139 -3881515 -12974985 -18107865 -16625754
2147 -16625754 -11985426 -6478385 150247 5075938 3152350 -4654920 -10018108 -7590158
2139 -7590158 -1628031 903754 -724353 -2721922 -3420645 -3685353 -3632767 -3684633 -6848827
2130 -6848827 -15057863 -24273759 -27878000 -24636565 -19220735 -15264032 -12506999 -10908897
2122 -10908897 -12144896 -15145384 -15119165 -10376950 -6319403 -8393837 -13584161 -13672940 -6013537
2113f013537R541358M969185k21009k925814m797613o247208m440767J071760
2105i063645N277119L511869j992072m630817j561138L503954N426741K997027
2097C469038j332275m762219n904329m760887k657559j681972k839770m742115
2089b5212088m875347k136560K336746O465897Q597163P861198M379746k40125
2081b823370l207455k394809J622057N714914O974242N309085K828886R82568
2073A5006118m69877j593912j351150L07480J247403o2638k142485l104500l703753
2064D132686m482129k164996N446321J1977553P736015n403665j2674386n452877
2056h85478N748182N831023k846592m572406N219406J2627023O011609p374029
$$ plain form
2113 -6013537 3527821 8497006 8275997 5350183 552570 -5694638 -10135405 -9063645
2105 -9063645 -3786526 -274657 -2266729 -6897546 -8458684 -4954730 472011 3469038
2097 3469038 2136763 -2625456 -8529785 -13290672 -15948231 -17630203 -20469973 -25212088
2089 -25212088 -30087435 -32223995 -29887249 -23421352 -14824189 -6962991 -2583245 -2823370
2081 -2823370 -6030825 -8425634 -6803577 -1088663 5885579 11194664 14023550 15006118
2073 15006118 14536241 12942329 11591179 11898659 13146062 13083424 10940939 7836439 4132686
2064 4132686 -349443 -2514439 2931882 14909435 22645450 17241785 4567399 -885478
2056 -885478 4862704 10693727 7847135 3274729 8494135 21121158 27132767 19758738
2048A9758738j2761175p520663m39257L011153M465432M356642M07270m867373
2040F410767m538828J887855N720203J298227n526922o265381j672625J559581
2032a127123J817884K608074L642179L09778p121601j1305662p645655m69587
2024a9291713L913189N104111N637806N122765K670641J195647L004010L983533
2016A1339989o50046o562288m611817M665772R632470L541460n938724q019860
2008C396956k973500J205978J118536l73962j435078k549398k173379J551189
2000b232658N287045L841900p29257o35931N632736J0071134O763728q3728l866398
1991B4048571n109047p550162r693796p496702k729154j115491k910638k640278
$$ plain form
2048 19758738 6997563 -523100 -962357 2048796 6514228 10870870 11278140 6410767
2040 6410767 1871939 3759794 9479997 10778224 5251302 -1014079 -2686704 -1127123
2032 -1127123 690761 3298835 6941014 7250792 129191 -11176471 -18822126 -19291713
2024 -19291713 -15378524 -10274413 -4636607 486158 3156799 4352446 7356456 11339989
2016 11339989 10689943 4127655 -484162 4181610 13814080 17355540 11416816 3396956
2008 3396956 423456 1629434 2747970 2374008 938930 -1610468 -3783847 -2232658
2000 -2232658 3054387 6896287 6167030 5531099 11163835 21234969 27998697 27914969 24048571
1991 24048571 18939524 11389362 1695566 -5801136 -8530290 -9645781 -12556419 -15196697
1983a5196697R69866K075574k344896o075891k446642M798512O111588J33380
1975a1975206l786911J503149J1087574J4464788Q484146k59103m374638l068729
1967A2075070o95786j238195n172723r693261j1014456p701751k281375J307342
1959b4415135J749467Q94154R69560K675223N009338N165488L25353p447681j0211036
1950b5285269l085212O933409P898244n08929n177944K043600J1901227J0538819
1942E257945q00911p831667k903396O212604Q230763J946861m940022o025708
1934h53531j965591J959297J900041p12667j429473J055868L067899J489960j658086
1925B853717k486395l26369L061662O298535P468088M079349k327362n459140
$$ plain form
1983 -15196697 -14226831 -12151257 -14496153 -20572044 -23018686 -18220174 -12108586 -11975206
1975 -11975206 -15762117 -14258968 -3171394 11293394 19777540 19518437 15143799 12075070
1967 12075070 11379284 10141089 4968366 -4724895 -15739351 -23441102 -25722477 -24415135
1959 -24415135 -22665668 -21771514 -20801954 -18126731 -13117393 -7951905 -7626552 -15074233 -25285269
1950 -25285269 -28370481 -21437072 -13538828 -14047757 -19225701 -17182101 -5280874 5257945
1942 5257945 4457034 -3374633 -6278029 -65425 8165338 10112199 5172177 -853531
1934 -853531 -2819122 -859825 1040216 327549 -1101924 -46056 3021843 4511803 2853717
1925 2853717 367322 40953 3102615 9401150 16869238 20948587 18621225 13162085
1917A3162085k477480J326269Q53556j073537n56426j151222o785554j1564218
1909h266527p717265P7434Q40047m365070l945602M387890R673921N921197K30783
1900c163192j350158k389086m911184l129087M216327P668271K002906l807998
1892d863201j025569M896671M976416J520112J116873J761879r46803k657913
1884D778465J804337O062048J218576q028459r910086l985824O14773J716155
1876e730015M472843P582909M256932l146391m029033L262426Q512755O258621
1868B1441047K604400K207695P32708m913088r383066p434953j514650L452778
1860G192871N656884M108193j521276o581696n136521K28403J193683k156528
$$ plain form
1917 13162085 10684605 12010874 12864430 11790893 11234467 10083245 3297691 -8266527
1909 -8266527 -15983792 -15906358 -15066311 -19431381 -23376983 -18989093 -9315172 -3393975 -3163192
1900 -3163192 -4513350 -6902436 -11813620 -14942707 -10726380 -3058109 -1055203 -4863201
1892 -4863201 -5888770 -992099 3984317 5504429 6621302 8383181 7436378 4778465
1884 4778465 6582802 12644850 13863426 5834967 -4075119 -8060943 -7446170 -5730015
1876 -5730015 -1257172 6325737 10582669 7436278 3407245 6669671 15182426 21441047
1868 21441047 24045447 26253142 26985850 22072762 12689696 5254743 3740093 7192871
1860 7192871 12849755 16957948 15436672 8854976 3718455 3946858 5140541 2984013
1852B984013n95574P915550J2687451O413021l771916p982453o881023n874434
1844D894635m577147o07306K735647J260566k117353j477117L450319Q267950
1836A1830194R850636O971767l23258p892658r433670n234908k889606n409443
1828b530946o268010j292762L261543J567272j550897j21464J492010k539687
1820g982941o429862j667141O118695M069185n958818p881217M077694J5756684
1812A02279J3620837L060158k017156Q06176K632405j196858n547806n145837
1804F314198k049048r79571j968642j439355J306933K702745N93949k101292j863972
1795E15945k16919j060805l812376m191861j808855j278266m150424n394672j240557
$$ plain form
1852 2984013 2388439 10303989 22991440 29404461 25632545 17650092 10769069 4894635
1844 4894635 317488 -289818 2445829 3706395 1589042 111925 3562244 11830194
1836 11830194 21680830 28652597 28329339 20436681 11003011 5768103 2878497 -2530946
1828 -2530946 -8798956 -10091718 -6830175 -5262903 -6813800 -6935264 -5443254 -7982941
1820 -7982941 -14412803 -16079944 -9961249 -5892064 -11850882 -19732099 -15654405 102279
1812 102279 13723116 16783274 14766118 15572294 18204699 17007841 11460035 6314198
1804 6314198 4265150 3285579 1316937 -122418 1184515 3887260 4481209 2379917 515945
1795 515945 299026 -761779 -4574155 -8766016 -10574871 -11853137 -16003561 -21398233 -22638790
1786b2638790M139842M070526j535312o415347n381072J158097Q165696R863175
1778h573185N187615J71503J202749N596637M499708l620098r532082o408774
1770a1475927Q39586M089207L032347J800781O67451j959311l882795k280452
1762i169113Q45023J933829J103335l58734l037691n494816l270588L118010N994556
1753h336189K153141j149504J331222L579965N45006n21362O750215J2793407
1745A7145901N862421o441674p345625J890924M376573m173156r765808m856552
1737c306996R35985J96609m45467M247991P032524K233430k701296R8895O048269
1728A4339944P568191O028373M947316J469454n545702q541122k842655L366609
$$ plain form
1786 -22638790 -18498948 -14428422 -15963734 -22379081 -27760153 -26602056 -18436360 -8573185
1778 -8573185 -3385570 -3214067 -2011318 3585319 8085027 4464929 -5067153 -11475927
1770 -11475927 -10636341 -6547134 -3514787 -1714006 -1046555 -3005866 -6888661 -9169113
1762 -9169113 -8324090 -6390261 -5286926 -5645660 -8683351 -14178167 -17448755 -14330745 -8336189
1753 -8336189 -6183048 -7332552 -6001330 -2421365 -1876359 -2397721 4352494 17145901
1745 17145901 23008322 16566648 9221023 11111947 15488520 11315364 1549556 -3306996
1737 -3306996 -2371011 -2174402 -2619869 1628122 8660646 10894076 8192780 8291675 14339944
1728 14339944 21908135 27936508 32883824 34353278 28807576 20266454 17423799 20790408
1720B0790408J228749m636355m999825j360838p15113j850545M81561L139908
1712A2077950m58923o638636n761290J852381O597371M899408K015773L51472
1704A4935506k888994n986859k813359N202996Q334889K927341l481369m764971
1696A1465180m070595m747870l130625L253634Q182304M965729l169883p835093
1688D912781o614986l225527p3368K809738L726098O98703l874004n397667l668979
1679a0707211k526970l134041k611175K6162J719290J091931J598561N547312
1671h996141Q677599N432600k280623o757760m671646n73271P68229N61682J988280
1662e851051M254395M476442K713766J248913P73297O76623J091185J313620j185334
$$ plain form
1720 20790408 22019157 17382802 12382977 11022139 10307026 8456481 8938042 12077950
1712 12077950 11619027 4980391 -780899 1071482 7668853 12568261 14584034 14935506
1704 14935506 12046512 6059653 3246294 8449290 16784179 19711520 16230151 11465180
1696 11465180 7394585 2646715 -483910 2769724 10952028 15917757 12747874 4912781
1688 4912781 -1702205 -4927732 -5001100 -2191362 1534736 2233439 -1640565 -7038232 -10707211
1679 -10707211 -13234181 -16368222 -18979397 -18953235 -17233945 -16142014 -14543453 -8996141
1671 -8996141 -318542 5114058 2833435 -3924325 -8595971 -9169242 -8401013 -7839331 -5851051
1662 -5851051 -1596656 2879786 5593552 6842465 7615762 8292385 9383570 10697190 9511856
$$ [...]
##END NTUPLES=NMR SPECTRUM
##END=
