##TITLE=31Pdec_LR-796-AK1-OH
 D2O, 24 sc
 29.1.2025
##JCAMPDX= 6.0         $$ Bruker NMR JCAMP-DX V2.0
##DATA TYPE= NMR SPECTRUM
##DATA CLASS= NTUPLES
##ORIGIN= UXNMR, Bruker Analytische Messtechnik GmbH
##OWNER= root
$$ XWIN-NMR		Version 3.5
$$ Wed Jan 29 16:26:55 2025 Russian Standard Time (UT+4h)  she@DPX200
##.OBSERVE FREQUENCY= 81.013821
##.OBSERVE NUCLEUS= ^31P
##.ACQUISITION MODE= SIMULTANEOUS
##.ACQUISITION SCHEME= undefined
##.AVERAGES= 24
##.DIGITISER RES= 17
##SPECTROMETER/DATA SYSTEM= spect
##.PULSE SEQUENCE= zgpg30
##.SOLVENT NAME= CDCl3
##.SHIFT REFERENCE= (INTERNAL, CDCl3, 0, 198.062)
##AUDIT TRAIL= $$ (NUMBER, WHEN, WHO, WHERE, WHAT)
$$ ##TITLE= Audit trail, XWIN-NMR		Version 3.5
$$ ##JCAMPDX= 5.01
$$ ##ORIGIN= Bruker BioSpin GmbH
$$ ##OWNER= she
$$ F:/spectra/data/she/nmr/P31/2/pdata/1/auditp.txt
$$ ##AUDIT TRAIL=  $$ (NUMBER, WHEN, WHO, WHERE, WHAT)
(   1,<2025-01-29 16:25:43.06 +0400>,<she>,<DPX200>,
      <created by zg, POWCHK disabled, PULCHK disabled
       configuration hash MD5:
       00 E9 B6 7A A2 85 ED C7 34 08 36 98 17 FE 4E 26
       data hash MD5: 32K
       83 D2 A9 2D 9E 16 5C A8 2E 18 D0 A4 C2 AA 34 65>)
(   2,<2025-01-29 16:25:49.92 +0400>,<she>,<DPX200>,
      <Start of raw data processing
       efp BC_mod = 2 LB = 1.5 FT_mod = 6 PKNL = 1 PHC0 = 1642.641 PHC1 = 308.6904 SI = 64K 
       data hash MD5: 64K
       27 F5 01 F7 C2 5C FB 1C 0A 8E 4E 80 60 A9 94 11>)
(   3,<2025-01-29 16:26:17.71 +0400>,<she>,<DPX200>,
      <pk PHC0 = 138.2598 PHC1 = -328.9999 
       data hash MD5: 64K
       9C E4 3B FA E4 F4 2D 70 48 D0 4C F7 9E 6B CF 03>)
$$ ##END=
$$ 
$$ hash MD5
$$ 19 CC DF 7D 59 06 6C D3 C5 31 FC 77 87 57 52 60
##$RELAX= 
##$RELAX= 
##$RELAX= 
##$RELAX= 
##$RELAX= 
##$RELAX= 
##$RELAX= 
##$RELAX= 
$$ Bruker specific parameters
$$ --------------------------
##$DU= <F:/spectra>
##$EXPNO= 2
##$NAME= <P31>
##$PROCNO= 1
##$TYPE= <nmr>
##$USER= <she>
##$AMP= (0..31)
100 100 100 100 100 100 100 100 100 100 100 100 100 100 100 100 100 100 
100 100 100 100 100 100 100 100 100 100 100 100 100 100 
##$AQSEQ= 0
##$AQ_mod= 1
##$AUNM= <au_zg>
##$AUTOPOS= <>
##$BF1= 81.014009
##$BF2= 200.13
##$BF3= 200.13
##$BF4= 200.13
##$BF5= 200.13
##$BF6= 200.13
##$BF7= 200.13
##$BF8= 200.13
##$BYTORDA= 1
##$CFDGTYP= 0
##$CFRGTYP= 5
##$CHEMSTR= <none>
##$CNST= (0..31)
1 1 145 1 1 1 1 1 1 1 1 1 1 1 1 1 1 1 1 1 1 1 1 1 1 1 1 1 1 1 1 1 
##$CPDPRG= <waltz16>
##$CPDPRG1= <>
##$CPDPRG2= <waltz16>
##$CPDPRG3= <>
##$CPDPRG4= <mlev>
##$CPDPRG5= <mlev>
##$CPDPRG6= <mlev>
##$CPDPRG7= <mlev>
##$CPDPRG8= <mlev>
##$CPDPRGB= <>
##$CPDPRGT= <>
##$D= (0..31)
0 1 0 0 0 0 0 0 0 0.06 0 0.03 2e-05 3e-06 0 0 0.0002 0 0 0 0 0 0 0 0 0 
0 0 0 0 0 0 
##$DATE= 1738153542
##$DBL= (0..7)
120 120 120 11 120 120 24 19 
##$DBP= (0..7)
150 150 150 150 150 150 150 150 
##$DBP07= 0
##$DBPNAM0= <>
##$DBPNAM1= <>
##$DBPNAM2= <>
##$DBPNAM3= <>
##$DBPNAM4= <>
##$DBPNAM5= <>
##$DBPNAM6= <>
##$DBPNAM7= <>
##$DBPOAL= (0..7)
0.5 0.5 0.5 0.5 0.5 0.5 0.5 0.5 
##$DBPOFFS= (0..7)
$$ [...]
##$SUBNAM2= <"">
##$SUBNAM3= <"">
##$SUBNAM4= <"">
##$SUBNAM5= <"">
##$SUBNAM6= <"">
##$SUBNAM7= <"">
##$SUBNAM8= <"">
##$SUBNAM9= <"">
##$SW= 400.765351723535
##$SWIBOX= (0..15)
0 1 3 0 0 0 0 0 0 0 0 0 0 0 0 0 
##$SW_h= 32467.5324675325
##$TD= 32768
##$TD0= 1
##$TE= 0
##$TE2= 300
##$TE3= 300
##$TEG= 300
##$TL= (0..7)
0 120 53 12 22 120 120 120 
##$TP= (0..7)
150 150 150 150 150 150 150 150 
##$TP07= 0
##$TPNAME0= <>
##$TPNAME1= <>
##$TPNAME2= <>
##$TPNAME3= <>
##$TPNAME4= <>
##$TPNAME5= <>
##$TPNAME6= <>
##$TPNAME7= <>
##$TPOAL= (0..7)
0.5 0.5 0.5 0.5 0.5 0.5 0.5 0.5 
##$TPOFFS= (0..7)
0 0 0 0 0 0 0 0 
##$TUNHIN= 0
##$TUNHOUT= 0
##$TUNXOUT= 0
##$USERA1= <user>
##$USERA2= <user>
##$USERA3= <user>
##$USERA4= <user>
##$USERA5= <user>
##$V9= 5
##$VALIST= <valist>
##$VCLIST= <CCCCCCCCCCCCCCC>
##$VD= 0
##$VDLIST= <DDDDDDDDDDDDDDD>
##$VPLIST= <PPPPPPPPPPPPPPP>
##$VTLIST= <TTTTTTTTTTTTTTT>
##$WBST= 1024
##$WBSW= 4
##$XGAIN= (0..3)
0 0 0 0 
##$XL= 0
##$YL= 0
##$YMAX_a= 6137
##$YMIN_a= -2747
##$ZGOPTNS= <>
##$ZL1= 120
##$ZL2= 120
##$ZL3= 120
##$ZL4= 120
##$ABSF1= 0
##$ABSF2= 0
##$ABSG= 0
##$ABSL= 0
##$ALPHA= 0
##$AQORDER= 0
##$ASSFAC= 0
##$ASSFACI= 0
##$ASSFACX= 0
##$ASSWID= 0
##$AUNMP= <proc_1d>
##$AZFE= 0.1
##$AZFW= 0.5
##$BCFW= 0
##$BC_mod= 2
##$BYTORDP= 0
##$COROFFS= 0
##$CY= -3
##$DATMOD= 1
##$DC= 0
##$DFILT= <>
##$DTYPP= 0
##$F1P= 0
##$F2P= 0
##$FCOR= 1
##$FTSIZE= 65536
##$FT_mod= 6
##$GAMMA= 0
##$GB= 0
##$INTBC= 1
##$INTSCL= 9.790993e-09
##$ISEN= 30
##$LB= 1.5
##$LEV0= 0
##$LPBIN= 0
##$MAXI= 10000
##$MC2= 0
##$MEAN= 0
##$ME_mod= 0
##$MI= 50
##$NCOEF= 0
##$NC_proc= -9
##$NLEV= 6
##$NOISF1= 182.463
##$NOISF2= 159.3651
##$NSP= 0
##$NTH_PI= 0
##$NZP= 0
##$OFFSET= 198.0616
##$PC= 4
##$PHC0= 1780.901
##$PHC1= -20.30951
##$PH_mod= 1
##$PKNL= yes
##$PPARMOD= 0
##$PSCAL= 0
##$PSIGN= 0
##$REVERSE= no
##$SF= 81.0140089999434
##$SI= 65536
##$SIGF1= 159.3651
##$SIGF2= -187.1042
##$SINO= 113.3802
##$SIOLD= 16384
##$SREGLST= <1H.CDCl3>
##$SSB= 0
##$STSI= 65536
##$STSR= 0
##$SW_p= 32467.5324675325
##$SYMM= 0
##$S_DEV= 0
##$TDeff= 32768
##$TDoff= 0
##$TI= <>
##$TILT= no
##$TM1= 0
##$TM2= 0
##$TOPLEV= 0
##$USERP1= <user>
##$USERP2= <user>
##$USERP3= <user>
##$USERP4= <user>
##$USERP5= <user>
##$WDW= 1
##$XDIM= 65536
##$YMAX_p= 283960286
##$YMIN_p= -90624703
$$ End of Bruker specific parameters
$$ ---------------------------------
##NTUPLES= NMR SPECTRUM
##VAR_NAME=  FREQUENCY,     SPECTRUM/REAL,   SPECTRUM/IMAG
##SYMBOL=    X,             R,               I
##VAR_TYPE=  INDEPENDENT,   DEPENDENT,       DEPENDENT
##VAR_FORM=  AFFN,          ASDF,            ASDF
##VAR_DIM=   65536,         65536,           65536
##UNITS=     HZ,            ARBITRARY UNITS, ARBITRARY UNITS
##FACTOR=    0.49542278885378, 1,            1
##FIRST=     16045.7642231865, 0,            0
##LAST=      -16421.768244346, 0,            0
##MIN=       -16421.768244346, -90624703,    0
##MAX=       16045.7642231865, 283960286,    0
$$ Real data points
##PAGE= N=1
##DATA TABLE= (X++(R..R)), XYDATA
$$ [...]
$$ plain form
40615 -7117195 -8592118 -7032532 -1620414 4110257 4909493 802107 -2308089 -864473
40607 -864473 1606844 745402 -1937984 -2679088 -2075577 -3015936 -4687560 -4054190 -1457260
40598 -1457260 623189 2830411 7196156 11217929 9957634 4018435 -744385 -2040267
40590 -2040267 -3436457 -6616552 -7802196 -4426635 342280 2875330 3894348 4853638
40582 4853638 4461241 2564014 2828604 7038200 10660358 8944325 4066267 1072140
40574 1072140 -299427 -3855266 -8966982 -10683196 -7522387 -3565100 -2222071 -2686707
40566 -2686707 -3397297 -4566363 -5840206 -5184794 -1887156 2014710 4555402 5749174
40558 5749174 5982554 5187712 4437747 5576227 8155947 9373250 8173428 6653751 5968810
$$ packed form
40615g117195j474923J559586N412118N730671P99236m107386l110196J443616
40607h64473K471317q61442k683386p41104O03511r40359j671624O33370K596930
40598a457260K080449K207222M365745M021773j260295n939199m762820j295882
40590b040267j396190l180095j185644L375561M768915K533050J019018R59290
40582D853638l92397j897227K64590M209596L622158j716033m878058k994127
40574A072140j371567l555839n111716j716214L160809L957287J343029m64636
40566b686707p10590j169066j273843O55412L297638L901866K540692J193772
40558E749174K33380p94842p49965J138480K579720J217303j199822j519677o84941
$$ plain form
40549 5968810 3852318 -1395210 -6799197 -7608268 -3263925 2012749 4112369 2595780
40541 2595780 -152698 -1399495 300669 4311158 8204734 9550180 7756797 4157133
40533 4157133 688894 -1405359 -2360266 -3702557 -6422791 -8992671 -8387835 -3853832
40525 -3853832 1419791 3420012 1332051 -2485012 -5625403 -7384329 -7934472 -7438823
40517 -7438823 -6382234 -5735946 -6012404 -6356678 -5164648 -2052686 906233 827201 -2441101
40508 -2441101 -5319113 -4384246 -604424 2151788 2386783 2148441 2704920 2404207 603719
40499 603719 611937 5428108 12318872 15364020 12935866 9222610 8107349 8838260 8765598
40490 8765598 7397832 5918669 4794801 3931628 3876976 4959201 6129825 6418434 6808751
$$ packed form
40549E968810k116492n247528n403987q09071M344343N276674K099620j516589
40541B595780k748478j246797J700164M010489L893576J345446j793383l599664
40533D157133l468239k094253r54907j342291k720234k569880O04836M534003
40525c853832N273623K000221k087961l817063l140391j758926n50143M95649
40517g438823J056589O46288k76458l44274J192030L111962K958919p9032l268302
40508b441101k878012R34867L779822K756212K34995k38342N56479l00713j800488
40499F03719Q218M816171O890764L045148k428154l713256j115261P30911p2662
40490H765598j367766j479163j123868q63173n4652J082225J170624K88609L90317
$$ plain form
40481 6808751 8745021 11051861 10386604 5341297 -1319747 -5366821 -5217269 -2569834
40473 -2569834 441869 3644338 8207578 14337885 20266296 23658977 23657121 21155386 17334457
40464 17334457 12691708 7703660 3468996 695704 -1564912 -4946443 -9268109 -11996698
40456 -11996698 -10815873 -6152602 -711413 2783670 2914238 -88436 -3859000 -4647365
40448 -4647365 -826717 4202665 4878042 83267 -5216811 -6247890 -4113518 -3044872
40440 -3044872 -3961002 -4105867 -2268525 -621030 -889932 -2038950 -2895425 -4033026 -5302562
40431 -5302562 -4222063 649074 6484649 8888245 6895966 3313470 922406 151743
40423 151743 -216680 -1595118 -4159690 -5860304 -4284913 -675063 176169 -3787655 -7979032
$$ packed form
40481F808751J936270K306840o65257n045307o661044m047074J49552K647435
40473b569834L011703L202469M563240O130307N928411L392681j856k501735l820929
40464A7334457m642749m988048m234664k773292k260616l381531m321666k728589
40456a1996698J180825M663271N441189L495083J30568l002674l770564p88365
40448d647365L820648N029382O75377m794775n300078j031079K134372J068646
40440c044872r16130j44865J837342J647495k68902j149018q56475j137601j269536
40431e302562J080499M871137N835575K403596j992279l582496k391064p70663
40423A51743l68423j378438k564572j700614J575391L609850Q51232l963824m191377
$$ plain form
40414 -7979032 -6693171 -789954 3857315 4392433 3266712 2943448 2758824 1651591 63253
40405 63253 -1831991 -4239881 -5287574 -2294202 3366536 6751216 6412491 6856948 11505511
40396 11505511 17093346 18251524 14414030 8787650 3366827 -1295150 -3764818 -3152398
40388 -3152398 -1226801 297576 2764729 7427964 11454073 11292891 8381495 6939704
40380 6939704 7265732 6023991 2514220 -350677 -1198174 -1302501 -287019 3955925 9989588
40371 9989588 12758244 10694726 8078204 8042492 8071764 5512716 2918416 3640023 5645208
40362 5645208 4551552 577289 -2235028 -2452691 -2537080 -4226058 -6511520 -8165367 -8900372
40353 -8900372 -7904673 -4431017 -329342 970859 -1025481 -2790701 -1373519 1849707
$$ packed form
40414g979032J285861N903217M647269N35118j125721l23264j84624j107233j588338
40405F3253j895244k407890j047693K993372N660738L384680l38725M44457M648563
40396A1505511N587835J158178l837494n626380n420823m661977k469668O12420
40388c152398J925597J524377K467153M663235M026109j61182k911396j441791
40380F939704L26028j241741l509771k864897q47497j04327J015482M242944O033663
40371I989588K768656k063518k616522l5712K9272k559048k594300P21607K005185
40362E645208j093656l974263k812317k17663q4389j688978k285462j653847p35005
40353h900372R95699L473656M101675J300201j996340j765220J417182L223226
$$ plain form
40345 1849707 3423395 2473841 1539503 3137374 6709310 9378438 9344426 7858826 7434781
40336 7434781 8749010 10457179 11686286 12860812 13785108 13047246 10336055 7415256
40328 7415256 5530774 3790283 1592975 435345 1146990 1524792 -304539 -1865299
40320 -1865299 694943 6414253 10073883 9051887 6188726 5258721 6827007 9640464
40312 9640464 13072750 16399319 17864779 16451653 13364701 10459819 8266680 6423008
40304 6423008 4806757 3382960 2089497 1490548 2228926 3359313 2932309 977848 22612
40295 22612 1464675 3224160 2595086 -992 -1929303 -2056168 -1761401 -2670078 -4706794
40286 -4706794 -6063968 -4266778 1843143 10012496 15392215 15028117 11056590 8007033
$$ packed form
40345A849707J573688r49554r34338J597871L571936K669128l4012j485600m24045
40336G434781J314229J708169J229107J174526R24296p37862k711191k920799
40328G415256j884482j740491k197308j157630P11645L77802j829331j560760
40320a865299K560242N719310L659630j021996k863161r30005J568286K813457
40312I640464L432286L326569J465460j413126l086952k904882k193139j843672
40304F423008j616251j423797j293463n98949P38378J130387m27004j954461r55236
40295B2612J442063J759485o29074k596078j928311j26865K94767r08677k036716
40286d706794j357174J797190O109921Q169353N379719l64098l971527l049557
$$ plain form
40278 8007033 7444835 7010476 4641982 1848277 2009023 6418830 12650978 16334092 14407325
40269 14407325 7424315 -837938 -6340142 -7644321 -5972997 -3096270 3864 2650658
40261 2650658 3953987 3466770 1826725 149330 -989274 -1590093 -1609598 -961596 -82287
40252 -82287 297554 351657 1470103 4514841 7999680 9049186 6451280 2005860 -1369938
40243 -1369938 -1997351 254983 4510294 8753865 10515621 9311767 7698980 8329900
40235 8329900 10462635 10901554 7842201 2135169 -4500050 -10184862 -12210774 -8667497
40227 -8667497 -1565161 4024169 4984235 2488882 -1126169 -5156666 -8998359 -10663040
40219 -10663040 -9131202 -6311587 -4435667 -3079549 -954455 998461 1004594 -207793
$$ packed form
40278H007033n62198m34359k368494k793705J60746M409807O232148L683114j926767
40269A4407325o983010q262253n502204j304179J671324K876727L100134K646794
40261B650658J303329m87217j640045j677395j138604o00819j9505O48002Q79309
40252h2287L79841N4103J118446L044738L484839J049506k597906m445420l375798
40243a369938o27413K252334M255311M243571J761756j203854j612787O30920
40235H329900K132735M38919l059353n707032o635219n684812k025912L543277
40227h667497P102336N589330R60066k495353l615051m030497l841693j664681
40219a0663040J531838K819615J875920J356118K125094J952916O133j212387
$$ plain form
40211 -207793 -327213 936996 1973478 2607256 4325752 6959688 8098667 6791210 5363165
40202 5363165 6061617 7637430 6992894 3346088 -823296 -2953965 -3504266 -5144606 -8731598
40193 -8731598 -11029876 -8174488 -1515653 2561808 304294 -4382754 -5477825 -3370754
40185 -3370754 -3509097 -7254367 -9372856 -6053648 -578281 2089382 2603187 4856091
40177 4856091 8523451 8935769 4376511 -726802 -1466321 1407581 3073415 1017099
40169 1017099 -2228356 -2657307 410886 4087834 5987687 6974491 8854438 10632485
40161 10632485 9505790 5630198 3078730 4624116 7906723 8978709 7755065 6999575
40153 6999575 7094858 5499593 1608743 -1323858 -486148 2854901 5681381 7070258 7703261
$$ packed form
40211b07793j19420J264209J036482O33778J718496K633936J138979j307457j428045
40202E363165O98452J575813o44536l646806m169384k130669n50301j640340l586992
40193h731598k298278K855388O658835M077461k257514m687048j095071K107071
40185c370754j38343l745270k118489L319208N475367K667663N13805K252904
40177D856091L667360M12318m559258n103313p39519K873902J665834k056316
40169A017099l245455m28951L068193L676948J899853R86804J879947J778047
40161A0632485j126695l875592k551468J545386L282607J071986j223644p55490
40153F999575R5283j595265l890850k932601Q37710L341049K826480J388877O33003
$$ plain form
40144 7703261 7245368 4842493 1622221 212960 1476540 3517335 4388868 4239529 4102013
40135 4102013 3978245 3345406 2774417 3636623 6155206 8693695 9373110 8034702 6390070
40126 6390070 6370093 8253125 10156038 9563488 5962402 2043311 1563546 5532504 11040388
40117 11040388 14460854 15220160 15369907 15928608 15543189 13403936 11570307 12486117 15095602
40108 15095602 15765795 13128322 9683325 7802482 6504156 4045175 1778293 2437696
40100 2437696 5244860 6084597 3305555 339365 718871 2808797 2119315 -2437196 -7474900
40091 -7474900 -9924222 -10044020 -9203184 -7325283 -4040041 -726012 346873 -1582745
40083 -1582745 -5136062 -8088564 -8851894 -7476084 -5705308 -5298792 -6019889 -6224077 -5355358
$$ packed form
40144G703261m57893k402875l220272j409261J263580K040795Q71533j49339j37516
40135D102013j23768o32839n70989Q62206K518583K538489O79415j338408j644632
40126F390070j9977J883032J902913n92550l601086l919091m79765L968958N507884
40117A1040388L420466P59306J49747N58701l85419k139253j833629R15810K609485
40108A5095602O70193k637473l444997j880843j298326k458981k266882O59403
40100B437696K807164Q39737k779042k966190L79506K089926o89482m556511n037704
40091g474900k449322j19798Q40836J877901L285242L314029J072885j929618
40083a582745l553317k952502p63330J375810J770776M06516p21097k04188Q68719
$$ plain form
40074 -5355358 -4103124 -1908332 2925668 9183165 11693401 7358693 414267 -1971709
40066 -1971709 1346445 4616964 3337049 -536617 -2652265 -2072874 -876713 -437981
40058 -437981 -585691 -972360 -1097690 -23995 2080287 3167287 2003060 689176 2269135
40049 2269135 6223122 8544329 6502398 1605736 -2541670 -3964789 -3493523 -3274025
40041 -3274025 -4521849 -6229777 -6284010 -4421844 -3196187 -4565893 -6307532 -4179721
40033 -4179721 2127864 7631380 7762577 3543586 -407699 -1400909 -222445 1666159
40025 1666159 3884883 6085670 7437856 7979671 8947685 10904755 12792624 13710147 14308802
40016 14308802 15110527 14577986 10809150 4850284 407368 -106316 2192197 4631566
$$ packed form
40074e355358J252234K194792M834000O257497K510236m334708o944426k385976
40066a971709L318154L270519j279915l873666k115648N79391J196161M38732
40058d37981j47710l86669j25330J073695K104282J087000j164227j313884J579959
40049B269135L953987K321207k041931m896662m147406j423119M71266K19498
40041c274025j247824j707928n4233J862166J225657j369706j741639K127811
40033d179721O307585N503516J31197m218991l951285r93210J178464J888604
40025A666159K218724K200787J352186N41815R68014J957070J887869R17523N98655
40016A4308802Q01725n32541l768836n958866m442916n13684K298513K439369
$$ plain form
40008 4631566 5552880 4292129 507729 -4810045 -8675168 -8307000 -4026773 943951
40000 943951 3370153 2249489 -876118 -2959209 -1862386 1072024 2004122 -452878
39992 -452878 -2776337 -1186786 2773663 4510152 3293735 2833497 4682470 5458010 2298166
39983 2298166 -2767778 -6355743 -8346373 -10023922 -10488747 -8565645 -6239868 -6307890 -7851615
39974 -7851615 -7764339 -5814848 -4283782 -3120286 227424 5747518 9737407 9939804 8290432
39965 8290432 7112649 5959908 4235447 3848133 6411262 9789359 10323508 7513534
39957 7513534 4183725 2663207 2791141 3314335 3503805 3298532 2853608 2000491 20428
39948 20428 -3173705 -5392924 -3325114 3528217 11259875 15188637 14322952 11386071 9588151
$$ packed form
40008D631566R21314j260751l784400n317774l865123L68168M280227M970724
40000I43951K426202j120664l125607k083091J096823K934410R32098k457000
39992d52878k323459J589551L960449J736489j216417m60238J848973P75540l159844
39983B298166n065944l587965j990630j677549m64825J923102K325777o8022j543725
39974g851615Q7276J949491J531066J163496L347710N520094L989889K02397j649372
39965H290432j177783j152741j724461l87314K563129L378097N34149k809974
39957G513534l329809j520518J27934N23194J89470k05273m44924q53117j980063
39948B0428l194133k219219K067810O853331P731658L928762q65685k936881j797920
$$ plain form
39939 9588151 10459151 13567995 16753512 17320006 14373815 9580764 4931976 813410
39931 813410 -2881095 -5227821 -5300325 -3521697 -651905 3197201 7087886 8561833 6548815
39922 6548815 3490333 2226220 2225750 1583247 1158521 3103474 6138325 6377537 2981490
39913 2981490 -798248 -2639423 -3419140 -3768092 -2485252 76586 988705 -672662 -1685019
39904 -1685019 429110 3629933 5134867 5568413 6030438 4442197 -617746 -4868839
39896 -4868839 -2375743 6334822 14940998 19428892 20666498 19311648 14044942 6392591
39888 6392591 2026944 4221169 9489316 12451163 12101306 10654857 9024257 6673822
39880 6673822 4101671 2404670 1451608 779548 1084955 2721038 4091715 3757310 2847468
$$ packed form
39939I588151Q71000L108844L185517N66494k946191m793051m648788m118566
39931H13410l694505k346726p2504J778628K869792L849106L890685J473947k013018
39922F548815l058482j264113m70o42503m24726J944953L034851K39212l396047
39913B981490l779738j841175p79717l48952J282840K561838R12119j661367j012357
39904a685019K114129L200823J504934M33546M62025j588241n059943m251093
39896d868839K493096Q710565Q606176M487894J237606j354850n266706p652351
39888F392591m365647K194225N268147K961847l49857j446449j630600k350435
39880F673822k572151j697001r53062o72060L05407J636083J370677l34405r09842
$$ plain form
39871 2847468 3210515 4558828 5732215 7191304 9480524 10696756 8814620 5575473
39863 5575473 4591888 6187503 7716971 8566267 10657242 13682270 14327120 11649717 9108626
39854 9108626 9052439 8823295 5187846 -263027 -3344171 -2841049 -798299 1080010 2259561
39845 2259561 1908532 -279533 -2572669 -3329386 -3922324 -6685893 -10610535 -12320827 -11199143
39836 -11199143 -10129780 -10623179 -10567923 -8112277 -4733406 -2433120 -309270 3460053
39828 3460053 7649532 8797208 5744203 1185537 -1650594 -2296574 -2413233 -3011390 -3337234
39819 -3337234 -2270065 63004 2554958 4613955 6469586 7718346 6707884 2658325
39811 2658325 -2092516 -3677565 -994513 2827538 3908527 1568541 -1894034 -4283960
$$ packed form
39871B847468L63047J348313J173387J459089K289220J216232j882136l239147
39863E575473r83585J595615J529468Q49296K090975L025028O44850k677403k541091
39854I108626n6187k29144l635449n450873l081144N03122K042750J878309J179551
39845B259561l51029k188065k293136p56717n92938k763569l924642j710292J121684
39836a1199143J069363m93399N5256K455646L378871K300286K123850L769323
39828C460053M189479J147676l053005m558666k836131o45980j16659n98157l25844
39819c337234J067169K333069K491954K058997J855631J248760j010462m049559
39811B658325m750841j585049K683052L822051J080989k339986l462575k389926
$$ plain form
39803 -4283960 -5105758 -4646950 -3035155 -634357 1565093 2744744 3276275 4405398 6731538
39794 6731538 9229494 10093061 8594910 5881696 3851583 3531963 4706575 6690716
39786 6690716 8910613 10742852 11244946 9453128 5313976 576419 -1693262 465893
39778 465893 5582809 9548015 9205669 4752028 -1342759 -6565654 -9135341 -8284327 -5320124
39769 -5320124 -3468645 -4944248 -8418831 -10589341 -9803495 -6884447 -2959883 1757216
39761 1757216 6898231 11026414 12339191 10034975 5433176 1946148 2501794 6016322
39753 6016322 8091792 6615758 4461743 4339327 3731893 -742369 -5724317 -3796280
39745 -3796280 5668029 14055939 14269957 9245174 6498062 7965214 9298664 6889429
$$ packed form
39803d283960q21798M58808J611795K400798K199450J179651N31531J129123K326140
39794F731538K497956Q63567j498151k713214k030113l19620J174612J984141
39786F690716K219897J832239N02094j791818m139152m737557k269681K159155
39778D65893N116916L965206l42346m453641o094787n222895k569687Q51014K964203
39769e320124J851479j475603l474583k170510P85846K919048L924564M717099
39761A757216N141015M128183J312777k304216m601799l487028N55646L514528
39753F016322K075470j476034k154015j22416o07434m474262m981948J928037
39745c796280R464309Q387910K14018n024783k747112J467152J333450k409235
$$ plain form
39737 6889429 1562574 -3647695 -6224315 -5301578 -2476697 -878012 -1719275 -2823636
39729 -2823636 -1928189 311343 2238074 3929654 5929145 7468436 8228978 9373813
39721 9373813 10274034 7363216 -36111 -5823995 -4011529 2722371 6841161 6644311
39713 6644311 6896243 9528361 10761160 8479437 5772610 4958357 4148455 2539244 3247965
39704 3247965 7131065 9109915 5375601 -42540 -990217 2024649 4056959 3761096
39696 3761096 3287317 2170756 -2175048 -8234604 -10765042 -8304508 -5129348 -4289508
39688 -4289508 -3385773 559763 5987251 9323282 9789978 8967023 7617783 5604461 3661819
39679 3661819 2941509 3526485 5044742 7780340 11354630 13131192 10235602 3442081
$$ packed form
39737F889429n326855n210269k576620R22737K824881J598685q41263j104361
39729b823636Q95447K239532J926731J691580J999491J539291P60542J144835
39721I373813R00221k910818p399327n787884J812466O733900M118790j96850
39713F644311K51932K632118J232799k281723k706827q14253q09902j609211P08721
39704C247965L883100J978850l734314n418141r47677L014866K032310k95863
39696C761096m73779j116561m345804o059556k530438K460534L175160Q39840
39688d289508R03735L945536N427488L336031M66696q22955j349240k013322j942642
39679C661819p20310N84976J518257K735598L574290J776562k895590o793521
$$ plain form
39671 3442081 -2622785 -3963249 -1138490 1879037 2237960 763554 -159866 -372606 -2205274
39662 -2205274 -6497454 -9808219 -7598782 -208596 6367710 6892861 2825572 71881
39654 71881 1238110 2455163 -876432 -6944383 -8884941 -3414885 4780992 9097211
39646 9097211 9065037 9041735 10154083 8424194 2188855 -3234122 -1862025 4768638 9874861
39637 9874861 10379270 9220690 9162402 8981991 7111262 5238777 5911743 8844996 11710136
39628 11710136 12989441 12372829 9865338 6270668 3406232 2265982 1898872 1253875
39620 1253875 800450 971299 579401 -1306916 -3278757 -3713084 -4002041 -6912415 -11957580
39611 -11957580 -15153536 -13940255 -10142843 -7298215 -6945447 -8369441 -10110861 -10515226
$$ packed form
39671C442081o064866j340464K824759L017527L58923j474406r23420k12740j832668
39662b205274m292180l310765K209437P390186O576306N25151m067289k753691
39654G1881J166229J217053l331595o067951j940558N470056Q195877M316219
39646I097211l2174k3302J112348j729889o235339n422977J372097O630663N106223
39637I874861N04409j158580n8288j80411j870729j872485O72966K933253K865140
39628A1710136J279305o16612k507491l594670k864436j140250l67110o44997
39620A253875m53425J70849l91898j886317j971841m34327k88957k910374n045165
39611a1957580l195956J213281L797412K844628L52768j423994j741420m04365
$$ plain form
39603 -10515226 -8373548 -4484802 -1464495 -692409 -526826 1133500 3812429 5830301
39595 5830301 7499480 10220938 12771635 11796903 7072856 3339835 4625978 8697827
39587 8697827 9958643 6822582 3084190 2050052 2654049 2642989 2712246 4945161 8739271
39578 8739271 11170690 11067448 10122388 9527210 7876309 3775657 -1146345 -3887681 -4193618
39569 -4193618 -4901632 -7547642 -9328453 -6182219 1567557 8609655 10428395 8228942
39561 8228942 6775848 8456602 11443935 13147948 12943797 11180983 8214217 5656459
39553 5656459 6090130 9546777 12305242 11502196 9064548 8280277 8355769 6302650 3168297
39544 3168297 3549380 8395805 13025451 13993616 13559311 14607244 15078110 11457815 5218816
$$ packed form
39603a0515226K141678L888746L020307P72086J65583J660326K678929K017872
39595E830301J669179K721458K550697r74732m724047l733021J286143M071849
39587H697827J260816l136061l738392j034138O03997j1060O9257K232915L794110
39578H739271K431419j03242r45060n95178j650901m100652m922002k741336l05937
39569d193618p08014k646010j780811L146234P749776P042098J818740k199453
39561H228942j453094J680754K987333J704013k04151j762814k966766k557758
39553E656459M33671L456647K758465q03046k437648p84271P5492k053119l134353
39544C168297L81083M846425M629646R68165m34305J047933M70866l620295o238999
$$ plain form
39535 5218816 1346783 1583055 3090251 3389132 3009850 3147276 3880823 5207593 7250608
39526 7250608 9052004 9439634 9202323 10084472 11730971 12215865 11323606 10118338 7446168
39517 7446168 1053980 -7039770 -11002440 -9152831 -7013448 -9250881 -12801115 -12484119
39509 -12484119 -9904905 -10795457 -15270291 -17171887 -13197152 -6657031 -917783 5080672
39501 5080672 12073027 16349447 14583603 9477306 6269942 5738878 4820275 2628813
39493 2628813 1258969 901913 -1345099 -6679204 -12034176 -13983747 -12784310 -10890085
39485 -10890085 -9331116 -7336191 -4375673 -1026646 1632875 2681691 2142511 1510158
39477 1510158 2220347 3081994 1076383 -4055202 -7928476 -6364168 -865837 3277967
$$ packed form
39535E218816l872033K36272J507196K98881l79282J37426P33547J326770K043015
39526G250608J801396L87630k37311Q82149J646499M84894q92259j205268k672170
39517G446168o392188q093750l962670J849609K139383k237433l550234L16996
39509a2484119K579214q90552m474834j901596L974735O540121N739248N998455
39501E080672O992355M276420j765844n106297l207364n31064r18603k191462
39493B628813j369844l57056k247012n334105n354972j949571J199437J894225
39485a0890085J558969J994925K960518L349027K659521J048816n39180o32353
39477A510158P10189Q61647k005611n131585l873274J564308N498331M143804
$$ plain form
39469 3277967 3719433 3033735 3854345 5103652 4502321 2478691 1344437 1758305 2172705
39460 2172705 1367905 -347187 -2433400 -4884005 -7225433 -8088165 -6529577 -3049851
39452 -3049851 1148359 5110335 7867388 8217083 5844772 2295205 -196353 -887636
39444 -887636 -810382 -801626 -108664 2454437 6394294 9451643 9968172 8904980 8864140 11073883
39434 11073883 14022585 15437869 14813920 13025205 10110532 5261344 -659460 -4500166
39426 -4500166 -4148522 -1417837 -69434 -1548267 -4127543 -5714024 -5662066 -3884564 -166171
39417 -166171 4868371 9321456 11240732 9679493 4806365 -1760294 -7044620 -9052122
39409 -9052122 -9086246 -9634902 -9947274 -6783486 -446397 3657611 2002294 -1644840 -1303689
$$ packed form
39469C277967M41466o85698Q20610J249307o01331k023630j134254M13868M14400
39460B172705q04800j715092k086213k450605k341428q62732J558588L479726
39452c049851M198210L961976K757053L49695k372311l549567k491558o91283
39444h87636P7254Q756O92962K563101L939857L057349N16529j063192m0840K209743
39434A1073883K948702J415284o23949j788715k914673m849188n920804l840706
39426d500166L51644K730685J348403j478833k579276j586481N1958J777502L718393
39417a66171N034542M453085J919276j561239m873128o566659n284326k007502
39409i052122l4124n48656l12372L163788O337089M104008j655317l647134L41151
$$ plain form
39400 -1303689 3093369 6850923 8123589 9272087 10795704 9300833 3295384 -3250668
39392 -3250668 -5807393 -4813186 -3629427 -3159300 -1331218 3149481 8819487 12908006
39384 12908006 13681846 11964194 10703816 11814689 13440327 12437155 9588882 9143506
39376 9143506 12285744 14874598 13706762 11145036 10321689 9396883 5154577 -334171
39368 -334171 -2132626 -413247 -476526 -4538954 -8525064 -8279038 -4734126 -1186036 1058628
39359 1058628 2372376 2979037 3333393 4130211 4508134 2432244 -1870366 -5182435 -5431441
39350 -5431441 -4357904 -4588853 -6164086 -7473273 -7549539 -5832484 -1727241 3813083 8134336
39341 8134336 10029366 11169714 12762076 13063078 10460312 6840748 5033880 4557196
$$ packed form
39400a303689M397058L757554J272666J148498J523617j494871o005449o546052
39392c250668k556725R94207J183759M70127J828082M480699N670006M088519
39384A2908006P73840j717652j260378J110873J625638j003172k848273m45376
39376I143506L142238K588854j167836k561726q23347r24806m242306n488748
39368c34171j798455J719379o3279m062428l986110K46026L544912L548090K244664
39359A058628J313748O06661L54356P96818L77923k075890m302610l312069k49006
39350e431441J073537k30949j575233j309187p6266J717055M105243N540324M321253
39341H134336J895030J140348J592362L01002k602766l619564j806868m76684
$$ plain form
39333 4557196 3038291 755207 441133 2904663 5828852 7014894 6255809 3878996
39325 3878996 66975 -3736641 -5054886 -3192166 -487346 93916 -2148634 -5297025
39317 -5297025 -6414603 -3692707 1656932 5627394 4902760 409829 -3600299 -4027102
39309 -4027102 -1471799 1448704 2945197 3091898 3284364 4987414 8139183 10701527
39301 10701527 10586110 7932831 4761377 2817803 2672763 4133997 6013904 6123372
39293 6123372 3499010 473839 408910 3113504 4671575 2528122 -1305160 -3341917
39285 -3341917 -3197568 -3287913 -4803750 -5855955 -3951625 610913 4484303 4590853 1568503
39276 1568503 -748851 286210 3142131 4521188 3856020 3523895 4839964 6147531
$$ packed form
39333D557196j518905k283084l14074K463530K924189J186042p59085k376813
39325C878996l812021l803616j318245J862720K704820N81262k242550l148391
39317e297025j117578K721896N349639L970462p24634m492931m010128m26803
39309d027102K555303K920503J496493J46701J92466J703050L151769K562344
39301A0701527j15417k653279l171454j943574j45040J461234J879907J09468
39293F123372k624362l025171o4929K704594J558071k143453l833282k036757
39285c341917J44349r0345j515837j052205J904330M562538L873390J06550l022350
39276A568503k317354J035061K855921J379057o65168l32125J316069J307567
$$ plain form
39268 6147531 5644158 4099807 3258906 2797060 684203 -3688618 -8147479 -9809148 -7819110
39259 -7819110 -3754048 229364 3118122 4902359 5425184 4320538 2052281 -177618
39251 -177618 -2040436 -4394634 -7196985 -8467895 -6731981 -3399180 -1062162 -282318
39243 -282318 198333 920795 1418624 1744594 2082051 1499352 -416216 -1320499 1410394
39234 1410394 6101700 8051900 5803443 2672651 1151645 -471301 -4117626 -7988735
39226 -7988735 -9192350 -7723630 -5333124 -2670494 449 1443032 1502574 2614081
39218 2614081 6529769 11266573 13928577 14524928 13891870 10101065 1328216 -8842157
39210 -8842157 -13707688 -11226370 -5590053 -885560 2661102 5518799 6586920 6184023
$$ packed form
39268F147531n03373j544351q40901m61846k112857m372821m458861j661669J990038
39259g819110M065062L983412K888758J784237N22825j104646k268257k229899
39251a77618j862818k354198k802351j270910J735914L332801K337018P79844
39243b82318M80651P22462M97829L25970L37457n82699j915568r04283K730893
39234A410394M691306J950200k248457l130792j521006j622946l646325l871109
39226g988735j203615J468720K390506K662630K670943J442583N9542J111507
39218B614081L915688M736804K662004N96351o33058l790805q772849j0170373
39210h842157m865531K481318N636317M704493L546662K857697J068121m02897
$$ plain form
39202 6184023 7437455 11684070 15091318 12985582 5973069 -1038061 -4849780 -6344020
39194 -6344020 -7361090 -7829209 -6565825 -3363751 531918 3579627 5353545 6781153
39186 6781153 8507745 9132736 6398552 779420 -3594783 -3180153 538247 2604911
39178 2604911 582926 -2587028 -2261084 2548992 8393353 11199204 9608318 4724842
39170 4724842 -1658046 -7373503 -9750918 -7730642 -4461384 -5263850 -11321656 -17196050
39162 -17196050 -16902118 -11217307 -6130264 -4667530 -3818402 -323613 3994729 5032229
39154 5032229 2360037 -375419 -125988 2853181 6670640 9958387 11852885 11401040
39146 11401040 8151063 3101018 -1553107 -4068281 -4862041 -6246274 -9681764 -13459937
$$ packed form
39202F184023J253432M246615L407248k105736p012513p011130l811719j494240
39194f344020j017070m68119J263384L202074L895669L047709J773918J427608
39186F781153J726592O24991k734184n619132m374203M14630L718400K066664
39178B604911k021985l169954L25944M810076N844361K805851j590886m883476
39170D724842o382888n715457k377415K020276L269258q02466o057806n874394
39162a7196050K93932N684811N087043J462734Q49128L494789M318342J037500
39154E032229k672192k735456K49431K979169L817459L287747J894498m51845
39146A1401040l249977n050045m654125k515174p93760j384233l435490l778173
$$ plain form
39138 -13459937 -14263398 -11116840 -6384626 -2586084 -100673 1187280 331385 -2607070
39130 -2607070 -4858575 -4147736 -2473238 -3417482 -6025942 -5102396 1432352 8923344 11723677
39121 11723677 9768019 6791368 4369578 1459868 -1268453 -1064837 2122356 4175020
39113 4175020 2064181 -2079532 -4452686 -4932624 -5954830 -7476989 -6771338 -3260709
39105 -3260709 -66923 379712 -610627 -971058 -1337262 -3120620 -5023716 -4474211 -1692746
39096 -1692746 549871 959601 648165 -128754 -2995261 -7900672 -11226675 -9760234 -5134072
39087 -5134072 -2066340 -2811812 -5243579 -6096565 -4300689 -1028163 1930543 3326829
39079 3326829 3172360 2893268 3930206 5711032 5900253 3389139 284225 -207658 2326545
$$ packed form
39138a3459937q03461L146558M732214L798542K485411J287953q55895k938455
39130b607070k251505P10839J674498r44244k608460R23546O534748P490992K800333
39121A1723677j955658k976651k421790k909710k728321K03616L187193K052664
39113D175020k110839m143713k373154m79938j022206j522159P05651L510629
39105c260709L193786M46635r90339l60431l66204j783358j903096N49505K781465
39096a692746K242617M09730l11436p76919k866507m905411l326003J466441M626162
39087e134072L067732p45472k431767q52986J795876L272526K958706J396286
39079C326829j54469k79092J036938J780826J89221k511114l104914m91883K534203
$$ plain form
39070 2326545 4893662 4717120 2491883 1225835 2486677 4967618 6625093 6873736
39062 6873736 6185362 4768168 2725541 769898 -478850 -1563772 -3310226 -4930747
39054 -4930747 -4269346 -323381 5324589 9940161 11870016 11233562 9287363 7604342
39046 7604342 7325363 8628256 10841129 12886702 13480937 11651580 7978382 4795602
39038 4795602 3901781 4330058 3814324 2319472 2292997 5025881 8600679 10317512 9574969
39029 9574969 7352329 4480948 1882893 1078532 2469819 3880718 2787067 -237903
39021 -237903 -2041894 -839977 1986529 4254899 5538244 6656860 7841471 8446848
39013 8446848 7939269 6303377 3698158 445333 -2584607 -4159782 -3622316 -1402626
$$ packed form
39070B326545K567117j76542k225237j266048J260842K480941J657475K48643
39062F873736o88374j417194k042627j955643j248748j084922j746454j620521
39054d930747O61401L945965N647970M615572J929855o36454j946199j683021
39046G604342k78979J302893K212873K045573N94235j829357l673198l182780
39038D795602q93821M28277n15734j494852k6475K732884L574798J716833p42543
39029I574969k222640k871381k598055q04361J391287J410899j093651l024970
39021b37903j803991J201917K826506K268370J283345J118616J184611O05377
39013H446848n07579j635892k605219l252825l029940j575175N37466K219690
$$ plain form
39005 -1402626 1727433 5621072 10242846 14216054 15119718 12126815 7487827 4188532
38997 4188532 2797061 2079737 2022034 3932744 7393594 9546557 8486481 5517023 2850689
38988 2850689 744365 -1676841 -4217227 -5860342 -6198170 -5258000 -2971130 -96276
38980 -96276 1601433 1600253 1723274 3215641 4086300 1686961 -2966551 -5983139 -5390279
38971 -5390279 -2916018 -1213629 -1451221 -3462772 -6036117 -7006720 -5255776 -2783240
38963 -2783240 -2655025 -4690335 -5471721 -3102362 340996 1897828 1223363 101457 270078
38954 270078 2566676 6493574 9843885 10502328 9279983 8958870 9855773 8958498 4896264
38945 4896264 1046194 1269363 4576492 6803143 6122950 3908918 1178369 -2260314
$$ packed form
39005a402626L130059L893639M621774L973208R03664k992903m638988l299295
38997D188532j391471p17324n7703J910710L460850K152963j060076k969458k666334
38988B850689k106324k421206k540386j643115l37828R40170K286870K874854
38980i6276J697709j180J23021J492367Q70659k399339m653512l016588N92860
38971e390279K474261J702389k37592k011551k573345r70603J750944K472536
38963b783240J28215k035310p81386K369359L443358J556832o74465j121906J68621
38954B70078K296598L926898L350311O58443j222345l21113Q96903q97275m062234
38945D896264l850070K23169L307129K226651o80193k214032k730549l438683
$$ plain form
38937 -2260314 -5094410 -4517508 -337143 3472572 3130307 -685353 -4560382 -6750968
38929 -6750968 -7598088 -6540090 -1865226 5725488 11849109 12830946 10224553 8891683
38921 8891683 11138865 14871550 17234707 17361973 15045491 9845849 3345603 -452981
38913 -452981 222871 1775720 -129577 -4161743 -4946520 -165210 7572893 15164444 20927268
38904 20927268 22192561 16377270 6362695 83888 1569569 5755214 5392698 194186
38896 194186 -4397044 -5107075 -3537380 -2371615 -2572719 -3769314 -4576724 -3207515 -101552
38887 -101552 1356597 -628382 -2697445 -696251 3879869 5919935 4317840 2908348
38879 2908348 3721946 4216995 2560295 1104906 2107266 3589868 2684284 717205 1541601
$$ packed form
38937b260314k834096N76902M180365L809715l42265l815660l875029k190586
38929f750968q47120J057998M674864P590714O123621R81837k606393j332870
38921H891683K247182L732685K363157J27266k316482n199642o500246l798584
38913d52981O75852J552849j905297m032166p84777M781310P738103P591551N762824
38904B0927268J265293n815291j0014575o278807J485681M185645l62516n198512
38896A94186m591230p10031J569695J165765k01104j196595q07410J369209L105963
38887a01552J458149j984979k069063K001194M576120K040066j602095j409492
38879B908348Q13598M95049j656700j455389J002360J482602r05584j967079Q24396
$$ plain form
38870 1541601 5783354 9621560 9315141 5102434 346157 -2084848 -2168211 -1789478 -1881005
38861 -1881005 -1372749 428833 1703373 168158 -3431666 -6121681 -6755710 -6843420 -7211592
38852 -7211592 -6518891 -3836203 -286428 2832516 5344410 6770042 6119657 4373955
38844 4373955 4662311 8169467 11900355 12321730 9407341 5386839 1510571 -1848746
38836 -1848746 -3710941 -3553180 -2611452 -1991983 -761271 1981529 4582631 4901518 3719767
38827 3719767 3326998 3516359 1943379 -1712133 -4706870 -4736100 -2413482 -1226 633055
38818 633055 -1134409 -4121177 -5769858 -4834493 -3215132 -3181263 -3451064 -786612 4562873
38809 4562873 8106774 6760528 2742765 527032 1838795 4955306 7278056 7173387
$$ packed form
38870A541601M241753L838206l06419m212707m756277k431005q3363L78733r1527
38861a881005N08256J801582J274540j535215l599824k690015o34029q7710l68172
38852g211592O92701K682688L549775L118944K511894J425632o50385j745702
38844D373955K88356L507156L730888M21375k914389m020502l876268l359317
38836a848746j862195J57761R41728O19469J230712K742800K601102L18887j181751
38827C719767l92769J89361j572980l655512k994737k9230K322618K412256O34281
38818F33055j767464k986768j648681R35365J619361L3869k69801K664452N349485
38809D562873L543901j346246m017763k215733J311763L116511K322750j04669
$$ plain form
38801 7173387 4521656 842275 -1799804 -2803906 -3242135 -3747856 -3404655 -1221775 2611964
38792 2611964 7507346 12981673 17566183 18882582 16276924 12256216 9761971 8724615
38784 8724615 6801791 3108050 -341361 -1142133 570977 2277784 1894447 26906
38776 26906 -944064 -32744 878265 -563604 -4071761 -7288231 -8928698 -9601333 -9568404
38767 -9568404 -7786626 -3927622 279862 2712962 2816258 1450248 79346 369919
38759 369919 2730834 4617386 2463838 -3453717 -8208743 -8048055 -5143574 -4313524 -6547997
38750 -6547997 -8512846 -7667447 -4997953 -2569737 -800753 1079957 3361842 5295285
38742 5295285 5508488 3137737 -700601 -3281567 -3352893 -3074383 -5312147 -9758801 -13663592
$$ packed form
38801G173387k651731l679381k642079j004102m38229n05721L43201K182880L833739
38792B611964M895382N474327M584510J316399k605658m020708k494245j037356
38784H724615j922824l693741l449411q00772J713110J706807l83337j867541
38776B6906r70970R11320R11009j441869l508157l216470j640467o72635L2929
38767i568404J781778L859004M207484K433100J03296j366010j370902K90573
38759C69919K360915J886552k153548n917555m755026J60688K904481Q30050k234473
38750f547997j964849Q45399K669494K428216J768984J880710K281885J933443
38742E295285K13203k370751l838338k580966p1326K78510k237764m446654l904791
$$ plain form
38733 -13663592 -15701655 -16606018 -16193123 -12796477 -6579786 -873403 1373561 853208
38725 853208 278672 902726 1982232 2531522 2219435 1339011 1029696 2719113 6215408
38716 6215408 9112578 9246857 7061610 4382912 1679308 -1769089 -5302447 -6474177
38708 -6474177 -3901232 787887 4814033 7264359 9203626 11209838 12112133 10541217
38700 10541217 6799785 2528486 -820274 -2404153 -1681189 870867 3029262 2647799
38692 2647799 598374 219068 3231236 7975625 12376310 16187086 18738893 17312823
38684 17312823 10905509 3697284 949515 2434972 3919037 4499866 7540401 13578794
38676 13578794 17493470 15292910 9758046 6249147 6038494 7008913 8082786 9063628
$$ packed form
38733a3663592k038063r04363M12895L396646O216691N706383K246964n20353
38725H53208n74536O24054J079506N49290l12087q80424l09315J689417L496295
38716F215408K897170J34279k185247k678698k703604l448397l533358j171730
38708f474177K572945M689119M026146K450326J939267K006212R02295j570916
38700A0541217l741432m271299l348760j583879P22964K552056K158395l81463
38692B647799k049425l79306L012168M744389M400685L810776K551807j426070
38684A7312823o407314p208225k747769J485457J484065N80829L040535O038393
38676A3578794L914676k200560n534864l508899k10653R70419J073873R80842
$$ plain form
38668 9063628 8154211 3927763 -1162514 -3200434 -2462834 -3109779 -7074811 -11451329 -12482128
38659 -12482128 -9500321 -4427586 217369 2296677 1240040 -1212722 -3154170 -5144934
38651 -5144934 -8448173 -11147130 -9443885 -3397114 2148416 3892379 4234071 6892411
38643 6892411 10921091 12020586 8542474 3484631 766363 1335704 2921781 2516334
38635 2516334 -736967 -4488044 -5466731 -3130978 -115672 1207845 1215264 1608977 3275215
38626 3275215 6411055 10836011 14820204 15536148 12583187 9470343 9447158 11235949 11313399
38617 11313399 9191340 7435017 7047179 6227103 4139139 2725905 3432098 4667009
38609 4667009 4403395 3490435 4210353 6575624 8344497 8553371 8917945 10958154 13227116
$$ packed form
38668I063628r09417m226448n090277k037920P37600o46945l965032m376518j030799
38659a2482128K981807N072735M644955K079308j056637k452762j941448j990764
38651e144934l303239k698957J703245O046771N545530J743963L41692K658340
38643F892411M028680J099495l478112n057843k718268N69341J586077m05447
38635B516334l253301l751077r78687K335753L015306J323517P419L93713J666238
38626C275215L135840M424956L984193P15944k952961l112844k3185J788791P7450
38617A1313399k122059j756323l87838q20076k087964j413234P06193J234911
38609D667009k63614r12960P19918K365271J768873K08874L64574K040209K268962
$$ plain form
38600 13227116 12887934 9628217 6416311 5731444 6247368 4755896 1013939 -1221254
38592 -1221254 1286582 7159756 12008201 12998298 10367460 5441721 -449692 -4931608
38584 -4931608 -4923174 282874 7244883 11271184 10974022 8797623 7059062 5035570 1078872
38575 1078872 -3488042 -4863316 -1691184 2559783 3822693 2591305 2431053 4124066
38567 4124066 4492411 1536745 -2422702 -4271807 -4093929 -3540202 -2472461 160375 3748055
38558 3748055 7042965 10454610 14516939 17224417 16048684 11851633 7531998 3433582
38550 3433582 -2128208 -8013908 -10377180 -8466403 -5920636 -4694061 -2204974 2757521
38542 2757521 5668454 2172897 -4539141 -7208684 -4009570 89577 943135 -447861
$$ packed form
38600A3227116l39182l259717l211906o84867N15924j491472l741957k235193
38592a221254K507836N873174M848445R90097k630838m925739n891413m481916
38584d931608Q434N206048O962009M026301k97162k176399j738561k023492l956698
38575A078872m566914j375274L172132M250967J262910j231388j60252J693013
38567D124066L68345k955666l959447j849105J77878N53727J067741K632836L587680
38558C748055L294910L411645M062329K707478j175733m197051m319635m098416
38550C433582n561790n885700k363272J910777K545767J226575K489087M962495
38542B757521K910933l495557o712038k669543L199114M099147Q53558j390996
$$ plain form
38534 -447861 -1737136 -2903082 -4295612 -4448476 -2435343 -415632 -1384848 -5257474 -8843167
38525 -8843167 -9137041 -5605517 -23102 4912240 7449950 8147329 8889631 10243866 10805897
38516 10805897 9526310 7157231 4644672 1966406 -41986 1172194 6312029 11212369
38508 11212369 10754882 5540358 1258631 949919 1559501 -214780 -2255429 -327053
38500 -327053 5370752 10660197 13086710 13350082 11683571 7122147 1073455 -2483388
38492 -2483388 -2296147 -2186751 -5830294 -11720017 -15698251 -16167447 -14086502 -9978551 -4388234
38483 -4388234 73210 825002 -1045361 -2433988 -2865608 -3881749 -4249701 -426348 7056696
38474 7056696 12055233 10198165 4618710 1424010 1876323 2363252 680017 -1163313
$$ packed form
38534d47861j289275j165946j392530j52864K013133K019711r69216l872626l585693
38525h843167k93874L531524N582415M935342K537710O97379P42302J354235N62031
38516A0805897j279587k369079k512559k678266k008392J214180N139835M900340
38508A1212369m57487n214524m281727l08712O09582j774281k040649J928376
38500c27053N697805N289445K426513K63372j666511m561424o048692l556843
38492b483388J87241J09396l643543n889723l978234m69196K080945M107951N590317
38483d388234M461444P51792j870363j388627m31620j016141l67952L823353P483044
38474G056696M998537j857068n579455l194700M52313M86929j683235j843330
$$ plain form
38466 -1163313 -388457 2933484 6470510 8414336 8881094 8913210 8592329 6943509 4422066
38457 4422066 4242489 8789767 14985159 16433963 11137600 4054680 655477 1287004
38449 1287004 3981781 8917485 16148004 21824252 21745082 17538219 14728231 15299042 16682237
38440 16682237 17596030 19496942 21521212 19676504 13544219 8948524 10325715 14032220
38432 14032220 13341530 7546050 1679538 -1279807 -3164109 -5596910 -6669436 -4350209
38424 -4350209 -359591 1594103 199073 -2551052 -4301177 -4816136 -5380737 -6590277
38416 -6590277 -7493577 -7054046 -5804948 -5178164 -5381603 -5204487 -4236995 -3750511 -4317655
38407 -4317655 -3958102 -513143 4770573 8106943 7764968 5965562 5620430 6882794 8051809
$$ packed form
38466a163313P74856L321941L537026J943826M66758L2116l20881j648820k521443
38457D422066j79577M547278O195392J448804n296363p082920l399203O31527
38449A287004K694777M935704P230519N676248p9170m206863k809988N70811J383195
38440A6682237R13793J900912K024270j844708o132285m595695J377191L706505
38432A4032220o90690n795480n866512k959345j884302k432801j072526K319227
38424d350209L990618J953694j395030k750125j750125n14959n64601j209540
38416f590277r03300M39531J249098O26784k03439J77116R67492M86484n67144
38407d317655L59553L444959N283716L336370l41975j799406l45132J262364J169015
$$ plain form
38398 8051809 8466242 8679627 8376618 6236154 2356104 -860031 -1380624 -110830 472016
38389 472016 -459186 -1739870 -2733892 -4291127 -6755655 -8739322 -8838805 -7224393 -4443324
38380 -4443324 -24632 6097384 11714246 13851628 12006221 8466660 5607670 4127352
38372 4127352 3559757 2980754 1390073 -1090105 -2581190 -1584162 529921 1038901 -325549
38363 -325549 -1364533 -1268510 -1704903 -3231970 -3574656 -1345842 950201 232154 -2432154
38354 -2432154 -3305839 -1458126 198968 -398212 -1368244 247741 4119059 6764299 5664427
38345 5664427 2027787 -831752 -1219180 -543136 -1201858 -3745943 -6583376 -7944383 -7498617
38336 -7498617 -6480305 -6850495 -9601294 -12898243 -12856222 -7831955 -1216724 2223928 2374141
$$ packed form
38398H051809M14433K13385l03009k140464l880050l216135n20593J269794N82846
38389D72016r31202j280684r94022j557235k464528j983667r9483J614412K781069
38380d443324M418692O122016N616862K137382j845407l539561k858990j480318
38372D127352n67595n79003j590681k480178j491085R97028K114083N08980j364450
38363c25549j038984R6023m36393j527067l42686K228814K296043p18047k664308
38354b432154q73685J847713J657094n97180r70032J615985L871318K645240j099872
38345E664427l636640k859539l87428O76044o58722k544085k837433j361007M45766
38336g498617J018312l70190k750799l296949M2021N024267O615231L440652J50213
$$ plain form
38327 2374141 3406778 7197050 10207917 8234260 1654571 -5701474 -10682351 -12014892
38319 -12014892 -9577851 -4894063 -1009884 232238 -75164 -146288 172596 731600 2457019
38310 2457019 5162268 6114982 3582694 17104 -1292929 -971600 -1493595 -2097571 -172174
38301 -172174 3181605 3965796 1968544 1696962 5216724 8533848 7451664 3386786 546332
38292 546332 126835 327702 147748 181449 727850 1554731 2922554 5069935 7281284
38283 7281284 8711776 9283700 8845815 6843106 3970524 2499244 3404121 4708474 4371622
38274 4371622 3198522 2856357 2652144 950562 -1382356 -2025323 -1189871 -1417388 -3318216
38265 -3318216 -4734852 -4889522 -6032122 -9130818 -10889324 -8152838 -3487335 -2463187
$$ packed form
38327B374141J032637L790272L010867j973657o579689p356045m980877j332541
38319a2014892K437041M683788L884179J242122l07402p1124L18884N59004J725419
38310B457019K705249R52714k532288l565590j310033L21329n21995o03976J925397
38301a72174L353779P84191j997252k71582L519762L317124j082184m064878k840454
38292E46332m19497K00867j79954L3701N46401Q26881J367823K147381K211349
38283G281284J430492N71924m37885k002709k872582j471280R04877J304353l36852
38274D371622j173100l42165k04213j701582k332918o42967Q35452k27517j900828
38265c318216j416636j54670j142600l098696j758506K736486M665503J024148
$$ plain form
38257 -2463187 -5547642 -6793177 -2285537 3637052 4114324 -327157 -2324388 1794868
38249 1794868 7059526 7715668 5592187 6245014 9663434 10654736 7889286 6474822 9794471
38240 9794471 13875419 13089099 7887175 3305073 2285463 4080873 7391995 11222832
38232 11222832 13603205 13209590 12043453 13176301 15752483 15515984 10965716 5906120
38224 5906120 4460777 5940193 6514430 4465990 1809771 1162198 2514727 3519141
38216 3519141 2517125 737649 890465 3626115 6595670 7659274 7555041 7988343 8478570
38207 8478570 7229878 4199043 873924 -2357906 -5859487 -8122792 -6827503 -3006989
38199 -3006989 -751318 -1472501 -1702019 1448359 5694388 7268138 6752202 7662410 10577256
$$ packed form
38257b463187l084455j245535M507640N922589M77272m441481j997231M119256
38249A794868N264658O56142k123481O52827L418420R91302k765450j414464L319649
38240I794471M080948p86320n201924m582102j019610J795410L311122L830837
38232A1222832K380373l93615j166137J132848K576182k36499m550268n059596
38224E906120j445343J479416N74237k048440k656219o47573J352529J004414
38216C519141j002016j779476J52816K735650K969555J063604j04233M33302M90227
38207H478570j248692l030835l325119l231830l501581k263305J295289L820514
38199c006989K255671p21183k29518L150378M246029J573750n15936R10208K914846
$$ plain form
38190 10577256 12475388 11711164 10202577 10063544 10931465 11674268 12355876 13115254 12921892
38181 12921892 10989230 8193362 5749062 3528838 1045684 -795178 -516088 1683958
38173 1683958 3829819 4308829 3183082 1497120 209794 -224624 -127964 -600201 -2523700
38164 -2523700 -5368260 -7496325 -7721813 -6156346 -3720216 -1474751 -235406 46262
38156 46262 532160 2288280 4806874 6584925 7034117 6648908 5411473 2722219 -784370
38147 -784370 -3326777 -4686127 -6702263 -9687159 -10664946 -7634991 -3815697 -4412863 -9867085
38138 -9867085 -15404601 -16976507 -14494774 -9389088 -2920242 2124036 2124246 -2553714 -6397533
38129 -6397533 -5157312 -1228945 63354 -2424728 -5388738 -6455183 -6258809 -5542769
$$ packed form
38190A0577256J898132p64224j508587j39033Q67921P42803O81608P59378j93362
38181A2921892j932662k795868k444300k220224k483154j840862K79090K200046
38173A683958K145861M79010j125747j685962j287326m34418R6660m72237j923499
38164b523700k844560k128065k25488J565467K436130K245465J239345K81668
38156D6262M85898J756120K518594J778051M49192l85209j237435k689254l506589
38147g84370k542407j359350k016136k984896r77787L029955L819294n97166n454222
38138i867085n537516j571906K481733N105686O468846N044278K10m677960l843819
38129f397533J240221L928367J292299k488082k964010j066445J96374P16040
$$ plain form
38121 -5542769 -3607491 -410450 2170482 2297316 308471 -1505657 -690386 3234115
38113 3234115 7527665 8212408 4712581 1272777 1899042 5257997 7054248 6113762 4769622
38104 4769622 4009646 2382954 186251 592288 4863788 9706717 11583762 11157423 11189287
38095 11189287 12133432 12357520 11337236 10161344 9620687 9852734 11331719 14273071 17195270
38086 17195270 17736446 15310180 12151052 11429946 14463175 19627362 24116292 27038375
38078 27038375 30083571 34359813 38071851 39686893 42310881 51168407 66454565 82950129
38070 82950129 98582098 119373706 152425680 196133338 240052254 272184281 283960286
38063 283960286 271932715 240343705 201173318 166323529 138732244 114255813 91386713
$$ packed form
38121e542769J935278L197041K580932J26834j988845j814128Q15271L924501
38113C234115M293550O84743l499827l439804O26265L358955J796251r40486j344140
38104D769622p59976j626692k196703M06037M271500M842929J877045m26339L1864
38095A1189287R44145K24088j020284j175892n40657K32047J478985K941352K922199
38086A7195270N41176k426266l159128p21106L033229N164187M488930K922083
38078B7038375L045196M276242L712038J615042K623988Q857526J5286158J6495564
38070H2950129J5631969K0791608L3051974M3707658M3918916L2132027J1776005
38063B83960286j2027571l1589010l9170387l4849789k7591285k4476431k2869100
$$ plain form
38056 91386713 73929658 63463241 55168593 44615894 34561939 30602342 32531735
38049 32531735 34832832 34996221 36509533 42184015 48170656 47655258 39164633 28266422
38041 28266422 20852904 17315398 14726212 12425158 12131603 13072897 11154246 4835829
38033 4835829 -1392774 -2498539 307811 1982210 1492095 2746492 7509194 11832998
38025 11832998 11350112 6951763 3149038 3017974 6453421 11335602 14707676 14601111
38017 14601111 12209061 10587708 10313947 9021245 6461524 6365514 10424482 13860320
38009 13860320 11396345 5462417 3340174 6910533 10464982 9239484 5141859 2232294
38001 2232294 864452 -757281 -2249648 -1668037 1018801 3755663 4952536 4449714
$$ packed form
38056I1386713j7457055j0466417q294648j0552699j0053955l959597J929393
38049C2531735K301097J63389J513312N674482N986641n15398q490625j0898211
38041B8266422p413518l537506k589186k301054k93555R41294j918651o318417
38033D835829o228603j105765K806350J674399m90115J254397M762702M323804
38025A1832998m82886m398349l802725j31064L435447M882181L372074j06565
38017A4601111k392050j621353k73761j292702k559721r6010M058968L435838
38009A3860320k463975n933928k122243L570359L554449j225498m097625k909565
38001B232294j367842j621733j492367N81611K686838K736862J196873n02822
$$ plain form
37993 4449714 2898930 1710069 2466934 4825443 6213698 5271379 4132099 5111016 6511917
37984 6511917 4786618 438190 -1548619 1976545 8160827 11681334 10629787 7373916
37976 7373916 4888466 3984005 3682629 2816413 983622 -1358557 -3411158 -4705245 -5245097
37967 -5245097 -5153984 -4538969 -3610225 -2505142 -1095772 630346 2297906 3795723 5741227
37958 5741227 8481360 11060046 12080070 11025081 7745191 1813865 -5624343 -10470095
37950 -10470095 -9329931 -4561893 -2192414 -3975903 -5215068 -2176052 2278665 3601027
37942 3601027 2760384 4196096 8552146 12049084 12286515 10448152 8079633 5708905
37934 5708905 4543158 5428300 5973291 2957037 -1989898 -3632544 -830908 1923555
$$ packed form
37993D449714j550784j188861P56865K358509J388255r42319j139280R78917J400901
37984F511917j725299m348428j986809L525164O184282L520507j051547l255871
37976G373916k485450r04461l01376q66216j832791k342179k052601j294087n39852
37967e245097R1113O15015R28744J105083J409370J726118J667560J497817J945504
37958E741227K740133K578686J020024j054989l279890n931326p438208m845752
37950a0470095J140164M768038K369479j783489j239165L039016M454717J322362
37942C601027q40643J435712M356050L496938K37431j838363k368519k370728
37934E708905j165747Q85142N44991l016254m946935j642646K801636K754463
$$ plain form
37926 1923555 1971693 1972147 3550713 3393079 -193765 -2178611 2076626 8614240 10127107
37917 10127107 6589007 4014300 4555098 5019383 4526302 6036610 9254767 9157080 4035193
37908 4035193 -1075908 -2017865 -1171617 -2011420 -2900967 -644167 3616369 6680299 8676216
37899 8676216 11639441 14687132 14936345 12085867 8541404 6125875 5712184 8315201
37891 8315201 12804990 14178563 8645636 -192664 -4664663 -2481637 1407805 2726146
37883 2726146 3006104 5290061 8754580 10236217 8570084 5090047 1570573 -543587
37875 -543587 -444515 919189 1384144 420020 -109854 873001 1680448 713131 -516152
37866 -516152 498110 3184778 4384065 2741341 586658 856323 3254293 4245078 867685
$$ packed form
37926A923555M8138M54J578566j57634l586844j984846M255237O537614J512867
37917A0127107l538100k574707N40798M64285m93081J510308L218157r7687n121887
37908D035193n111101r41957Q46248q39803q89547K256800M260536L063930J995917
37899H676216K963225L047691K49213k850478l544463k415529m13691K603017
37891H315201M489789J373573n532927q838300m471999K183026L889442J318341
37883B726146K79958K283957L464519J481637j666133l480037l519474k114160
37875e43587R9072J363704M64955r64124n29874R82855Q07447r67317j229283
37866e16152J014262K686668J199287j642724k154683K69665K397970R90785l377393
$$ plain form
37857 867685 -5581313 -10231959 -9695820 -5763464 -2598132 -932141 2257171 7982243
37849 7982243 12450238 11860445 7388576 3037637 711075 103169 1382524 4455296
37841 4455296 6887530 6414351 4936333 6196044 9745078 11379014 9818275 8336172
37833 8336172 8607570 7883782 4721458 2749913 4862875 7544379 5826422 1117219
37825 1117219 -1324068 -950275 -1974617 -5269895 -6450197 -3361760 83932 89699 -1601214
37816 -1601214 -1613608 -547808 -1049533 -2995854 -4222097 -4052042 -2789244 373094 5331130
37807 5331130 8595748 6889038 2340394 72521 1050173 1599318 287386 679174 5507753
37798 5507753 11828947 14561413 12469989 8261839 4523819 1964610 658986 781802
$$ packed form
37857H67685o448998m650646N36139L932356L165332J665991L189312N725072
37849G982243M467995n89793m471869m350939k326562o07906J279355L072772
37841D455296K432234m73179j478018J259711L549034J633936j560739j482103
37833H336172K71398p23788l162324j971545K112962K681504j717957m709203
37825A117219k441287L73793j024342l295278j180302L088437L445692N767j690913
37816a601214j2394J065800n01725j946321j226243J70055J262798L162338M958036
37807E331130L264618j706710m548644k267873R77652N49145j311932L91788M828579
37798E507753O321194K732466k091424m208150l738020k559209j305624J22816
$$ plain form
37790 781802 2075413 3697317 4693344 4546412 3826525 4041970 5694474 6848464 5394468
37781 5394468 2500548 1438680 2737066 3248706 952441 -2081069 -3008661 -1968054
37773 -1968054 -661376 487918 1550644 1496158 -62375 -1013767 803040 4279588 6326477
37764 6326477 5500895 2455384 -1868955 -6261116 -8829470 -9210367 -10129457 -13984382 -18678124
37755 -18678124 -19783983 -16419590 -12045058 -9520568 -8217852 -6337777 -3563606 -820478
37747 -820478 761822 461182 -892948 -838884 1809134 4780183 5317263 4231330 4067074
37738 4067074 4350347 2552132 -697424 -1888124 -633168 -777003 -4048530 -6961433
37730 -6961433 -6293740 -3852134 -3061992 -4039524 -4999227 -5814452 -7026234 -7433496 -5713235
$$ packed form
37790G81802J293611J621904R96027j46932p19887K15445J652504J153990j453996
37781E394468k893920j061868J298386N11640k296265l033510r27592J040607
37773a968054J306678J149294J062726n4486j558533r51392J816807L476548K046889
37764F326477q25582l045511m324339m392161k568354l80897r19090l854925m693742
37755a8678124j105859L364393M374532K524490J302716J880075K774171K743128
37747h20478J582300l00640j354130N4064K648018K971049N37080j085933j64256
37738D067074K83273j798215l249556j190700J254956j43835l271527k912903
37730f961433O67693K441606P90142r77532r59703q15225j211782m07262J720261
$$ plain form
37721 -5713235 -2853777 -464834 1592987 3520966 3690747 1425578 -198956 2229833
37713 2229833 7382298 10738674 10401373 8355161 6664598 5488383 4513029 3510043
37705 3510043 1641996 -1239520 -2897471 -872050 3848779 7695368 8689198 7323669
37697 7323669 3939294 -1611698 -7617480 -10947208 -10583172 -8407098 -6191821 -4237857
37689 -4237857 -3051064 -3295159 -3329480 107088 7155038 13098064 13192898 7902905 2139225
37680 2139225 349920 2853752 5740851 4299787 -1771536 -6721210 -4642406 2980544
37672 2980544 8570801 7753665 3887565 2086320 2552092 2479805 1399916 951075 1137435
37663 1137435 485868 -739975 -548358 1679315 4386328 5921939 5508380 2658448 -2259301
$$ packed form
37721e713235K859458K388943K057821J927979J69781k265169j624534K428789
37713B229833N152465L356376l37301k046212j690563j176215r75354j002986
37705C510043j868047k881516j657951K025421M720829L846589R93830j365529
37697G323669l384375n550992o005782l329728L64036K176074K215277J953964
37689d237857J186793k44095l4321L436568P047950N943026R4834n289993n763680
37680B139225j789305K503832K887099j441064o071323m949674K078804P622950
37672B980544N590257q17136l866100j801245M65772p2287j079889m48841J86360
37663A137435o51567j225843J91617K227673K707013J535611m13559k849932m917749
$$ plain form
37654 -2259301 -7218690 -10335398 -12164265 -14185684 -15450222 -13332258 -7908743 -3028836
37646 -3028836 -1911598 -3466564 -4201657 -2532613 -37330 752700 -1192036 -4694753
37638 -4694753 -7443199 -8058138 -7442449 -7748395 -9876731 -12444519 -13280042 -11410630 -7604287
37629 -7604287 -3706946 -1626230 -2183670 -4440893 -6494141 -7254230 -7220178 -7390452 -7807474
37620 -7807474 -7502720 -5734685 -2988160 -635433 301835 -146732 -1363156 -2677789 -3064513
37611 -3064513 -1237609 2633565 5800701 5403333 2252017 160880 887363 1984969
37603 1984969 948519 -969346 -1374585 -1055492 -2416541 -4718674 -4523489 -784543 3894075
37594 3894075 7342834 9650238 10253836 7350923 2283868 684598 5753330 12935614
$$ packed form
37654b259301m959389l116708j828867k021419j264538K117964N423515M879907
37646c028836J117238j554966p35093J669044K495283P90030j944736l502717
37638d694753k748446o14939O15689l05946k128336k567788q35523J869412L806343
37629g604287L897341K080716n57440k257223k053248p60089L4052j70274m17022
37620g807474L04754J768035K746525K352727R37268m48567j216424j314633l86724
37611c064513J826904L871174L167136l97368l151316k091137P26483J097606
37603A984969j036450j917865m05239L19093j361049k302133J95185L738946M678618
37594C894075L448759K307404O03598k902913n067055j599270N068732P182284
$$ plain form
37586 12935614 15163225 11800376 8339725 8129620 8963528 8273154 7187574 7519705 8237135
37577 8237135 7585354 6291262 5845344 5262592 2447793 -2100492 -5588355 -6495000 -5564321
37568 -5564321 -3698787 -1329038 338101 189299 -317738 1739319 6272071 9349851
37560 9349851 8189230 4741143 2698373 2973833 4021411 4723058 4659291 3065458 37369
37551 37369 -2375815 -2661985 -2138784 -2188914 -974248 3308792 7226904 5285772 -1422916
37542 -1422916 -5119431 -1681793 3870601 5123975 2894871 1911909 2600947 1671538 -991741
37533 -991741 -1719768 756058 3368482 3779947 3415479 4256143 5869367 6896359 6735092
37524 6735092 4637177 -116461 -5764472 -8313870 -5945614 -1333216 1719853 2099639
$$ packed form
37586A2935614K227611l362849l460651k10105Q33908o90374j085580L32131P17430
37577H237135o51781j294092m45918n82752k814799m548285l487863r06645R30679
37568e564321J865534K369749J667139j48802n07037K057057M532752L077780
37560I349851j160621l448087k042770K75460J047578P01647o3767j593833l028089
37551C7369k413184k86170N23201n0130J214666M283040L918112j941132o708688
37542a422916l696515L437638N552394J253374k229104r82962O89038r29409k663279
37533i91741p28027K475826K612424M11465l64468Q40664J613224J026992j61267
37524F735092k097915m753638n648011k549398K368256M612398L053069L79786
$$ plain form
37516 2099639 756099 -1493870 -3904347 -5391904 -5813923 -6039588 -5480670 -1769886 5220032
37507 5220032 11315749 12701823 11007538 10796175 13127007 14816930 13599582 10737802
37499 10737802 8253323 6557415 5670112 6249607 8162727 9914585 10674912 11325289 12478871
37490 12478871 13108512 12569369 12685934 16027673 22559059 29445049 34175423 36997524
37482 36997524 40421381 47259172 59155659 75814241 94413500 109613278 115370534
37475 115370534 108708536 92684620 74710510 60625994 50649368 41864327 33463374
37468 33463374 27407551 24431678 22390633 19517096 16729153 15016056 12839619 8693571
37460 8693571 4635567 4027332 6236692 6893943 3951342 469161 55715 2128598 3698979
$$ packed form
37516B099639j343540k249969k410477j487557m22019k25665N58918L710784O989918
37507E220032O095717J386074j694285k11363K330832J689923j217348k861780
37499A0737802k484479j695908q87303N79495J913120J751858P60327O50377J153582
37490A2478871O29641n39143J16565L341739O531386O885990M730374K822101
37482C6997524L423857O837791J1896487J6658582J8599259J5199778N757256
37475A15370534o661998j6023916j7974110j4084516r976626q785041q400953
37468C3463374o055823k975873k041045k873537k787943j713097k176437m146048
37460H693571m058004o08235K209360O57251k942601l482181m13446K072883J570381
$$ plain form
37451 3698979 3865056 4009857 4741106 5388744 6153117 8047066 10410189 11050723 9816429
37442 9816429 9684525 12558532 15701916 14734904 9566259 5022324 5222653 9061136 12028628
37433 12028628 11244655 7607648 3746019 1254071 64200 -627221 -1678901 -3710818
37425 -3710818 -6261957 -7054793 -3472509 4106023 11362799 14095743 12867701 11716060
37417 11716060 12259707 11575506 6870862 -226257 -5886968 -8497417 -8463844 -5485435 566442
37408 566442 6783988 8846822 5956429 1310866 -2737773 -6996667 -12104620 -16025689
37400 -16025689 -16534206 -13810148 -8979620 -2422553 4615962 8954955 8390773 4373519
37392 4373519 141010 -2249747 -1797518 1846007 6299387 6630593 1044131 -5404862
$$ packed form
37451C698979J66077J44801P31249O47638P64373J893949K363123O40534j234294
37442I816429j31904K874007L143384r67012n168645m543935K00329L838483K967492
37433A2028628p83973l637007l861629k491948j189871o91421j051680k031917
37425c710818k551139p92836L582284P578532P256776K732944j228042j151641
37417A1716060N43647o84201m704644p097119n660711k610449L3573K978409O051877
37408E66442O217546K062834k890393m645563m048639m258894n107953l921069
37400a6025689n08517K724058M830528O557067P038515M338993n64182m017254
37392D373519m232509k390757M52229L643525M453380L31206n586462o448993
$$ plain form
37384 -5404862 -6371412 -2115646 1870470 2774957 2492871 2374297 1135760 -1146558 -1773447
37375 -1773447 8004 1198555 -77307 -1553305 -1063239 -249829 -1041750 -1674378 -63217
37366 -63217 1286469 -1710520 -7790529 -10896551 -8173733 -3896562 -4026358 -9012524 -13434627
37357 -13434627 -11782643 -3701880 6054026 12379354 14234908 13913987 12687130 9419036
37349 9419036 4025911 -541625 -1914816 -1909052 -3958203 -8326536 -12344500 -14061882 -13016184
37340 -13016184 -8919328 -3050722 193709 -2549560 -7930535 -8652615 -2745548 4006198
37332 4006198 6270827 5652563 6546298 9136293 10002790 7529470 3414615 114335 -468293
37323 -468293 3014347 9773256 15929424 17678090 15214229 11781387 9598626 8618128
$$ packed form
37384e404862r66550M255766L986116R04487k82086j18574j238537k282318o26889
37375a773447J781451J190551j275862j475998M90066Q13410p91921o32628J611161
37366f3217J349686k996989o080009l106022K722818M277171j29796m986166m422103
37357a3434627J651984Q080763R755906O325328J855554l20921j226857l268094
37349I419036n393125m567536j373191N764k049151m368333m017964j717382J045698
37340a3016184M096856N868606L244431k743269n380975p22080N907067O751746
37332D006198K264629o18264Q93735K589995Q66497k473320m114855l300280n82628
37323d68293L482640O758909O156168J748666k463861l432842k182761r80498
$$ plain form
37315 8618128 8252767 7865368 6239670 3222040 1528832 4102040 9520510 12753139
37307 12753139 11020256 6443676 2245276 -997218 -3954874 -5775558 -4844776 -1234791
37299 -1234791 3215304 6656567 8125318 7544622 5797415 4119394 2768321 1114716
37291 1114716 -509820 -341751 2550853 6550989 8845307 7621127 2671268 -4374974
37283 -4374974 -9533195 -8394644 -677754 8427325 13440637 14012840 13249902 12197114
37275 12197114 9150543 3947111 -568479 -2215800 -1965729 -1635677 -1267749 -32292
37267 -32292 2111218 4923693 8355876 11180468 10925193 7066165 3059993 3061413 7039942
37258 7039942 10814382 10688543 6757106 2065895 -42151 1935321 6499674 9906037
$$ packed form
37315H618128l65361l87399j625698l017630j693208K573208N418470L232629
37307A2753139j732883m576580m198400l242494k957656j820684R30782L609985
37299a234791M450095L441263J468751n80696j747207j678021j351073j653605
37291A114716j624536J68069K892604M000136K294318j224180m949859p046242
37283d374974n158221J138551P716890R105079N013312N72203p62938j052788
37275A2197114l046571n203432m515590j647321K50071L30052L67928J235457
37267c2292K143510K812475L432183K824592k55275l859028m006172J420L978529
37258G039942L774440j25839l931437m691211k108046J977472M564353L406363
$$ plain form
37250 9906037 9359867 5798031 2602213 1555070 1246874 -281908 -2612885 -3480347 -1544321
37241 -1544321 2132368 5083314 5359098 2663895 -1670177 -5333917 -5929585 -2305549
37233 -2305549 3951878 8724259 8574139 4311234 249379 -647689 451275 1150137 1731396
37224 1731396 4155565 8226726 11287002 11689641 10346646 8425117 5559466 1274761
37216 1274761 -3322300 -6339595 -6762350 -4871177 -2050603 -518934 -1823500 -4746344
37208 -4746344 -5778567 -2640002 3232350 8110930 9143753 6055623 1140612 -1857771
37200 -1857771 -345110 4513698 8650683 9337858 7685242 6434187 6719292 7963262
37192 7963262 9430642 10346566 9594262 7001790 4264789 3090146 2999806 2382757 1058598
$$ packed form
37250I906037n46170l561836l195818j047143l08196j528782k330977q67462J936026
37241a544321L676689K950946K75784k695203m334072l663740n95668L624036
37233b305549O257427M772381j50120m262905m061855q97068J098964O98862N81259
37224A731396K424169M071161L060276M02639j342995j921529k865651m284705
37216A274761m597061l017295m22755J891173K820574J531669j304566k922844
37208d746344j032223L138565N872352M878580J032823l088130m915011k998383
37200a857771J512661M858808M136985O87175j652616j251055K85105J243970
37192G963262J467380R15924p52304k592472k737001j174643r0340o17049j324159
$$ plain form
37183 1058598 131821 -260768 -1161116 -2608806 -2927834 -894462 2336744 4181640 3242710
37174 3242710 716869 -870717 -510281 57158 -1221417 -3454009 -3792656 -1895124 -958366
37165 -958366 -3029243 -5714686 -5773225 -3962630 -3426162 -4680741 -5535020 -5245376 -5177464
37156 -5177464 -5317679 -3756053 -585555 857001 -1728062 -6372813 -9518056 -10213290
37148 -10213290 -10170562 -10883778 -11918583 -11330025 -7425208 -1189600 3237237 2453225 -1730566
37139 -1730566 -4026658 -2251097 543370 1250607 747824 968734 1167458 90892 -478411
37130 -478411 1983075 6071386 7781118 6385920 5584282 7933129 11014343 11020634 8504934
37121 8504934 8143585 12609353 18401720 19260307 13432919 5727344 1419500 45594
$$ packed form
37183A058598r26777l92589r00348j447690l19028K033372L231206J844896r38930
37174C242710k525841j587586L60436N67439j278575k232592l38647J897532R36758
37165i58366k070877k685443n8539J810595N36468j254579q54279K89644O7912
37156e177464j40215J561626L170498J442556k585063m644751l145243o95234
37148a0213290M2728p13216j034805N88558L904817O235608M426837p84012m183791
37139a730566k296092J775561K794467P07237n02783K20910J98724j076566n69303
37130d78411K461486M088311J709732j395198q01638K348847L081214O291k515700
37121H504934l61349M465768N792367Q58587n827388p705575m307844j373906
$$ plain form
37113 45594 -2374602 -6340022 -8025649 -5792254 -3272162 -3698349 -4559300 -1316672 5581119
37104 5581119 10983902 11464757 8396430 5049902 3376829 3584353 4464062 3894955 871055
37095 871055 -2808519 -4213472 -2340850 1682651 6465020 10654597 12434135 11057148
37087 11057148 8386269 6749101 5805336 3759266 1014947 -36864 1396064 3780615
37079 3780615 5998287 8130351 9529847 8994459 7160807 5841271 4528705 721748
37071 721748 -5271864 -9067037 -7620012 -3524324 -1865950 -4432074 -8691054 -11070208
37063 -11070208 -9750513 -5450064 -757322 2174073 3790540 5709914 7204839 5743350
37055 5743350 1810347 -28466 2951934 7253687 7568201 3751085 204845 -584677
$$ packed form
37113D5594k420196l965420j685627K233395K520092m26187q60951L242628O897791
37104E581119N402783M80855l068327l346528j673073K07524Q79709n69107l023900
37095H71055l679574j404953J872622M023501M782369M189577J779538j376987
37087A1057148k670879j637168r43765k046070k744319j051811J432928K384551
37079C780615K217672K132064J399496n35388j833652j319536j312566l806957
37071G21748n993612l795173J447025M095688J658374k566124m258980k379154
37063a1070208J319695M300449M692742K931395J616467J919374J494925j461489
37055E743350l933003j838813K980400M301753L14514l817116l546240p89522
$$ plain form
37047 -584677 -346456 -831789 -750187 1568756 4529430 4385098 -345922 -6864989 -10791357
37038 -10791357 -10312574 -7236546 -4280450 -2267480 -331412 2215779 5295505 8569826
37030 8569826 11302541 12498652 12661617 14382022 18932079 23046494 22066952 16280080
37022 16280080 11006291 9832433 10886440 10803974 9168368 7402949 6178960 5906755
37014 5906755 7339231 9796340 11102595 10874202 11078815 11603706 8848297 1571343 -5361261
37005 -5361261 -6934235 -4800483 -3750313 -3880396 -1604166 2983310 5620661 4824378
36997 4824378 3858843 4692001 4889226 2427493 -567963 -1378547 -735225 -645721 -651049 927143
36987 927143 3464444 4318675 2213714 -1193045 -2902521 -1149515 2884365 5558920
$$ packed form
37047e84677K38221m85333Q1602K318943K960674j44332m731020o519067l926368
37038a0791357M78783L076028K956096K012970J936068K547191L079726L274321
37030H569826K732715J196111J62965J720405M550057M114415r79542n786872
37022A6280080n273789j173858J054007q2466j635606j765419j223989k72205
37014E906755J432476K457109J306255k28393K04613N24891k755409p276954o932604
37005e361261j572974K133752J050170j30083K276230M587476K637351p96283
36997D824378r65535Q33158J97225k461733k995456q10584O43322Q9504n328J578192
36987I27143K537301Q54231k104961l406759j709476J753006M033880K674555
$$ plain form
36979 5558920 4025884 -573663 -4219196 -4610699 -3379554 -3307406 -4817819 -6147824 -5938012
36970 -5938012 -4470316 -2595154 -302347 3071683 7030942 9055123 7028200 2576339
36962 2576339 -63142 669169 1746676 334345 -2093397 -2694088 -1791137 -1280878 -577793
36953 -577793 2068827 5679320 7905572 9056725 10574642 10688528 6506829 -209485
36945 -209485 -4749129 -6804369 -10223605 -14873046 -15429532 -10393158 -5740134 -6038423 -7713963
36936 -7713963 -5603306 -1156966 1118108 1269744 2142125 3030498 1238103 -1712748 -1395710
36927 -1395710 2395224 5021523 3837382 1349919 895973 2701134 5022566 6369634
36919 6369634 5794458 3053406 -942756 -4954565 -8200900 -9417341 -6933708 -1564914
$$ packed form
36979E558920j533036m599547l645533l91503J231145P2148j510413j330005K09812
36970e938012J467696J875162K292807L374030L959259K024181k026923m451861
36962B576339k639481P32311J077507j412331k427742o00691R02951N10259P03085
36953e77793K646620L610493K226252J151153J517917J13886m181699o716314
36945b09485m539644k055240l419236m649441n56486N036374M653024k98289j675540
36936g713963K110657M446340K275074J51636Q72381Q88373j792395k950851L17038
36927a395710L790934K626299j184141k487463m53946J805161K321432J347068
36919F369634n75176k741052l996162m011809l246335j216441K483633N368794
$$ plain form
36911 -1564914 2595843 2810322 1170746 631214 -36586 -3361102 -7236275 -6943204 -2518367
36902 -2518367 909029 551338 -862345 -371289 982415 983176 5834 -58533 1502157
36893 1502157 3915825 5612301 4759355 1137937 -2358800 -2398471 601553 3423243 4770372
36884 4770372 5685793 5350556 813020 -7595188 -14235922 -13866720 -7158206 895940 5845420
36875 5845420 6095296 3119791 787313 2024545 4896384 4460601 -471072 -5352392
36867 -5352392 -5951723 -3200874 -333988 1465274 2264663 1407008 -771388 -1781219 -419801
36858 -419801 869934 -142095 -1586901 -581515 1952169 2997783 2165599 1087338
36850 1087338 -310024 -2894499 -4779560 -3075350 1011664 3077768 1985647 1377900
$$ packed form
36911a564914M160757K14479j639576n39532o67800l324516l875173K93071M424837
36902b518367L427396l57691j413683M91056J353704P61r77342o4367J560690
36893A502157K413668J696476q52946l621418l496737l9671L000024K821690J347129
36884D770372R15421l35237m537536q408208o640734L69202O708514Q054146M949480
36875E845420K49876k975505k332478J237232K871839m35783m931673m881320
36867e352392n99331K750849K866886J799262P99389q57655k178396j009831J361418
36858d19801J289735j012029j444806J005386K533684J045614q32184j078261
36850A087338j397362k584475j885061J704210M087014K066104j092121o07747
$$ plain form
36842 1377900 3613805 6042267 5424676 3073813 2814599 5498479 8192866 8234796 5961357
36833 5961357 3248594 811748 -2233898 -6476201 -10589932 -12203874 -10366374 -6483885
36825 -6483885 -2716447 -488452 -872381 -4615800 -10264134 -13688255 -11804692 -6379715
36817 -6379715 -2174248 -1559593 -2889602 -3891927 -4185542 -3993594 -2818596 -701485 897372
36808 897372 908035 251879 434976 1441136 2131729 1909238 772477 -1592631 -5292384
36799 -5292384 -8962495 -10472049 -9343100 -7543424 -7285967 -8594800 -9575392 -8601147 -5538539
36790 -5538539 -1213703 3186402 5991549 5615825 2359621 -891315 -1033412 1956435
36782 1956435 4729508 3728576 -1565610 -8074634 -11245024 -8465300 -1585568 4177117
$$ packed form
36842A377900K235905K428462o17591k350863k59214K683880K694387M1930k273439
36833E961357k712763k436846l045646m242303m113731j613942J837500L882489
36825f483885L767438K227995l83929l743419n648334l424121J883563N424977
36817f379715M205467O14655j330009j002325k93615J91948J174998K117111J598857
36808H97372J0663o56156J83097J006160O90593k22491j136761k365108l699753
36799e292384l670111j509554J128949J799676K57457j308833r80592R74245L062608
36790e538539M324836M400105K805147l75724l256204l250936j42097K989847
36782A956435K773073j000932n294186o509024l170390K779724O879732N762685
$$ plain form
36774 4177117 4863530 1132363 -3536209 -6681199 -7306632 -4167704 2913269 10110561
36766 10110561 11736668 6761290 434243 -2086566 -1178762 -315708 -1025292 -2541124
36758 -2541124 -4029377 -4525162 -2665017 783307 1938008 -1730806 -7475804 -10678219
36750 -10678219 -10540516 -9245404 -7376930 -4443181 -2697176 -5245338 -10100354 -11173950
36742 -11173950 -6654428 -1945294 -2035647 -4814844 -4993602 -1739648 1146945 1061251 -779746
36733 -779746 -2079268 -2163762 -1690027 -1376485 -1493012 -1848163 -2181065 -2780988 -4184409
36724 -4184409 -5939422 -6443540 -4568810 -921566 2826671 5326431 6252832 6402750 7032152
36715 7032152 8217737 8227595 5859133 2989060 2730839 4861072 5413055 1846688 -3312999
$$ packed form
36774D177117O86413l731167m668572l144990o25433L138928P080973P197292
36766A0110561J626107m975378o327047k520809R07804Q63054p09584j515832
36758b541124j488253m95785J860145L448324J154701l668814n744998l202415
36750a0678219J37703J295112J868474K933749J746005k548162m855016j073596
36742a1173950M519522M709134r0353k779197j78758L253954K886593q5694j840997
36733g79746j299522q4494M73735L13542j16527l55151l32902n99923j403421
36724d184409j755013n04118J874730L647244L748237K499760R26401J49918O29402
36715G032152J185585R858k368462k870073k58221K130233N51983l566367n159687
$$ plain form
36706 -3312999 -5422218 -2925379 1752841 5383671 6520936 5602662 3876256 2206340
36698 2206340 399476 -2063146 -4608148 -5751717 -4923971 -3116523 -1386810 230241
36690 230241 1953661 3556919 4979950 6608152 8378295 9491776 9474038 8775979 8195402
36681 8195402 8539297 10564841 13835217 15827628 14033177 9144286 4350221 1354901
36673 1354901 -687719 -1964761 -602655 4084541 9281490 11581739 10762749 9061132
36665 9061132 8048507 7885084 8619383 10517787 13370486 16236861 17548050 15699519
36657 15699519 10898959 6210069 4755888 5899856 6577333 6272651 7288119 9581603
36649 9581603 9544320 5754621 1975787 1760745 3607463 4480928 4629066 5229450 4582756
$$ packed form
36706c312999k109219K496839M678220L630830J137265r18274j726406j669916
36698B206340j806864k462622k545002j143569Q27746J807448J729713J617051
36690B30241J723420J603258J423031J628202J770143J113481j7738o98059n80577
36681H195402L43895K025544L270376J992411j794451m888891m794065k995320
36673A354901k042620j277042J362106M687196N196949K300249q18990j701617
36665I061132j012625j63423P34299J898404K852699K866375J311189j848531
36657A5699519m800560m688890j454181J143968O77477l04682J015468K293484
36649I581603l7283l789699l778834k15042J846718Q73465J48138O00384o46694
$$ plain form
36640 4582756 1159112 -2227686 -2250112 -1058764 -3165545 -7665253 -9111265 -5710745
36632 -5710745 -1247573 1329507 2966029 4465400 4595414 3659913 4229446 6435038 6783808
36623 6783808 3785292 901870 1562633 4614581 6968872 7525446 6207146 2407607
36615 2407607 -2924296 -6674704 -7883084 -9729304 -13888493 -15651215 -9096856 4002497
36607 4002497 14614041 16065051 10430768 4977071 4420669 7371056 9192227 7615739
36599 7615739 5126885 5097017 6484584 5100276 349510 -3000287 -1645144 1222394
36591 1222394 883191 -1698829 -1655704 2448318 7174034 9356902 8912256 6842180 4096978
36582 4096978 2485366 3290817 4686986 3744895 1223224 828583 3214454 4725952 3476696
$$ packed form
36640D582756l423644l386798k2426J191348k106781m499708j446012L400520
36632e710745M463172K577080J636522J499371J30014r35501N69533K205592L48770
36623F783808k998516k883422O60763L051948K354291N56574j318300l799539
36615B407607n331903l750408j208380j846220m159189j762722O554359J3099353
36607D002497J0611544J451010n634283n453697n56402K950387J821171j576488
36599G615739k488854k9868J387567j384308m750766l349797J355143K867538
36591A222394l39203k582020M3125M104022M725716K182868m44646k070076k745202
36582D096978j611612Q05451J396169r42091k521671l94641K385871J511498j249256
$$ plain form
36573 3476696 2569002 4748644 7439706 6626507 3115805 885454 696635 -264150 -2564707
36564 -2564707 -2663872 1741797 7685747 10346108 8602571 5261558 3046599 2282978 1887600
36555 1887600 1000155 -112969 260556 3902556 9562134 12258822 8090276 -446019
36547 -446019 -6556950 -7054660 -5401143 -5805325 -7530280 -7647866 -6683746 -7488661 -9786623
36538 -9786623 -10305670 -8402097 -7200067 -8021334 -7866933 -4690840 -1522869 -1973480 -4123607
36529 -4123607 -2769332 3337870 10000041 13025239 12179557 9620084 7131338 5578285
36521 5578285 5036049 4642042 3595262 2556383 2807703 4099131 4823149 4263108 3038797
36512 3038797 1393411 -998307 -3238772 -3332173 -954919 1662700 2699546 3067891 4477807
$$ packed form
36573C476696r07694K179642K691062q13199l510702k230351j88819r60785k300557
36564b564707r9165M405669N943950K660361j743537l341013k214959p63621l95378
36555A887600q87445j113124L73525L642000N659578K696688m168546q536295
36547d46019o110931m97710J653517m04182j724955j17586R64120q04915k297962
36538i786623n19047J903573J202030q21267J54401L176093L167971m50611k150127
36529d123607J354275O107202O662171L025198q45682k559473k488746j553053
36521E578285n42236l94007j046780j038879K51320J291428P24018n60041j224311
36512C038797j645386k391718k240465r3401K377254K617619J036846L68345J409916
$$ plain form
36503 4477807 6455543 7015426 5790648 4851885 6164057 9288894 12116407 13245969
36495 13245969 12902804 11654241 9287362 5793394 2763154 2186339 3671077 4477611
36487 4477611 2962928 375069 -1616151 -3121555 -4217425 -3162720 940988 5358503
36479 5358503 6764810 6025430 6540865 8645188 9695472 9520889 10995264 14046364 13835541
36470 13835541 7444498 -1353520 -6895157 -8165834 -7711461 -6998703 -6145522 -5688709 -5122229
36461 -5122229 -2050120 3490811 6388269 2794709 -2861295 -2719176 3575435 8708101
36453 8708101 8641260 7431183 9336400 12046082 11216765 7251692 3515431 926345 -1792106
36444 -1792106 -4815392 -7764680 -11492817 -15710705 -16664594 -11246487 -2435096 3330333
$$ packed form
36503D477807J977736N59883j224778r38763J312172L124837K827513J129562
36495A3245969l43165j248563k366879l493968l030240n76815J484738Q06534
36487D477611j514683k587859j991220j505404j095870J054705M103708M417515
36479E358503J406307p39380N15435K104323J050284j74583J474375L051100k10823
36470A3835541o391043q798018n541637j270677M54373P12758Q53181M56813N66480
36461e122229L072109N540931K897458l593560n656004J42119O294611N132666
36453H708101o6841j210077J905217K709682q29317l965073l736261k589086k718451
36444a792106l023286k949288l728137m217888r53889N418107Q811391N765429
$$ plain form
36436 3330333 3898608 2905403 3555629 4628126 3557774 416072 -2603187 -3681833 -2406768
36427 -2406768 49534 1250287 -307269 -2936112 -3428353 -1196267 1163169 1600745
36419 1600745 688699 -348677 -1103857 -699993 2265692 7008175 10050549 9216112 6373633
36410 6373633 4564634 4133287 3583260 2727806 2680219 3395619 3135450 319921 -4852781
36401 -4852781 -9933385 -10999480 -5641652 3660023 10730435 11654248 8200182 4357472
36393 4357472 1616149 -640770 -2297070 -2533950 -1265085 1434699 5648768 9642772
36385 9642772 10244140 7796562 7615784 12614925 17400250 14934837 7049740 2247638
36377 2247638 4001942 7742972 9369893 9563505 8396069 3346150 -3985035 -6136313
$$ packed form
36436C330333N68275r93205O50226J072497j070352l141702l019259j078646J275065
36427b406768K456302J200753j557556k628843m92241K232086K359436M37576
36419A600745r12046j037376p55180M03864K965685M742483L042374q34437k842479
36410F373633j808999m31347n50027q55454m7587P15400k60169k815529n172702
36401d852781n080604j066095N357828R301675P070412R23813l454066l842710
36393D357472k741323k256919j656300k36880J268865K699784M214069L994004
36385I642772O01368k447578j80778M999141M785325k465413p885097m802102
36377B247638J754304L741030J626921J93612j167436n049919p331185k151278
$$ plain form
36369 -6136313 279094 8275823 9425168 4617908 441489 -1021059 -2331812 -3739151
36361 -3739151 -3175508 -1726211 -2367267 -3804811 -1938619 2556852 4432712 2244343
36353 2244343 166162 8013 -2109284 -8265953 -13754702 -13673402 -10049778 -7933241 -7896822
36344 -7896822 -7319641 -6643604 -8894564 -13614838 -16142853 -13727501 -8820754 -5186229
36336 -5186229 -3547179 -2552109 -1854151 -2131708 -2950563 -2589752 -324426 2248361 2911550
36327 2911550 1392067 -589688 -1620318 -1800574 -1502383 -539554 424337 -740579 -4978069
36318 -4978069 -9837526 -12028616 -11430247 -10327600 -9511024 -8073513 -6632976 -7052788 -8353593
36309 -8353593 -6743292 -1462487 2763957 1674161 -2663147 -4793188 -2924855 -121110
$$ packed form
36369f136313O415407P996729J149345m807260m176419j462548j310753j407339
36361c739151N63643J449297o41056j437544J866192M495471J875860k188369
36353B244343k078181j58149k117297o156669n488749Q1300L623624K116537L6419
36344g896822N77181O76037k250960m720274k528015K415352M906747L634525
36336e186229J639050R95070O97958k77557q18855L60811K265326K572787O63189
36327B911550j519483j981755j030630j80256K98191R62829R63891j164916m237490
36318d978069m859457k191090N98369J102647Q16576J437511J440537m19812j300805
36309h353593J610301N280805M226444j089796m337308k130041J868333K803745
$$ plain form
36301 -121110 499234 -1060975 -3055671 -4357763 -5128559 -6108221 -7080343 -5977532 -1159461
36292 -1159461 4730155 5615230 -1307407 -11555098 -18307953 -19745196 -18949867 -18167901
36284 -18167901 -16604155 -13410661 -9576208 -6430721 -4536389 -4109742 -4483459 -3512778
36276 -3512778 86121 4175935 5663958 5155427 5822909 7510654 5937888 -800708
36268 -800708 -8537715 -12130108 -11399573 -9407608 -7381735 -4716019 -2334608 -2190822 -3697476
36259 -3697476 -4026436 -2425083 -1338725 -2263242 -3051849 -1073151 2707989 4882888 4018148
36250 4018148 1980743 1016546 1286308 1768540 2155414 2820204 3734108 4602811 5722380
36241 5722380 7468643 8943734 8538539 6488241 5612254 8122781 12234771 13629957
$$ packed form
36301a21110O20344j560209j994696j302092p70796r79662r72122J102811M818071
36292a159461N889616Q85075o922637j0247691o752855j437243P95329P81966
36284a8167901J563746L193494L834453L145487J894332M26647l73717R70681
36276c512778L598899M089814J488023n08531O67482J687745j572766o738596
36268h00708p737007l592393P30535J991965K025873K665716K381411J43786j506654
36259c697476l28960J601353J086358r24517p88607J978698L781140K174899q64740
36250D018148k037405r64197K69762M82232L86874O64790R13904Q68703J119569
36241E722380J746263J475091m05195k050298q75987K510527M111990J395186
$$ plain form
36233 13629957 10686000 6880440 6874518 10831250 14030664 12414050 7341642 3824087
36225 3824087 4657443 7882853 10255444 11344938 12751075 14638874 15493808 15075478 14979253
36216 14979253 15481612 14245766 9812948 4567004 2124656 2924546 4539867 5457540
36208 5457540 6010604 5907511 3779049 29420 -2274801 -957009 2299206 4085628
36200 4085628 3334624 1637978 217843 -1480308 -4021612 -6475619 -7461128 -6631721 -4292294
36191 -4292294 -568004 3739730 6334534 5653486 4025045 6043270 12468036 18108140
36183 18108140 18144635 14609505 13177965 14819041 15256028 12882233 11790899 14476051
36175 14476051 16334009 11846487 3193608 -2332763 -2041001 -40011 -169640 -1596857
$$ packed form
36233A3629957k943957l805560n922L956732L199414j616614n072408l517555
36225C824087Q33356L225410K372591J089494J406137J887799Q54934m18330r6225
36216A4979253N02359j235846m432818n245944k442348P99890J615321R17673
36208E457540N53064j03093k128462l749629k304221J317792L256215J786422
36200D085628p51004j696646j420135j698151k541304k454007r85509Q29407K339427
36191d292294L724290M307734K594804o81048j628441K018225O424766N640104
36183A8108140L6495l535130j431540J641076M36987k373795j091334K685152
36175A4476051J857958m487522q652879n526371K91762K000990j29629j427217
$$ plain form
36167 -1596857 -2207421 -2054166 -1734900 -659594 1179003 2249218 1931627 1638227 2026887
36158 2026887 1562429 -313460 -1007220 1674013 5507188 6284273 3520147 1043131 1841197
36149 1841197 4596272 6110192 5574240 5002299 5754195 6047546 3099051 -2543586 -6614617
36140 -6614617 -6175303 -3525262 -3113148 -5676192 -8139604 -8739533 -8812234 -9077667 -7904902
36131 -7904902 -5076759 -4129793 -8195603 -15379388 -20727428 -21401957 -17874186 -11740580
36123 -11740580 -5104726 -1008737 -1408336 -4613060 -6787838 -6075036 -3796678 -1999008
36115 -1999008 -1384428 -1270859 -137171 3208760 7529795 9177620 6303670 2425959
36107 2425959 3311818 10154567 17940557 20989170 18395299 13648485 10546846 10096052
$$ packed form
36167a596857o10564J53255L19266J075306J838597J070215l17591k93400L88660
36158B026887m64458j875889o93760K681233L833175P77085k764126k477016P98066
36149A841197K755075J513920n35952n71941P51896K93351k948495n642637m071031
36140f614617M39314K650041M12114k563044k463412n99929p2701k65433J172765
36131g904902K828143R46966m065810p183785n348040o74529L527771O133606
36123a1740580O635854M095989l99599l204724k174778P12802K278358J797670
36115a999008O14580J13569J133688L345931M321035J647825k873950l877711
36107B425959Q85859O842749P785990L048613k593871m746814l101639m50794
$$ plain form
36099 10096052 10251807 8296455 4224047 1413873 2715615 6518648 8714305 8221584
36091 8221584 7864094 9166747 9174234 4472404 -3378284 -8899297 -8778846 -4999174 -1723049
36082 -1723049 -581160 120318 2273997 5303097 7080080 6828740 5991722 6051397 6595514
36073 6595514 6184487 4121711 430701 -4853012 -10864770 -15099600 -15295099 -12148055
36065 -12148055 -8683858 -6841222 -5949964 -4501462 -2000183 926280 2845443 2159723
36057 2159723 -783428 -2411179 775567 7049332 10162325 6574631 -170587 -3979216
36049 -3979216 -3075942 -37856 3351055 7951111 14030877 19129994 20445461 17971139
36041 17971139 14308511 12045414 11638941 11129619 7895657 1719826 -3815005 -4379024
$$ packed form
36099A0096052J55755j955352m072408k810174J301742L803033K195657m92721
36091H221584l57490J302653P487m701830p850688n521013J20451L779672L276125
36082a723049J141889P01478K153679L029100J776983k51340q37018N9675N44117
36073F595514m11027k062776l691010n283713o011758m234830j95499L147044
36065a2148055L464197J842636Q91258J448502K501279K926463J919163o85720
36057B159723k943151j627751L186746O273765L112993l587694o745218l808629
36049c979216R03274L038086L388911M600056O079766N099117J315467k474322
36041A7971139l662628k263097m06473n09322l233962o175831n534831n64019
$$ plain form
36033 -4379024 110465 4873154 5542587 2861030 872148 1545686 3101138 3198571 1506925
36024 1506925 -1361306 -5318046 -9897097 -13427030 -14727577 -14601113 -14021848 -11896211
36016 -11896211 -6855049 -765267 2221718 645443 -2487295 -3777414 -3267139 -3014482
36008 -3014482 -3684534 -4253032 -3967216 -3082176 -2353526 -2737137 -4608459 -6605842 -6833727
35999 -6833727 -6072418 -7493258 -11454847 -13080309 -7893806 1967364 10441378 14874411
35991 14874411 16759122 16404798 12156925 5588968 2238510 4635157 8430673 8432035 5501304
35982 5501304 4240400 6168493 8788105 10002104 9911372 8861433 6953275 5372762
35974 5372762 5278948 5221095 2465152 -2664068 -6588177 -7534287 -7881276 -9607096 -9980334
$$ packed form
36033d379024M489489M762689O69433k681557j988882O73538J555452R7433j691646
36024A506925k868231l956740m579051l529933j300547J26464N79265K125637
36016a1896211N041162O089782K986985j576275l132738j290119N10275K52657
36008c014482o70052n68498K85816Q85040P28650l83611j871322j997383k27885
35999f833727P61309j420840l961589j625462N186503R861170Q474014M433033
35991A4874411J884711l54324m247873o567957l350458K396647L795516J362k930731
35982E501304j260904J928093K619612J213999r0732j049939j908158j580513
35974E372762r3814n7853k755943n129220l924109r46110l46989j725820l73238
$$ plain form
35965 -9980334 -4920694 4477802 12201664 14408549 13266798 12497320 11898496 8966615
35957 8966615 4268632 1535656 2195591 3118541 1277537 -1939901 -3367338 -3295505 -5242449
35948 -5242449 -10868681 -17479756 -20980937 -19854679 -15916879 -12141638 -9911561 -7994573
35940 -7994573 -4643696 -660224 1415903 1791261 4194059 9925343 14119645 11891165
35932 11891165 6092080 3854207 6330110 7686411 4752710 1456242 1448334 2088300 -507009
35923 -507009 -5001800 -7743486 -8507460 -8797995 -7432587 -2833751 2397271 4337652 3875491
35914 3875491 5019253 7983774 9177019 7899901 7627336 9652645 10544356 7937157
35906 7937157 4551804 3761827 4493313 3512934 372335 -2967537 -5890121 -9511947 -13765136
$$ packed form
35965i980334N059640R398496P723862K206885j141751p69478n98824k931881
35957H966615m697983k732976O59935R22950j841004l217438j427437P1833j946944
35948e242449n626232o611075l501181J126258L937800L775241K230077J916988
35940g994573L350877L983472K076127L75358K402798N731284M194302k228480
35932A1891165n799085k237873K475903J356301k933701l296468p908O39966k595309
35923e07009m494791k741686p63974k90535J365408M598836N231022J940381m62161
35914C875491J143762K964521J193245j277118k72565K025309Q91711k607199
35906G937157l385353p89977P31486r80379l140599l339872k922584l621826m253189
$$ plain form
35897 -13765136 -16378991 -15120041 -10092620 -3875462 223512 655528 -1078364 -2074689
35889 -2074689 -1096948 719071 2080532 3094757 4260722 5230230 5294272 4261845 2430775
35880 2430775 513550 -197896 1325290 4379057 6714914 6551458 3855410 -182203
35872 -182203 -3999473 -6210736 -6488268 -5875787 -5270823 -4017372 -1219635 2237504 4697833
35863 4697833 6120073 7366835 7777130 6226710 4357900 5354950 8871674 10679353
35855 10679353 8827814 6810051 8307748 11683706 12752467 11026346 9824181 11109213
35847 11109213 13370894 14553270 14533702 14270276 14228683 14056214 12724953 9052811 3179039
35838 3179039 -2549054 -5164185 -3709934 29975 3046843 3217531 913505 -1019185
$$ packed form
35897a3765136k613855J258950N027421O217158M098974M32016j733892r96325
35889b074689R77741J816019J361461J014225J165965R69508O4042j032427j831070
35880B430775j917225p11446J523186L053767K335857j63456k696048m037613
35872a82203l817270k211263k77532O12481O04964J253451K797737L457139K460329
35863D697833J422240J246762M10295j550420j868810R97050L516724J807679
35855A0679353j851539k017763J497697L375958J068761j726121j202165J285032
35847A1109213K261681J182376j9568k63426m1593j72469j331261l672142n873772
35838C179039n728093k615131J454251L739909L016868J70688k304026j932690
$$ plain form
35830 -1019185 19940 3216775 5279744 5028833 5008743 7351264 10261250 10663348 8520671
35821 8520671 6002514 3724158 711542 -2570233 -4102211 -3346087 -2034675 -1618936
35813 -1618936 -1815258 -1920227 -1885114 -1819567 -1690392 -1458676 -579681 1772079 4637128
35804 4637128 4861652 1010692 -3612183 -4804694 -3336721 -3429423 -5917963 -7206615 -5453559
35795 -5453559 -3202847 -2300601 -692471 2932696 5146853 2184140 -4228121 -9161960
35787 -9161960 -10717628 -10342286 -8656046 -5196054 -1530858 -252871 -586829 1041502
35779 1041502 5123833 7326935 4198040 -2311798 -7828986 -10479966 -10644698 -8079442
35771 -8079442 -2435392 4164580 8055474 8062645 6755549 6991768 8510567 8871766 7056712
$$ packed form
35830a019185J039125L196835K062969k50911k0090K342521K909986M02098k142677
35821H520671k518157k278356l012616l281775j531978P56124J311412M15739
35813a618936j96322j04969L5113O5547J29175K31716Q78995K351760K865049
35804D637128K24524l850960m622875j192511J467973r2702k488540j288652J753056
35795e453559K250712R02246J608130L625167K214157k962713o412261m933839
35787i161960j555668L75342J686240L459992L665196J277987l33958J628331
35779A041502M082331K203102l128895o509838n517188k650980j64732K565256
35771h079442N644050O599972L890894P171j307096K36219J518799L61199j815054
$$ plain form
35762 7056712 5012250 5368088 8187595 10660289 10110038 6688405 2684383 -151646
35754 -151646 -1735360 -2604992 -2973806 -2805435 -1817091 519914 3932840 6591487 6902876
35745 6902876 5871342 5668686 5760859 3130397 -2687666 -7718655 -8706864 -7477305 -7249662
35736 -7249662 -7008734 -3730559 1086476 2262264 -1075156 -3212314 248800 6162453
35728 6162453 8654345 7220000 6129161 7312967 7905764 4879189 -1080567 -6992516
35720 -6992516 -10512873 -10681252 -7750965 -3498798 -545416 -188959 -1165753 -968460 1713687
35711 1713687 5658203 7907220 6480792 2850462 808852 1837330 2580275 -1337692
35703 -1337692 -9381122 -15820875 -15557225 -8893155 -557206 4511951 4333821 642664
$$ packed form
35762G056712k044462L55838K819507K472694n50251l421633m004022k836029
35754a51646j583714q69632l68814J68371R88344K337005L412926K658647L11389
35745F902876j031534k02656R2173k630462n818063n030989r88209J229559K27643
35736g249662K40928L278175M817035J175788l337420k137158L461114N913653
35728F162453K491892j434345j090839J183806N92797l026575n959756n911949
35720f992516l520357j68379K930287M252167K953382L56457r76794J97293K682147
35711A713687L944516K249017j426428l630330k041610J028478P42945l917967
35703a337692q043430o439753K63650O664070Q335949N069157j78130l691157
$$ plain form
35695 642664 -2624116 -2469529 877259 4905365 7431917 7504697 4799165 -82375 -5249391
35686 -5249391 -9358328 -13312656 -17971184 -20820140 -18125140 -10760069 -4587765 -3724186
35678 -3724186 -6130699 -7281776 -5493143 -1929599 1818581 3729270 1392064 -4905487
35670 -4905487 -10752116 -12170050 -10343717 -9081017 -9000943 -7671451 -4730771 -2966021
35662 -2966021 -3792587 -4966788 -4004401 -1419562 743105 1687570 1827702 1388281 390433
35653 390433 -764933 -1665506 -2331421 -2739889 -2456154 -1244608 296897 1112293 751028
35644 751028 146632 1131114 4454101 8238832 9474838 7326251 3701846 365526 -2463560
35635 -2463560 -3984197 -2239727 2218489 4795048 2252839 -2162384 -2676186 1116013
$$ packed form
35695F42664l266780J54587L346788M028106K526552P2780k705532m881540n167016
35686e249391m108937l954328m658528k848956K695000P365071O172304Q63579
35678c724186k406513j151077J788633L563544L748180J910689k337206o297551
35670d905487n846629j417934J826333J262700Q0074J329492K940680J764750
35662b966021q26566j174201R62387K584839K162667R44465J40132m39421r97848
35653C90433j155366r00573o65915m08468K83735J211546J541505Q15396l61265
35644G51028o04396R84482L322987L784731J236006k148587l624405l336320k829086
35635b463560j520637J744470M458216K576559k542209m415223n13802L792199
$$ plain form
35627 1116013 4304620 4087558 2850942 3450443 5524433 7658215 9615440 10881770
35619 10881770 10055142 7258076 4489540 2332732 -770026 -4622084 -5958509 -3087295
35611 -3087295 1113937 3189670 3437467 3834846 4351092 4230822 4513979 5906102 6062001
35602 6062001 2637812 -2241090 -4204416 -2558842 -477140 285466 1230966 3398423
35594 3398423 5173115 4894543 3237401 1859073 1275493 811952 -458440 -2791735 -4652612
35585 -4652612 -3156397 2512426 8698466 10700485 8470979 6298618 6538273 6522674 2868735
35576 2868735 -3579776 -8865509 -10369683 -8444213 -4726231 -661252 2555004 3972013
35568 3972013 3361667 1562159 245733 884602 3305573 5492729 5538119 3635344 1644322
$$ packed form
35627A116013L188607k17062j236616N99501K073990K133782J957225J266330
35619A0881770q26628k797066k768536k156808l102758l852058j336425K871214
35611c087295M201232K075733K47797L97379N16246j20270K83157J392123J55899
35602F062001l424189m878902j963326J645574K081702P62606R45500K167457
35594C398423J774692k78572j657142j378328n83580m63541j270392k333295j860877
35585d652612J496215N668823O186040K002019k229506k172361K39655j5599l653939
35576B868735o448511n285733j504174J925470L717982M064979L216256J417009
35568C972013o10346j799508j316426O38869K420971K187156M5390j902775j991022
$$ plain form
35559 1644322 1312393 3667519 9022943 15908341 20745735 20724832 16961284 13020856 10466737
35550 10466737 7794233 3587631 -1597103 -6642940 -10678224 -12041703 -9156772 -3493869
35542 -3493869 744298 1089794 -1254858 -4801014 -9945707 -15909316 -18885518 -16591407
35534 -16591407 -12293013 -10454158 -10041692 -6557673 55605 4545679 4114790 2250668
35526 2250668 2676864 3682675 1924823 -1226191 -1641403 655683 1246557 -1721077 -4605519
35517 -4605519 -3948978 -1600885 -1493339 -3717412 -5104880 -4415659 -3335940 -2427729 287549
35508 287549 5475754 10086382 10762898 7828500 4124029 1573061 829673 2593814 6504650
$$ packed form
35559A644322l31929K355126N355424O885398M837394k0903l763548l940428k554119
35550A0466737k672504m206602n184734n045837m035284j363479K884931N662903
35542c493869M238167L45496k344652l546156n144693n963609k976202K294111
35534a6591407M298394J838855M12466L484019O613278M490074m30889j864122
35526B250668M26196J005811j757852l151014m15212K297086N90874k967634k884442
35517d605519O56541K348093J07546k224073j387468O89221J079719R08211K715278
35508B87549N188205M610628O76516k934398l704471k550968p43388J764141L910836
$$ [...]
##END NTUPLES=NMR SPECTRUM
##END=
