##TITLE=31Pdec_LR-795-RM1
 , 24 sc
 28.12.2024
##JCAMPDX= 6.0         $$ Bruker NMR JCAMP-DX V2.0
##DATA TYPE= NMR SPECTRUM
##DATA CLASS= NTUPLES
##ORIGIN= UXNMR, Bruker Analytische Messtechnik GmbH
##OWNER= root
$$ XWIN-NMR		Version 3.5
$$ Sat Dec 28 13:59:30 2024 Russian Standard Time (UT+4h)  she@DPX200
##.OBSERVE FREQUENCY= 81.013821
##.OBSERVE NUCLEUS= ^31P
##.ACQUISITION MODE= SIMULTANEOUS
##.ACQUISITION SCHEME= undefined
##.AVERAGES= 24
##.DIGITISER RES= 17
##SPECTROMETER/DATA SYSTEM= spect
##.PULSE SEQUENCE= zgpg30
##.SOLVENT NAME= D2O
##.SHIFT REFERENCE= (INTERNAL, D2O, 0, 198.062)
##AUDIT TRAIL= $$ (NUMBER, WHEN, WHO, WHERE, WHAT)
$$ ##TITLE= Audit trail, XWIN-NMR		Version 3.5
$$ ##JCAMPDX= 5.01
$$ ##ORIGIN= Bruker BioSpin GmbH
$$ ##OWNER= she
$$ F:/spectra/data/she/nmr/P31/2/pdata/1/auditp.txt
$$ ##AUDIT TRAIL=  $$ (NUMBER, WHEN, WHO, WHERE, WHAT)
(   1,<2024-12-28 13:57:30.68 +0400>,<she>,<DPX200>,
      <created by zg, POWCHK disabled, PULCHK disabled
       configuration hash MD5:
       00 E9 B6 7A A2 85 ED C7 34 08 36 98 17 FE 4E 26
       data hash MD5: 32K
       56 4F 1F 31 E2 D3 70 BA BE C2 62 6C 45 B3 B5 1B>)
(   2,<2024-12-28 13:57:32.93 +0400>,<she>,<DPX200>,
      <Start of raw data processing
       efp BC_mod = 2 LB = 1.5 FT_mod = 6 PKNL = 1 PHC0 = 2095.332 PHC1 = 161.0865 SI = 64K 
       data hash MD5: 64K
       46 A1 A8 4B 26 37 D8 53 8A 81 8A E9 EE 20 56 CE>)
(   3,<2024-12-28 13:57:57.32 +0400>,<she>,<DPX200>,
      <pk PHC0 = 15.05473 PHC1 = -62.2 
       data hash MD5: 64K
       4B 69 F8 E1 90 66 D3 FC E1 17 92 FA D4 B4 AD AB>)
(   4,<2024-12-28 13:58:01.57 +0400>,<she>,<DPX200>,
      <abs ABSG = 5 
       data hash MD5: 64K
       D7 3C 9F 86 61 FC 2A B5 0E E6 25 6A F7 FB 3B D4>)
$$ ##END=
$$ 
$$ hash MD5
$$ 11 24 32 C2 C1 36 95 E4 70 D6 AA C3 60 0D 38 FA
##$RELAX= 
##$RELAX= 
##$RELAX= 
##$RELAX= 
##$RELAX= 
##$RELAX= 
##$RELAX= 
##$RELAX= 
$$ Bruker specific parameters
$$ --------------------------
##$DU= <F:/spectra>
##$EXPNO= 2
##$NAME= <P31>
##$PROCNO= 1
##$TYPE= <nmr>
##$USER= <she>
##$AMP= (0..31)
100 100 100 100 100 100 100 100 100 100 100 100 100 100 100 100 100 100 
100 100 100 100 100 100 100 100 100 100 100 100 100 100 
##$AQSEQ= 0
##$AQ_mod= 1
##$AUNM= <au_zg>
##$AUTOPOS= <>
##$BF1= 81.014009
##$BF2= 200.13
##$BF3= 200.13
##$BF4= 200.13
##$BF5= 200.13
##$BF6= 200.13
##$BF7= 200.13
##$BF8= 200.13
##$BYTORDA= 1
##$CFDGTYP= 0
##$CFRGTYP= 5
##$CHEMSTR= <none>
##$CNST= (0..31)
1 1 145 1 1 1 1 1 1 1 1 1 1 1 1 1 1 1 1 1 1 1 1 1 1 1 1 1 1 1 1 1 
##$CPDPRG= <waltz16>
##$CPDPRG1= <>
##$CPDPRG2= <waltz16>
##$CPDPRG3= <>
##$CPDPRG4= <mlev>
##$CPDPRG5= <mlev>
##$CPDPRG6= <mlev>
##$CPDPRG7= <mlev>
##$CPDPRG8= <mlev>
##$CPDPRGB= <>
##$CPDPRGT= <>
##$D= (0..31)
0 1 0 0 0 0 0 0 0 0.06 0 0.03 2e-05 3e-06 0 0 0.0002 0 0 0 0 0 0 0 0 0 
0 0 0 0 0 0 
##$DATE= 1735379850
##$DBL= (0..7)
120 120 120 11 120 120 24 19 
##$DBP= (0..7)
150 150 150 150 150 150 150 150 
##$DBP07= 0
##$DBPNAM0= <>
##$DBPNAM1= <>
##$DBPNAM2= <>
$$ [...]
##$SUBNAM3= <"">
##$SUBNAM4= <"">
##$SUBNAM5= <"">
##$SUBNAM6= <"">
##$SUBNAM7= <"">
##$SUBNAM8= <"">
##$SUBNAM9= <"">
##$SW= 400.765351723535
##$SWIBOX= (0..15)
0 1 3 0 0 0 0 0 0 0 0 0 0 0 0 0 
##$SW_h= 32467.5324675325
##$TD= 32768
##$TD0= 1
##$TE= 0
##$TE2= 300
##$TE3= 300
##$TEG= 300
##$TL= (0..7)
0 120 53 12 22 120 120 120 
##$TP= (0..7)
150 150 150 150 150 150 150 150 
##$TP07= 0
##$TPNAME0= <>
##$TPNAME1= <>
##$TPNAME2= <>
##$TPNAME3= <>
##$TPNAME4= <>
##$TPNAME5= <>
##$TPNAME6= <>
##$TPNAME7= <>
##$TPOAL= (0..7)
0.5 0.5 0.5 0.5 0.5 0.5 0.5 0.5 
##$TPOFFS= (0..7)
0 0 0 0 0 0 0 0 
##$TUNHIN= 0
##$TUNHOUT= 0
##$TUNXOUT= 0
##$USERA1= <user>
##$USERA2= <user>
##$USERA3= <user>
##$USERA4= <user>
##$USERA5= <user>
##$V9= 5
##$VALIST= <valist>
##$VCLIST= <CCCCCCCCCCCCCCC>
##$VD= 0
##$VDLIST= <DDDDDDDDDDDDDDD>
##$VPLIST= <PPPPPPPPPPPPPPP>
##$VTLIST= <TTTTTTTTTTTTTTT>
##$WBST= 1024
##$WBSW= 4
##$XGAIN= (0..3)
0 0 0 0 
##$XL= 0
##$YL= 0
##$YMAX_a= 40224
##$YMIN_a= -43973
##$ZGOPTNS= <>
##$ZL1= 120
##$ZL2= 120
##$ZL3= 120
##$ZL4= 120
##$ABSF1= 198.0616
##$ABSF2= -202.7028
##$ABSG= 5
##$ABSL= 3
##$ALPHA= 0
##$AQORDER= 0
##$ASSFAC= 0
##$ASSFACI= 0
##$ASSFACX= 0
##$ASSWID= 0
##$AUNMP= <proc_1d>
##$AZFE= 0.1
##$AZFW= 0.5
##$BCFW= 0
##$BC_mod= 2
##$BYTORDP= 0
##$COROFFS= 0
##$CY= -3
##$DATMOD= 1
##$DC= 0
##$DFILT= <>
##$DTYPP= 0
##$F1P= 0
##$F2P= 0
##$FCOR= 1
##$FTSIZE= 65536
##$FT_mod= 6
##$GAMMA= 0
##$GB= 0
##$INTBC= 1
##$INTSCL= 9.790993e-09
##$ISEN= 30
##$LB= 1.5
##$LEV0= 0
##$LPBIN= 0
##$MAXI= 10000
##$MC2= 0
##$MEAN= 0
##$ME_mod= 0
##$MI= 50
##$NCOEF= 0
##$NC_proc= -6
##$NLEV= 6
##$NOISF1= 182.463
##$NOISF2= 159.3651
##$NSP= 0
##$NTH_PI= 0
##$NZP= 0
##$OFFSET= 198.0616
##$PC= 4
##$PHC0= 2110.387
##$PHC1= 98.88651
##$PH_mod= 1
##$PKNL= yes
##$PPARMOD= 0
##$PSCAL= 0
##$PSIGN= 0
##$REVERSE= no
##$SF= 81.0140089999434
##$SI= 65536
##$SIGF1= 159.3651
##$SIGF2= -187.1042
##$SINO= 113.3802
##$SIOLD= 16384
##$SREGLST= <1H.CDCl3>
##$SSB= 0
##$STSI= 65536
##$STSR= 0
##$SW_p= 32467.5324675325
##$SYMM= 0
##$S_DEV= 0
##$TDeff= 32768
##$TDoff= 0
##$TI= <>
##$TILT= no
##$TM1= 0
##$TM2= 0
##$TOPLEV= 0
##$USERP1= <user>
##$USERP2= <user>
##$USERP3= <user>
##$USERP4= <user>
##$USERP5= <user>
##$WDW= 1
##$XDIM= 65536
##$YMAX_p= 420627913
##$YMIN_p= -9951723
$$ End of Bruker specific parameters
$$ ---------------------------------
##NTUPLES= NMR SPECTRUM
##VAR_NAME=  FREQUENCY,     SPECTRUM/REAL,   SPECTRUM/IMAG
##SYMBOL=    X,             R,               I
##VAR_TYPE=  INDEPENDENT,   DEPENDENT,       DEPENDENT
##VAR_FORM=  AFFN,          ASDF,            ASDF
##VAR_DIM=   65536,         65536,           65536
##UNITS=     HZ,            ARBITRARY UNITS, ARBITRARY UNITS
##FACTOR=    0.49542278885378, 1,            1
##FIRST=     16045.7642231865, 0,            0
##LAST=      -16421.768244346, 0,            0
##MIN=       -16421.768244346, -9951723,     0
##MAX=       16045.7642231865, 420627913,    0
$$ Real data points
##PAGE= N=1
##DATA TABLE= (X++(R..R)), XYDATA
$$ [...]
$$ plain form
44708 -663645 -745186 -544774 -557057 -580739 -306457 -121428 -545573 -1240246 -1421005 -1074813
44698 -1074813 -928991 -1245175 -1470379 -1203474 -740015 -422795 -148651 151923 170453 -219045
44688 -219045 -554436 -397539 23888 205127 62515 -167908 -415783 -707992 -855627 -670536
44678 -670536 -345225 -219131 -304835 -406486 -527148 -743365 -839137 -544777 -54280 181528
44668 181528 142236 217553 484759 544776 201837 -217298 -438252 -632117 -915185 -916779
44658 -916779 -311021 529068 917037 726124 403802 238215 133145 82334 279869 608080
44648 608080 566275 11200 -499913 -508050 -384631 -732626 -1372805 -1621981 -1461922 -1638071
44638 -1638071 -2444621 -3163740 -3079047 -2395649 -1648795 -800302 346471 1261614 1152617
$$ packed form
44708f63645q1541K00412j2283k3682K74282J85029m24145o94673j80759L46192
44698a074813J45822l16184k25204K66905M63459L17220K74144L00574J8530l89498
44688b19045l35391J56897M21427J81239j42612k30423k47875k92209j47635J85091
44678f70536L25311J26094q5704j01651j20662k16217r5772K94360M90497K35808
44668A81528l9292P5317K67206O0017l42939m19135k20954j93865k83068j594
44658i16779O05758Q40089L87969j90913l22322j65587j05070n0811J97535L28211
44648F08080m1805n55075n11113q137J23419l47995o40179k49176J60059j76149
44638a638071q06550p19119Q4693O83398P46854Q48493J146773R15143j08997
$$ plain form
44629 1152617 233678 -352695 -41114 490447 431046 -95570 -512081 -748829 -1127453 -1633275
44619 -1633275 -1911978 -1864848 -1757316 -1766780 -1800615 -1753958 -1632048 -1401458 -974987 -378424
44609 -378424 239827 763115 1140364 1313115 1241663 962449 533155 3679 -496734 -791689
44599 -791689 -863913 -856451 -781136 -462689 83177 484692 455768 175283 -24915 -128660
44589 -128660 -292537 -419691 -227812 326339 960766 1358566 1374082 1083061 792220 796775
44579 796775 948194 748597 114632 -328914 -101409 374964 409582 104291 84245 370938
44569 370938 340461 -184189 -624034 -632977 -635478 -1000517 -1315952 -1002336 -229614 291294
44559 291294 194345 -266991 -655995 -744180 -611977 -595085 -971473 -1534746 -1708419 -1252047
$$ packed form
44629A152617r18939n86373L11581N31561n9401n26616m16511k36748l78624n05822
44619a633275k78703M7130J07532r464l3835M6657J21910K30590M26471N96563
44609c78424O18251N23288L77249J72751p1452k79214m29294n29476n00413k94955
44599g91689p2224P462P5315L18447N45866M01515k8924k80485k00198j03745
44589a28660j63877j27154J91879N54151O34427L97800J5516k91021k90841M555
44579G96775J51419j99597o33965m43546K27505M76373L4618l05291k0046K86693
44569C70938l0477n24650m39845q943k501l65039l15435L13616P72722N20908
44559B91294r6949m61336l89004q8185J32203J6892l76388n63273j73673M56372
$$ plain form
44549 -1252047 -564721 -86526 246658 645852 926120 777768 360150 133688 183204 157749
44539 157749 -123890 -427199 -531153 -533669 -578272 -559683 -312855 59174 257405 171358
44529 171358 61479 284120 840353 1286225 1206611 746573 484512 719658 1080224 973037
44519 973037 270978 -597885 -1113614 -1052644 -541858 60156 385009 338655 159195 98730
44509 98730 127063 66416 -98074 -227519 -272995 -309367 -359368 -374688 -383581 -478543 -649058
44498 -649058 -792955 -904463 -1069859 -1238031 -1197175 -894874 -614391 -645043 -862579 -863363
44488 -863363 -530770 -227041 -271065 -421362 -181590 422350 746794 377946 -243722 -375923
44478 -375923 28240 277066 -128101 -902758 -1418575 -1417384 -1128992 -925476 -1056258 -1565014
$$ packed form
44549a252047O87326M78195L33184L99194K80268j48352m17618k26462M9516k5455
44539A57749k81639l03309j03954k516m4603J8589K46828L72029J98231q6047
44529A71358j09879K22641N56233M45872p9614m60038k62061K35146L60566j07187
44519I73037p02059q68863n15729O0970N10786O02014L24853m6354j79460o0465
44509I8730K8333o0647j64490j29445m5476l6372n0001j5320q893r4962j70515
44498f49058j43897j11508j65396j68172M0856L02301K80483l0652k17536p84
44488h63363L32593L03729m4024j50297K39772O03940L24444l68848o21668j32201
44478c75923M04163K48826m05167p74657n15817J191K88392K03516j30782n08756
$$ plain form
44468 -1565014 -2264318 -2826630 -2982437 -2618000 -1773203 -735088 -58150 -154048 -780124
44459 -780124 -1228981 -1134481 -799204 -611958 -513652 -286796 -35306 -5485 -128566 -111135
44449 -111135 111596 320631 358090 280912 222272 296236 550304 822930 779682 318582
44439 318582 -194935 -354949 -246913 -263708 -517437 -790900 -1002602 -1302054 -1654469 -1738770
44429 -1738770 -1440038 -1138363 -1260025 -1707080 -1954486 -1641320 -905270 -173235 237124
44420 237124 294222 143675 -78684 -312826 -530305 -714276 -868317 -961408 -897546 -668977
44410 -668977 -499812 -631958 -964695 -1161613 -1161960 -1266966 -1583333 -1740183 -1439582 -997323
44400 -997323 -969456 -1417660 -1898390 -2054683 -1884106 -1539300 -1223838 -1207854 -1577702 -1994637
$$ packed form
44468a565014o99304n62312j55807L64437Q44797J038115O76938r5898o26076
44459g80124m48857R4500L35277J87246R8306K26856K51490K9821j23081J7431
44449a11135K22731K09035L7459p7178n8640P3964K54068K72626m3248m61100
44439C18582n13517j60014J08036j6795k53729k73463k11702k99452l52415q4301
44429a738770K98732L01675j21662m47055k47406L13166P36050P32035M10359
44420B37124N7098j50547k22359k34142k17479j83971j54041r3091O3862K28569
44410f68977J69165j32146l32737j96918l47j05006l16367j56850L00601M42259
44400i97323K7867m48204m80730j56293J70577L44806L15462J5984l69848m16935
$$ plain form
44390 -1994637 -2032232 -1721378 -1429194 -1248323 -908944 -324321 189126 365731 335465 363995
44380 363995 501074 618358 596003 383007 42409 -239930 -366041 -481532 -667951 -599770
44370 -599770 69593 999895 1352300 828331 56369 -278042 -249896 -346179 -702741 -1095534
44360 -1095534 -1413309 -1696118 -1841177 -1663447 -1203677 -684164 -211428 224671 530993
44351 530993 560854 351267 85275 -133746 -254749 -119694 361841 892132 974186 529640
44341 529640 63452 48554 346781 452000 186013 -99128 -12833 404239 806482 981268
44331 981268 975738 847483 528449 32833 -374498 -409615 -132256 68817 -133303 -701856
44321 -701856 -1300793 -1581705 -1433668 -1026233 -606448 -263989 15547 113736 -139149 -565570
$$ packed form
44390a994637l7595L10854K92184J80871L39379N84623N13447J76605l0266K8530
44380C63995J37079J17284k2355k12996l40598k82339j26111j15491j86419O8181
44370e99770O69363R30302L52405n23969p71962l34411K8146r6283l56562l92793
44360a095534l17775k82809j45059J77730M59770N19513M72736M36099L06322
44351E30993K9861k09587k65992k19021j21003J35055M81535N30291Q2054m44546
44341E29640m66188j4898K98227J05219k65987k85141Q6295M17072M02243J74786
44331I81268n530j28255l19034m95616m07331l5117K77359K01073k02120n68553
44321g01856n98937k80912J48037M07435M19785L42459K79536R8189k52885m26421
$$ plain form
44311 -565570 -670882 -334051 -143502 -621063 -1354226 -1465108 -849208 -301291 -317579 -439384
44301 -439384 -96307 486214 728198 643561 736233 1104196 1238325 790820 100865 -244694
44291 -244694 -115403 106966 46809 -295881 -694470 -1037569 -1359456 -1568487 -1398209 -791873
44281 -791873 -138626 149699 174663 331956 644192 748058 562690 458569 572711 446671
44271 446671 -293915 -1247848 -1635756 -1190974 -324404 408264 681727 438626 -70338 -383007
44261 -383007 -282177 -66744 -97197 -234781 -94485 273160 400208 105515 -231876 -199461
44251 -199461 182045 637145 983461 1128693 942717 360774 -431209 -1027269 -1045720 -415161
44241 -415161 486749 1057876 1004862 633473 468339 639163 829984 784142 590963 415671
$$ packed form
44311e65570j05312L36831J90549m77561p33163j10882O15900N47917j6288j21805
44301d39384L43077N82521K41984q4637R2672L67963J34129m47505o89955l45559
44291b44694J29291K22369o0157l42690l98589l43099l21887k09031J70278O06336
44281g91873O53247K88325K4964J57293L12236J03866j85368j04121J14142j26040
44271D46671p40586r53933l87908M44782Q66570P32668K73463k43101n08964l12669
44261c83007J00830K15433l0453j37584J40296L67645J27048k94693l37391L2415
44251a99461L81506M55100L46316J45232j85976n81943p91983n96060j8451O30559
44241d15161R01910N71127n3014l71389j65134J70824J90821m5842j93179j75292
$$ plain form
44231 415671 204487 -159763 -544775 -633592 -334480 6900 -66539 -578614 -1032873 -991848
44221 -991848 -653138 -635128 -1197262 -1926879 -2276366 -2155787 -1852329 -1612358 -1518561 -1578769
44211 -1578769 -1673340 -1534532 -1017421 -318732 248711 596016 816278 954825 1019109 1076979
44201 1076979 1141224 1090476 883470 665182 463056 39567 -657309 -1178332 -1141682 -919791
44191 -919791 -1238558 -2150465 -2915398 -2940073 -2368462 -1655499 -1024001 -536464 -307676 -352629
44181 -352629 -436186 -304467 38909 395291 603828 672380 785272 1148756 1686501 1983721
44171 1983721 1751462 1244381 951028 982887 1093971 1175275 1294114 1310867 978056 477995
44161 477995 344843 699249 1039652 1003801 880846 1075915 1450899 1546673 1207706 689927
$$ packed form
44231D15671k11184l64250l85012q8817K99112L41380p3439n12075m54259M1025
44221i91848L38710J8010n62134p29617l49487J20579L03458K39971R3797o0208
44211a578769r4571J38808N17111O98689N67443L47305K20262J38547O4284N7870
44201A076979O4245n0748k07006k18288k02126m23489o96876n21023L6650K21891
44191i19791l18767r11907p64933k4675N71611P12963O31498M87537K28788m4953
44181c52629q3557J31719L43376L56382K08537O8552J12892L63484N37745K97220
44171A983721k32259n07081k93353L1859J11084Q1304J18839J6753l32811n00061
44161D77995j33152L54406L40403l5851j22955J95069L74984R5774l38967n17779
$$ plain form
44151 689927 332120 325071 604748 811105 579568 6975 -437012 -566686 -687237 -976445
44141 -976445 -1073509 -585181 321754 1131671 1497084 1300500 583622 -232691 -434195 210049
44131 210049 1019151 1208646 878412 679169 719841 477708 -204933 -697900 -410437 399218
44121 399218 959132 897599 552316 457355 723521 974140 838910 404790 54380 -81022
44111 -81022 -245446 -585423 -874559 -886374 -740819 -636354 -523337 -340842 -299177 -556069
44101 -556069 -840892 -806232 -565194 -455333 -442347 -238870 102595 239799 154508 200962
44091 200962 490166 694320 561579 220361 -114363 -356915 -416001 -254967 -161660 -519162
44081 -519162 -1175730 -1464840 -1022015 -198350 489261 897428 1052300 867486 400572 49868
$$ packed form
44151F89927l57807p049K79677K06357k31537n72593m43987j29674j20551k89208
44141i76445r7064M88328R06935Q09917L65413j96584p16878q16313k01504O44244
44131B10049Q09102J89495l30234j99243M0672k42133o82641m92967K87463Q09655
44121C99218N59914o1533l45283r4961K66166K50619j35230m34120l50410j35402
44111h1022j64424l39977k89136j1815J45555J04465J13017J82495M1665k56892
44101e56069k84823L4660K41038J09861J2986K03477L41465J37204q5291M6454
44091B00962K89204K04154j32741l41218l34724k42552n9086J61034R3307l57502
44081e19162o56568k89110M42825Q23665O87611M08167J54872j84814m66914l50704
$$ plain form
44071 49868 136039 501488 786161 870737 815045 632285 403769 360110 537470 577372 200069
44060 200069 -300482 -367818 130696 812231 1247320 1245534 807468 107600 -526316 -866111
44050 -866111 -984448 -1062401 -1139605 -1215078 -1362781 -1495838 -1272530 -590779 51937 136025
44040 136025 -111088 -46874 362085 454828 -84268 -695764 -745131 -377966 -172677 -266853
44030 -266853 -307047 -138245 -83569 -462450 -1132606 -1655201 -1761200 -1529636 -1188258 -877805
44020 -877805 -637338 -515739 -557481 -654878 -563036 -198618 157477 136929 -243340 -559800
44010 -559800 -478869 -127875 107043 38563 -175079 -290277 -274225 -295866 -450242 -584499
44000 -584499 -497254 -261376 -157555 -257029 -320361 -238557 -281732 -635674 -954365 -791577
$$ packed form
44071D9868Q6171L65449K84673Q4576n5692j82760k28516m3659J77360L9902l77303
44060B00069n00551o7336M98514O81535M35089j786m38066o99868o33916l39795
44050h66111j18337p7953p7204p5473j47703j33057K23308O81751O42716Q4088
44040A36025k47113O4214M08959R2743n39096o11496m9367L67165K05289r4176
44030b66853m0194J68802N4676l78881o70156n22595j05999K31564L41378L10453
44020h77805K40467J21599m1742r7397R1842L64418L56095k0548l80269l16460
44010e59800Q0931L50994K34918o8480k13642j15198J6052k1641j54376j34257
44000e84499Q7245K35878J03821r9474o3332Q1804m3175l53942l18691J62788
$$ plain form
43990 -791577 -323226 -141329 -361220 -476820 -207266 63984 -50395 -335057 -400902 -327982
43980 -327982 -426461 -626309 -585608 -256705 103271 395248 714909 959196 828837 292414
43970 292414 -291661 -593460 -582709 -368660 -87184 6896 -318210 -899760 -1225592 -1002551
43960 -1002551 -474836 -78612 -8154 -222380 -611271 -972715 -1031435 -694447 -188457 177177
43950 177177 277505 150467 -103871 -312119 -314151 -182821 -188347 -452946 -834686 -1221150
43940 -1221150 -1661203 -2077834 -2171296 -1831988 -1358856 -1006016 -616331 -47930 337212 100623
43930 100623 -519962 -814227 -532471 -123573 9612 4372 124395 284269 262986 98390
43920 98390 -22055 -83190 -189146 -282891 -148804 294736 815876 1014402 675475 44219
$$ packed form
43990g91577M68351J81897k19891j15600K69554K71250j14379k84662o5845P2920
43980c27982r8479j99848M0701L28903L59976K91977L19661K44287j30359n36423
43970B92414n84075l01799J0751K14049K81476R4080l25106n81550l25832K23041
43960a002551N27715L96224P0458k14226l88891l61444n8720L36988N05990L65634
43950A77177J00328j27038k54338k08248k032J31330n526k64599l81740l86464
43940a221150m40053m16631r3462L39308M73132L52840L89685N68401L85142k36589
43930A00623o20585k94265K81756M08898J33185n240J20023J59874k1283j64596
43920I8390j20445o1135j05956r3745J34087M43540N21140J98526l38927o31256
$$ plain form
43910 44219 -305003 -7641 708488 1303590 1503862 1405920 1124364 682882 264395 191110
43900 191110 503344 827009 808017 471239 74996 -129258 65564 666928 1227722 1141651
43890 1141651 430123 -143445 -43935 338601 364355 137252 243638 725128 991154 751362
43880 751362 389296 234159 18105 -609516 -1400622 -1723882 -1311310 -534304 -17390 -116127
43870 -116127 -672589 -1189173 -1344145 -1344825 -1577133 -1920354 -1772883 -916451 14129 252306
43860 252306 -155333 -511363 -428071 -189837 -169102 -324286 -434271 -484548 -562881 -586360
43850 -586360 -418119 -163378 -91482 -271042 -485745 -535386 -444397 -325773 -207928 -91487
43840 -91487 -42831 -101349 -178608 -183584 -193497 -356406 -640403 -821781 -748338 -498855 -238745
$$ packed form
43910D4219l49222K97362P16129N95102K00272r7942k81556m41482m18487p3285
43900A91110L12234L23665j8992l36778l96243k04254J94822O01364N60794q6071
43890A141651p11528n73568R9510L82536K5754k27103J06386M81490K66026k39792
43880G51362l62066j55137k16054o27621p91106l23260M12572P77006N16914r8737
43870a16127n56462n16584j54972o80k32308l43221J47471Q56432R30580K38177
43860B52306m07639l56030Q3292K38234K0735j55184j09985n0277p8333k3479
43850e86360J68241K54741P1896j79560k14703m9641R0989J18624J17845J16441
43840i1487M8656n8518p7259m976r913j62909k83997j81378P3443K49483K60110
$$ plain form
43829 -238745 -21582 183983 320809 200147 -296355 -948881 -1214015 -686569 375904
43820 375904 1152007 1044834 269537 -502305 -921206 -1102329 -1126934 -853475 -309689 135719
43810 135719 212344 75106 -10744 -42082 -115756 -170720 -170639 -295472 -625112 -850984 -689163
43799 -689163 -420180 -575840 -1146331 -1539014 -1362642 -861507 -494032 -449620 -704851 -1195351
43789 -1195351 -1702748 -1823900 -1323366 -435217 331925 636526 513155 262804 184660 316046
43779 316046 430017 375687 314670 423730 505954 253104 -168043 -252368 49379 171828
43769 171828 -209967 -648008 -612274 -308588 -306982 -622789 -746049 -487749 -209083 -141671
43759 -141671 -28512 326940 591063 325932 -380577 -1053341 -1424531 -1538693 -1379186 -831309
$$ packed form
43829b38745K17163K05565J36826j20662m96502o52526k65134N27446J062473
43820C75904P76103j07173p75297p71842m18901j81123k4605K73459N43786M45408
43810A35719P6625j37238q5850l1338p3674n4964Q1j24833l29640k25872J61821
43799f89163K68983j55660n70491l92683J76372N01135L67475M4412k55231m90500
43789a195351n07397j21152N00534Q88149P67142L04601j23371k50351p8144J31386
43779C16046J13971n4330o1017J09060Q2224k52850m21147q4325L01747J22449
43769A71828l81795m38041L5734L03686J606l15807j23260K58300K78666O7412
43759a41671J13159L55452K64123k65131p06509o72764l71190j14162J59507N47877
$$ plain form
43749 -831309 -105433 200663 -253757 -1051203 -1458080 -1262618 -862906 -570637 -224100 376011
43739 376011 1006752 1288919 1199148 1011948 869374 714828 548319 404362 130643 -432169
43729 -432169 -1028834 -1136541 -638145 7319 406664 680062 1052104 1350497 1249254 782813
43719 782813 276030 -93429 -352218 -469718 -359247 -92050 147569 258939 145456 -423169
43709 -423169 -1508948 -2611471 -2985387 -2457865 -1616857 -1069936 -822740 -563200 -254297
43700 -254297 -127220 -224404 -267104 -490 516689 1003419 1229009 1186426 1071859 1074412
43690 1074412 1123318 912084 287039 -460525 -871996 -869192 -795283 -853860 -778091 -259504
43680 -259504 511082 1054654 1257665 1427222 1655561 1554295 863466 10107 -291279 159201
$$ packed form
43749h31309P25876L06096m54420p97446m06877J95462L99712K92269L46537O00111
43739C76011O30741K82167q9771j87200j42574j54546j66509j43957k73719n62812
43729d32169n96665j07707M98396O45464L99345K73398L72042K98393j01243m66441
43719G82813n06783l69459k58789j17500J10471K67197K39619J11370j13483n68625
43709d23169j085779j102523l73916N27522Q41008N46921K47196K59540L08903
43700b54297J27077r7184m2700K66614N17179M86730K25590m2583j14567K553
43690A074412M8906k11234o25045p47564m11471K804P3909n8577P5769N18587
43680b59504P70586N43572K03011J69557K28339j01266o90829q53359l01386M50480
$$ plain form
43670 159201 955149 1654562 2070750 2061075 1481332 504644 -325187 -572476 -300294 113083
43660 113083 381446 449190 404599 383977 462255 576384 637684 678620 725200 610387 207402
43649 207402 -188038 -101139 417784 743119 504798 70718 -60585 35783 -9423 -168866
43639 -168866 -59270 458884 1106610 1541473 1586807 1212350 601882 153478 98969 184290
43629 184290 6848 -422290 -751303 -812123 -722775 -546165 -232410 122653 343348 504883
43619 504883 818762 1168882 1180939 842470 631587 856303 1239292 1370810 1230773 1002081
43609 1002081 680353 216927 -155331 -124965 216790 409415 186528 -193663 -254147 167872
43599 167872 751227 1016303 780198 263795 -227680 -595799 -831352 -783397 -315569 355421
$$ packed form
43670A59201P95948O99413M16188r675n79743r76688q29831k47289K72182M13377
43660A13083K68363O7744m4591k0622P8278J14129O1300M0936M6580j14813m02985
43649B07402l95440Q6899N18923L25335k38321m34080j31303R6368m5206j59443
43639a68866J09596N18154O47726M34863M5334l74457o10468m48404n4509Q5321
43629A84290j77442m29138l29013o0820Q9348J76610L13755L55063K20695J61535
43619E04883L13879L50120J2057l38469k10883K24716L82989J31518j40037k28692
43609A002081l21728m63426l72258L0366L41755J92625k22887l80191o0484M22019
43599A67872N83355K65076k36105n16403m91475l68119k35553M7955M67828O70990
$$ plain form
43589 355421 781876 805784 698035 700390 707620 552969 351572 336028 521365 751428 952271
43578 952271 1129119 1206353 1084671 820754 585809 479224 518269 747533 1171418 1576516
43568 1576516 1600946 1082664 296389 -214312 -82971 538989 1073814 1031206 481727 -36055
43558 -36055 -93320 252398 687405 1058224 1382358 1566060 1396933 888227 416359 337221
43548 337221 558957 692822 607727 591302 850302 1092465 886698 320492 -72449 -70689
43538 -70689 -57145 -372468 -735927 -637581 -75227 462147 617434 442025 156514 -32704
43528 -32704 34613 283150 321949 -88447 -568996 -530690 9099 485601 636345 736147
43518 736147 912163 857591 486571 282230 570674 909115 688354 14050 -513685 -666814
$$ packed form
43589C55421M26455K3908j07749K355P230j54651k01397j5544J85337K30063K00843
43578I52271J76848P7234j21682k63917k34945j06585L9045K29264M23885M05098
43568A576516K4430n18282p86275n10701J31341O21960N34825m2608n49479n17782
43558c6055n7265L45718M35007L70819L24134J83702j69127n08706m71868p9138
43548C37221K21736J33865q5095j6425K59000K42163k05767n66206l92941J760
43538g0689J3544l15323l63459R8346N62354N37374J55287j75409k85511j89218
43528c2704O7317K48537L8799m10396m80549L8306N39789M76502J50744R9802
43518G36147J76016n4572l71020k04341K88444L38441k20761o74304n27735j53129
$$ plain form
43508 -666814 -736949 -953278 -1221599 -1400226 -1448634 -1316554 -1004523 -711021 -633475 -648717
43498 -648717 -441558 90551 777257 1424137 1885152 2009706 1802532 1541119 1448610 1348842
43488 1348842 952097 386009 95179 262785 666742 1063922 1361423 1434220 1171810 770702
43478 770702 638257 911782 1333409 1621909 1677376 1430396 868977 285855 128631 475279
43468 475279 962817 1319468 1624689 1947544 2125290 2080962 1992438 1929330 1667361 1104827
43458 1104827 529236 198482 -19225 -285366 -403076 -173215 136600 118271 -168468 -346456
43448 -346456 -329030 -320650 -308721 -48155 438740 801162 866797 807861 724331 472580 48295
43437 48295 -246040 -225223 -115180 -229173 -602927 -1096933 -1570350 -1795506 -1537716 -945097
$$ packed form
43508f66814p0135k16329k68321j78627m8408J32080L12031K93502P7546j5242
43498f48717K07159N32109O86706O46880M61015J24554k07174k61413r2509r9768
43488A348842l96745n66088k90830J67606M03957L97180K97501P2797k62410m01108
43478G70702j32445K73525M21627K88500N5467k46980n61419n83122j57224L46648
43468D75279M87538L56651L05221L22855J77746m4328q8524o3108k61969n62534
43458A104827n75591l30754k17707k66141j17710K29861L09815j8329k86739j77988
43448c46456J7426Q380J1929K60566M86895L62422O5635n8936q3530k51751m24285
43437D8295k94335K0817J10043j13993l73754m94006m73417k25156K57790N92619
$$ plain form
43427 -945097 -518298 -416711 -167743 540802 1143309 846290 -200771 -1013802 -1013235 -541520
43417 -541520 -99317 269467 610121 711876 541892 537788 979209 1422913 1273644 646563
43407 646563 119997 -172767 -597707 -1224284 -1593186 -1401299 -919715 -546894 -348572 -226624
43397 -226624 -174013 -133907 97911 602547 1185693 1631251 1849002 1674006 906560 -213909
43387 -213909 -944579 -801794 -146774 304235 316739 159905 57983 53474 240170 654375
43377 654375 1003581 959807 710292 768812 1202978 1506059 1350148 1016532 867003 799967
43367 799967 557967 266253 247996 433086 352585 -239883 -1028661 -1519704 -1569239 -1394908
43357 -1394908 -1192834 -955043 -683028 -570422 -777466 -1098570 -1113641 -740540 -406861 -523701
$$ packed form
43427i45097M26799J01587K48968P08545O02507k97019j047061q13031N67M71715
43417e41520M42203L68784L40654J01755j69984m104M41421M43704j49269o27081
43407F46563n26566k92764m24940o26577l68902J91887M81584L72821J98322J21948
43397b26624N2611M0106K31818N04636N83146M45558K17751j74996p67446j120469
43387b13909p30670J42785O55020M51009J2504j56834j01922m509J86696M14205
43377F54375L49206m3774k49515N8520M34166L03081j55911l33616j49529o7036
43367G99967k42000k91714j8257J85090q0501n92468p88778m91043m9535J74331
43357a394908K02074K37791K72015J12606k07044l21104j5071L73101L33679j16840
$$ plain form
43347 -523701 -987751 -1400982 -1581107 -1562297 -1252293 -511048 412603 924360 733785 201457
43337 201457 -120922 -78344 133853 406568 840885 1460986 2005102 2120615 1771976 1385820
43327 1385820 1456513 1961270 2337233 2173095 1724193 1491052 1470001 1208489 535565 -197106
43317 -197106 -645262 -821730 -814482 -590254 -275289 -222405 -509668 -698879 -399952 204292
43307 204292 702083 1030150 1328749 1461250 1138707 432350 -236340 -588263 -665247 -603135
43297 -603135 -555901 -746877 -1202737 -1478847 -1070998 -139094 575292 633951 333306 161904
43287 161904 240553 487992 933777 1527352 1902291 1720459 1161585 757598 741473 785681
43277 785681 427207 -385488 -1214980 -1548080 -1268987 -715079 -250714 113326 539114 920204
$$ packed form
43347e23701m64050m13231j80125J8810L10004P41245R23651N11757j90575n32328
43337B01457l22379M2578K12197K72715M34317O20101N44116J15513l48639l86156
43327A385820P0693N04757L75963j64138m48902k33141k1051k61512o72924p32671
43317a97106m48156j76468P248K24228L14965N2884k87263j89211K98927O04244
43307B04292M97791L28067K98599J32501l22543p06357o68690l51923p6984O2112
43297f03135M7234j90976m55860k76110M07849R31904P14386N8659l00645j71402
43287A61904P8649K47439M45785N93575L74939j81832n58874m03987j6125M4208
43277G85681l58474q12695q29492l33100K79093N53908M64365L64040M25788L81090
$$ plain form
43267 920204 935480 581770 316475 491568 902202 1107876 983368 718094 468969 293484
43257 293484 284323 481219 730569 867597 930081 966675 816672 410963 127207 408255
43247 408255 1091483 1575663 1642438 1601441 1553757 1103735 66709 -1058538 -1710440 -1945459
43237 -1945459 -2076284 -2009509 -1485779 -732930 -280596 -201674 -87265 215601 364688 122884
43227 122884 -262862 -453796 -421746 -292073 -122236 -22068 -179944 -541243 -717813 -462872
43217 -462872 -45250 78267 -183903 -537457 -706833 -648538 -424782 -53223 473798 1051468
43207 1051468 1371101 1117276 424083 -20767 339572 1204118 1771905 1820944 1925674 2475069
43197 2475069 3046706 3092201 2754684 2537084 2508974 2338827 1872550 1225213 526266 26177
$$ packed form
43267I20204J5276l53710k65295J75093M10634K05674j24508k65274k49125j75485
43257B93484r161J96896K49350J37028O2484L6594j50003m05709k83756K81048
43247D08255O83228M84180O6775m0997m7684m50022j037026j125247o51902k35019
43237a945459j30825O6775N23730P52849M52334P8922J14409L02866J49087k41804
43227A22884l85746j90934L2050J29673J69837J00168j57876l61299j76570K54941
43217d62872M17622J23517k62170l53554j69376N8295K23756L71559N27021N77670
43207A051468L19633k53825o93193m44850L60339Q64546N67787M9039J04730N49395
43197B475069N71637M5495l37517k17600k8110j70147m66277o47337o98947n00089
$$ plain form
43187 26177 187051 1088160 1914447 1681122 443850 -791701 -1350492 -1452122 -1448297 -1222835
43177 -1222835 -654711 -93307 67656 -61240 -102549 78892 406610 864563 1415520 1835680
43167 1835680 1913036 1686978 1321984 938648 729190 964491 1622468 2225915 2330521 2009250
43157 2009250 1610394 1247959 852998 551745 576036 821643 868701 522658 63144 -140026
43147 -140026 -33579 214518 525266 929568 1339716 1484368 1159053 497118 -99344 -342325
43137 -342325 -329484 -381212 -648358 -963411 -1061855 -862213 -518187 -248104 -110407 57427
43127 57427 396780 716960 612874 -4024 -711663 -1099614 -1247908 -1411808 -1491485 -1247110
43117 -1247110 -864255 -766770 -911294 -829831 -425613 -144640 -206128 -259806 -86698 -74091
$$ packed form
43187B6177J60874R01109Q26287k33325j237272j235551n58791j01630L825K25462
43177a222835N68124N61404J60963j28896m1309J81441L27718M57953N50957M20160
43167A835680P7356k26058l64994l83336k09458K35301O57977O03447J04606l21271
43157B009250l98856l62435l94961l01253K4291K45607M7058l46043m59514k03170
43147a40026J06447K48097L10748M04302M10148J44652l25315o61935n96462k42981
43137c42325J2841n1728k67146l15053r8444J99642L44026K70083J37697J67834
43127E7427L39353L20180j04086o16898p07639l87951j48294j63900p9677K44375
43117a247110L82855R7485j44524Q1463M04218K80973o1488n3678J73108J2607
$$ plain form
43107 -74091 -573947 -1235803 -1461831 -1223465 -982938 -1045051 -1391644 -1923829 -2438882 -2547181
43097 -2547181 -2041426 -1248391 -670707 -403080 -214383 -29223 38675 -13544 -106353 -269049
43087 -269049 -459821 -381537 110575 589778 533777 121785 43034 532555 1114987 1357855
43077 1357855 1360499 1343124 1230529 920830 632447 671102 1003320 1267989 1139225 600764
43067 600764 -48371 -445953 -519094 -520765 -587570 -431673 247371 1179400 1731260 1658555
43057 1658555 1271654 870097 452957 61914 -64850 93476 152611 -161301 -579714 -667185
43047 -667185 -430553 -254460 -339282 -487102 -443538 -240430 -116482 -179808 -249766 -96243
43037 -96243 202365 307737 101413 -92128 50683 388499 580890 642224 841901 1157112
$$ packed form
43107g4091m99856o61856k26028K38366K40527o2113l46593n32185n15053j08299
43097b547181N05755P93035N77684K67627J88697J85160O7898n2219r2809j62696
43087b69049j90772P8284M92112M79203n6001m11992p8751M89521N82432K42868
43077A357855K644j7375j12595l09699k88383L8655L32218K64669j28764n38461
43067F00764o49135l97582p3141j671o6805J55897O79044R32029N51860p2705
43057A658555l86901m01557m17140l91043j26764J58326N9135l13912m18413q7471
43047f67185K36632J76093q4822j47820M3564K03108J23948o3326o9958J53523
43037i6243K98608J05372k06324j93541J42811L37816J92391O1334J99677L15211
$$ plain form
43027 1157112 1296527 1280934 1500732 2055839 2503142 2489971 2221879 2002125 1684587 992760
43017 992760 134660 -343825 -230026 186913 566048 805717 892274 775822 491428 200620
43007 200620 23087 -42762 152 185292 431614 508994 287128 -62962 -254032 -227259
42997 -227259 -155771 -111322 50566 363310 548815 421704 333729 798907 1676499 2197240
42987 2197240 1967578 1489726 1383273 1525597 1423229 1088425 949449 1074791 1134105 1103720
42977 1103720 1359976 1932759 2250444 1901515 1209783 755657 666273 668086 560164 334590
42967 334590 26329 -276503 -380525 -142936 379375 999150 1484874 1571372 1134383 438412
42957 438412 -29704 -78207 51309 112114 126100 137960 43691 -131663 -83736 368882 922175
$$ packed form
43027A157112J39415j5593K19798N55107M47303j3171k68092k19754l17538o91827
43017I92760q58100m78485J13799M16939L79135K39669Q6557j16452k84394k90808
43007B00620j77533o5849M2914J85140K46322P7380k21866l50090j91070K6773
42997b27259P1488M4449J61888L12744J85505j27111q7975M65178Q77592N20741
42987B197240k29662m77852j06453J42324j02368l34804j38976J25342N9314l0385
42977A103720K56256N72783L17685l48929o91732m54126q9384J813j07922k25574
42967C34590l08261l02832j04022K37589N22311O19775M85724Q6498m36989o95971
42957D38412m68116m8503J29516O0805J3986J1860r4269j75354M7927M52618N53293
$$ plain form
42946 922175 1084046 740212 269805 196537 794031 1854434 2758773 2982032 2635897 2321281
42936 2321281 2387350 2601345 2628040 2493677 2394842 2367991 2395338 2575499 2921239 3190466
42926 3190466 3160374 2891139 2519016 2013564 1381590 888991 776717 896969 908138 728618
42916 728618 556973 538257 640041 788120 925627 993648 1008555 1089095 1277270 1419502
42906 1419502 1348573 1104297 880360 825997 930463 988306 704116 44584 -521473 -424684
42896 -424684 300932 1002793 1175049 934618 647327 433983 216391 -50153 -361062 -623302
42886 -623302 -554219 38887 802049 1084876 779985 458058 522545 769490 995791 1405660
42876 1405660 2040415 2436951 2370363 2369385 2879433 3412884 3242590 2548230 2102889 2086931
$$ packed form
42946I22175J61871l43834m70407p3268N97494J060403R04339K23259l46135l14616
42936B321281O6069K13995K6695j34363r8835k6851K7347J80161L45740K69227
42926C190466l0092k69235l72123n05452o31974m92599j12274J20252J1169j79520
42916G28618j71645j8716J01784J48079J37507O8021J4907Q0540J88175J42232
42906A419502p0929k44276k23937n4363J04466N7843k84190o59532n66057R6789
42896d24684P25616P01861J72256k40431k87291k13344k17592k66544l10909k62240
42886f23302O9083N93106P63162K82827l04891l21927O4487K46945K26301M09869
42876A405660O34755L96536o6588r78N10048N33451j70294o94360m45341j5958
$$ plain form
42866 2086931 2000051 1611186 1233226 1075256 1001913 973761 1129133 1368850 1383161 1148887
42856 1148887 950425 901887 878567 881121 1019108 1184538 1190754 1161787 1326130 1536023 1501183
42845 1501183 1383810 1590725 2052847 2307019 2241911 2147126 2065649 1773771 1417590 1451739
42835 1451739 1842697 2037691 1882109 1859972 2193743 2405277 2106097 1609759 1384187 1429709
42825 1429709 1580485 1934351 2559997 3144316 3308499 3024438 2517582 2077391 2075545 2705570
42815 2705570 3523803 3744706 3211516 2576695 2326640 2234013 2050494 2037819 2333739 2434286
42805 2434286 1943232 1355073 1418915 2060762 2571307 2600111 2364485 2097271 1881585 1868899
42795 1868899 2097905 2216094 1893395 1392814 1240014 1463887 1682177 1810128 2098717
$$ packed form
42866B086931q6880l88865l77960j57970p3343k8152J55372K39717J4311k34274
42856A148887j98462m8538k3320K554J37987J65430O216k8967J64343K09893l4840
42845A501183j17373K06915M62122K54172o5108r4785q1477k91878l56181L4149
42835A451739L90958J94994j55582k2137L33771K11534k99180m96338k25572M5522
42825A429709J50776L53866O25646N84319J64183k84061n06856m40191j846O30025
42815B705570Q18233K20903n33190o34821k50055r2627j83519j2675K95920J00547
42805B434286m91054n88159O3842O41847N10545K8804k35626k67214k15686j2686
42795A868899K29006J18189l22699n00581j52800K23873K18290J27951K88589
$$ plain form
42786 2098717 2501142 2587663 2187884 1656519 1404521 1538929 1979541 2508288 2675476 2129403
42776 2129403 1163400 526700 554727 861443 1012742 1075357 1280508 1548720 1687983 1793832
42766 1793832 2091286 2516806 2766301 2696578 2439670 2170461 1987804 2003859 2313506 2802444
42756 2802444 3149014 3131459 2861106 2615889 2480444 2262263 1803926 1300458 1191283 1690465
42746 1690465 2475628 2932760 2759290 2297971 2196650 2700035 3351125 3490817 3003126
42737 3003126 2409157 2226150 2443572 2712007 2819161 2794584 2723558 2694427 2812380 3031009
42727 3031009 3074952 2778440 2400318 2320193 2500650 2563596 2348989 2056490 1844833 1652857
42717 1652857 1460246 1373965 1377536 1325291 1271642 1470826 1943711 2388839 2663549 3002713
$$ packed form
42786B098717M02425Q6521l99779n31365k51998J34408M40612N28747J67188n46073
42776B129403r66003o36700K8027L06716J51299O2615K05151K68212J39263J05849
42766A793832K97454M25520K49495o9723k56908k69209j82657J6055L09647M88938
42756B802444L46570j7555k70353k45217j35445k18181m58337n03468j09175M99182
42746A690465P85163M57132j73470m61319j01321N03385O51090J39692m87691
42737C003126n93969j83007K17422K68435J07154k4577p1026k9131J17953K18629
42727C031009M3943k96512l78122q0125J80457O2946k14607k92499k11657j91976
42717A652857j92611q6281L571n2245n3649J99184M72885M45128K74710L39164
$$ plain form
42707 3002713 3554190 4007238 3951025 3413580 2829984 2597140 2770315 3052379 3028161 2591373
42697 2591373 2144661 2136002 2429333 2474515 2091968 1666390 1517160 1558645 1697900 2033375
42687 2033375 2437789 2479435 2084027 1794139 1999773 2362682 2417628 2295591 2342754 2420728
42677 2420728 2203451 1906157 2052125 2594135 2876750 2545267 2027091 1975915 2547330 3339190
42667 3339190 3851371 3921745 3782964 3691109 3557113 3158885 2685374 2662605 3207136 3790100
42657 3790100 3971453 3912908 3865229 3673677 3267023 3148654 3743774 4568807 4745900 4190376
42647 4190376 3637600 3568256 3744953 3841011 3933477 4204908 4562858 4714023 4401073 3594472
42637 3594472 2671989 2254591 2558780 3094728 3344647 3477211 3923480 4508489 4635400
$$ packed form
42707C002713N51477M53048n6213n37445n83596k32844J73175K82064k4218m36788
42697B591373m46712q659K93331M5182l82547m25578j49230M1485J39255L35475
42687B033375M04414M1646l95408k89888K05634L62909N4946j22037M7163P7974
42677B420728k17277k97294J45968N42010K82615l31483n18176n1176N71415P91860
42667C339190N12181P0374j38781r1855j33996l98228m73511k2769N44531N82964
42657C790100J81353n8545m7679j91552m06654j18369N95120Q25033J77093n55524
42647D190376n52776o9344J76697R6058R2466K71431L57950J51165l12950q06601
42637C594472r22483m17398L04189N35948K49919J32564M46269N85009J26911
$$ plain form
42628 4635400 4223334 3818801 3766971 3862367 3872140 3836904 3752285 3483686 3136190 3036055
42618 3036055 3209876 3318324 3215218 3122277 3128783 2985012 2574174 2175159 2059378 2179146
42608 2179146 2414880 2779061 3214098 3524626 3680456 3900203 4308915 4786655 5224279
42599 5224279 5614712 5839511 5730921 5428129 5296555 5392356 5386793 5133721 4910435 4939875
42589 4939875 5066061 5101047 5135235 5277235 5390259 5316073 5126927 4979694 4922414 4946614
42579 4946614 5007101 4938443 4616300 4224878 4062743 4101033 4112678 4196467 4648744 5267063
42569 5267063 5400958 4903374 4425326 4436535 4526459 4130998 3459886 3135361 3254372 3414933
42559 3414933 3479394 3711365 4187162 4598462 4747686 4859646 5233758 5808009 6220855 6212783
$$ packed form
42628D635400m12066m04533n1830R5396R773l5236q4619k68599l47496j00135
42618C036055J73821J08448j03106r2941O506j43771m10838l99015j15781J19768
42608B179146K35734L64181M35037L10528J55830K19747M08712M77740M37624
42599E224279L90433K24799j08590l02792j31574R5801n563k53072k23286K9440
42589D939875J26186L4986L4188J42000J13024p4186j89146j47233n7280K4200
42579D946614O0487o8658l22143l91422j62135L8290J1645Q3789M52277O18319
42569E267063J33895m97584m78048J1209Q9924l95461o71112l24525J19011J60561
42559C414933O4461K31971M75797M11300J49224J11960L74112N74251M12846q072
$$ plain form
42549 6212783 5870842 5486660 5220564 4989749 4735349 4646793 4918701 5391536 5714305 5803132
42539 5803132 5814778 5723657 5362897 4925032 4923203 5472361 6064087 6299917 6399943 6649156
42529 6649156 6766646 6307389 5425102 4734750 4539428 4634239 4807682 5092150 5464989 5678762
42519 5678762 5553249 5223333 4961997 4894284 4993796 5249647 5684085 6209931 6603210 6711713
42509 6711713 6627989 6526510 6380392 6064847 5751278 5852663 6387930 6736949 6368522 5571679
42499 5571679 5080666 5171248 5551274 5961058 6360535 6609712 6521072 6258292 6189844 6306038
42489 6306038 6256336 5998752 5907075 6156580 6490982 6680114 6725594 6555356 6052876 5481151
42479 5481151 5311334 5495452 5469644 5015549 4531877 4313845 4211037 4170632 4398153 4731975
$$ packed form
42549F212783l41941l84182k66096k30815k54400q8556K71908M72835L22769Q8827
42539E803132J1646r1121l60760m37865j829N49158N91726K35830J00026K49213
42529F649156J17490m59257q82287o90352j95322R4811J73443K84468L72839K13773
42519E678762j25513l29916k61336o7713R9512K55851M34438N25846L93279J08503
42509F711713q3724j01479j46118l15545l13569J01385N35267L49019l68427p96843
42499E571679m91013R0582L80026M09784L99477K49177q8640k62780o8448J16194
42489F306038m9702k57584r1677K49505L34402J89132M5480j70238n02480n71725
42479E481151j69817J84118k5808m54095m83672k18032j02808m0405K27521L33822
$$ plain form
42469 4731975 4639880 4196797 4258131 5169663 6100998 6289165 6191106 6621814 7402169 7785018
42459 7785018 7745710 7845927 8069110 7785349 6870931 6039185 5937105 6512650 7342066 8055501
42449 8055501 8380437 8231916 7855722 7583514 7469426 7391021 7307241 7122494 6597708 5815724
42439 5815724 5425707 5890665 6732016 7099825 6907306 6779535 6993883 7144155 6901964
42430 6901964 6524173 6449162 6793255 7352137 7806835 7924016 7807966 7852272 8180138 8360884
42420 8360884 8046146 7597454 7565667 7798579 7711533 7305637 7198436 7619851 8071285 8136982
42410 8136982 8016729 8006093 7967977 7644366 7130785 6728135 6533627 6393589 6126853 5690239
42400 5690239 5239041 5030897 5133757 5292964 5256807 5113345 5088009 5171188 5234160 5348281
$$ packed form
42469D731975r2095m43083O1334R11532R31335J88167r8059M30708P80355L82849
42459G785018l9308J00217K23183k83761r14418q31746j02080N75545Q29416P13435
42449H055501L24936j48521l76194k72208j14088p8405q3780j84747n24786p81984
42439E815724l90017M64958Q41351L67809j92519j27771K14348J50272k42191
42430F901964l77791p5011L44093N58882M54698J17181j16050M4306L27866J80746
42420H360884l14738m48692l1787K32912q7046m05896j07201M21415M51434O5697
42410H136982j20253j0636l8116l23611n13581m02650j94508j40038k66736m36614
42400E690239m51198k08144J02860J59207l6157j43462k5336Q3179O2972J14121
$$ plain form
42390 5348281 5639688 5965755 6116996 6224326 6558537 7018960 7263783 7303710 7505515 7975700
42380 7975700 8372132 8420927 8256973 8132232 8073098 7951843 7717017 7488258 7509191 7922401
42370 7922401 8482071 8686714 8388371 8029907 8014653 8101773 7774051 6982825 6154866 5655514
42360 5655514 5612983 6063500 6861758 7614614 8076310 8430226 8858843 9125118 8973363 8623131
42350 8623131 8418604 8336893 8332922 8742706 9699470 10541681 10564325 10061392 9836964 9967269
42340 9967269 9923665 9692939 9796310 10289727 10717261 11023005 11525517 12004244 11901301 11531784
42330 11531784 11941814 13325070 14781516 16041581 18101261 21316983 23977107 23941184
42322 23941184 21147203 17513881 14753908 13193626 12454257 12264262 12424266 12632616 12682454
$$ packed form
42390E348281K91407L26067J51241J07330L34211M60423K44823L9927K01805M70185
42380G975700L96432M8795j63954j24741n9134j21255k34826k28759K0933M13210
42370G922401N59670K04643k98343l58464j5254Q7120l27722p91226q27959m99352
42360E655514m2531M50517P98258P52856M61696L53916M28617K66275j51755l50232
42350H623131k04527q1711l971M09784R56764Q42211K2644n02933k24428J30305
42340I967269m3604k30726J03371M93417M27534L05744N02512M78727j02943l69517
42330A1531784M10030J383256J456446J260065K059680L215722K660124l5923
42322B3941184k793981l633322k759973j560282p39369j89995J60004K08350M9838
$$ plain form
42313 12682454 12668524 12954164 13973481 15834460 17927485 19157762 18834234 17250269 15312918
42304 15312918 13793382 12970372 12674221 12521035 12338748 12436351 13181608 14293737 14924165
42295 14924165 14529289 13347838 12002372 11013551 10694862 11021796 11497914 11591392 11377023
42286 11377023 11302548 11335297 10950232 10050628 9235054 8948536 9014826 9270544 9987985 11247879
42276 11247879 12440222 12869806 12502960 11777695 11054602 10573766 10568955 11061686 11788349
42267 11788349 12526510 13200775 13597358 13449336 12955584 12697442 12824920 12830170 12355241 11708389
42257 11708389 11335692 11308361 11586484 12218329 12954295 13225336 12904264 12616752 12921815
42248 12921815 13610164 14125753 14219747 13891640 13210199 12557488 12535457 13207821 13871932 13964459
$$ packed form
42313A2682454j3930K85640J019317J860979K093025J230277l23528j583965j937351
42304A5312918j519536q23010k96151j53186j82287R7603P45257J112129O30428
42295A4924165l94876j181451j345466r88821l18689L26934M76118R3478k14369
42286A1377023p4475L2749l85065q99604q15574k86518O6290K55718P17441J259894
42276A1247879J192343M29584l66846p25265p23093m80836m811M92731P26663
42267A1788349P38161O74265L96583j48022m93752k58142J27478N250m74929o46852
42257A1708389l72697k7331K78123O31845P35966K71041l21072k87512L05063
42248A2921815O88349N15589R3994l28107o81441o52711k2031O72364O64111R2527
$$ plain form
42238 13964459 13754737 13771124 14009977 14150593 14153339 14193737 14292330 14367352 14417557 14444256 14484607
42227 14484607 14816780 15707425 16866446 17644291 17827595 17671198 17167712 16084021 14795998
42218 14795998 14130920 14124537 13905658 13156094 12643149 12829329 13058249 12798562 12623773 13085495
42208 13085495 13578887 13355339 12880555 13106052 13989010 14753260 15086150 15087620 14560586 13425819
42198 13425819 12442874 12437362 13046529 13186909 12556491 11788323 11339649 11127520 11108978 11355947
42188 11355947 11612682 11505039 11127082 10842990 10694306 10546262 10507630 10607609 10438490 9800546
42178 9800546 9307599 9586819 10226671 10329502 9826719 9442561 9587468 10058072 10611806
42169 10611806 11083864 11140509 10649465 10116539 10097246 10400319 10487737 10343660 10284380 10256317
$$ packed form
42238A3964459k09722J6387K38853J40616K746M0398R8593P5022N0205K6699M0351
42227A4484607L32173Q90645J159021P77845J83304j56397n03486j083691j288023
42218A4795998o65078o383k18879p49564n12945J86180K28920k59687j74789M61722
42208A3085495M93392k23548m74784K25497Q82958P64250L32890J470n27034j134767
42198A3425819r82945n512O09167J40380o30418p68168m48674k12129j8542K46969
42188A1355947K56735j07643l77957k84092j48684j48044l8632R9979j69119o37944
42178I800546m92947K79220O39852J02831n02783l84158J44907M70604N53734
42169A0611806M72058N6645m91044n32926j9293L03073Q7418j44077n9280k8063
$$ plain form
42159 10256317 10030230 9761276 9676583 9586802 9382690 9534551 10325666 11095559 11109162 10689300
42149 10689300 10572192 10651231 10388878 10002017 10093611 10456824 10409390 10064847 10129835 10626773
42139 10626773 10923377 10879578 10915302 11113650 11283476 11669442 12500278 13077193 12501717 11152985
42129 11152985 10274206 10248467 10462623 10672493 11177047 11740173 11724950 11333234 11377968 11771133
42119 11771133 11603297 10826492 10425725 10691249 10772246 10332485 10229633 10969942 11755063
42110 11755063 11767707 11354779 11216879 11279144 11054571 10485218 9861585 9375476 9093855 8978584
42100 8978584 8832485 8635696 8771699 9369691 9791905 9562654 9353666 10013227 11066646
42091 11066646 11437835 11266514 11537198 12170956 12133143 11361136 10855887 10767434 10184550 9102668
$$ packed form
42159A0256317k26087k68954q4693q9781k04112J51861P91115P69893J3603m19862
42149A0689300j17108P9039k62353l86861R1594L63213m7434l44543O4988M96938
42139A0626773K96604m3799L5724J98348J69826L85966Q30836N76915n75476j348732
42129A1152985q78779k5739K14156K09870N04554N63126j5223l91716M4734L93165
42119A1771133j67836p76805m00767K65524Q0997m39761j02852P40309P85121
42110A1755063J2644m12928j37900O2265k24573n69353o23633m86109k81621j15271
42100H978584j46099j96789J36003N97992M22214k29251k08988O59561J053419
42091A1066646L71189j71321K70684O33758l7813p72007n05249q8453n82884j081882
$$ plain form
42081 9102668 8768884 9562915 10287502 10227024 10248695 11071630 12005647 12322341 12492828 13132780
42071 13132780 13948069 14586786 15360650 16307413 16698206 16273768 15836580 15869358 15752208
42062 15752208 15123225 14778140 15331166 16143947 16494245 16692724 17119430 17257470 16684953
42053 16684953 16042865 16044612 16417030 16692607 17111860 17853166 18297515 17976515 17405688 17133000
42043 17133000 16813042 16038605 15220898 14816985 14509716 13944912 13497892 13607981 14141669
42034 14141669 14985586 16354572 17972587 19000691 19373517 20088253 21525283 22664991
42026 22664991 22698002 22231083 22118746 22254459 22293915 22417294 22618325 22421474 22021707 22439538
42016 22439538 23828854 24982272 25224586 25288860 25530481 24969759 23148019 21260931 20245210
$$ packed form
42081I102668l33784P94031P24587o0478K1671Q22935R34017L16694J70487O39952
42071A3132780Q15289O38717P73864R46763L90793m24438m37188L2778j17150
42062A5752208o28983l45085N53026Q12781L50298J98479M26706J38040n72517
42053A6684953o42088J747L72418K75577M19253P41306M44349l21000n70827k72688
42043A7133000l19958p74437q17707m03913l07269n64804m47020J10089N33688
42034A4141669Q43917J368986J618015J028104L72826P14736J437030J139708
42026B2664991L3011m66919j12337J35713L9456J23379K01031j96851l99767M17831
42016B2439538J389316J153418K42314O4274K41621n60722j821740j887088j015721
$$ plain form
42007 20245210 19340061 17817381 16534677 16359514 16563735 16250442 15947089 16311205 16658035
41998 16658035 16275021 15848641 16107971 16387751 15963163 15409510 15229238 14652156 13274679
41989 13274679 12274947 12432404 12636872 12028156 11786363 12911335 14097075 13966431 13628212
41980 13628212 14648219 16128650 16328876 15731895 15908132 16596637 16482530 15759399 15466437
41971 15466437 15366471 14819852 14590641 15477552 16437080 16372183 16319829 17458308 18598873
41962 18598873 18282240 17611525 18151822 18859722 18237230 17662426 19104795 21294103 21850628
41953 21850628 21530671 22490836 24071526 24497247 25080024 28186336 32540381 35292799 37262428
41944 37262428 41096588 45779619 48473638 50328363 54515890 60029731 64008569 68548069
$$ packed form
42007B0245210r05149j522680j282704j75163K04221l13293l03353L64116L46830
41998A6658035l83014m26380K59330K79780m24588n53653j80272n77082j377477
41989A3274679r99732J57457K04468o08716k41793J124972J185740j30644l38219
41980A3628212J020007J480431K00226n96981J76237O88505j14107p23131k92962
41971A5466437r9966n46619k29211Q86911R59528o4897n2354J138479J140565
41962A8598873l16633o70715N40297P07900o22492n74804J442369K189308N56525
41953B1850628l19957R60165J580690M25721N82777L106312M354045K752418J969629
41944C7262428L834160M683031K694019J854725M187527N513841L978838M539500
$$ plain form
41936 68548069 77603395 88793120 97357828 106927688 125396218 151003904 177078759
41929 177078759 212208251 275652272 360872701 420627913 409081091 333139993 244584248
41922 244584248 184282588 151492814 127023076 104686030 89761750 81600977 73054292
41915 73054292 62202798 53416668 48378671 44150315 39463748 36354045 35309631 33975435
41907 33975435 31370563 29335013 28910639 28568148 27039923 25222624 24119724 23084189
41899 23084189 21375785 19725484 18994454 18631429 17878451 17422755 18247662 19570571 19686997
41890 19686997 18565258 17816966 18077464 18279149 17871235 17816968 18641861 19374905 19434606
41881 19434606 19713787 20630232 21084464 20745295 21187317 23037308 24386086 24175575 24565527
$$ packed form
41936F8548069R055326J1189725Q564708R569860J8468530K5607686K6074855
41929A77078759L5129492O3444021Q5220429N9755212j1546822p5941098q8555745
41922B44584248o0301660l2789774k4469738k2337046j4924280q160773q546685
41915G3054292j0851494q786130n037997m228356m686567l109703j044414j334196
41907C3975435k604872k035550m24374l42491j528225j817299j102900j035535
41899B3084189j708404j650301p31030l63025p52978m55696Q24907J322909J16426
41890A9686997j121739p48292K60498K01685m07914n4267Q24893P33044N9701
41881A9434606K79181R16445M54232l39169M42022J849991J348778k10511L89952
$$ plain form
41872 24565527 27297332 30502273 32344393 34826321 40011797 45626118 49250721 53663115
41864 53663115 62225835 72364164 80686693 91025777 108571396 129895413 150941377
41857 150941377 181882741 236291302 302208943 343269673 339799267 313503931 296582342
41850 296582342 288903969 265076527 216675162 165091148 131407881 113302973 98324682
41843 98324682 84212584 75752704 71858246 67018710 60735988 56748654 55403479 53589336
41835 53589336 50885749 50282628 53089855 57263665 61127165 65693055 72299745 80011144
41827 80011144 87296495 95682597 109008811 128039591 149957589 177414180 222455309
41820 222455309 289519118 354412482 376160011 339686510 275939515 228238651 208948511
$$ packed form
41872B4565527K731805L204941J842120K481928N185476N614321L624603M412394
41864E3663115Q562720J0138329Q322529J0339084J7545619K1324017K1045964
41857A50941377L0941364N4408561O5917641M1060730l470406k6295336j6921589
41850B96582342p678373k3827442m8401365n1584014l3683267j8104908j4978291
41843I8324682j4112098q459880l894458m839536o282722l987334j345175j814143
41835E3589336k703587o03121K807227M173810L863500M565890O606690P711399
41827H0011144P285351Q386102J3326214J9030780K1917998K7456591M5041129
41820B22455309O7063809O4893364K1747529l6473501o3746995m7700864j9290140
$$ plain form
41813 208948511 204059787 208880085 232943076 269092801 284866974 258058154 204328834
41806 204328834 156011284 125876890 105377775 87705471 75215643 68160150 61571163
41799 61571163 54005632 48795928 46124424 42337523 37188387 34184566 33702709 32577701
41791 32577701 30461548 30176694 31739487 32083341 30881743 30979494 32769721 33487161 32502936
41782 32502936 32337846 33907694 35396751 36396588 38778685 42721861 45741625 46327174
41774 46327174 45206807 42828102 38957182 34839048 32403874 31249276 29479290 27248763
41766 27248763 26275716 26299061 25493608 24090989 24080605 25511652 26557297 27090881 28712298
41757 28712298 31255280 32664220 32391281 31716798 30791802 28591149 25666364 23675451
$$ packed form
41813B08948511m888724M820298K4062991L6149725J5774173k6808820n3729320
41806B04328834m8317550l0134394k0499115j7672304j2489828p055493o588987
41799F1571163p565531n209704k671504l786901n149136l003821m81857j125008
41791C2577701k116153k84854J562793L43854j201598R7751J790227P17440r84225
41782C2502936j65090J569848J489057R99837K382097L943176L019764N85549
41774D6327174j120367k378705l870920m118134k435174j154598j769986k230527
41766B7248763r73047K3345q05453j402619j0384J431047J045645N33584J621417
41757B8712298K542982J408940k72939o74483r24996k200653k924785j990913
$$ plain form
41749 23675451 22309209 19939441 17090764 15860954 16076579 15554534 14106210 13679664
41741 13679664 14485487 14653738 13963543 14276784 15891834 16987680 17100112 17705387 18962587
41732 18962587 19313116 18697756 18745933 19455883 19188197 18210134 18586019 20292150 21274121
41723 21274121 21612458 23520860 26873895 29179105 30515889 33707039 38769639 42377273
41715 42377273 44096311 47643533 54199702 60447162 65736433 74712942 89324077 105612158
41707 105612158 124191568 155792346 205302648 253685589 268875180 238513589 183820852
41700 183820852 136809559 110340079 95638332 82380321 70882908 64917924 62434949
41693 62434949 58949094 55176082 55080293 58410188 61165983 62892887 67308514 75003778
$$ packed form
41749B3675451j366242k369768k848677j229810K15625n22045j448324m26546
41741A3679664Q05823J68251o90195L13241J615050J095846J12432O05275J257200
41732A8962587L50529o15360M8177P09950k67686r78063L75885J706131R81971
41723B1274121L38337J908402L353035K305210J336784L191150N062600L607634
41715D2377273J719038L547222O556169O247460N289271Q976509J4611135J6288081
41707A05612158J8579410L1600778M9510302M8382941J5189591l0361591n4692737
41700A83820852m7011293k6469480j4701747j3258011j1497413n964984k482975
41693F2434949l485855l773012r5789L329895K755795J726904M415627P695264
$$ plain form
41685 75003778 82197096 88812992 100499544 119084869 139903674 165359324 210460778
41678 210460778 279981246 344945189 360900703 314769058 240168815 180146959 147048330
41671 147048330 126849061 109096968 96640674 91755935 89298119 85385070 81818834
41664 81818834 79238699 74088666 65046073 55967531 49934834 45593057 41377623 38529038
41656 38529038 37826985 37553761 36794912 37250241 40009592 43691514 47227533 51364229 55898818
41647 55898818 58332698 56894655 52566266 46960559 40573751 34143211 29215508 26093734
41639 26093734 23338651 20335621 18300736 17868630 17817713 17134761 16325622 15784823 14852269
41630 14852269 13400830 12473502 12454611 12362415 11701545 11250773 11348330 11216417 10639064 10458574
$$ packed form
41685G5003778P193318O615896J1686552J8585325K0818805K5455650M5101454
41678B10460778O9520468O4963943J5955514m6131645p4600243o0021856l3098629
41671A47048330k0199269j7752093j2456294m884739k457816l913049l566236
41664H1818834k580135n150033r042593r078542o032697m341777m215434k848585
41656C8529038p02053k73224p58849M55329K759351L681922L536019M136696M534589
41647E5898818K433880j438043m328389n605707o386808o430540m927703l121774
41639B6093734k755083l003030k034885m32106n0917o82952q09139n40799r32554
41630A4852269j451439r27328j8891r2196o60870m50772R7557j31913n77353j80490
$$ plain form
41620 10458574 10763248 10483116 9449005 8895628 9196969 9110537 8100490 7390684 7746394
41611 7746394 8178627 7919045 7781017 8401525 8949421 8817387 8889180 9853234 10865327
41602 10865327 11152693 11374084 12091047 12455629 11832191 11254969 11765829 12614932 12631394
41593 12631394 12189870 12305521 12877580 13335446 14001297 15318237 16715135 17743000 19348601
41584 19348601 22449111 26298161 30107750 35246374 43322599 52329122 57274849 55426766
41576 55426766 49219695 43238533 39843060 38726384 39290788 41485598 44349032 45380442
41568 45380442 42506004 36369729 29831506 25096510 22040693 19560051 17518920 16436791
41560 16436791 16000159 15252826 14049684 13029004 12214210 11020739 9741126 9508036 10380329
$$ packed form
41620A0458574L04674k80132j034111n53377L01341q6432j010047p09806L55710
41611G746394M32233k59582j38028O20508N47896j32034P1793R64054J012093
41602A0865327K87366K21391P16963L64582o23438n77222N10860Q49103J6462
41593A2631394m41524J15651N72059M57866O65851J316940J396898J027865J605601
41584A9348601L100510L849050L809589N138624Q076225R006523M945727j848083
41576E5426766o207071n981162l395473j116676N64404K194810K863434J031410
41568D5380442k874438o136275o538223m734996l055817k480642k041131j082129
41560A6436791m36632p47333j203142j020680q14794j193471j279613k33090Q72293
$$ plain form
41551 10380329 10922263 10285188 9330848 8972402 8792300 8244802 7904141 8316991 8709812
41542 8709812 8162011 7216381 6989246 7355658 7366408 6964519 6940283 7485519 8062456 8548237
41532 8548237 9319841 10229001 10582945 10251364 9877265 9854316 9891815 9734923 9573796 9510764
41522 9510764 9237078 8548230 7793981 7554189 8040868 8909754 9558578 9656069 9460895 9491154
41512 9491154 9852262 10166340 10210290 10207881 10344650 10460468 10460350 10566409 10870226 11083283
41502 11083283 11053801 11096035 11456235 11853554 11902630 11634296 11301418 11035055 10928099 11028669
41492 11028669 11032805 10483914 9499532 8732255 8388999 7990734 7422243 7396715 8321124 9436445
41482 9436445 9776563 9397708 8976918 8738924 8514795 8402251 8609121 8974175 9294231
$$ packed form
41551A0380329N41934o37075r54340l58446j80102n47498l40661M12850L92821
41542H709812n47801r45630k27135L66412J0750m01889k4236N45236N76937M85781
41532H548237P71604R09160L53944l31581l74099k2949L7499j56892j61127o3032
41522I510764k73686o88848p54249k39792M86679Q68886O48824R7491j95174L0259
41512I491154L61108L14078M3950k409J36769J15818j18J06059L03817K13057
41502A1083283k9482M2234L60200L97319M9076k68334l32878k66363j06956J00570
41492A1028669M136n48891r84382p67277l43256l98265n68491k5528R24409J115321
41482I436445L40118l78855m20790k37994k24129j12544K06870L65054L20056
$$ plain form
41473 9294231 9770554 10504651 10958535 10620424 9860477 9417186 9351955 9232824 9043460 9107616
41463 9107616 9314132 9238463 8978511 9133074 9918231 10911205 11686783 12160237 12295316 12006958
41453 12006958 11428478 10870198 10472658 10197189 10083257 10206392 10490821 10840878 11279461
41444 11279461 11693577 11737194 11339976 10985125 11040842 11137290 10736254 10045228 9755810 10032926
41434 10032926 10374867 10428436 10391094 10577733 11042089 11668580 12278536 12638578 12669142 12612661
41424 12612661 12734941 12952634 13000721 12803856 12407676 11765887 10956502 10404418 10447979 10781329
41414 10781329 10739542 10110138 9319895 8835895 8694392 8647126 8522647 8357331 8260280 8188255
41404 8188255 7923785 7403806 6961389 6962606 7288099 7555871 7781859 8301337 9043568 9523938
$$ packed form
41473I294231M76323P34097M53884l38111p59947m43291o5231j19131j89364O4156
41463I107616K06516p5669k59952J54563P85157R92974P75578M73454J35079k88358
41453A2006958n78480n58280l97540k75469j13932J23135K84429L50057M38583
41444A1279461M14116M3617l97218l54851N5717R6448m01036o91026k89418K77116
41434A0032926L41941N3569l7342J86639M64356O26491O09956L60042L0564n6481
41424A2612661J22280K17693M8087j96865l96180o41789q09385n52084M3561L33350
41414A0781329m1787o29404p90243m84000j41503m7266j24479j65316r7051p2025
41404H188255k64470n19979m42417J217L25493K67772K25988N19478P42231M80370
$$ plain form
41394 9523938 9678964 10026626 10756794 11348734 11428699 11335154 11415750 11409637 11011031 10440433
41384 10440433 9943835 9325650 8542061 8154172 8524663 9087399 9123006 8807049 8756468 8934622
41374 8934622 8800132 8287427 7883515 7859875 8065611 8391378 8892975 9503248 10017778 10289311
41364 10289311 10217916 9805945 9419976 9601394 10369968 11140645 11518848 11638624 11578635 11211982
41354 11211982 10885795 11360402 12705430 14176592 15513258 17220631 19247372 21002232
41346 21002232 23349652 28436022 35849626 40862463 39077366 31885543 24799912 20960957
41338 20960957 18916824 16547016 14106301 12594780 11707266 10819357 10254766 10251358 10023780
41329 10023780 9051002 8149014 8130441 8399187 8006233 7253288 7081620 7472894 7567802 7017497
$$ packed form
41394I523938J55026L47662P30168N91940P9965r3545Q0596o113l98606n70598
41384A0440433m96598o18185p83589l87889L70491N62736L5607l15957n0581J78154
41374H934622j34490n12705m03912k3640K05736L25767N01597O10273N14530K71533
41364A0289311p1395m11971l85969J81418P68574P70677L78203J19776n9989l66653
41354A1211982l26187M74607J345028J471162J336666J707373K026741J754860
41346B1002232K347420N086370P413604N012837j785097p191823p085631l838955
41338B0960957k044133k369808k440715j511521q87514q87909n64591l408k27578
41329A0023780r72778r01988j8573K68746l92954p52945j71668L91274R4908n50305
$$ plain form
41319 7017497 6276966 5762215 5474385 5344632 5372308 5473779 5552515 5626312 5705869 5748172
41309 5748172 5814091 5972092 6025615 5744677 5371824 5398783 5821434 6170192 6301209 6529525
41299 6529525 6907749 7041151 6769983 6425558 6273634 6283716 6522928 7147797 7926156 8399073
41289 8399073 8573503 8832182 9190416 9347523 9409428 9775769 10385664 10897380 11457519 12386475
41279 12386475 13446331 14638413 17256797 22243721 27446155 28743282 24784996 18799895
41271 18799895 14652891 12809884 11456107 9842917 8597441 7831442 7005840 6238825
41263 6238825 6076038 6230230 5974197 5512999 5601874 6046244 5966094 5409080 5298306 5758828
41253 5758828 5872750 5298964 4843562 5050024 5391339 5379265 5453433 6103216 6906138 7176161
$$ packed form
41319G017497p40531n14751k87830j29753K7676J01471P8736P3797P9557M2303
41309E748172O5919J58001N3523k80938l72853K6959M22651L48758J31017K28316
41299F529525L78224J33402k71168l44425j51924J0082K39212O24869P78359M72917
41289H399073J74430K58679L58234J57107O1905L66341O09895N11716N60139R28956
41279A2386475J059856J192082K618384M986924N202434J297127l958286n985101
41271A8799895m147004j843007j353777j613190j245476p65999q25602p67015
41263F238825j62787J54192k56033m61198Q8875M44370q0150n57014j10774M60522
41253E758828J13922n73786m55402K06462L41315j2074P4168O49783Q02922K70023
$$ plain form
41243 7176161 7021048 7072583 7571037 8367706 9510950 11118473 12875729 14527864 16928053
41234 16928053 21501655 27874298 32762877 32596374 27390815 20908129 16574582 14380969
41226 14380969 12494781 10502047 9394708 9163495 8545247 7240821 6459164 6740087 6952276
41217 6952276 6262771 5564485 5860555 6502188 6297276 5414892 4889616 4916798 4885497 4638733
41207 4638733 4571542 4783367 5073381 5497642 6139485 6645228 6681512 6488576 6405427 6359004
41197 6359004 6362666 6815890 7684358 8213342 8178698 8482193 9711772 11306778 13216952
41188 13216952 16879613 22685955 27601214 27706228 22852002 16752078 12590047 10532205
41180 10532205 9504974 9085144 8982883 8580365 7918316 7810554 8383271 8813871 8940894
$$ packed form
41243G176161j55113N1535M98454P96669J143244J607523J757256J652135K400189
41234A6928053M573602O372643M888579j66503n205559o482686m333547k193613
41226A4380969j886188j992734j107339k31213o18248j304426p81657K80923K12189
41217F952276o89505o98286K96070O41633k04912q82384n25276K7182l1301k46764
41207D638733o7191K11825K90014M24261O41843N05743L6284j92936q3149m6423
41197F359004L662M53224Q68468N28984l4644L03495J229579J595006J910174
41188A3216952L662661N806342M915259J05014m854226o099924m162031k057842
41180A0532205j027231m19830j02261m02518o62049j07762N72717M30600J27023
$$ plain form
41171 8940894 9624833 11029853 12270908 13497539 16396326 21266626 25223263 25118212
41163 25118212 21309630 16940255 14325158 13753276 15090170 18252620 21834314 23270990
41155 23270990 21502073 18516967 17282561 18547537 20363569 20469130 18464465 15641114
41147 15641114 13326765 11881445 11092043 10871449 11243690 12073305 13295541 15096379 17236678
41138 17236678 18436560 17320690 14123550 10702826 8585992 7642628 6949955 6219049
41130 6219049 5808388 5843137 5972673 5830687 5336091 4669127 4173410 4092420 4267272 4340653
41120 4340653 4311518 4519325 5014509 5407546 5488047 5537042 5847010 6351236 6865372 7266579
41110 7266579 7363673 7101500 6934340 7378566 8174767 8693143 9240525 10866220 13429756
$$ packed form
41171H940894O83939J405020J241055J226631K898787M870300L956637j05051
41163B5118212l808582m369375k615097n71882J336894L162450L581694J436676
41155B3270990j768917k985106j234406J264976J816032J05561k004665k823351
41147A5641114k314349j445320p89402k20594L72241Q29615J222236J800838K140299
41138A7236678J199882j115870l197140l420724k116834r43364o92673p30906
41130F219049m10661L4749J29536j41986m94596o66964m95717q0990J74852P3381
41120D340653k9135K07807M95184L93037Q0501M8995L09968N04226N14136M01207
41110G266579R7094k62173j67160M44226P96201N18376N47382J625695K563536
$$ plain form
41101 13429756 14995497 14022224 11343853 9023193 7881864 7211698 6444948 5869621 5732658
41092 5732658 5698290 5436126 5035456 4636846 4205379 3823245 3738558 3973440 4237670 4323162
41082 4323162 4306271 4350462 4569660 5037477 5662166 6123970 6195316 6025246 5870738 5715483
41072 5715483 5435131 5142758 5031624 5050474 5087635 5294996 5826946 6405244 6581585 6357407
41062 6357407 6133570 6099218 6083259 6002944 6047247 6324013 6632251 6704128 6509610 6290916
41052 6290916 6395773 6991266 7818143 8369530 8445249 8318353 8202557 7888498 7206743 6509519
41042 6509519 6236567 6232598 5999448 5493374 5168133 5290396 5698444 6206287 6740177 7047631
41032 7047631 6800860 6134582 5620994 5513110 5421619 4989449 4517238 4565011 5146749 5677624
$$ packed form
41101A3429756J565741r73273k678371k320660j141329o70166p66750n75327j36963
41092E732658l4368k62164m00670l98610m31467l82134q4687K34882K64230Q5492
41082D323162j6891M4191K19198M67817O24689M61804P1346j70070j54508j55255
41072E715483k80352k92373j11134J8850L7161K07361N31950N78298J76341k24178
41062F357407k23837l4352j5959q0315M4303K76766L08238P1877j94518k18694
41052F290916J04857N95493Q26877N51387P5719j26896j15796l14059o81755o97224
41042F509519k72952l969k33150n06074l25241J22263M08048N07843N33890L07454
41032G047631k46771o66278n13588j07884r1491m32170m72211M7773N81738N30875
$$ plain form
41022 5677624 5660205 5152053 4548553 4122794 3872566 3702705 3613195 3680842 3944431 4392201
41012 4392201 5009063 5711730 6269907 6471063 6382674 6256121 6130926 5777120 5130265 4515163
41002 4515163 4250704 4266647 4342809 4516510 4962544 5612726 6200483 6611640 6919630 7123863
40992 7123863 7119483 6916669 6655896 6395798 6086382 5762915 5575878 5592587 5719776 5856791
40982 5856791 5997793 6145549 6238998 6241781 6256529 6471805 6949400 7489104 7813691 7939930
40972 7939930 8215944 8832131 9428390 9437062 8757238 7838543 7153079 6866859 6964023 7312706
40962 7312706 7583217 7488974 7200226 7178978 7529871 7858896 7824870 7449099 6851906 6149578
40952 6149578 5667736 5705006 5956543 5768789 5153048 4888909 5352859 5969164 6217882 6405223
$$ packed form
41022E677624j7419n08152o03500m25759k50228j69861q9510O7647K63589M47770
41012D392201O16862P02667N58177K01156q8389j26553j25195l53806o46855o15102
41002D515163k64459J5943P6162J73701M46034O50182N87757M11157L07990K04233
40992G123863m380k02814k60773k60098l09416l23467j87037J6709J27189J37015
40982E856791J41002J47756R3449K783J4748K15276M77595N39704L24587J26239
40972G939930K76014O16187N96259Q672o79824r18695o85464k86220R7164L48683
40962G312706K70511r4243k88748k1248L50893L29025l4026l75771n97193p02328
40952F149578m81842L7270K51537j87754o15741k64139M63950O16305K48718J87341
$$ plain form
40942 6405223 6838835 7000212 6379681 5565969 5546557 6264148 6803040 6796384 6711544 6811654
40932 6811654 6752849 6319760 5787655 5388280 5053158 4821084 4904974 5208497 5309619 5057209
40922 5057209 4713044 4441817 4168450 3999242 4234019 4830164 5345044 5529493 5522620 5404645
40912 5404645 5097396 4813466 5008584 5643188 6001738 5555515 4626021 3928262 3783695
40903 3783695 4015461 4317063 4477705 4441540 4309890 4168498 3933981 3571549 3334425 3434119
40893 3434119 3585824 3326872 2719095 2247258 2073505 1948386 1847693 2061414 2555202
40884 2555202 2873192 2839433 2760054 2766051 2600186 2278456 2269196 2666116 2847453 2414702
40874 2414702 1879867 1889583 2270685 2425625 2266291 2143991 2141433 2027342 1749241 1482159
$$ packed form
40942F405223M33612J61377o20531q13712j9412P17591N38892o656q4840J00110
40932F811654n8805m33089n32105l99375l35122k32074Q3890L03523J01122k52410
40922E057209l44165k71227k73367j69208K34777N96145N14880J84449o873j17975
40912E404645l07249k83930J95118O34604L58550m46223r29494o97759j44567
40903C783695K31766L01602J60642l6165j31650j41392k34517l62432k37124R9694
40893C434119J51705k58952o07777m71837j73753j25119j00693K13721M93788
40884B555202L17990l3759p9379N997j65865l21730r260L96920J81337m32751
40874B414702n34835R716L81102J54940j59334j22300k558j14091k78101k67082
$$ plain form
40864 1482159 1318090 1287385 1491126 1835779 1880993 1386965 797746 719395 1102863 1434212
40854 1434212 1587356 1932545 2605877 3188611 3250265 2868216 2484097 2461120 2815942 3196880
40844 3196880 3159989 2673203 2278758 2517291 3264755 3908585 4106406 4033742 3884003 3516847
40834 3516847 2791083 1986212 1604339 1783334 2105709 2076621 1696542 1405701 1458346 1582567
40824 1582567 1436134 1184476 1265138 1649569 1775976 1319401 646555 317878 447134 760275
40814 760275 1020332 1177062 1312444 1612348 2176807 2739439 2863154 2544130 2263138 2262534
40804 2262534 2209826 1870428 1650949 2016718 2735708 3236618 3449422 3714965 4061189 4236252
40794 4236252 4422362 5213073 6659890 7873446 7924370 6859793 5549141 4712673 4357174
$$ packed form
40864A482159j64069l0705K03741L44653M5214m94028n89219p8351L83468L31349
40854A434212J53144L45189O73332N82734O1654l82049l84119k2977L54822L80938
40844C196880l6891m86786l94445K38533P47464O43830J97821p2664j49739l67156
40834C516847p25764q04871l81873J78995L22375k9088l80079k90841N2645J24221
40824A582567j46433k51658Q0662L84431J26407m56575o72846l28677J29256L13141
40814G60275K60057J56730J35382K99904N64459N62632J23715l19024k80992o04
40804B262534n2708l39398k19479L65769P18990N00910K12804K65543L46224J75063
40794D236252J86110P90711J446817J213556N0924j064577j310652q36468l55499
$$ plain form
40785 4357174 4073929 3636687 3205499 3009621 2979033 2832653 2497429 2231695 2271791 2559420
40775 2559420 2905322 3195301 3321230 3173613 2867140 2700221 2708682 2585491 2280146 2274078
40765 2274078 2860097 3508417 3487087 2879294 2406213 2378604 2433676 2278070 2072862 1986599
40755 1986599 1919595 1838280 1905925 2088342 2049663 1643298 1136722 769588 472077 227142
40745 227142 312199 881681 1620206 2114949 2321962 2386097 2260977 1849843 1346224 1098972
40735 1098972 1234880 1663093 2300611 2999406 3398182 3225503 2714607 2356453 2213775
40726 2213775 1838577 981023 41171 -406827 -296469 -7779 203774 391759 595727
40717 595727 694737 672474 722248 906425 967547 746242 584670 923296 1544822 1655429
$$ packed form
40785D357174k83245m37242m31188j95878l0588j46380l35224k65734M0096K87629
40775B559420L45902K89979J25929j47617l06473j66919Q461j23191l05345o068
40765B274078N86019O48320k1330o07793m73081k7609N5072j55606k05208q6263
40755A986599o7004q1315O7645J82417l8679m06365n06576l67134k97511k44935
40745B27142Q5057N69482P38525M94743K07013O4135j25120m11134n03619k47252
40735A098972J35908M28213O37518O98795L98776j72679n10896l58154j42678
40726B213775l75198q57554r39852m47998J10358K88690K11553J87985K03968
40717E95727R9010k2263M9774J84177O1122k21305j61572L38626O21526J10607
$$ plain form
40707 1655429 876073 -168846 -494528 194732 1299256 2013283 2019715 1623494 1409074
40698 1409074 1709021 2265233 2492777 2183538 1784129 1803125 2137799 2279119 2056048 1803921
40688 1803921 1793083 1873736 1841345 1847815 2165815 2678816 2914427 2636134 2175287 2010834
40678 2010834 2154294 2216747 2075442 2107085 2533768 2864702 2438793 1375509 458861 82149
40668 82149 -113095 -423489 -557953 -272595 53813 12806 -96401 268845 990941 1488114
40658 1488114 1618650 1735653 1939567 1945827 1713727 1572355 1623223 1603226 1469903 1528884
40648 1528884 1772811 1684670 1039033 413139 491905 1209276 1953962 2338340 2396983 2266361
40638 2266361 2053494 1886775 1794185 1647808 1457540 1534339 2076969 2748644 2976563 2599340
$$ packed form
40707A655429p79356j044919l25682O89260J104524P14027O432l96221k14420
40698A409074K99947N56212K27544l09239l99409J8996L34674J41320k23071k52127
40688A803921j0838Q0653l2391O470L18000N13001K35611k78293m60847j64453
40678B010834J43460O2453j41305L1643M26683L30934m25909j063284r16648l76712
40668H2149j95244l10394j34464K85358L26408m1007j09207L65246P22096M97173
40658A488114J30536J17003K03914O260k32100j41372N0868j9997j33323N8981
40648A528884K43927q8141o45637o25894P8766P17371P44686L84378N8643j30622
40638B266361k12867j66719r2590j46377j90268P6799N42630O71675K27919l77223
$$ plain form
40628 2599340 1966220 1476596 1267846 1278477 1346766 1266599 984146 742256 822149 1136941
40618 1136941 1294358 1112389 878997 978709 1363554 1537293 1092134 203495 -484146 -498547
40608 -498547 -9772 410415 433545 252794 269539 688591 1423855 2194201 2658104 2651985
40598 2651985 2373323 2151719 2005692 1689870 1250693 1147830 1559552 1925653 1634371
40589 1634371 956483 739653 1188741 1541856 1179352 542757 514927 1194005 1814719 1806146
40579 1806146 1403424 1101252 976084 850837 796732 1043809 1514867 1845198 1860465 1693823
40569 1693823 1407874 883554 222188 -100100 254058 1029817 1674100 1908009 1803731
40560 1803731 1507246 1169026 998460 1078946 1197965 1102985 836706 592931 378933 101336
$$ packed form
40628B599340o33120m89624k08750J0631O8289q0167k82453k41890P9893L14792
40618A136941J57417j81969k33392R9712L84845J73739m45159q88639o87641j4401
40608d98547M88775M20187K3130j80751J6745M19052P35264P70346M63903o119
40598B651985k78662k21604j46027l15822m39177j02863M11722L66101k91282
40589A634371o77888k16830M49088L53115l62504o36595k7830O79078O20714q573
40579A806146m02722l02172j25168j25247n4105K47077M71058L30331J5267j66642
40569A693823k85949n24320o61366l22288L54158P75759O44283K33909j04278
40560A803731k96485l38220j70566Q0486J19019r4980k66279k43775k13998k77597
$$ plain form
40550 101336 -148313 -222007 -217935 -301540 -332825 -87244 226985 163676 -230453 -391222 -50912
40539 -50912 428607 709486 934811 1231869 1262415 747176 116445 110752 849093 1714173
40529 1714173 2114633 2017883 1751521 1584877 1543871 1438302 1065758 522148 231435 500924
40519 500924 1142855 1720293 2042914 2176033 2082535 1613968 878855 288365 107137 195663
40509 195663 333653 571890 1044938 1579663 1773930 1482070 1007604 727166 681981 674468
40499 674468 647764 757875 1074716 1407917 1506620 1308934 936816 573538 409739 567301
40489 567301 981502 1462087 1901833 2258171 2336544 1924454 1263504 997105 1372775 1855235
40479 1855235 1889180 1669305 1648649 1634690 1097109 226085 -121234 380192 1107711 1475122
$$ packed form
40550A01336k49649p3694M072q3605l1285K45581L14229o3309l94129j60769L40310
40539e0912M79519K80879K25325K97058L0546n15239o30731n693P38341Q65080
40529A714173M00460r6750k66362j66644m1006j05569l72544n43610k90713K69489
40519E00924O41931N77438L22621J33119r3498m68567p35113n90490j81228Q8526
40509A95663J37990K38237M73048N34725J94267k91860m74466k80438m5185p513
40499F74468k6704J10111L16841L33201R8703j97686l72118l63278j63799J57562
40489E67301M14201M80585M39746L56338P8373m12090o60950k66399L75670M82460
40479A855235L3945k19875k0656j3959n37581q71024l47319N01426P27519L67411
$$ plain form
40469 1475122 1640107 1908237 2074911 1844630 1441314 1291238 1407468 1532991 1630629 1792343
40459 1792343 1860498 1574184 1013676 577838 561751 936211 1418534 1621943 1340962 846586
40449 846586 671426 973811 1414464 1784386 2311336 3078470 3611912 3484228 2974253 2658494
40439 2658494 2632146 2612257 2553826 2625928 2739229 2631825 2356828 2217822 2261453 2252287 2116493
40428 2116493 2028538 2089215 2248021 2469131 2657224 2557004 2095335 1678680 1743773 2149720
40418 2149720 2443783 2569944 2804839 3113675 3154845 2906443 2720612 2727751 2745952 2826494
40408 2826494 3277631 4003734 4417520 4237162 3831349 3527103 3137055 2523582 2100232
40399 2100232 2275662 2763496 2952910 2728164 2449456 2299956 2147924 1998991 2102575
$$ packed form
40469A475122J64985K68130J66674k30281m03316j50076J16230J25523R7638J61714
40459A792343O8155k86314n60508m35838j6087L74460M82323K03409k80981m94376
40449H46586j75160L02385M40653L69922N26950P67134N33442j27684n09975l15759
40439B658494k6348j9889n8431P2102J13301j07404k74997j39006M3631r166j35794
40428B116493q7955O0677J58806K21110J88093j00220m61669m16655O5093M05947
40418B149720K94063J26161K34895L08836M1170k48402j85831P139J8201Q0542
40408B826494M51137P26103M13786j80358m05813l04246l90048o13473m23350
40399B100232J75430M87834J89414k24746k78708j49500j52032j48933J03584
$$ plain form
40390 2102575 2495006 2781757 2583768 2056736 1792124 2188886 2974627 3409429 3018791
40381 3018791 2083710 1309190 1065427 1136374 1191724 1226165 1398504 1650494 1706611 1390409
40371 1390409 801682 220286 -72304 64669 538073 1046204 1269996 1120785 839859
40362 839859 801763 1111065 1413363 1275798 771512 435323 541026 745896 693970 633981
40352 633981 1004131 1625885 1871228 1602159 1380318 1601424 1911480 1754949 1160116 681543
40342 681543 765416 1396538 2200784 2700628 2625727 2171260 1852180 1954078 2219140 2192397
40332 2192397 1771262 1270464 1008019 975932 946990 828525 812770 1112334 1619077 2011312
40322 2011312 2206924 2447165 2832901 3107320 3134382 3261171 3828214 4572039 4946850 4840294
$$ packed form
40390B102575L92431K86751j97989n27032k64612L96762P85741M34802l90638
40381C018791r35081p74520k43763P0947N5350L4441J72339K51990N6117l16202
40371A390409n88727n81396k92590J36973M73404N08131K23792j49211k80926
40362H39859l8096L09302L02298j37565n04286l36189J05703K04870n1926n9989
40352F33981L70150O21754K45343k69069k21841K21106L10056j56531n94833m78573
40342F81543Q3873O31122Q04246M99844p4901m54467l19080J01898K65062k6743
40332B192397m21135n00798k62445l2087k8942j18465j5755K99564N06743L92235
40322B011312J95612K40241L85736K74419K7062J26789N67043P43825L74811j06556
$$ plain form
40312 4840294 4513696 4055114 3478626 3203279 3693923 4593387 4961836 4570118 4240006
40303 4240006 4580740 5068577 4875625 4087871 3524377 3682831 4399584 5311591 6117816
40294 6117816 6487560 6189539 5368747 4443443 3735758 3341732 3222223 3221206 3113272 2812723
40284 2812723 2440698 2103836 1802792 1643533 1841128 2329043 2650970 2485341 2045026
40275 2045026 1728735 1621074 1592583 1649865 1870314 2152674 2323713 2381059 2403585 2346332
40265 2346332 2126685 1785890 1399492 980939 608024 435287 435296 374451 207145 207809 517240
40254 517240 876507 1054430 1199844 1462437 1610291 1427835 1209019 1389575 1872897 2177507
40244 2177507 2137866 2023960 2026543 2032174 1914014 1710465 1482363 1234898 988947 767663
$$ packed form
40312D840294l26598m58582n76488k75347M90644Q99464L68449l91718l30112
40303D240006L40734M87837j92952p87754n63494J58454P16753R12007Q06225
40294F117816L69744k98021q20792r25304p07685l94026j19509j017j07934l00549
40284B812723l72025l36862l01044j59259J97595M87915L21927j65629m40315
40275B045026l16291j07661k8491N7282K20449K82360J71039N7346K2526n7253
40265B346332k19647l40795l86398m18553l72915j72737Ro0845j67306O64L09431
40254E17240L59267J77923J45414K62593J47854j82456k18816J80556M83322L04610
40244B177507l9641j13906K583N631j18160k03549k28102k47465k45951k21284
$$ plain form
40234 767663 573042 489606 643689 922045 980422 732969 545666 683260 881575 810144
40224 810144 644406 749261 1054770 1219238 1209593 1232954 1252911 1070484 768253 591006
40214 591006 488521 257891 32950 115179 392838 467643 327606 351946 651440 962091
40204 962091 1222929 1663537 2205970 2379134 2053063 1738385 1876273 2256526 2416123 2243644
40194 2243644 1917377 1578409 1347730 1390373 1685301 1939496 1954122 1886125 1958625 2106076
40184 2106076 2103714 1897928 1630589 1429309 1280938 1041356 564774 -44242 -347292 35787
40174 35787 935005 1741199 2029552 1887561 1656867 1590578 1749025 1970365 1925493 1434831
40164 1434831 740731 270708 179039 318383 537935 751599 870929 980111 1377493 2066897
$$ packed form
40234G67663j94621q3436J54083K78356N8377k47453j87303J37594J98315p1431
40224H10144j65738J04855L05509J64468r645K3361J9957j82427l02231j77247
40214E91006j02485k30630k24941Q2229K77659P4805j40037K4340K99494L10651
40204I62091K60838M40608N42433J73164l26071l14678J37888L80253J59597j72479
40194B243644l26267l38968k30679M2643K94928K54195J4626o7997P2500J47451
40184B106076k362k05786k67339k01280j48371k39582m76582o09016l03050L83079
40174C5787Q99218Q06194K88353j41991k30694o6289J58447K21340m4872m90662
40164A434831o94100m70023r1669J39344K19552K13664J19330J09182L97382O89404
$$ plain form
40154 2066897 2466579 2147699 1625329 1740443 2396148 2690467 2292376 1831318 1772330 1773580
40144 1773580 1475872 1119890 951074 743322 398031 321752 657684 811931 391825 -9092
40134 -9092 273549 813459 736191 146577 -49635 416561 865702 813309 547210 397935
40124 397935 225702 -58803 -128030 191187 478080 321252 39328 310765 1207198 2027024
40114 2027024 2154076 1787711 1638340 2023560 2506621 2499446 2007470 1528572 1324437 1161825
40104 1161825 826871 503225 441204 581927 770599 1052062 1437772 1622771 1308228 664047
40094 664047 131182 -133017 -304306 -487395 -578530 -482109 -199299 249998 771511 1146534
40084 1146534 1254282 1242385 1274931 1268074 1115942 989311 1090738 1262081 1190887 918465
$$ packed form
40154B066897L99682l18880n22370J15114O55705K94319l98091m61058n8988J250
40144A773580k97708l55982j68816k07752l45291p6279L35932J54247m20106m00917
40134i092K82641N39910p7268n89614j96212M66196M49141n2393k66099j49275
40124C97935j72233k84505o9227L19217K86893j56828k81924K71437Q96433Q19826
40114B027024J27052l66365j49371L85220M83061p175m91976m78898k04135j62612
40104A161825l34954l23646o2021J40723J88672K81463L85710J84999l14543o44181
40094F64047n32865k64199j71289j83089r1135R6421K82810M49297N21513L75023
40084A146534J07748j1897L2546o857j52132j26631J01427J71343p1194k72422
$$ plain form
40074 918465 803899 1040645 1507954 2011310 2342869 2199293 1436946 415524 -255793
40065 -255793 -359907 -209358 -175719 -359722 -679713 -960065 -925368 -415849 336683 868120
40055 868120 927876 610725 162428 -119343 44715 625592 1187375 1377501 1336997 1291940
40045 1291940 1040374 396479 -104133 297322 1405001 2165376 2069234 1692628 1600117 1517802
40035 1517802 1075743 671325 906135 1601016 2060651 2064030 1966304 1982767 1984696 1958356 2101416
40024 2101416 2391702 2510903 2311875 2018008 1859212 1802692 1735240 1648397 1547254 1411929
40014 1411929 1347652 1544823 1956337 2209265 2013311 1537087 1205815 1193668 1293177 1279352
40004 1279352 1216226 1298542 1507329 1605024 1475110 1289546 1251953 1323251 1345147 1313782 1331616
$$ packed form
40074I18465j14566K36746M67309N03356L31559j43576p62347j021422o71317
40065b55793j04114J50549L3639j84003l19991k80352L4697N09519P52532N31437
40055H68120N9756l17151m48297k81771J64058N80877N61783J90126m0504m5057
40045A291940k51566o43895n00612M01455J107679P60375r6142l76606r2511q2315
40035A517802m42059m04418K34810O94881M59635L379r7726J6463J929k6340J43060
40024B101416K90286J19201j99028k93867j58796n6520o7452q6843j01143j35325
40014A411929o4277J97171M11514K52928j95954m76224l31272j2147R9509j3825
40004A279352o3126Q2316K08787R7695j29914j85564l7593P1298K1896l1365J7834
$$ plain form
39993 1331616 1359804 1246987 988824 744833 610455 608471 887433 1598117 2484460 2941159
39983 2941159 2692004 2153166 1882666 1890410 1777377 1382339 943482 677782 524214 333186
39973 333186 56747 -294197 -655239 -805619 -478019 298193 1101490 1493633 1410989 1099556
39963 1099556 773209 481308 254428 189368 325692 555455 750729 915338 1113833 1309492
39953 1309492 1417693 1508330 1772419 2208711 2489626 2262575 1504412 506754 -357814 -769054
39943 -769054 -575487 -4876 390986 282667 -22105 22576 476817 925479 1152126 1355565
39933 1355565 1603955 1537884 902642 60428 -364114 -185717 247528 506155 388365 -57523
39923 -57523 -537487 -645702 -272262 187368 288926 149362 316721 1027935 1872937 2272944
$$ packed form
39993A331616K8188j12817k58163k43991j34378j984K78962P10684Q86343M56699
39983B941159k49155n38838k70500P744j13033l95038m38857k65700j53568j91028
39973C33186k76439l50944l61042j50380L27600P76212Q03297L92143q2644l11433
39963A099556l26347k91901k26880o5060J36324K29763J95274J64609J98495J95659
39953A309492J08201R0637K64089M36292K80915k27051p58163r97658q64568m11240
39943g69054J93567N70611L95862j08319l04772M4681M54241M48662K26647K03439
39933A355565K48390o6071o35242q42214m24542J78397M33245K58627j17790m45888
39923e7523m79964j08215L73440M59630J01558j39564J67359P11214Q45002M00007
$$ plain form
39913 2272944 2077825 1595507 1205581 1064354 1079035 1051139 871042 607139 374086 153485
39903 153485 -132179 -368137 -249199 343756 1066020 1378104 1121295 718943 728217 1234509
39893 1234509 1776179 1861909 1452153 881633 438294 170047 36478 38956 162689 359967
39883 359967 651186 1083795 1520484 1655436 1381974 989113 812667 814245 727315 540319
39873 540319 553990 917807 1357978 1507774 1357739 1210254 1255924 1372635 1378216 1349228
39863 1349228 1557653 2083936 2592798 2600151 1984965 1175458 770769 981380 1464904 1698043
39853 1698043 1473405 1022723 690496 553835 411912 119162 -172409 -163005 250542 847985
39843 847985 1292588 1422461 1347515 1292644 1354366 1434082 1435641 1444925 1569905 1648341 1360026
$$ packed form
39913B272944j95119m82318l89926j41227J4681k7896j80097k63903k33053k20601
39903A53485k85664k35958J18938N92955P22264L12084k56809m02352R274N06292
39893A234509N41670Q5730m09756n70520m43339k68247j33569K478J23733J97278
39883C59967K91219M32609M36689J34952k73462l92861j76446J578q6930j86996
39873E40319J3671L63817M40171J49796j50035j47485M5670J16711N581k8988
39863A349228K08425N26283N08862P353o15186q09507m04689K10611M83524K33139
39853A698043k24638m50682l32227j36661j41923k92750k91571R404M13547N97443
39843H47985M44603J29873p4946n4871O1722P9716J559R284J24980P8436k88315
$$ plain form
39832 1360026 703141 112700 -47078 115496 307046 480372 696199 793004 594624 316346
39822 316346 340052 640877 858931 910903 1060434 1339244 1398336 1081074 684356 458331
39812 458331 285716 79501 44142 246861 370062 257433 292779 785962 1335944 1323919
39802 1323919 778964 220919 -139915 -457955 -651928 -414293 140117 439900 234818
39793 234818 -76623 -71750 184816 455792 734864 1050837 1196254 969957 488091 8150
39783 8150 -369712 -617430 -623307 -394842 -228875 -354993 -526740 -326276 152253 311025
39773 311025 -141853 -725272 -776290 -286250 181366 302707 315066 446718 441709 -31442
39763 -31442 -757092 -1175028 -1109862 -877037 -662656 -249320 503641 1307055 1784774 1850824
$$ packed form
39832A360026o56885n90441j59778J62574J91550J73326K15827R6805j98380k78278
39822C16346K3706L00825K18054N1972J49531K78810N9092l17262l96718k26025
39812D58331j72615k06215l5359K02719J23201j12629L5346M93183N49982j2025
39802A323919n44955n58045l60834l18040j93973K37635N54410K99783k05082
39793B34818l11441M873K56566K70976K79072L15973J45417k26297m81866m79941
39783H150l77862k47718n877K28465J65967j26118j71747K00464M78529J58772
39773C11025m52878n83419n1018M90040M67616J21341J2359J31652n009m73151
39763c1442p25650m17936O5166K32825K14381M13336P52961Q03414M77719O6050
$$ plain form
39753 1850824 1554852 917324 185856 -110842 261229 877135 1208148 1262513 1317479 1362447
39743 1362447 1299735 1375419 1776883 2015945 1435455 268552 -527534 -530803 -239729 -116241
39733 -116241 -19115 177433 186490 -51814 -19922 555911 1107751 1047829 703948 753487 1085951
39722 1085951 986857 286061 -409416 -623078 -506405 -337177 -87163 300472 607587 552483
39712 552483 97468 -544212 -1022880 -998224 -443534 191908 393860 155131 -121966 -230656
39702 -230656 -307409 -391239 -269895 118534 512676 725282 891189 1153916 1421310 1609960
39692 1609960 1796215 1897916 1566289 740543 15739 16363 564798 923163 794778 620344
39682 620344 824589 1213041 1322927 1054475 682443 420428 245012 103155 84419 331248
$$ packed form
39753A850824k95972o37528p31468k96698L72071O15906L31013N4365N4966M4968
39743A362447o2712P5684M01464K39062n80490j166903p96086l269K91074J23488
39733a16241R7126J96548R057k38304L1892N75833N51840n9922l43881M9539L32464
39722A085951r9094p00796o95477k13662J16673J69228K50014L87635L07115n5104
39712E52483m55015o41680m78668K4656N54690O35442K01952k38729k77097j08690
39702b30656p6753q3830J21344L88429L94142K12606J65907K62727K67394J88650
39692A609960J86255J01701l31627q25746p24804O24N48435L58365j28385j74434
39682F20344K04245L88452J09886k68452l72032k62015j75416j41857j8736K46829
$$ plain form
39672 331248 834850 1337729 1478622 1137934 640314 466667 713870 989560 912933 540768
39662 540768 171620 -79880 -297298 -493846 -611140 -740106 -1059933 -1517677 -1803411 -1717480
39652 -1717480 -1384445 -1059586 -909589 -1005966 -1282790 -1421862 -1061843 -290761 312769 342786
39642 342786 65166 19511 315836 615271 660779 495790 241172 7734 14755 435287
39632 435287 1045173 1329824 1066384 570472 258522 189663 169678 97880 28101 8870
39622 8870 22443 28125 -11570 -82752 -74458 105434 348351 428641 312834 229698 370751
39611 370751 667556 922603 1005145 858951 490378 37043 -298533 -447480 -454084 -245483
39601 -245483 314338 1044181 1414429 1110575 422228 -132636 -371153 -424484 -392941 -331703
$$ packed form
39672C31248N03602N02879J40893l40688m97620j73647K47203K75690p6627l72165
39662E40768l69148k51500k17418j96548j17294j28966l19827m57744k85734Q5931
39652a717480L33035L24859J49997r6377k76824j39072L60019P71082O03530L0017
39642C42786k77620m5655K96325K99435M5508j64989k54618k33438P021M20532
39632D35287O09886K84651k63440m95912l11950o8859j9985p1798o9779j9231
39622H870J3573N682l9695p1182Q294J79892K42917Q0290j15807q3136J41053
39611C70751K96805K55047Q2542j46194l68573m53335l35576j48947o604K08601
39601b45483N59821P29843L70248l03854o88347n54864k38517n3331L1543O1238
$$ plain form
39591 -331703 -398095 -636826 -706577 -213188 682965 1366265 1530328 1467691 1469392 1348338
39581 1348338 874366 365610 349150 696206 613237 -303796 -1396182 -1693543 -1127606 -543149
39571 -543149 -539521 -816885 -847784 -684454 -664851 -675491 -312961 338968 712791 595861
39561 595861 390632 376524 284061 -92259 -381366 -189583 219672 310372 74454 -69183
39551 -69183 5866 49256 -22257 -30012 17133 -112021 -373122 -375362 48493 602184 1013229
39540 1013229 1367773 1746994 1909157 1661501 1290444 1254694 1563161 1769869 1548871 1015111
39530 1015111 469603 58625 -238968 -456852 -609849 -750504 -920558 -1030800 -913169
39521 -913169 -582284 -338016 -423430 -627418 -495655 4032 338829 127598 -287794 -305279
$$ packed form
39591c31703o6392k38731o9751M93389Q96153O83300J64063o2637J701j21054
39581A348338m73972n08756j6460L47056q2969r17033j092386k97361N65937N84457
39571e43149L628k77364l0899J63330J9603j0640L62530O51929L73823j16930
39561E95861k05229j4108r2463l76320k89107J91783M09255R0700k35918j43637
39551f9183P5049M3390p1513p755M7145j29154k61101k240M23855N53691M11045
39540A013229L54544L79221J62163k47656l71057l5750L08467K06708k20998n33760
39530A015111n45508m10978k97593k17884j52997j40655j70054j10242J17631
39521i13169L30885K44268q5414k03988J31763M99687L34797k11231m15392j7485
$$ plain form
39511 -305279 111048 459587 446191 275425 209280 258119 385601 621728 822252 670369
39501 670369 127371 -398919 -549461 -438390 -368758 -351259 -168582 228599 641594 863853
39491 863853 822916 574685 321325 335220 684800 1099581 1255102 1123568 913692 764783
39481 764783 670920 628845 658490 694855 647770 600049 782686 1260358 1737238 1809626 1426546
39470 1426546 988134 875304 936220 641742 -191826 -1079438 -1462967 -1414113 -1420770 -1609265
39460 -1609265 -1602538 -1161469 -544277 -104932 102749 166815 112145 46769 181692 473748
39450 473748 557666 288893 49214 218191 637337 940187 1124049 1375362 1570891 1450264
39440 1450264 1147927 1047075 1154865 1112180 832415 645991 726787 825652 721938 551982
$$ packed form
39511c05279M16327L48539j3396j70766o6145M8839J27482K36127K00524j51883
39501F70369n42998n26290j50542J11071O9632J7499J82677L97181M12995K22259
39491H63853m0937k48231k53360J3895L49580M14781J55521j31534k09876j48909
39481G64783r3863m2075K9645L6365m7085m7721J82637M77672M76880P2388l83080
39470A426546m38412j12830O0916k94478q33568q87612l83529M8854o657j88495
39460a609265O727M41069O17192M39345K07681O4066n4670o5376J34923K92056
39450D73748Q3918k68773k39679J68977M19146L02850J83862K51313J95529j20627
39440A450264l02337j00852J07790m2685k79765j86424Q0796R8865j03714j69956
$$ plain form
39430 551982 516863 595512 706289 825864 774851 228674 -796954 -1725459 -1956715 -1472926
39420 -1472926 -727223 -112152 276639 533252 803992 1123842 1262410 934309 293208
39411 293208 -78250 90440 329100 91404 -411834 -517493 -107919 240178 124991 -204992
39401 -204992 -418613 -641166 -1077537 -1463230 -1358979 -843016 -470491 -547550 -809193 -875294
39391 -875294 -688653 -365579 72467 561054 802889 556711 59464 -160168 61508 332266
39381 332266 286925 101784 200174 611738 923850 856005 619174 606511 892329 1175914
39371 1175914 1165992 905284 670767 575879 365186 -264959 -1158399 -1742677 -1712222 -1440945
39361 -1440945 -1459040 -1711285 -1720605 -1389018 -1129188 -1114853 -932152 -268648 489242 769343
$$ packed form
39430E51982l5119P8649J10777J19575n1013n46177j025628r28505k31256M83789
39420a472926P45703O15071L88791K56613K70740L19850J38568l28101o41101
39411B93208l71458J68690K38660k37696n03238j05659M09574L48097j15187l29983
39401b04992k13621k22553m36371l85693J04251N15963L72525p7059k61643o6101
39391h75294J86641L23074M38046M88587K41835k46178m97247k19632K21676K70758
39381C32266m5341j85141R8390M11564L12112o7845k36831j2663K85818K83585
39371A175914r922k60708k34517r4888k10693o30145q93440n84278L0455K71277
39361a440945j8095k52245r320L31587K59830J4335J82701O63504P57890K80101
$$ plain form
39351 769343 614258 495530 552994 568088 588176 955472 1623039 2021210 1850737 1524768
39341 1524768 1487685 1511480 1124576 461746 155702 456164 922442 1033087 723394 237957
39331 237957 -209666 -493649 -574640 -608450 -833076 -1184285 -1236856 -731912 13752 464262
39321 464262 506629 472977 589801 705780 617937 415330 363637 595958 1033698 1495278
39311 1495278 1765474 1663530 1202255 647126 286614 150823 64753 -41665 -37999 135931
39301 135931 257802 44721 -450237 -827043 -781589 -453134 -236408 -314496 -514734 -629809
39291 -629809 -718362 -963499 -1320147 -1491914 -1295839 -893371 -549528 -282036 64845 437679
39281 437679 511035 127153 -371215 -455994 -21790 499833 641349 355875 -50726 -266720
$$ packed form
39351G69343j55085j18728N7464J5094K0088L67296O67567L98171j70473l25969
39341A524768l7083K3795l86904o62830l06044L00462M66278J10645l09693m85437
39331B37957m47623k83983q0991l3810k24626l51209n2571N04944P45664M50510
39321D64262M2367l3652J16824J15979q7843k02607n1693K32321M37740M61580
39311A495278K70196j01944m61275n55129l60512j35791q6070j06418L666J73930
39301A35931J21871k13081m94958l76806M5454L28455K16726p8088k00238j15075
39291f29809q8553k45137l56648j71767J96075M02468L43843K67492L46881L72834
39281D37679P3356l83882m98368q4779M34204N21623J41516k85474m06601k15994
$$ plain form
39271 -266720 -177352 106234 288832 104921 -345236 -600819 -390798 -65996 -183276 -683120
39261 -683120 -842660 -186195 860963 1473017 1376176 1011096 851132 882312 797059 441262
39251 441262 -66161 -515431 -763991 -757437 -503486 -71554 388297 678350 697654 573128
39241 573128 536824 610602 538627 146594 -358627 -621184 -571421 -413097 -239904 55276
39231 55276 453111 672552 516141 166509 -37658 -19379 -6638 -217710 -623366 -984069
39221 -984069 -1032439 -659278 -12803 591940 916922 956494 849929 693695 468004 102693
39211 102693 -414629 -969344 -1358099 -1433700 -1202988 -763617 -227192 217327 289987 -127094
39201 -127094 -752166 -1114521 -1011203 -601844 -112962 306245 483214 336789 164001 441103
$$ packed form
39271b66720Q9368K83586J82598j83911m50157k55583K10021L24802j17280m99844
39261f83120j59540O56465J047158O12054r6841l65080j59964L1180q5253l55797
39251D41262n07423m49270k48560O554K53951M31932M59851K90053J9304j24526
39241E73128l6304P3778p1975l92033n05221k62557M9763J58324J73193K95180
39231E5276L97835K19441j56411l49632k04167J8279J2741k11072m05656l60703
39221i84069m8370L73161O46475O04743L24982L9572j06565j56234k25691l65311
39211A02693n17322n54715l88755p5601K30712M39371N36425M44519P2660m17081
39201a27094o25072l62355J03318M09359M88882M19207J76969j46425j72788K77102
$$ plain form
39191 441103 1166253 1736380 1692005 1238085 744967 125194 -817420 -1702562 -1874782 -1363898
39181 -1363898 -950375 -1122735 -1463233 -1327033 -741383 -280655 -278018 -516262 -623161 -488440
39171 -488440 -270094 -168875 -248620 -402306 -469468 -394650 -238616 -53080 152033 303764
39161 303764 269938 51703 -130031 -50069 263041 562580 645659 518404 326403 185773
39151 185773 98370 8927 -91510 -158062 -170592 -134285 14144 370428 849684 1142885
39141 1142885 1035445 678336 384622 245296 129945 -24403 -164280 -299791 -454128
39132 -454128 -441463 -3198 758630 1353591 1419518 1054039 565163 154147 -54566 32486
39122 32486 301697 443290 325360 146329 61502 -60111 -288130 -360958 -101074 181340
$$ packed form
39191D41103P25150N70127m4375m53920m93118o19773r42614q85142j72220N10884
39181a363898M13523j72360l40498J36200N85650M60728K637k38244j06899J34721
39171d88440K18346J01219p9745j53686o7162P4818J56034J85536K05113J51731
39161C03764l3826k18235j81734P9962L13110K99539Q3079j27255j92001j40630
39151A85773q7403q9443j00437o6552j2530L6307J48429L56284M79256K93201
39141A142885j07440l57109k93714j39326j15351j54348j39877j35511j54337
39132d54128J2665M38265P61828N94961O5927l65479m88876m11016k08713Q7052
39122C2486K69211J41593j17930j79031q4827j21613k28019p2828K59884K82414
$$ plain form
39112 181340 135598 5584 281507 812627 879927 248562 -434176 -539700 -245834 -52161
39102 -52161 61225 456678 1045987 1265103 877700 343392 227466 556249 926443 1015396
39092 1015396 799241 436213 121561 -38553 -147830 -427132 -890655 -1228290 -1144130 -697727
39082 -697727 -155378 363731 866159 1212723 1182742 834279 518479 448862 495641 497608
39072 497608 509151 575265 516199 182010 -254968 -525124 -663521 -930312 -1396046 -1829459
39062 -1829459 -1946517 -1595856 -812363 94020 644747 683709 649627 1014224 1543847 1560221
39052 1560221 942077 378970 471263 1005975 1369273 1318466 1039140 709112 360446 54689
39042 54689 -85208 3499 280771 592195 669549 351927 -138387 -409753 -460728 -674621
$$ packed form
39112A81340m5742j30014K75923N31120O7300o31365o82738j05524K93866J93673
39102e2161J13386L95453N89309K19116l87403n34308j15926L28783L70194Q8953
39092A015396k16155l63028l14652j60114j09277k79302m63523l37635Q4160M46403
39082f97727N42349N19109N02428L46564k9981l48463l15800o9617M6779J967
39072D97608J1543O6114n9066l34189m36978k70156j38397k66791m65734m33413
39062a829459j17058L50661P83493R06383N50727L8962l4082L64597N29623J6374
39052A560221o18144n63107R2293N34712L63298n0807k79326l30028l48666l05757
39042E4689j39897Q8707K77272L11424P7354l17622m90314k71366n0975k13893
$$ [...]
##END NTUPLES=NMR SPECTRUM
##END=
