##TITLE=31Pdec_LR-795-MK1
 CDCl3, 24 sc
 24.1.2025
##JCAMPDX= 6.0         $$ Bruker NMR JCAMP-DX V2.0
##DATA TYPE= NMR SPECTRUM
##DATA CLASS= NTUPLES
##ORIGIN= UXNMR, Bruker Analytische Messtechnik GmbH
##OWNER= root
$$ XWIN-NMR		Version 3.5
$$ Fri Jan 24 16:18:14 2025 Russian Standard Time (UT+4h)  she@DPX200
##.OBSERVE FREQUENCY= 81.013821
##.OBSERVE NUCLEUS= ^31P
##.ACQUISITION MODE= SIMULTANEOUS
##.ACQUISITION SCHEME= undefined
##.AVERAGES= 24
##.DIGITISER RES= 17
##SPECTROMETER/DATA SYSTEM= spect
##.PULSE SEQUENCE= zgpg30
##.SOLVENT NAME= CDCl3
##.SHIFT REFERENCE= (INTERNAL, CDCl3, 0, 198.062)
##AUDIT TRAIL= $$ (NUMBER, WHEN, WHO, WHERE, WHAT)
$$ ##TITLE= Audit trail, XWIN-NMR		Version 3.5
$$ ##JCAMPDX= 5.01
$$ ##ORIGIN= Bruker BioSpin GmbH
$$ ##OWNER= she
$$ F:/spectra/data/she/nmr/P31/2/pdata/1/auditp.txt
$$ ##AUDIT TRAIL=  $$ (NUMBER, WHEN, WHO, WHERE, WHAT)
(   1,<2025-01-24 16:17:11.68 +0400>,<she>,<DPX200>,
      <created by zg, POWCHK disabled, PULCHK disabled
       configuration hash MD5:
       00 E9 B6 7A A2 85 ED C7 34 08 36 98 17 FE 4E 26
       data hash MD5: 32K
       88 B0 4B 4B E8 6A 6C E6 85 5A 04 3A 25 CE A2 FB>)
(   2,<2025-01-24 16:17:15.00 +0400>,<she>,<DPX200>,
      <Start of raw data processing
       efp BC_mod = 2 LB = 1.5 FT_mod = 6 PKNL = 1 PHC0 = 2096.3 PHC1 = 165.2872 SI = 64K 
       data hash MD5: 64K
       8D C9 C4 27 94 96 82 89 84 E8 47 7D 91 0D DB 24>)
(   3,<2025-01-24 16:17:29.18 +0400>,<she>,<DPX200>,
      <pk PHC0 = 11.69503 PHC1 = 0 
       data hash MD5: 64K
       40 0D 7D F2 E9 B7 60 A1 AD 14 74 3B BC CA 0E E3>)
(   4,<2025-01-24 16:17:44.96 +0400>,<she>,<DPX200>,
      <abs ABSG = 5 
       data hash MD5: 64K
       BC 65 AB 36 C2 87 93 03 1E 74 5E E9 01 AC 24 54>)
$$ ##END=
$$ 
$$ hash MD5
$$ 6A 71 FC C5 C1 AA F8 B8 B5 7F C6 F6 4F 30 54 02
##$RELAX= 
##$RELAX= 
##$RELAX= 
##$RELAX= 
##$RELAX= 
##$RELAX= 
##$RELAX= 
##$RELAX= 
$$ Bruker specific parameters
$$ --------------------------
##$DU= <F:/spectra>
##$EXPNO= 2
##$NAME= <P31>
##$PROCNO= 1
##$TYPE= <nmr>
##$USER= <she>
##$AMP= (0..31)
100 100 100 100 100 100 100 100 100 100 100 100 100 100 100 100 100 100 
100 100 100 100 100 100 100 100 100 100 100 100 100 100 
##$AQSEQ= 0
##$AQ_mod= 1
##$AUNM= <au_zg>
##$AUTOPOS= <>
##$BF1= 81.014009
##$BF2= 200.13
##$BF3= 200.13
##$BF4= 200.13
##$BF5= 200.13
##$BF6= 200.13
##$BF7= 200.13
##$BF8= 200.13
##$BYTORDA= 1
##$CFDGTYP= 0
##$CFRGTYP= 5
##$CHEMSTR= <none>
##$CNST= (0..31)
1 1 145 1 1 1 1 1 1 1 1 1 1 1 1 1 1 1 1 1 1 1 1 1 1 1 1 1 1 1 1 1 
##$CPDPRG= <waltz16>
##$CPDPRG1= <>
##$CPDPRG2= <waltz16>
##$CPDPRG3= <>
##$CPDPRG4= <mlev>
##$CPDPRG5= <mlev>
##$CPDPRG6= <mlev>
##$CPDPRG7= <mlev>
##$CPDPRG8= <mlev>
##$CPDPRGB= <>
##$CPDPRGT= <>
##$D= (0..31)
0 1 0 0 0 0 0 0 0 0.06 0 0.03 2e-05 3e-06 0 0 0.0002 0 0 0 0 0 0 0 0 0 
0 0 0 0 0 0 
##$DATE= 1737721031
##$DBL= (0..7)
120 120 120 11 120 120 24 19 
##$DBP= (0..7)
150 150 150 150 150 150 150 150 
##$DBP07= 0
##$DBPNAM0= <>
##$DBPNAM1= <>
$$ [...]
##$SUBNAM3= <"">
##$SUBNAM4= <"">
##$SUBNAM5= <"">
##$SUBNAM6= <"">
##$SUBNAM7= <"">
##$SUBNAM8= <"">
##$SUBNAM9= <"">
##$SW= 400.765351723535
##$SWIBOX= (0..15)
0 1 3 0 0 0 0 0 0 0 0 0 0 0 0 0 
##$SW_h= 32467.5324675325
##$TD= 32768
##$TD0= 1
##$TE= 0
##$TE2= 300
##$TE3= 300
##$TEG= 300
##$TL= (0..7)
0 120 53 12 22 120 120 120 
##$TP= (0..7)
150 150 150 150 150 150 150 150 
##$TP07= 0
##$TPNAME0= <>
##$TPNAME1= <>
##$TPNAME2= <>
##$TPNAME3= <>
##$TPNAME4= <>
##$TPNAME5= <>
##$TPNAME6= <>
##$TPNAME7= <>
##$TPOAL= (0..7)
0.5 0.5 0.5 0.5 0.5 0.5 0.5 0.5 
##$TPOFFS= (0..7)
0 0 0 0 0 0 0 0 
##$TUNHIN= 0
##$TUNHOUT= 0
##$TUNXOUT= 0
##$USERA1= <user>
##$USERA2= <user>
##$USERA3= <user>
##$USERA4= <user>
##$USERA5= <user>
##$V9= 5
##$VALIST= <valist>
##$VCLIST= <CCCCCCCCCCCCCCC>
##$VD= 0
##$VDLIST= <DDDDDDDDDDDDDDD>
##$VPLIST= <PPPPPPPPPPPPPPP>
##$VTLIST= <TTTTTTTTTTTTTTT>
##$WBST= 1024
##$WBSW= 4
##$XGAIN= (0..3)
0 0 0 0 
##$XL= 0
##$YL= 0
##$YMAX_a= 3909
##$YMIN_a= -17190
##$ZGOPTNS= <>
##$ZL1= 120
##$ZL2= 120
##$ZL3= 120
##$ZL4= 120
##$ABSF1= 198.0616
##$ABSF2= -202.7028
##$ABSG= 5
##$ABSL= 3
##$ALPHA= 0
##$AQORDER= 0
##$ASSFAC= 0
##$ASSFACI= 0
##$ASSFACX= 0
##$ASSWID= 0
##$AUNMP= <proc_1d>
##$AZFE= 0.1
##$AZFW= 0.5
##$BCFW= 0
##$BC_mod= 2
##$BYTORDP= 0
##$COROFFS= 0
##$CY= -3
##$DATMOD= 1
##$DC= 0
##$DFILT= <>
##$DTYPP= 0
##$F1P= 0
##$F2P= 0
##$FCOR= 1
##$FTSIZE= 65536
##$FT_mod= 6
##$GAMMA= 0
##$GB= 0
##$INTBC= 1
##$INTSCL= 9.790993e-09
##$ISEN= 30
##$LB= 1.5
##$LEV0= 0
##$LPBIN= 0
##$MAXI= 10000
##$MC2= 0
##$MEAN= 0
##$ME_mod= 0
##$MI= 50
##$NCOEF= 0
##$NC_proc= -8
##$NLEV= 6
##$NOISF1= 182.463
##$NOISF2= 159.3651
##$NSP= 0
##$NTH_PI= 0
##$NZP= 0
##$OFFSET= 198.0616
##$PC= 4
##$PHC0= 2107.995
##$PHC1= 165.2872
##$PH_mod= 1
##$PKNL= yes
##$PPARMOD= 0
##$PSCAL= 0
##$PSIGN= 0
##$REVERSE= no
##$SF= 81.0140089999434
##$SI= 65536
##$SIGF1= 159.3651
##$SIGF2= -187.1042
##$SINO= 113.3802
##$SIOLD= 16384
##$SREGLST= <1H.CDCl3>
##$SSB= 0
##$STSI= 65536
##$STSR= 0
##$SW_p= 32467.5324675325
##$SYMM= 0
##$S_DEV= 0
##$TDeff= 32768
##$TDoff= 0
##$TI= <>
##$TILT= no
##$TM1= 0
##$TM2= 0
##$TOPLEV= 0
##$USERP1= <user>
##$USERP2= <user>
##$USERP3= <user>
##$USERP4= <user>
##$USERP5= <user>
##$WDW= 1
##$XDIM= 65536
##$YMAX_p= 510624912
##$YMIN_p= -26287605
$$ End of Bruker specific parameters
$$ ---------------------------------
##NTUPLES= NMR SPECTRUM
##VAR_NAME=  FREQUENCY,     SPECTRUM/REAL,   SPECTRUM/IMAG
##SYMBOL=    X,             R,               I
##VAR_TYPE=  INDEPENDENT,   DEPENDENT,       DEPENDENT
##VAR_FORM=  AFFN,          ASDF,            ASDF
##VAR_DIM=   65536,         65536,           65536
##UNITS=     HZ,            ARBITRARY UNITS, ARBITRARY UNITS
##FACTOR=    0.49542278885378, 1,            1
##FIRST=     16045.7642231865, 0,            0
##LAST=      -16421.768244346, 0,            0
##MIN=       -16421.768244346, -26287605,    0
##MAX=       16045.7642231865, 510624912,    0
$$ Real data points
##PAGE= N=1
##DATA TABLE= (X++(R..R)), XYDATA
$$ [...]
$$ plain form
44987 3664220 818125 -559385 -6854 2146009 4640071 5384290 3122990 -861604
44979 -861604 -3686951 -3800134 -2388724 -1763827 -2938331 -4980972 -6228926 -5832211 -4384009
44970 -4384009 -3278262 -3435916 -4698746 -6367618 -7828732 -8471591 -7762312 -6078645 -4860091
44961 -4860091 -5006008 -5555337 -4991391 -3490432 -2580773 -2687575 -2509548 -1154554 504616
44952 504616 1235026 1012719 416444 -485817 -1678136 -2459076 -2271771 -1792195 -2174669
44943 -2174669 -3456164 -4535847 -4559306 -3624866 -2315656 -1239307 -929615 -1527868 -2467729
44934 -2467729 -2871355 -2281803 -815963 1154785 3128836 4499816 4864052 4275228 3069515
44925 3069515 1630856 362368 -497926 -1116184 -1681067 -1825890 -1160976 -391220 -767665
$$ packed form
44987C664220k846095j377510N52531K152863K494062P44219k261300l984594
44979h61604k825347j13183J411410O24897j174504k042641j247954L96715J448202
44970d384009J105747j57654j262830j668872j461114o42859P09279J683667J218554
44961d860091j45917n49329N63946J500959R09659j06802J78027J354994J659170
44952E04616P30410k22307n96275r02261j192319p80940J87305M79576l82474
44943b174669j281495j079683k3459R34440J309210J076349L09692n98253r39861
44934b467729m03626N89552J465840J970748J974051J370980L64236n88824j205713
44925C069515j438659j268488q60294o18258n64883j44823O64914P69756l76445
$$ plain form
44916 -767665 -1989229 -1914270 649698 3876817 4956926 3569819 1902042 1499709 1642683
44907 1642683 1074098 13264 -277819 734493 2172616 2693708 1878521 658289 210429
44898 210429 442380 119587 -1280960 -2659376 -2809433 -1946645 -786322 961708 3685517
44889 3685517 6085412 6250937 4599629 3836840 5363226 7356385 7365119 5419455 3337923
44880 3337923 2043018 1079069 180613 -289672 -389339 -637172 -714204 582184 3345842
44871 3345842 5454938 4568063 960323 -2606234 -3896678 -3209204 -2138620 -1394940 -720745
44862 -720745 -209361 -303509 -574671 77240 1608171 2484095 1850056 878676 919133 1275971
44852 1275971 236072 -2190886 -4008735 -3670712 -1611004 729042 2391799 3270004
$$ packed form
44916g67665j221564P4959K563968L227119J080109j387107j667777m02333J42974
44907A642683n68585j060834k91083J012312J438123N21092q15187j220232m47860
44898B10429K31951l22793j400547j378416j50057Q62788J160323J748030K723809
44889C685517K399895J65525j651308p62789J526386J993159Q734j945664k081532
44880C337923j294905r63949q98456m70285r9667k47833p7032J296388K763658
44871C345842K109096q86875l607740l566557j290444O87474J070584P43680O74195
44862g20745N11384r4148k71162O51911J530931Q75924o34039r71380M0457L56838
44852A275971j039899k426958j817849L38023K059708K340046J662757Q78205
$$ plain form
44844 3270004 3841934 4748692 6054148 6948606 6722399 5729148 4640634 3180673 690244
44835 690244 -2308645 -4361567 -4858366 -4353666 -3126227 -810860 2233524 4494222 4822186
44826 4822186 3514874 1610637 -6679 -736739 -612201 -571759 -1137743 -953763 1543323
44817 1543323 4853276 5206536 1618674 -2189500 -2641935 -1046794 -1124037 -3269146 -4253195
44808 -4253195 -2296094 393362 776201 -1422395 -4252163 -6150966 -6809220 -6266245 -4420220
44799 -4420220 -1579360 1005174 1631566 -339489 -3365632 -4828978 -3807335 -2113386
44791 -2113386 -1867503 -2759205 -2830659 -1459358 -93324 18069 -541674 -479412 399037
44782 399037 1123509 799106 -571212 -2315066 -3920853 -5599794 -7771455 -9934089 -10727398
$$ packed form
44844C270004N71930R06758J305456Q94458k26207r93251j088514j459961k490429
44835F90244k998889k052922m96799N04700J227439K315367L044384K260698L27964
44826D822186j307312j904237j617316p30060J24538M0442n65984J83980K497086
44817A543323L309953L53260l587862l808174m52435J595141p7243k145109r84049
44808d253195J957101K689456L82839k198596k829768j898803o58254N42975J846025
44799d420220K840860K584534O26392j971055l026143j463346J021643J693949
44791b113386K45883q91702p1454J371301J366034J11393n59743O2262Q78449
44782C99037P24472l24403j370318j743854j605787j678941k171661k162634p93309
$$ plain form
44773 -10727398 -9617051 -7801120 -6616644 -5698799 -3860548 -1351389 143883 -288452
44765 -288452 -1856528 -3420900 -4528979 -4853135 -3891656 -1838486 188127 1386691 2062811
44756 2062811 2824287 3782427 4910484 6257519 7235471 6621518 4162142 1591907 1117997
44747 1117997 3088961 5823033 7563334 7995223 7899598 7871849 7624643 6471635 4432428
44738 4432428 2658003 2417856 3670784 4987644 4923795 3210260 784867 -864659 -623932
44729 -623932 1196279 2756644 2464332 905300 107178 819633 1731159 1748477 1617353
44720 1617353 2290426 2898889 1879333 -450599 -2001088 -1538538 101497 1540766 2327342
44711 2327342 2480098 1755964 231092 -1080735 -1112946 7774 1276161 2104592 2526172
$$ packed form
44773a0727398J110347J815931J184476R17845J838251K509159J495272m32335
44765b88452j568076j564372j108079l24156R61479K053170K026613J198564O76120
44756B062811P61476R58140J128057J347035R77952o13953k459376k570235m73910
44747A117997J970964K734072J740301M31889r5625k7749k47206j153008k039207
44738D432428j774425k40147J252928J316860o3849j713535k425393j649526K40727
44729f23932J820211J560365k92312j559032p98122P12455R11526J7318j31124
44720A617353O73073O08463j019556k329932j550489M62550J640035J439269P86576
44711B327342J52756p24134j524872j311827l2211J120720J268387Q28431M21580
$$ plain form
44702 2526172 2257739 649366 -1980844 -3866924 -3566876 -1769081 -347677 93663 442377
44693 442377 793111 -324570 -3412616 -6121314 -5704754 -2793910 -833106 -1684857 -3535563
44684 -3535563 -3678455 -1824180 255794 1163062 821600 -185156 -1050861 -932360 311473
44675 311473 1740645 2350358 2177634 1841758 1490312 996710 785733 1465228 2715636
44666 2715636 3392289 2798061 1246220 -554412 -1977179 -2399852 -1488666 180573 1376120
44657 1376120 1391017 639072 -15132 -118654 240813 685727 727305 55290 -1132922 -2295012
44647 -2295012 -3078719 -3425822 -3176832 -2034475 -104634 1888707 3199625 3686000 3683541
44638 3683541 3478359 3118398 2605038 2044402 1613668 1459223 1568046 1656747 1258748 88823
$$ packed form
44702B526172k68433j608373k630210j886080L00048J797795J421404M41340L48714
44693D42377L50734j117681l088046k708698M16560K910844J960804q51751j850706
44684c535563j42892J854275K079974R07268l41462j006756q65705J18501J243833
44675C11473J429172O09713j72724l35876l51446m93602k10977O79495J250408
44666B715636O76653n94228j551841j800632j422767m22673R11186J669239J195547
44657A376120J4897p51945o54204j03522L59467M44914M1578o72015j188212j162090
44647b295012p83707l47103K48990J142357J929841J993341J310918M86375k459
44638C683541k05182l59961n13360n60636m30734j54445J08823Q8701l97999j169925
$$ plain form
44628 88823 -1561215 -2808449 -2748979 -1283685 592757 1543625 1086743 -37401 -756217
44619 -756217 -777242 -683517 -1046301 -1678891 -1892522 -1473647 -1235187 -2288048 -4649724 -6930206
44609 -6930206 -7763995 -7284478 -6666751 -6429938 -5946549 -4665944 -2990452 -1614235 -714336
44600 -714336 -259874 -469905 -1323049 -2089436 -2086087 -1653363 -1681099 -2222299 -2198677 -662687
44590 -662687 1951042 3995363 4036705 2212672 129222 -784146 -602233 -166236 518845
44581 518845 1995771 3500802 3022406 52995 -3033936 -3605694 -1847621 61202 963041
44572 963041 1328067 1523707 1417378 1561178 2824389 4516147 4593462 2319892 -726287
44563 -726287 -2855921 -4038596 -4826917 -5080145 -4812667 -4952282 -5899214 -6322221 -4815323
$$ packed form
44628H8823j650038j247234N9470J465294J876442R50868m56882j124144p18816
44619g56217k1025R3725l62784o32590k13631M18875K38460j052861k361676k280482
44609f930206q33789M79517O17727K36813M83389J280605J675492J376217Q99899
44600g14336M54462k10031q53144p66387L349M32724k7736n41200K3622J535990
44590f62687K613729K044321M1342j824033k083450r13368J81913M35997O85081
44581E18845J476926J505031m78396k969411l086931n71758J758073J908823R01839
44572I63041L65026J95640j06329J43800J263211J691758P7315k273570l046179
44563g26287k129634j182675p88321k53228K67478j39615r46932m23007J506898
$$ plain form
44554 -4815323 -2072472 -28919 676430 1009915 1630119 2082779 1931019 1461663 1037570
44545 1037570 699333 623384 1137591 2040407 2605891 2478100 1984727 1502151 1166307 1237249
44535 1237249 1919521 2606237 2150090 350176 -1477374 -1939842 -1113529 -165823 143353
44526 143353 -9708 -254438 -651163 -1412370 -2313380 -2667667 -2017814 -814320 -100881
44517 -100881 -270488 -454416 319668 1562070 1681817 19171 -2216264 -3303704 -2625996
44508 -2625996 -624554 2021661 4510815 5879710 5757554 4885865 4177766 3552697 2421805
44499 2421805 957611 -93434 -689942 -1483040 -2414763 -2416941 -909655 1277474 2933931
44490 2933931 3653620 3586006 2883833 2001704 1684263 1850419 1269835 -644882 -2401857
$$ packed form
44554d815323K742851K043553P05349L33485O20204M52660j51760m69356m24093
44545A037570l38237p5949N14207R02816N65484j27791m93373m82576l35844P0942
44535A237249O82272O86716m56147j799914j827550m62468Q26313R47706L09176
44526A43353j53061k44730l96725p61207r01010l54287O49853J203494P13439
44517a00881j69607j83928P74084J242402J19747j662646k235435j087440O77708
44508b625996K001442K646215K489154J368895j22156q71689p08099o25069j130892
44499B421805j464194j051045n96508p93098r31723k178J507286K187129J656457
44490B933931P19689o7614p02173q82129l17441J66156n80584j914717j756975
$$ plain form
44481 -2401857 -2068855 15697 1575432 1425134 761636 1094317 2188746 2759214 2193567
44472 2193567 717908 -1441738 -4071700 -6421228 -7443289 -6626488 -4285110 -1254880
44464 -1254880 1418210 2880404 3018296 2395972 1431258 95754 -1292883 -1748379 -839537
44455 -839537 333821 392924 -382061 -490639 421039 896226 -111455 -1428727 -1091307
44446 -1091307 951887 2737110 2918855 2388311 2647830 3363952 2682761 -71562 -3145343
44437 -3145343 -4355330 -3553190 -2293947 -1602054 -1122097 -304586 674814 1349311 1404501
44428 1404501 494478 -1479673 -3654092 -4702222 -4393329 -3734723 -3289542 -2539376 -1368742
44419 -1368742 -708112 -779303 -179365 1906025 3875588 3846418 2572426 2174880 2713309
$$ packed form
44481b401857L33002K084552J559735j50298o63498L32681J094429N70468n65647
44472B193567j475659k159646k629962k349528j022061Q16801K341378L030230
44464a254880K673090J462194J37892o22324r64714j335504j388637m55496R08842
44455h39537J173358N9103p74985j08578R11678M75187j007681j317272L37420
44446a091307K043194J785223J81745n30544K59519P16122o81191k754323l073781
44437c145343j209987Q02140J259243O91893M79957Q17511R79400O74497N5190
44428A404501r10023j974151k174419j048130L08893O58606M45181P50166J170634
44419a368742O60630p1191N99938K085390J969563k9170j273992l97546N38429
$$ plain form
44410 2713309 2454817 1339247 1497701 3723713 5835203 5738619 4239123 3374704 3392953
44401 3392953 2954518 1430203 -440504 -1660694 -1682191 -533505 849129 1035195 -206109
44392 -206109 -1208550 -379071 1696442 3173972 3463754 3557246 4064746 4278942 3484033
44383 3484033 2188642 1501736 1763093 2217100 1910807 771509 -224680 -137891 643640
44374 643640 627416 -1007783 -3329448 -4783876 -5005568 -4926906 -5350380 -6066645 -6403148
44365 -6403148 -6125125 -5517005 -4685634 -3059425 1720 3896919 6657654 6878504 5424304
44356 5424304 4234592 3725496 2786506 1331514 927422 2089229 2762865 987151 -2198552
44347 -2198552 -4153248 -4031438 -3076830 -2224020 -1339497 -630743 -906500 -2123415 -3115279
$$ packed form
44410B713309k58492j115570J58454K226012K111490r6584j499496q64419J8249
44401C392953m38435j524315j870707j220190k1497J148686J382634J86066j241304
44392b06109j002441Q29479K075513J477530K89782R3492N07500K14196p94909
44383C484033j295391o86906K61357M54007l06293j139298r96189Q6789P81531
44374F43640j6224j635199k321665j454428k21692P8662m23474p16265l36503
44365f403148K78023O08120Q31371J626209L061145L895199K760735K20850j454200
44356E424304j189712n09096r38990j454992m04092J161807O73636j775714l185703
44347b198552j954696J21810R54608Q52810Q84523P08754k75757j216915r91864
$$ plain form
44338 -3115279 -3129132 -2521990 -1793511 -1089711 -775088 -1211621 -1708878 -989097 866670
44329 866670 2156211 1818892 859835 814013 1741023 2551683 2581838 2005036 1197605 454413
44319 454413 -4792 -360191 -1233144 -2851837 -4377753 -4556017 -3012975 -681072 996949
44310 996949 1248907 598897 388030 1468162 3378621 4970228 5591136 5324723 4443639
44301 4443639 3254106 2213745 1500950 685332 -473602 -1276769 -1084751 -651599 -1117432
44292 -1117432 -1868667 -1107466 1149625 2443427 1137244 -1180544 -1771304 -99834 2195874
44283 2195874 3771135 4457387 4153692 2502364 -63786 -2067926 -2286127 -846080 1093348
44274 1093348 2353466 2419539 1573890 552332 -40214 -50256 291784 464172 -109610
$$ packed form
44338c115279j3853O07142P28479P03800L14623m36533m97257P19781J855767
44329H66670J289541l37319r59057m5822R27010Q10660L0155n76802q07431p43192
44319D54413m59205l55399q72953j618693j525916j78264J543042K331903J678021
44310I96949K51958o50010k10867J080132J910459J591607O20908k66413q81084
44301D443639j189533j040361p12795q15618j158934q03167J92018M33152m65833
44292a117432p51235P61201K257091J293802j306183k317788n90760J671470K295708
44283B195874J575261O86252l03695j651328k566150k004140k18201J440047J939428
44274A093348J260118O6073q45649j021558n92546j0042L42040J72388n73782
$$ plain form
44265 -109610 -1314837 -1944434 -887895 1191071 2330365 1680274 375352 -432352 -1208540
44256 -1208540 -2926975 -5414078 -7771848 -9489359 -10097391 -8753514 -5537619 -2315918
44248 -2315918 -778216 -292431 650327 1587126 876092 -926151 -1096710 1174960 3135443
44239 3135443 2288453 -19730 -698510 685260 1787446 1274810 534752 1220740 2821323
44230 2821323 3627523 3103554 2218609 1825751 1651384 942013 -507757 -2190707 -3391759
44221 -3391759 -3629425 -2837540 -1411818 -28078 819616 1142581 1209566 1034389 329816
44212 329816 -988811 -2445454 -3251171 -2858926 -1341750 605780 2088024 2640670 2451949
44203 2451949 1890719 1086082 239891 -49889 612528 1746851 2628303 3345275 4281852
$$ packed form
44265a09610j205227o29597J056539K078966J139294o50091j304922q07704p76188
44256a208540j718435k487103k357770j717511o08032J343877L215895L221701
44248b315918J537702M85785R42758R36799p11034j802243j70559K271670J960483
44239C135443q46990k308183o78780J383770J102186n12636p40058O85988J600583
44230B821323Q06200n23969q84945l92858j74367p09371j449770j682950j201052
44221c391759k37666P91885J425722J383740Q47694L22965O6985j75177p04573
44212C29816j318627j456643q05717L92245J517176J947530J482244N52646j88721
44203B451949n61230q04637q46191k89780O62417J134323Q81452P16972R36577
$$ plain form
44194 4281852 4725816 3336702 274357 -2525705 -3824774 -4496084 -5598369 -6411399 -5746422
44185 -5746422 -4129162 -3019014 -2517358 -1539324 123667 1597543 2596422 3627186 4540618
44176 4540618 4576647 4040140 4218691 5210821 5524347 4515697 3618793 4173762 5431234
44167 5431234 5902548 5582436 5552241 6205592 7125857 8078384 8860803 8631193 6680293
44158 6680293 3729736 1399504 448302 422036 859413 1758876 2740824 2818226 1593037
44149 1593037 164861 252673 2376846 5070620 6043723 4343886 1343594 -745813 -1249390
44140 -1249390 -1254033 -1436739 -843359 1377530 3988094 4753036 3222153 1199522 437357
44131 437357 955150 1801567 2399430 2665189 2613613 2436945 2469588 2607576 2208761 1018344
$$ packed form
44194D281852M43964j389114l062345k800062j299069o71310j102285q13030O64977
44185e746422J617260J110148N01656R78034J662991J473876R98879J030764R13432
44176D540618L6029n36507J78551R92130L13526j008650q96904N54969J257472
44167E431234M71314l20112l0195O53351R20265R52527P82419k29610j950900
44158F680293k950557k330232r51202k6266M37377Q99463R81948P7402j225189
44149A593037j428176Q7812K124173K693774R73103j699837l000292k089407n03577
44140a249390m643j82706N93380K220889K610564P64942j530883k022631p62165
44131D37357N17793Q46417N97863K65759n1576j76668L2643J37988l98815j190417
$$ plain form
44121 1018344 -229146 -675016 -498863 -549697 -844763 -136770 2560009 6261066 8397479
44112 8397479 7193330 3481828 -109303 -1671485 -1407749 -677305 -328482 -294523 -286575
44103 -286575 -215424 -8140 501020 1397142 2599683 3912843 5041577 5716767 5905110
44094 5905110 5641164 4642765 2677070 513643 -347097 405925 985606 -436541 -3240292
44085 -3240292 -5143101 -5220976 -4717132 -4725325 -4598120 -3316780 -1219023 534588 1351790
44076 1351790 1258160 396225 -623679 -671304 514137 1515086 1006698 -186365 -170882
44067 -170882 1235558 2438914 2797319 3563915 5397246 6574990 5067906 1468557 -1620745
44058 -1620745 -2792642 -3149310 -4386886 -6621043 -8461275 -8615269 -7076576 -5018589
$$ packed form
44121A018344j247490m45870J76153n0834k95066P07993K696779L701057K136413
44112H397479j204149l711502l591131j562182K63736P30444L48823L3959P948
44103b86575P1151K07284N09160Q96122J202541J313160J128734O75190J88343
44094E905110k63946r98399j965695k163427q60740P53022N79681j422147k803751
44085c240292j902809p7875N03844q193J27205J281340K097757J753611Q17202
44076A351790r3630q61935j019904m7625J185441J000949n08388j193063J5483
44067a70882J406440J203356L58405P66596J833331J177744j507084l599349l089302
44058a620745j171897l56668j237576k234157j840232j53994J538693K057987
$$ plain form
44050 -5018589 -3663114 -3117681 -2450666 -1078844 313320 664644 -93148 -1237794 -2435617
44041 -2435617 -3753451 -4698793 -4491256 -3509155 -3206857 -3970503 -4148382 -2129439 1435335
44032 1435335 4491222 5962750 6118559 5158966 3026402 625599 -339941 623564 1998713
44023 1998713 2110160 965147 -365663 -1359863 -2126756 -2435967 -1756939 -250148 1087344
44014 1087344 1463808 1038334 555400 604124 1256190 2054622 2273633 1489824 24522
44005 24522 -1306278 -1853913 -1438379 -221457 1337567 2485211 2611526 1844464 908508
43996 908508 258046 -356283 -1275910 -2184376 -2322226 -1392024 30087 1034211 1139514
43987 1139514 449004 -746082 -2225996 -3637653 -4298464 -3618742 -1887319 -357188 -133477
$$ packed form
44050e018589J355475N45433O67015J371822J392164L51324p57792j144646j197823
44041b435617j317834r45342K07537R82101L02298p63646j77879K018943L564774
44032A435335L055887J471528J55809r59593k132564k400803r65540R63505J375149
44023A998713J11447j145013j330810r94200p66893l09211O79028J506791J337492
44014A087344L76464m25474m82934M8724O52066P98432K19011p83809j465302
44005B4522j330800n47635M15534J216922J559024J147644J26315p67062r35956
43996I08508o50462o14329r19627r08466j37850R30202J422111J004124J05303
43987A139514o90510j195086j479914j411657o60811O79722J731423J530131K23711
$$ plain form
43978 -133477 -942294 -1378470 -582653 651189 812441 -512459 -2296873 -3437243 -3679950
43969 -3679950 -2979366 -937189 2209425 4705688 4758309 2880911 1445577 1578568 1848156
43960 1848156 731053 -1001490 -1642541 -1225521 -1105189 -1396531 -793716 952675 2275015
43951 2275015 2168815 1752943 2468419 3978391 5042395 5503366 6019015 6389939 5603405
43942 5603405 3467978 1058806 -538273 -1008479 -343074 1319280 3037353 3214650 1164611
43933 1164611 -1866643 -3874606 -4151325 -3656757 -3384642 -3023895 -1739397 90007 867702
43924 867702 -134619 -1531392 -1540319 -383563 277284 86645 547340 2393774 4047740
43915 4047740 3798449 2293536 1477454 1948469 2914663 4098609 5807909 7233479 6598159
$$ packed form
43978a33477q08817m36176P95817J233842J61252j324900j784414j140370k42707
43969c679950P00584K042177L146614K496263N2621j877398j435334J32991K69588
43960A848156j117103j732543o41051M17020J20332k91342O02815J746391J322340
43951B275015j06200m15872P15476J509972J064004M60971N15649L70924p86534
43942E603405k135427k409172j597079m70206O65405J662354J718073J77297k050039
43933A164611l031254k007963k76719M94568K72115L60747J284498J829404P77695
43924H67702j002321j396773q927J156756O60847j90639M60695J846434J653966
43915D047740k49291j504913q16082M71015R66194J183946J709300J425570o35320
$$ plain form
43906 6598159 3557443 42524 -1973951 -2500903 -2738586 -3285407 -3861887 -4033036 -3488757
43897 -3488757 -2218263 -989373 -975928 -2233715 -3203151 -2568612 -1116136 -782699 -2111724
43888 -2111724 -3655077 -3954211 -3190616 -2500345 -2351365 -2238610 -1697677 -958233 -509844
43879 -509844 -528359 -1000947 -1983020 -3234568 -3928594 -3482294 -2571978 -2347440 -2476780 -1193787
43869 -1193787 2048646 5195782 6034784 5047083 4318262 4355637 3892362 2543756 1499394
43860 1499394 1278198 862788 -210772 -808790 -291486 66528 -922645 -2383442 -2872377
43851 -2872377 -2603280 -2585601 -2644746 -2094618 -1513512 -1893987 -2602412 -2226211 -1156431 -1214479
43841 -1214479 -2667482 -3716871 -3346518 -2677662 -2774612 -2933440 -2187940 -1010591 -325491
$$ packed form
43906F598159l040716l514919k016475n26952k37683n46821n76480j71149N44279
43897c488757J270494J228890J3445j257787r69436O34539J452476L33437j329025
43888b111724j543353k99134P63595O90271J48980J12755N40933P39444M48389
43879e09844j8515m72588r82073j251548o94026M46300R10316K24538j29340J282993
43869a193787L242433L147136Q39002r87701p28821L7375m63275j348606j044362
43860A499394k21196m15410j073560n98018N17304L58014r89173j460797m88935
43851b872377K69097J7679n9145N50128N81106l80475p08425L76201J069780n8048
43841a214479j453003j049389L70353O68856r6950j58828P45500J177349O85100
$$ plain form
43832 -325491 17029 637879 1459618 2203125 3155631 4352823 4829217 3868444 2328144
43823 2328144 1564817 1680305 2019331 2668451 3916221 4727263 3591255 888068 -1358946
43814 -1358946 -2359279 -3394958 -5178485 -6254003 -5352721 -3869765 -4126541 -5853227
43806 -5853227 -6313476 -3948116 -305647 2017630 2061515 605094 -1212034 -2467010 -2450744
43797 -2450744 -1180091 304787 925538 742114 586658 756877 786420 438025 151644
43788 151644 304036 597604 457019 -328710 -1469781 -2266891 -1812580 254091 2929157
43779 2929157 4407286 3936339 2664831 2199903 2802537 3568653 3883181 3829658 3414065
43770 3414065 2407533 1118628 449665 778585 1407926 1584833 1586468 2243968 3660838
$$ packed form
43832c25491L42520O20850Q21739P43507R52506J197192M76394r60773j540300
43823B328144p63327J15488L39026O49120J247770Q11042j136008k703187k247014
43814a358946j000333j035679j783527j075518R01282J482956k56776j726686
43806e853227m60249K365360L642469K323277M3885j456421j817128j254976J6266
43797b450744J270653J484878O20751j83424j55456J70219K9543l48395k86381
43788A51644J52392K93568j40585p85729j141071p97110M54311K066671K675066
43779B929157J478129m70947j271508m64928O02634P66116L14528n3523m15593
43770C414065j006532j288905o68963L28920O29341J76907J635O57500J416870
$$ plain form
43761 3660838 4964533 5318653 4802352 4209474 4193484 4701601 5162496 5125219 4603619 3779017
43751 3779017 2657107 1363548 581023 1063738 2540493 3632033 3232937 1660732 143350
43742 143350 -475688 -194651 516082 969659 510591 -720513 -1414204 -376428 1670956
43733 1670956 2491624 1038705 -999577 -1156105 778580 2665519 2881469 2208429 2422282
43724 2422282 3823770 5045838 5035689 4309359 4004971 4366393 4718257 4645873 4554952 4961093
43714 4961093 5693239 6079843 5648484 4365705 2474348 558056 -394385 335622 2231089
43705 2231089 3761001 3919160 3151024 2394999 1703303 462848 -1366330 -3094070 -4293096
43696 -4293096 -5043085 -5084864 -3758235 -1273200 825147 1221197 326506 -459420 -475064
$$ packed form
43761C660838J303695L54120n16301n92878j5990N08117M60895l7277n21600q24602
43751C779017j121910j293559p82525M82715J476755J091540l99096j572205j517382
43742A43350o19038K81037P10733M53577m59068j231104o93691J037776K047384
43733A670956Q20668j452919k038282j56528J934685J886939K15950o73040K13853
43724B422282J401488J222068j0149p26330l04388L61422L51864p2384r0921M06141
43714D961093P32146L86604m31359j282779j891357j916292r52441P30007J895467
43705B231089J529912J58159p68136p56025o91696j240455j829178j727740j199026
43696d293096p49989m1779J326629K485035K098347L96050q94691p85926j5644
$$ plain form
43687 -475064 -34229 576962 1356652 1996439 1935246 1072093 -175609 -1416270 -2299632
43678 -2299632 -2304254 -1359328 -445551 -600442 -1488849 -2030613 -2233257 -2972731 -3946154 -3625020
43668 -3625020 -1793053 -333909 -452796 -764513 384273 2108249 2403891 1405122 1038477
43659 1038477 1827972 2299203 1784312 1716320 3283973 5352405 5816957 4114444 1515368
43650 1515368 -415800 -956194 -396610 272819 192495 -494819 -976382 -1062391 -1434866 -2371030
43640 -2371030 -3086902 -2905231 -2376455 -2532680 -3440312 -4119545 -3704019 -2294647 -832819
43631 -832819 -266944 -541768 -447614 964241 2876692 3482048 2350283 898853 118809
43622 118809 -844440 -2931819 -5176923 -5885773 -5158081 -4721695 -5408334 -6134644 -5561539
$$ packed form
43687d75064M40835O11191P79690O39787o1193q63153j247702j240661q83362
43678b299632m622R44926R13777j54891q88407n41764k02644p39474r73423L21134
43668c625020J831967J459144j18887l11717J148786J723976K95642r98769l66645
43659A038477P89495M71231n14891o7992J567653K068432M64552j702513k599076
43650A515368j931168n40394N59584O69429q0324o87314m81563q6009l72475r36164
43640b371030p15872J81671N28776j56225r07632o79233M15526J409372J461828
43631h32819N65875k74824R4154J411855J912451O05356j131765j451430p80044
43622A18809r63249k087379k245104p08850P27692M36386o86639p26310N73105
$$ plain form
43613 -5561539 -3696512 -1531534 100113 929430 1068917 821304 533819 584889 1444599
43604 1444599 3208326 4793144 4409212 1661692 -1372783 -2133999 -260598 2591075
43596 2591075 4957298 6269207 5938649 3728872 1207818 858133 2932660 4743542
43588 4743542 4000282 1454691 -794802 -2139024 -3076466 -3204047 -1621804 1038091 2827481
43579 2827481 2856699 2086571 1661499 1751137 2188502 2879031 3145244 1944846 -522516
43570 -522516 -2397441 -2184615 -523579 828905 1194047 1248089 1459689 1313628 328825
43561 328825 -873566 -1127244 -240359 575471 167216 -954046 -1222401 -348974 4321
43552 4321 -1315432 -2760654 -1816982 1476586 4440209 5236319 4638684 3893116 2806748
$$ packed form
43613e561539J865027K164978J631647Q29317J39487k47613k87485N1070Q59710
43604A444599J763727J584818l83932k747520l034475p61216J873401K851673
43596B591075K366223J311909l30558k209777k521054l49685K074527J810882
43588D743542p43260k545591k249493j344222r37442j27581J582243K659895J789390
43579B827481K9218p70128m25072Q9638M37365O90529K66213j200398k467362
43570e22516j874925K12826J661036J352484L65142N4042K11600j46061r84803
43561C28825j202391k53678Q86885Q15830m08255j121262k68355Q73427L53295
43552D321j319753j445222R43672L293568K963623P96110n97635p45568j086368
$$ plain form
43543 2806748 1091004 -154277 40823 756653 673812 303958 873261 1851317 1717097
43534 1717097 614485 -25261 -147758 -842509 -1527841 -282144 2446325 3517958 1821818
43525 1821818 401797 1817707 4010417 3616838 1376599 729021 2072857 2237038 -177682
43516 -177682 -2448696 -1859466 592543 2222491 2308007 1835886 1006539 -956289 -3966800
43507 -3966800 -6644706 -7784455 -7332015 -5863993 -3743286 -950643 2424854 5538475
43499 5538475 6900986 5722791 3102282 1159515 911347 1719750 2789532 4093835
43491 4093835 5492949 6096732 5267777 3541137 1931052 943897 712314 1268596 2045039
43482 2045039 1898184 439946 -1239969 -1927723 -1831249 -2038464 -2908530 -3755003 -3799076
$$ packed form
43543B806748j715744j245281J95100P15830q2841l69854N69303R78056j34220
43534A717097j102612o39746j22497o94751o85332J245697K728469J071633j696140
43525A821818j420021J415910K192710l93579k240239o47578J343836J64181k414720
43516a77682k271014N89230K452009J629948Q5516m72121q29347j962828l010511
43507c966800k677906j139749M52440J468022K120707K792643L375497L113621
43499E538475J362511j178195k620509j942767k48168Q08403J069782J304303
43491D093835J399114O03783q28955j726640j610085r87155k31583N56282P76443
43482B045039j46855j458238j679915o87754R6474k07215q70066q46473m4073
$$ plain form
43473 -3799076 -2847264 -1388759 -490598 -1062001 -2690111 -3821491 -3708824 -3478226 -4485780
43464 -4485780 -6298637 -7291323 -6777546 -5600725 -4986779 -5676067 -7720035 -10114730 -10994190
43455 -10994190 -9288347 -6059422 -3306602 -1698804 -423845 1052817 2270221 2765490
43447 2765490 2721002 2552025 2693669 3678533 5466660 6798977 6263269 4040188 1669860
43438 1669860 154060 -729371 -1378910 -1834812 -2278138 -2817813 -2721066 -1204100 836948
43429 836948 1395661 147232 -791543 315814 2507857 3618361 3097334 2252609 2309060
43420 2309060 3228070 4171247 4456572 4159188 3906798 3728682 2391193 -1084554 -5339905
43411 -5339905 -7614386 -7126190 -5924078 -5707232 -5568380 -4083766 -1936764 -704845 -332765
$$ packed form
43473c799076R51812J458505Q98161n71403j628110j131380J12667K30598j007554
43464d485780j812857r92686N13777J176821O13946o89288k043968k394695q79460
43455a0994190J705843L228925K752820J607798J274959J476662J217404M95269
43447B765490m4488j68977J41644R84864J788127J332317n35708k223081k370328
43438A669860j515800q83431o49539m55902m43326n39675R6747J516966K041048
43429H36948N58713j248429r38775J107357K192043J110504n21027q44725N6451
43420B309060R19010R43177K85325k97384k52390j78116j337489l475747m255351
43411e339905k274481M88196J202112K16846J38852J484614K147002J231919L72080
$$ plain form
43402 -332765 164151 420709 -576339 -1960889 -1566015 773839 2655653 2462543 1457337
43393 1457337 1629926 2953831 3938274 3909981 3567927 3722746 4325401 4565445 3580573
43384 3580573 1404333 -674226 -1300290 -735301 -556167 -1421333 -2065872 -1029950 1461154
43375 1461154 3966624 5383240 5318233 3747078 1326396 -536094 -1100335 -1506044 -3406998
43366 -3406998 -6480484 -8530999 -8326589 -7163253 -6970617 -7741110 -7727733 -5763944 -2567508
43357 -2567508 114579 1017011 106151 -1538403 -2492390 -2102488 -971195 -84233 379634
43348 379634 876897 1351496 1157555 298481 -255140 -66680 -155297 -1492953 -3256025
43339 -3256025 -3753038 -2720911 -1433532 -736612 -452536 -789238 -2541696 -5180652 -6439112
$$ packed form
43402c32765M96916K56558r97048j384550L94874K339854J881814j93110j005206
43393A457337J72589J323905R84443k8293l42054J54819O02655K40044r84872
43384C580573k176240k078559o26064N64989J79134q65166o44539J035922K491104
43375A461154K505470J416616o5007j571155k420682j862490n64241m05709j900954
43366c406998l073486k050515K04410J163336J92636p70493J3377J963789L196436
43357b567508K682087R02432r10860j644554r53987L89902J131293Q86962M63867
43348C79634M97263M74599j93941q59074n53621J88460q8617j337656j763072
43339c256025m97013J032127J287379O96920K84076l36702j752458k638956j258460
$$ plain form
43330 -6439112 -5125386 -3098483 -2881557 -4253062 -5026024 -4590885 -4494440 -5448933 -6023974
43321 -6023974 -5160231 -4101963 -4402609 -5265576 -4550798 -1865481 901509 2026051 1616013
43312 1616013 714094 -24500 -257063 449133 2055168 3494234 3516102 2131809 682207
43303 682207 311989 745761 804450 -135433 -1535730 -2450693 -2529331 -2196757 -2124606 -2652675
43293 -2652675 -3479727 -3764145 -2832162 -1088060 26769 -595557 -2483588 -4052443 -4182002
43284 -4182002 -2945394 -1028828 806144 1649844 813413 -1113857 -2229255 -1219289
43276 -1219289 901972 1742943 253472 -2153720 -3287396 -2338275 -192327 1636787
43268 1636787 1881039 27889 -3080089 -5326614 -4949645 -2358280 246079 1233038 950805
$$ packed form
43330f439112J313726K026903K16926j371505p72962M35139R6445r54493n75041
43321f023974Q63743J058268l00646q62967P14778K685317K766990J124542m10038
43312A616013r01919p38594k32563P06196J606035J439066K1868j384293j449602
43303F82207l70218M33772N8689r39883j400297r14963p8638L32574P2151n28069
43293b652675q27052k84418R31983J744102J114829o22326j888031j568855j29559
43284d182002J236608J916566J834972Q43700q36431j927270j115398J009966
43276a219289K121261Q40971j489471k407192j133676R49121K145948J829114
43268A636787K44252j853150l107978k246525L76969K591365K604359R86959k82233
$$ plain form
43259 950805 648102 835296 1221695 1511444 1468426 769988 -269435 -319474 1421834 3538488
43249 3538488 3650700 1514034 -519963 -554410 760563 1887245 2619386 3330029 3254463
43240 3254463 1406970 -1298920 -2723047 -2337840 -1796331 -2427727 -3690836 -4613271 -5314890
43231 -5314890 -6230669 -6958688 -6958432 -6658490 -6828487 -7318261 -7364565 -6832398 -6268241 -5901920
43221 -5901920 -5411919 -4623347 -3714767 -2706317 -1377763 200450 1545450 2247642 2198089
43212 2198089 1408083 112997 -974610 -1110981 -325882 744122 1879581 3441647 5293066
43203 5293066 6373504 5943800 4623821 3421204 2209903 158025 -2559152 -4607851
43195 -4607851 -5178322 -4719910 -3669013 -1670421 1124480 3079062 2728362 879506 -301259
$$ packed form
43259I50805l02703J87194L86399K89749m3018o98438j039423n0039J741308K116654
43249C538488J12212k136666k033997l4447J314973J126682P32141P10643p5566
43240C254463j847493k705890j424127L85207N41509o31396j263109r22435p01619
43231e314890r15779p28019K56K99942j69997m89774m6304N32167N64157L66321
43221e901920M90001P88572R08580J008450J328554J578213J345000P02192m9553
43212B198089p90006j295086j087607j36371P85099J070004J135459J562066J851419
43203E293066J080438m29704j319979j202617j211301k051878k717177k048699
43195d607851n70471M58412J050897J998592K794901J954582l50700j848856j180765
$$ plain form
43186 -301259 -62675 439804 350659 213968 470193 444529 -226472 -432564 847371 2602884
43176 2602884 2789377 986665 -1063703 -1507337 -124749 1854283 2937848 2483781 1244282
43167 1244282 609852 829003 508598 -1389577 -3747640 -4652249 -4062918 -3670131 -4256453
43158 -4256453 -4806046 -4506112 -4060182 -4269354 -4546389 -3866658 -2475829 -1674002 -2146995
43149 -2146995 -3129783 -3204805 -1824177 -211489 -464990 -3153507 -6124209 -6675166 -4722659
43140 -4722659 -2605964 -1863580 -1796781 -1459429 -1172703 -1192795 -647950 828588 1845448
43131 1845448 1257387 281402 777462 2228279 2434835 820020 -999962 -1924850 -2620171
43122 -2620171 -3607906 -3949844 -2766246 -736618 925572 1998526 2708119 2435579 267126
$$ packed form
43186c01259K38584N02479q9145j36691K56225k5664o71001k06092J279935J755513
43176B602884J86493j802712k050368m43634J382588J979032J083565m54067j239499
43167A244282o34430K19151l20405j898175k358063r04609N89331L92787n86322
43158d256453n49593K99934M45930k09172k77035O79731J390829Q01827m72993
43149b146995r82788p5022J380628J612688k53501k688517k970702n50957J952507
43140d722659K116695P42384O6799L37352K86726k0092N44845J476538J016860
43131A845448n88061r75985M96060J450817K06556j614815j819982r24888o95321
43122b620171r87735l41938J183598K029628J662190J072954P09593k72540k168453
$$ plain form
43113 267126 -3254823 -5932473 -5890630 -3492740 -1055343 -603727 -1918913 -2969681 -2342763
43104 -2342763 -813934 -105220 -589118 -1114495 -940069 -730496 -1308970 -2360355 -2984502
43095 -2984502 -2907511 -2524174 -2215302 -2234990 -2859664 -3947546 -4617636 -4111997 -2881967
43086 -2881967 -2087536 -1991890 -1636167 -368075 1067001 1529422 1042687 603160 715885
43077 715885 966266 1037517 1247883 1740548 1929632 1359100 559952 354808 687326 873544
43067 873544 752964 815147 1322244 2076829 2985800 4040680 4706125 4163684 2383429
43058 2383429 334768 -983373 -1197152 -421257 725793 1140439 279020 -914585 -1239148
43049 -1239148 -1179763 -2092117 -3530651 -3450705 -1543735 -110933 -567795 -1367217 -1012063
$$ packed form
43113B67126l521949k677650M1843K397890K437397M51616j315186j050768O26918
43104b342763J528829P08714m83898n25377J74426K09573n78474j051385o24147
43095b984502P6991L83337L08872j9688o24674j087882o70090N05639J230030
43086b881967P94431R5646L55723J268092J435076M62421m86735m39527J12725
43077G15885K50381P1251K10366M92665J89084n70532p99148k05144L32518J86218
43067H73544j20580O2183N07097P54585R08971J054880O65445n42441j780255
43058B383429k048661j318141k13779P75895J147050M14646q61419j193605l24563
43049a239148N9385r12354j438534P9946J906970J432802m56862p99422L55154
$$ plain form
43040 -1012063 -860901 -2546826 -4456378 -3821672 -1266406 -63380 -1240585 -2568633
43032 -2568633 -2497864 -1930311 -1458209 8514 2533369 3835605 2524541 506291 216935
43023 216935 1248746 1799749 1903645 2761012 3863219 3431288 1490390 111745 290729
43014 290729 631192 -193989 -1382313 -1415344 -298543 809174 1448387 2040025 2446737
43005 2446737 1690025 -396019 -2157300 -1780738 267750 1507889 408517 -1851894
42997 -1851894 -3168720 -3132964 -2817106 -2614282 -1801866 -232505 982525 926333 -26443
42988 -26443 -976565 -1439958 -1188325 -199933 713842 237852 -1805391 -3967168 -4967947
42979 -4967947 -5136054 -5305516 -5120366 -3503275 -446595 2536220 3671797 2290687 -655095
$$ packed form
43040a012063J51162j685925j909552O34706K555266J203026j177205j328048
43032b568633P0769N67553M72102J466723K524855J302236j311064k018250k89356
43023B16935J031811N51003J03896Q57367J102207m31931j940898j378645J78984
43014B90729L40463q25181j188324l3031J116801J107717O39213N91638M06712
43005B446737p56712k086044j761281L76562K048488J240139j099372k260411
42997a851894j316826L5756L15858K02824Q12416J569361J215030n6192r52776
42988b6443r50122m63393K51633R88392R13775m75990k043243k161777j000779
42979d967947j68107j69462J85150J617091L056680K982815J135577j381110k945782
$$ plain form
42970 -655095 -3085790 -3375160 -1910513 -612526 -654736 -1401003 -1881976 -2203020 -2726218
42961 -2726218 -2879091 -1908004 -201755 1219912 2151603 3185081 4529746 5681039 6075167
42952 6075167 5471339 3987729 2265836 1150460 707238 139977 -787041 -1013076 373389
42943 373389 2645597 4227868 4375848 3345101 1660171 87925 -488029 -222134 -586458
42934 -586458 -2380956 -4211250 -4179741 -2398662 -525755 501960 865850 722948 286560
42925 286560 449401 1587838 2275610 1110099 -623383 -342820 1897251 3277484 2324724
42916 2324724 707976 179746 108934 -639751 -1403391 -1016523 24421 474585 535217
42907 535217 1507537 3674005 5760646 6293788 4749442 1809069 -875467 -1764212 -962532
$$ packed form
42970f55095k430695k89370J464647J297987m2210p46267m80973l21044n23198
42961b726218j52873R71087J706249J421667R31691J033478J344665J151293L94128
42952F075167o03828j483610j721893j115376m43222n67261r27018k26035J386465
42943C73389K272208J582271J47980j030747j684930j572246n75954K65895l64324
42934e86458j794498j830294L1509J781079J872907J027715L63890j42902m36388
42925B86560J62841J138437O87772j165511j733482K80563K240071J380233r52760
42916B324724j616748n28230p0812p48685p63640L86868J040944M50164O0632
42907E35217R72320K166468K086641N33142j544346k940373k684536q88745Q01680
$$ plain form
42898 -962532 -115488 -243014 -488082 274422 1477710 1566351 120353 -1708008 -2559531
42889 -2559531 -1920942 -210928 1433951 1806922 772758 -501181 -954914 -813183 -801286
42880 -801286 -806092 -168336 1094384 2256514 2909218 3269455 3569787 3775816 3830257 3631509
42870 3631509 2855523 1296563 -676638 -2429171 -3769550 -4994129 -6261185 -7209343
42862 -7209343 -7233974 -6061919 -4089360 -2072578 -355002 1325385 2944654 3607604 2619475
42853 2619475 760742 -567529 -1239655 -2132565 -3043035 -2617037 -828472 304322 -421145
42844 -421145 -1378458 -501178 1460103 1920674 187348 -1614540 -1458556 114928 872491
42835 872491 -584953 -3527846 -5906528 -6267052 -4986811 -3543676 -2717071 -2073267 -1125763
$$ packed form
42898i62532Q47044j27526k45068P62504J203288Q8641j445998j828361q51523
42889b559531O38589J710014J644879L72971j034164j273939m53733J41731J1897
42880h01286m806O37756J262720J162130O52704L60237L00332K06029N4441j98748
42870C631509p75986j558960j973201j752533j340379j224579j267056r48158
42862g209343k4631J172055J972559K016782J717576J680387J619269O62950r88129
42853B619475j858733j328271o72126q92910r10470M25998J788565J132794p25467
42844d21145r57313Q77280J961281M60571j733326j801888J55984J573484P57563
42835H72491j457444k942893k378682l60524J280241J443135Q26605O43804R47504
$$ plain form
42826 -1125763 -18214 1120053 2335497 2989284 2066603 -6378 -1264956 -833214 -222394
42817 -222394 -893637 -2048739 -2305912 -2033550 -2087714 -1568295 760894 3624147 4349073
42808 4349073 2598973 721732 407883 1066411 1504574 1177099 -266422 -2617574 -4198835
42799 -4198835 -3386147 -1144332 114174 260401 1509672 4396754 6519042 6272325 5140111
42790 5140111 4850528 4738572 3685231 2452284 2059909 1738393 648196 -41129 852308
42781 852308 1823685 530181 -2542984 -4717000 -4852375 -4114821 -3363797 -2093756 -49718
42772 -49718 2030393 3440725 3791838 2572794 138805 -1310725 86893 2805587 3383060
42763 3383060 1144523 -935995 -649718 719213 1206869 1260479 2231211 3787157 5077228
$$ packed form
42826a125763J107549J138267J215444O53787r22681k072981j258578M31742O10820
42817b22394o71243j155102k57173K72362n4164N19419K329189K863253P24926
42808D349073j750100j877241l13849O58528M38163l27475j443521k351152j581261
42799d198835Q12688K241815J258506J46227J249271K887082K122288k46717j132214
42790E140111k89583j11956j053341j232947l92375l21516j090197o89325Q93437
42781H52308R71377j293504l073165k174016j35375P37554P51024J270041K044038
42772d9718K080111J410332L51113j219044k433989j449530J397618K718694N77473
42763C383060k238537k080518K86277J368931M87656N3610R70732J555946J290071
$$ plain form
42754 5077228 6996454 10625555 14107740 13930090 9672222 5099029 3540124 3984306
42746 3984306 3102236 -154952 -3670007 -5298779 -5177710 -4713605 -4634852 -4694333 -4421972
42737 -4421972 -3389306 -1282721 1472592 3524484 3911103 3391781 3525816 4459273 4742453
42728 4742453 3632355 2366817 2369391 3162496 3180983 2068853 941470 584611 549737
42719 549737 79220 -1067074 -2818677 -4840790 -6112507 -5426109 -2860485 -110870 1174427
42710 1174427 933500 232590 -115479 53597 682446 1537195 2054182 1890404 1635631
42701 1635631 2297840 3844089 4803718 3807866 1278425 -958453 -1752173 -1756144 -2192656
42692 -2192656 -3055389 -3272686 -2428364 -1338703 -677908 -988 1196818 2250029 2221272
$$ packed form
42754E077228J919226L629101L482185j77650m257868m573193j558905M44182
42746C984306q82070l257188l515055j628772J21069M64105P8753n9481K72361
42737d421972J032666K106585K755313K051892L86619n19322J34035R33457K83180
42728D742453j110098j265538K574P93105J8487j112130j127383l56859l4874
42719E49737m70517j146294j751603k022113j271717O86398K565624K749615J285297
42710A174427k40927p00910l48069J69076O28849Q54749N16987j63778k54773
42701A635631O62209J546249R59629r95852k529441k236878p93720l971m36512
42692b192656q62733k17297Q44322J089661O60795O76920J197806J053211k8757
$$ plain form
42683 2221272 1640322 2089010 3891489 5321350 4683865 2443453 528519 -91004 -296280
42674 -296280 -1245397 -2642062 -3120805 -2098850 -520546 513191 1214215 2457856 4006707
42665 4006707 4489219 3343517 1701126 791711 467529 126562 166311 1338844 3269657
42656 3269657 4890057 5956478 6850006 7175909 6062777 3872706 2156724 1691462 1916710
42647 1916710 2506450 3860903 5477208 5552500 3362280 738048 -159714 399576 548616
42638 548616 -311269 -992024 -587620 363677 963828 1194622 1722599 2935213 4281069
42629 4281069 4421444 2440066 -761939 -2916090 -2862890 -1934528 -2017767 -2901123 -2814237
42620 -2814237 -1309555 -153259 -1051193 -3588095 -5901564 -6613254 -5629646 -3690077 -1728617
$$ packed form
42683B221272n80950M48688J802479J429861o37485k240412j914934o19523k05276
42674b96280r49117j396665m78743J021955J578304J033737P01024J243641J548851
42665D006707M82512j145702j642391r09415l24182l40967L9749J172533J930813
42656C269657J620400J066421Q93528L25903j113132k190071j715982m65262K25248
42647A916710N89740J354453J616305P5292k190220k624232q97762N59290J49040
42638E48616q59885o80755M04404R51297O00151K30794N27977J212614J345856
42629D281069J40375j981378l202005k154151N3200R28362q3239q83356Q6886
42620b814237J504682J156296q97934k536902k313469p11690R83608J939569J961460
$$ plain form
42611 -1728617 -405613 180858 345050 374194 386324 487319 707951 790525 355556 -653602
42601 -653602 -1811862 -2413509 -1836453 -101175 1791690 2613100 2255179 1699793 1361255
42592 1361255 465329 -1214735 -2165176 -1037723 1058887 1880213 1284049 1286927 2795435
42583 2795435 4115895 3292801 452339 -2828106 -5179589 -5853158 -4852119 -3512764
42575 -3512764 -3727758 -5610038 -6981320 -6135380 -4018230 -2574593 -2064858 -1466167 -634236
42566 -634236 -338536 -580949 -566290 -272086 -535393 -1433683 -1896231 -1191699 302969 2026093
42556 2026093 3805189 5209616 5460125 4543619 3554977 3353596 3553460 3348788 2711965
42547 2711965 2224489 2202029 2486714 2743849 2588933 1778786 577521 -436434 -1119904
$$ packed form
42611a728617J323004N86471J64192K9144J2130J00995K20632Q2574m34969j009158
42601f53602j158260o01647N77056J735278J892865Q21410l57921n55386l38538
42592A361255q95926j680064r50441J127453K096610Q21326n96164K878J508508
42583B795435J320460q23094k840462l280445k351483o73569J001039J339355
42575c512764k14994j882280j371282Q45940K117150J443637N09735N98691Q31931
42566f34236K95700k42413J4659K94204k63307q98290m62548P04532J494668J723124
42556B026093J779096J404427K50509r16506r88642k01381J99864k04672o36823
42547B711965m87476k2460K84685K57135j54916q10147j201265j013955o83470
$$ plain form
42538 -1119904 -1799417 -2338339 -1908285 -229406 1604540 2296363 1918026 1513858 1441233
42529 1441233 1052496 -9731 -1191217 -2008055 -2813398 -4008743 -5062460 -5030896 -3797615
42520 -3797615 -2127879 -609987 761008 1917076 2447100 2385692 2606393 3771007 5275233
42511 5275233 5923452 5360661 4061466 2176769 -463970 -3075536 -3947880 -2514339 -456552
42502 -456552 229494 -372433 -697036 -196175 84988 -607440 -1585693 -1888847 -1621906 -1511806
42492 -1511806 -1783270 -2100981 -2207748 -2057610 -1597739 -937859 -575450 -951485 -1738471
42483 -1738471 -1919764 -786939 1177318 2539380 2218445 626599 -713475 -894915 -701749
42474 -701749 -1534122 -3411103 -4636616 -3633527 -742056 2003715 2694191 1108082 -1240183
$$ packed form
42538a119904o79513n38922M30054J678879J833946O91823l78337m04168p2625
42529A441233l88737j062227j181486q16838q05343j195345j053717L1564J233281
42520c797615J669736J517892J370995J156068N30024o1408K20701J164614J504226
42511E275233O48219n62791j299195j884697k640739k611566q72344J433541K057787
42502d56552O86046o01927l24603N00861K81163o92428r78253l03154K66941J10100
42492a511806k71464l17711j06767J50138M59871O59880L62409l76035p86986
42483a738471j81293J132825J964257J362062l20935j591846j340074j81440J93166
42474g01749q32373j876981j225513J003089K891471K745771O90476j586109k348265
$$ plain form
42465 -1240183 -2466849 -1866126 -185961 1523493 2968095 4351947 5565813 6149095
42457 6149095 5791638 4453718 2386520 531676 261943 1767582 3149210 2350561 -122200
42448 -122200 -1665304 -841865 1083294 2123779 1788554 815983 -112748 -664089 -729855
42439 -729855 -610317 -573684 26051 2078640 4851780 6299129 5948409 5854847 7502665
42430 7502665 9327118 8963643 6662027 4484029 3079581 1551427 43335 -12313 1530827
42421 1530827 2853321 2683304 1778928 1261174 1057835 837010 1100107 2289966 3757053
42412 3757053 4548669 4546193 4132088 3440299 2603716 2065366 1956432 1739875 1094799 584583
42402 584583 781613 1227320 1010733 124418 -386432 448535 2614520 5195913 7093465
$$ packed form
42465a240183j226666O00723J680165J709454J444602J383852J213866N83282
42457F149095l57457j337920k067198j854844k69733J505639J381628p98649k472761
42448a22200j543104Q23439J925159J040485l35225r72571r28731n51341o5766
42439g29855J19538L6633N99735K052589K773140J447349l50720r3562J647818
42430G502665J824453l63475k301616k177998j404448j528154j508092n5648J543140
42421A530827J322494j70017r04376n17754k03339k20825K63097J189859J467087
42412C757053P91616k476m14105o91789q36583n38350j08934k16557o45076n10216
42402E84583J97030M45707k16587q86315n10850Q34967K165985K581393J897552
$$ plain form
42393 7093465 7768668 7458034 6675030 5711951 4842085 4562464 4989134 5316097 4692340
42384 4692340 3442738 2531998 2060224 1449640 978310 1613865 3062138 3589521 2506336
42375 2506336 1413714 2015985 3891744 5506290 6331793 6686399 6388519 5101280 3566362
42366 3566362 3064189 3709422 4339480 4061700 3120716 2400892 2764297 4550935 6969701
42357 6969701 8349342 7809763 6333339 5416999 5224771 5094302 5263042 6600437 8772231
42348 8772231 10220455 10293773 10116181 10828105 12056921 12841942 13254087 14214849 16057259
42339 16057259 18004567 19078539 19110565 18777687 18910462 20026058 22500171 26669496 32212120
42330 32212120 37798303 42409969 47099510 54234712 64541977 76201444 87713827 100315461
$$ packed form
42393G093465O75203l10634p83004r63079q69866k79621M26670L26963o23757
42384D692340j249602r10740m71774o10584m71330O35555J448273N27383j083185
42375B506336j092622O02271J875759J614546Q25503L54606k97880j287239j534918
42366C566362n02173O45233O30058k77780r40984p19824L63405J786638K418766
42357F969701J379641n39579j476424r16340j92228j30469J68740J337395K171794
42348H772231J448224P3318j77592P11924J228816P85021M12145R60762J842410
42339A6057259J947308J073972L2026l32878J32775J115596K474113M169325N542624
42330C2212120N586183M611666M689541P135202J0307265J1659467J1512383J2601634
$$ plain form
42322 100315461 116246714 135901445 158617818 185569788 219725577 262974252 314827434
42315 314827434 373082532 432638344 483009649 510624912 507597733 479298292 442351527
42308 442351527 413815587 400032531 393339913 379042425 347607894 302023085 253768996
42301 253768996 212322463 179616372 153396401 132236261 115670755 102166366 89872874
42294 89872874 78591380 69082237 61182856 54327179 49071106 46099002 44211675 41316519
42286 41316519 37262556 33826212 31870775 30320149 28133588 25535905 22875808 19929801
42278 19929801 17011837 15334172 15411395 16185418 16465577 16249014 15948178 15375239 14381966
42269 14381966 13630952 13727940 14167263 14016782 13167638 12105983 10931858 9499508 8215721
$$ packed form
42322A00315461J5931253J9654731K2716373K6951970L4155789M3248675N1853182
42315C14827434N8255098N9555812N0371305K7615263l027179k8299441l6946765
42308D42351527k8535940j3783056o692618j4297488l1434531m5584809m8254089
42301B53768996m1446533l2706091k6219971k1160140j6565506j3504389j2293492
42294H9872874j1281494r509143p899381o855677n256073k972104j887327k895156
42286D1316519m053963l436344j955437j550626k186561k597683k660097k946007
42278A9929801k917964j677665P7223P74023K80159k16563l00836n72939r93273
42269A4381966p51014R6988M39323j50481q49144j061655j174125j432350j283787
$$ plain form
42260 8215721 7806175 8370243 9316579 10078250 10285501 9513445 7722759 5940113 5637829
42251 5637829 7118658 9040137 9792678 8929993 7061734 4872893 2729710 1008681
42243 1008681 236466 638452 1660865 2198386 1546446 195993 -503086 380219 2534098
42234 2534098 4922150 6808839 7986703 8317986 7665827 6333055 5073274 4436602 4360104
42225 4360104 4518794 4815651 5418598 6563312 8377391 10581290 12284112 12484785 11026550
42216 11026550 8815440 6978359 6113816 6373946 7626490 9177649 9941765 9496542 8643897
42207 8643897 8464658 9206607 10489940 11891218 12611208 11452587 8441852 5872945 6011104
42198 6011104 7884594 8267617 6189765 4422589 5502302 8149096 9204299 7707746
$$ packed form
42260H215721m09546N64068R46336P61671K07251p72056j790686j782646l02284
42251E637829J480829J921479P52541q62685j868259k188841k143183j721029
42243A008681p72215M01986J022413N37521o51940j350453o99079Q83305K153879
42234B534098K388052J886689J177864L31283o52159j332772j259781o36672p6498
42225D360104J58690K96857O02947J144714J814079K203899J702822K00673j458235
42216A1026550k211110j837081q64543K60130J252544J551159P64116m45223q52645
42207H643897j79239P41949J283333J401278P19990j158621l010735k568907J38159
42198F011104J873490L83023k077852j767176J079713K646794J055203j496553
$$ plain form
42190 7707746 5212972 3108501 1775874 1903719 4313685 8122658 10852553 11020015
42182 11020015 9477285 7868431 6937508 6674675 6871688 6956565 6262886 4999886 4171270
42173 4171270 4216750 4585234 4853360 5219103 5603781 5438202 4794050 4557650 4936705 5014738
42163 5014738 4467813 4428804 5697563 7329471 8245344 9215296 11754672 15685332 19275367
42154 19275367 21505485 22917834 24409700 26357377 28789694 31238485 32363603 30828313
42146 30828313 26880701 22397904 19181958 17656299 17091005 16435648 14956189 12696543
42138 12696543 10427206 8794034 7643694 6505035 5375784 4535796 3952065 3464648
42130 3464648 3231771 3363416 3410713 2847513 1816638 902751 547505 1149183 3079364
$$ packed form
42190G707746k494774k104471j332627J27845K409966L808973K729895J67462
42182A1020015j542730j608854r30923k62833J97013Q4877o93679j263000q28616
42173D171270M5480L68484K68126L65743L84678j65579o44152k36400L79055P8033
42163E014738n46925l9009J268759J631908R15873R69952K539376L930660L590035
42154A9275367K230118J412349J491866J947677K432317K448791J125118j535290
42146C0828313l947612m482797l215946j525659n65294o55357j479459k259646
42138A2696543k269337j633172j150340j138659j129251q39988n83731m87417
42130C464648k32877J31645M7297n63200j030875r13887l55246O01678J930181
$$ plain form
42121 3079364 5842854 7846029 7948823 6798189 5770073 5201549 4718281 4640967 5630570
42112 5630570 7244852 8251693 8241238 7627472 6271870 3673365 615820 -948232 -123978
42103 -123978 1984129 3879566 5125790 5988844 6847001 8276904 10564773 12795742 13589611
42094 13589611 13122013 13282791 15407753 18874962 22202556 24374030 24870808 23813575
42086 23813575 22494512 22326892 22745866 21641426 18440572 15078175 13163954 12131856
42078 12131856 11393070 12215298 15427339 18844461 19495538 17626925 16063089 15922866 15415928
42069 15415928 13170071 10536077 9652427 10688390 12001146 12148978 10980206 9308890
42061 9308890 8093872 7620455 7233678 6150542 4511828 3229686 2925010 3522778 4690561
$$ packed form
42121C079364K763490K003175J02794j150634j028116n68524m83268p7314R89603
42112E630570J614282J006841j0455o13766j355602k598505l057545j564052Q24254
42103a23978K108107J895437J246224Q63054Q58157J429903K287869K230969P93869
42094A3589611m67598J60778K124962L467209L327594K171474M96778j057233
42086B3813575j319063j67620M18974j104440l200854l362397j914221j032098
42078A2131856p38786Q22228L212041L417122O51077j868613j563836j40223n06938
42069A5415928k245857k633994q83650J035963J312756J47832j168772j671316
42061I308890j215018m73417l86777j083136j638714j282142l04676N97768J167783
$$ plain form
42052 4690561 5969280 6557949 5794656 4077982 2738502 2700862 3521155 3842231 2710427
42043 2710427 630454 -592509 464786 3054653 4767651 4225563 2461334 1015410
42035 1015410 -213707 -1938187 -3253344 -2430213 168460 1921180 1251340 -449139
42027 -449139 -968718 -40729 1029685 1470317 1559377 1600565 1569383 1692415 2505383 4186030
42017 4186030 6250372 7884566 8316286 7149629 4813559 2491901 1067219 175929
42009 175929 -1193006 -3165223 -4649491 -4787831 -4165122 -3956345 -4133571 -3381898 -1055418
42000 -1055418 1561299 2655335 2110750 1444813 1698877 2456881 3128993 4014933 5361975
41991 5361975 6286912 5733509 4106069 2926838 2958991 3507173 3592230 3073389 2467056
$$ packed form
42052D690561J278719N88669p63293j716674j339480l7640Q20293L21076j131804
42043B710427k079973j222963J057295K589867J712998n42088j764229j445924
42035A015410j229117j724480j315157Q23131K598673J752720o69840j700479
42027d49139n19579R27989J070414M40632Q9060M1188l1182J23032Q12968J680647
42017D186030K064342J634194M31720j166657k336070k321658j424682q91290
42009A75929j368935j972217j484268j38340O22709K08777j77226P51673K326480
42000a055418K616717J094036n44585o65937K54064P58004O72112Q85940J347042
41991E361975R24937n53403j627440j179231L2153N48182Q5057n18841o06333
$$ plain form
41982 2467056 2236912 2453955 2782604 2713734 2089549 1353028 998532 916209 603741 -164375
41972 -164375 -1246728 -2475773 -3633361 -4279248 -4089622 -3265232 -2254622 -1297948 -586693
41963 -586693 -463744 -901969 -1132446 -452122 832950 1853372 2225465 1990658 972478
41954 972478 -803767 -2298588 -2249959 -909549 53546 -317282 -1172135 -1353632 -1146957
41945 -1146957 -1727816 -3206485 -4052789 -2790782 21969 2067289 1870099 687479 913567
41936 913567 2751957 3868906 2823065 1239768 1347675 2727790 3292092 2514279 1546907
41927 1546907 669295 -957093 -2935419 -3473557 -2222212 -1142625 -1621915 -2624191 -2797183
41918 -2797183 -2592311 -2876639 -3039583 -2234792 -1355871 -1912586 -3612479 -4796029 -4898408
$$ packed form
41982B467056k30144K17043L28649o8870o24185p36521l54496q2323l12468p68116
41972a64375j082353j229045j157588o45887J89626Q24390J010610R56674P11255
41963e86693J22949m38225k30477O80324J285072J020422L72093k34807j018180
41954I72478j776245j494821M8629J340410R63095l70828q54853j81497K06675
41945a146957n80859j478669q46304J262007K812751K045320j97190j182620K26088
41936I13567J838390J116949j045841j583297J07907J380115N64302p77813r67372
41927A546907q77612j626388j978326n38138J251345J079587m79290j002276j72992
41918b797183K04872k84328j62944Q04791Q78921n56715j699893j183550j02379
$$ plain form
41909 -4898408 -4848414 -5123386 -4925650 -3574786 -1615074 -139833 353639 270625 546740
41900 546740 1916320 4083270 5758529 5979931 5180119 4471703 4170488 3627119 2323132
41891 2323132 532581 -1023386 -1724366 -1392386 -519685 -31084 -453002 -1426686 -2242926
41882 -2242926 -2570630 -2457637 -2063019 -1722987 -1822432 -2194472 -2082308 -1125667 36952
41873 36952 570240 399958 -45352 -509477 -779109 -409858 695362 1751616 1833806 1035667
41863 1035667 408057 871191 2476206 4417050 5441606 4694419 2661767 981655 832725
41854 832725 1676957 1900370 519375 -1861846 -3481693 -2836241 -189818 2387595 3170021
41845 3170021 2781492 3044732 4059679 4081067 2605161 1625035 2710636 4449070 4280660
$$ packed form
41909d898408M9994k74972J97736J350864J959712J475241M93472q3014K76115
41900E46740J369580K166950J675259K21402p99812p08416l01215n43369j303987
41891B323132j790551j555967p00980L31980Q72701M88601m21918r73684q16240
41882b242926l27704J12993L94618L40032r9445l72040J12164R56641J162619
41873C6952N33288j70282m45310m64125k69632L69251J105220J056254Q2190p98139
41863A035667o27610M63134J605015J940844J024556p47187k032652j680112j48930
41854H32725Q44232K23413j380995k381221j619847O45452K646423K577413P82426
41845C170021l88529K63240J014947K1388j475906r80126J085601J738434j68410
$$ plain form
41836 4280660 1728865 -1665940 -4582828 -6442969 -6520503 -4409176 -1195709 1266114
41828 1266114 2231837 2338969 2450681 3091990 4309028 5097238 3907480 926298 -1253109
41819 -1253109 -782191 745217 665671 -706947 -773304 1228593 3350553 4031215 3598847
41810 3598847 2606130 1117114 -38113 277688 1252623 655568 -1690296 -3261332 -2515530
41801 -2515530 -914794 -159939 298375 1467303 2583327 2573362 2227251 2966447 4426875
41792 4426875 4941180 3732910 1363473 -1219152 -2970317 -3028361 -1882809 -1386497 -2488689
41783 -2488689 -3848345 -3744626 -2320431 -774107 528179 1704535 2144571 1288449 -46685
41774 -46685 -643182 -678866 -1172654 -2116851 -2483996 -1719119 -123118 1732965 2954173
$$ packed form
41836D280660k551795l394805k916888j860141p7534K111327L213467K461823
41828A266114R65723J07132J11712O41309J217038P88210j189758k981182k179407
41819a253109M70918J527408p9546j372618o6357K001897K121960O80662m32368
41810C598847r92717j489016j155227L15801R74935n97055k345864j571036P45802
41801b515530J600736P54855M58314J168928J116024r965l46111P39196J460428
41792D426875N14305j208270k369437k582625j751165n8044J145552M96312j102192
41783b488689j359656J03719J424195J546324J302286J176356M40036q56122j335134
41774d6685n96497l5684m93788r44197l67145P64877J596001J856083J221208
$$ plain form
41765 2954173 2456740 392043 -1319195 -1169431 44257 896814 1840901 4100517 6831662
41756 6831662 7689477 6083006 3785948 2256639 1313564 620048 469589 642558 303062
41747 303062 -381309 -149085 1238415 2356939 2228886 1532725 989654 120546 -1388103
41738 -1388103 -2458304 -1970693 -366641 1147591 2139355 2742269 2790212 2242625 1826722
41729 1826722 2232614 3129028 3791132 4165866 4488509 4399826 3396157 1800552 428224
41720 428224 -438413 -1009271 -1295763 -1311288 -1675668 -3033817 -4844730 -5616316 -4642558
41711 -4642558 -2970422 -2311499 -3218952 -4518368 -4458090 -2374312 778626 3542379 5332113
41702 5332113 6359712 6515099 5243453 2763415 504456 -322061 -24010 351553 619998
$$ packed form
41765B954173m97433k064697j711238J49764J213688Q52557R44087K259616K731145
41756F831662Q57815j606471k297058j529309r43075o93516j50459J72969l39496
41747C03062o84371K32224J387500J118524j28053o96161n43071q69108j508649
41738a388103j070201M87611J604052J514232R91764O02914M7943n47587m15903
41729A826722M05892Q96414O62104L74734L22643q8683j003669j595605j372328
41720D28224q66637n70858k86492j5525l64380j358149j810913p71586R73758
41711d642558J672136O58923r07453j299416O0278K083778L152938K763753J789734
41702E332113J027599J55387j271646k480038k258959q26517K98051L75563K68445
$$ plain form
41693 619998 1501880 3327495 5483769 7126159 7826357 7514651 6373671 4922604 3744043
41684 3744043 2919300 2014625 795369 -228425 -162746 1293239 3212509 3973392 2797692
41675 2797692 784746 -32930 1150324 3118511 4195996 4026081 3360568 2699731 1987621
41666 1987621 1417526 1607509 2754492 4186825 4995637 4766703 3627767 2012071 532310
41657 532310 -281463 -339001 67749 639486 1104275 1043327 277129 -530570 -355691 819404
41647 819404 1804651 1792410 1369973 1182785 402024 -2033877 -4897776 -5223046 -2073775
41638 -2073775 1737947 2950030 1759551 834088 1213546 1381571 459054 -26457 1366871
41629 1366871 3522468 4341151 3626676 2782844 2480644 2371776 2566032 3463497 4249645
$$ packed form
41693F19998Q81882J825615K156274J642390P00198l11706j140980j451067j178561
41684C744043q24743r04675j219256j023794O5679J455985J919270P60883j175700
41675B797692k012946q17676J183254J968187J077485j69915o65513o60837p12110
41666A987621n70095J89983J146983J432333Q08812k28934j138936j615696j479761
41657E32310q13773n7538M06750N71737M64789o0948p66198q07699J74879J175095
41647H19404R85247j2241m22437j87188p80761k435901k863899l25270L149271
41638b073775L811722J212083j190479r25463L79458J68025r22517m85511J393328
41629A366871K155597Q18683p14475q43832l02200j08868J94256Q97465P86148
$$ plain form
41620 4249645 3532724 1790914 1315867 3031908 5043294 5321647 4391246 4108612 4890734
41611 4890734 5511196 4910781 2992060 236723 -2301204 -3203921 -2143546 -757779 -967348
41602 -967348 -2798730 -4888987 -6501980 -7676669 -7998187 -7057374 -5937081 -6239083 -7375771
41593 -7375771 -6835380 -3826060 -754623 9900 -843894 -1200586 -724736 -640393 -1258614
41584 -1258614 -1688263 -1639232 -1702266 -1835316 -1170030 437101 2009237 2900054 3418295
41575 3418295 3666938 2987779 1137372 -994533 -2475062 -3312167 -3773929 -3545617 -2283957
41566 -2283957 -429040 1153614 1889235 1523606 188731 -1119965 -1080263 190078 796718
41557 796718 -523174 -2451456 -2751027 -1268705 112048 189254 -363028 -522587 -242369
$$ packed form
41620D249645p16921j741810m75047J716041K011386K78353r30401k82634P82122
41611D890734O20462o00415j918721k755337k537927r02717J060375J385767k09569
41602i67348j831382k090257j612993j174689l21518R40813J120293l02002j136688
41593g375771N40391L009320L071437P64523q53794l56692M75850Q4343o18221
41584a258614m29649M9031o3034j33050O65286J607131J572136Q90817N18241
41575C418295K48643o79159j850407k131905j480529q37105m61762K28312J261660
41566b283957J854917J582654P35621l65629j334875j308696L9702J270341O06640
41557G96718j319892j928282k99571J482322J380753P7206n52282j59559K80218
$$ plain form
41548 -242369 49489 134798 -149676 -829301 -1389859 -1441025 -1806526 -3633270 -6172837 -7021974
41538 -7021974 -5309314 -3202801 -3163683 -4877271 -6151714 -5870047 -4612766 -3078884 -1490231
41529 -1490231 -259283 245009 579594 1600715 2896570 3029898 1515000 -512460 -1813372
41520 -1813372 -2219410 -2007091 -1115968 454376 2168033 3436887 4204421 4740403 5181436
41511 5181436 5408752 5060579 3740849 1680396 -9227 -456126 -264189 -733022 -1856894
41502 -1856894 -2177711 -903353 894872 1726936 1402534 647072 -187591 -1187031 -2190766
41493 -2190766 -2895257 -3357481 -3704100 -3559686 -2428948 -607274 765955 611850 -1259980
41484 -1259980 -3972236 -6044373 -6419088 -5345581 -3963654 -2867626 -1623820 19375
$$ packed form
41548b42369K91858Q5309k84474o79625n60558n1166l65501j826744k539567q49137
41538g021974J712660K106513L9118j713588j274443K81667J257281J533882J588653
41529a490231J230948N04292L34585J021121J295855J33328j514898k027460j300912
41520a813372m06038K12319Q91123J570344J713657J268854P67534N35982M41033
41511E181436K27316l48173j319730k060453j689623m46899J91937m68833j123872
41502a856894l20817J274358J798225Q32064l24402p55462q34663r99440j003735
41493b190766p04491m62224l46619J44414J130738J821674J373229j54105j871830
41484a259980k712256k072137l74715J073507J381927J096028J243806J643195
$$ plain form
41476 19375 1232217 1160457 337862 55260 478359 387780 -983466 -2655863 -2981645 -1649035
41466 -1649035 -64916 290511 -458009 -845892 12027 1193080 1097106 -405042 -1689632
41457 -1689632 -1446491 -293878 233957 -221657 -577184 40294 1194736 1868036 1666551
41448 1666551 965566 258355 -216505 -382378 -294006 -258865 -677457 -1576045 -2489336 -3047639
41438 -3047639 -3528568 -4450340 -5651389 -6267971 -5796723 -4703529 -3703358 -2952663 -2387316
41429 -2387316 -2327084 -3065667 -4178704 -4879028 -4774712 -3725816 -1515506 1441056 3625567
41420 3625567 3950155 3503252 4335451 6535352 8064633 7707689 6496562 5664472 4959542
41411 4959542 4019367 3787094 5019849 6512176 6477034 5046570 3870211 3691181 3858119
$$ packed form
41476A9375J212842p1760q22595k82602M23099r0579j371246j672397l25782J332610
41466a649035J584119L55427p48520l87883Q57919J181053r5974j502148j284590
41457a689632K43141J152613N27835m55614l55527O17478J154442O73300k01485
41448A666551p00985p07211m74860j65873Q8372L5141m18592q98588r13291n58303
41438c047639m80929r21772j201049o16582M71248J093194J000171P50695N65347
41429b387316O0232p38583j113037p00324J04316J048896K210310K956562K184511
41420C625567L24588m46903Q32199K199901J529281l56944j211127q32090p04930
41411D959542r40175k32273J232755J492327l5142j430464j176359j79030J66938
$$ plain form
41402 3858119 4022555 4756100 6248895 7627315 8020871 7525624 6764125 6089462 5581357
41393 5581357 5482215 6243996 7946549 9616344 9617610 7488502 5092561 4672674 5702756
41384 5702756 5325482 2466740 -383184 -681609 737744 1542991 1549095 2048057 2639328
41375 2639328 1629496 -725374 -2206723 -2088331 -1948567 -2440653 -1874865 766299 3597606
41366 3597606 4240294 2942478 1735003 1572431 1753188 1427136 442982 -828231 -1661356
41357 -1661356 -1450900 -563921 -77076 -310255 -544504 -518520 -925153 -1855966 -2218879 -1590219
41347 -1590219 -1136983 -1491844 -1227230 897289 3442302 4065736 2934417 2163171 2314426
41338 2314426 1846160 167838 -1126826 -874574 -199459 -518441 -1210175 -823622 340390
$$ packed form
41402C858119J64436P33545J492795J378420L93556m95247p61499o74663n08105
41393E581357r9142P61781J702553J669795J266k129108k395941m19887J030082
41384E702756l77274k858742k849924k98425J419353Q05247O104M98962N91271
41375B639328j009832k354870j481349J18392J39764m92086N65788K641164K831307
41366C597606O42688j297816j207475j62572J80757l26052r84154j271213q33125
41357a661356K10456Q86979M86845k33179k34249K5984m06633r30813l62913O28660
41347a590219M53236l54861K64614K124519K545013O23434j131319p71246J51255
41338B314426m68266j678322j294664K52252O75115l18982o91734L86553J164012
$$ plain form
41329 340390 552873 -743627 -2227977 -2814377 -3125466 -4116032 -5148305 -4587912 -2120515
41320 -2120515 577620 1768568 1486259 1001604 1127888 1721995 2346415 2551056 1781141
41311 1781141 -29481 -1814227 -2237472 -1282739 -147385 453542 861499 1232229 949583
41302 949583 -199955 -1341511 -1706828 -1641140 -1699545 -1555592 -625559 874703 2260931
41293 2260931 3169315 3334412 2296349 177882 -1843729 -2698725 -2550080 -2015378 -954011
41284 -954011 988495 3183114 4449010 4390648 3488752 2331223 1598525 2146397 3937783
41275 3937783 5391546 5040249 3443230 2185840 1442298 134768 -1689782 -2497082 -1624223
41266 -1624223 -344492 96112 114984 586204 1112996 620924 -877368 -2073945 -1860547
$$ packed form
41329C40390K12483j296500j484350n86400l11089r90566j032273N60393K467397
41320b120515K698135J190948k82309m84655J26284N94107O24420K04641p69915
41311A781141j810622j784746m23245R54733J135354O00927M07957L70730k82646
41302I49583j149538j141556l65317O5688n8405J43953R30033J500262J386228
41293B260931R08384J65097j038063k118467k021611q54996J48645N34702J061367
41284i54011J942506K194619J265896n8362r01896j157529p32698N47872J791386
41275C937783J453763l51297j597019j257390p43542j307530j824550q07300Q72859
41266a624223J279731M40604J8872M71220N26792m92072j498292j196577K13398
$$ plain form
41257 -1860547 -605699 56372 -1198441 -3706631 -5036125 -3601408 -793804 509684
41249 509684 -538300 -1933575 -1614737 274503 2315200 3600920 3817362 2779898 987282
41240 987282 -244899 -338818 -517516 -2221981 -4936525 -6686320 -6421568 -4883628 -3268127
41231 -3268127 -2052535 -1213038 -728023 -607663 -922221 -1823517 -3055096 -3624527 -2767656
41222 -2767656 -1313952 -1219547 -3290513 -5986656 -7098296 -6268228 -5171808 -5261411 -6056986
41213 -6056986 -6028579 -4658256 -2938328 -1937066 -1649821 -1539358 -1475819 -1518437 -1317027
41204 -1317027 -590319 102239 -2118 -637746 -970901 -1202319 -2330293 -4006010 -4200561
41195 -4200561 -1976774 728283 1488286 596487 207542 864995 914993 -505303 -1894045
$$ packed form
41257a860547J254848O62071j254813k508190j329494J434717K807604J303488
41249E09684j047984j395275L18838J889240K040697J285720K16442j037464j792616
41240I87282j232181r3919j78698j704465k714544j749795K64752J537940J615501
41231c268127J215592Q39497M85015J20360l14558r01296j231579n69431Q56871
41222b767656J453704R4405k070966k696143j111640Q30068J096420q9603p95575
41213f056986K8407J370323J719928J001262K87245J10463O3539m2618K01410
41204a317027P26708O92558j04357o35628l33155k31418j127974j675717j94551
41195d200561K223787K705057P60003q91799l88945O57453M9998j420296j388742
$$ plain form
41186 -1894045 -1613109 -136800 1054262 1633947 2110827 2172086 980514 -1096050 -2598654
41177 -2598654 -3042190 -3496947 -4542978 -4868601 -3001135 190105 1936255 577895 -2654006
41168 -2654006 -5094136 -5370932 -4361567 -3668501 -3582556 -2943012 -1113344 546502 176790
41159 176790 -1710273 -2365714 -640034 763159 -1369718 -5977601 -8583808 -7007511
41151 -7007511 -3856172 -2472985 -2613324 -1798481 699332 3366461 5003530 5579978 4938355
41142 4938355 2822271 321587 -692995 -108374 106076 -1215653 -2704253 -2490512 -729428
41133 -729428 953673 1572546 1199656 -21140 -1999842 -4000300 -4845204 -4069872 -2453700
41124 -2453700 -1318345 -1413297 -2301269 -2754643 -2067751 -966449 -677784 -1116112 -898607
$$ packed form
41186a894045K80936J476309J191062N79685M76880O1259j191572k076564j502604
41177b598654m43536m54757j046031l25623J867466L191240J746150j358360l231901
41168b654006k440130k76796J009365O93066Q5945O39544J829668J659846l69712
41159A76790j887063o55441J725680J403193k132877m607883k606207J576297
41151g007511L151339J383187j40339Q14843K497813K667129J637069N76448o41623
41142D938355k116084k500684j014582N84621K14450j321729j488600K13741J761084
41133g29428J683101O18873l72890j220796j978702k000458q44904P75332J616172
41124b453700J135355r4952q87972m53374O86892J101302K88665m38328K17505
$$ plain form
41115 -898607 506689 1649895 874049 -1534952 -3906736 -5346150 -6225456 -6729769 -6098306
41106 -6098306 -3688724 -144179 2858645 3757691 2071865 -1166534 -3759117 -3744529 -1052295
41097 -1052295 2316345 4082351 3657377 2180802 871586 -42401 -647745 -483836 699729
41088 699729 1705173 757746 -2072077 -4610932 -5459608 -5782932 -6955182 -7692682 -5630303
41079 -5630303 -1220268 2312164 3108961 2529407 2262561 1904348 674727 -510803 -538409
41070 -538409 -169949 -561527 -763669 1052971 4389188 6670954 6704560 5830049 5287624
41061 5287624 4376255 2114415 -725372 -2413074 -2330459 -1309091 -339026 325134 969427
41052 969427 1851437 2846362 3528450 3632371 3292759 2647327 1502246 -236221 -2113847
$$ packed form
41115h98607J405296J143206p75846k409001k371784j439414q79306n04313O31463
41106f098306K409582L544545L002824Q99046j685826l238399k592583J4588K692234
41097a052295L368640J766006m24974j476575j309216r13987o05344J63909J183565
41088F99729J005444r47427k829823k538855q48676l23324j172250p37500K062379
41079e630303M410035L532432P96797n79554k66846l58213j229621j185530k7606
41070e38409L68460l91578k02142J816640L336217K281766L3606q74511n42425
41061E287624r11369k261840k839787j687702Q2615J021368R70065O64160O44293
41052I69427Q82010R94925O82088J03921l39612o45432j145081j738467j877626
$$ plain form
41043 -2113847 -3564027 -4412410 -4441079 -3068890 -382645 2037801 2601768 1833205 1651099
41034 1651099 2469478 2525172 590268 -2073013 -3413153 -3202252 -2803672 -2927355 -2776765
41025 -2776765 -1355568 1145528 3345822 3735383 1924099 -873263 -2855947 -3359185
41017 -3359185 -3167411 -2964116 -2278826 -622596 1073468 1331197 293869 -143705 1244416
41008 1244416 3297240 3807561 2137867 -208367 -1551255 -1901598 -2526255 -4013067 -5357975
40999 -5357975 -5137144 -3200144 -780447 1006693 2330568 4058439 6222922 7511664
40991 7511664 6544824 3565425 541044 -579576 482702 2559168 4454461 5555401
40983 5555401 5341591 3422708 510762 -1548353 -1592261 -590835 -499965 -1916072 -3615002
$$ packed form
41043b113847j450180q48383k8669J372189K686245K420446N63967p68563j82106
41034A651099Q18379N5694j934904k663281j340140K10901L98580j23683J50590
41025b776765J421197K501096K200294L89561j811284k797362j982684n03238
41017c359185J91774K03295O85290J656230J696064K57729j037328m37574J388121
41008A244416K052824N10321j669694k346234j342888l50343o24657j486812j344908
40999e357975K20831J937000K419697J787140J323875J727871K164483J288742
40991G511664r66840k979399l024381j120620J062278K076466J895293J100940
40983E555401k13810j918883k911946k059115m3908J001426R0870j416107j698930
$$ plain form
40974 -3615002 -4258358 -3758735 -2889913 -2198536 -1500334 -137371 2191646 4578559 5317850
40965 5317850 3826423 1730915 1066927 1646561 1462162 -224008 -1639561 -999888 949043
40956 949043 1926750 929051 -1045788 -2676222 -3592836 -3954630 -3699925 -2631697 -827698
40947 -827698 1319358 3267758 4435082 4413567 3318092 1858742 872319 678913 957508
40938 957508 1341583 1988204 3227759 4691857 5376353 4875261 3973984 3467691 2951315
40929 2951315 1639235 -33065 -817496 -651813 -1002159 -2805166 -5109579 -6336702 -6002169
40920 -6002169 -4557531 -2438324 -178872 1260628 1418368 1194450 1682094 2367555 1718794
40911 1718794 -364609 -1979276 -1628553 -139429 697854 631098 897850 1964391 2666380
$$ packed form
40974c615002o43356M99623Q68822O91377O98202J362963K329017K386913P39291
40965E317850j491427k095508o63988N79634j84399j686170j415553O39673J948931
40956I49043R77707r97699j974839j630434r16614l61794K54705J068228J803999
40947h27698K147056J948400J167324k1515j095475j459350r86423j93406K78595
40938I57508L84075O46621J239555J464098O84496n01092r01277n06293n16376
40929B951315j312080j672300p84431J65683l50346j803007k304413j227123L34533
40920f002169J444638K119207K259452J439500J57740k23918M87644O85461o48761
40911A718794k083403j614667L50723J489124Q37283o6756K66752J066541P01989
$$ plain form
40902 2666380 2011807 773310 416494 1023654 1279314 345470 -1204121 -2413770 -3031619
40893 -3031619 -3275660 -3295315 -3313306 -3671816 -4245978 -4324988 -3496854 -2116142 -561526 1193474
40883 1193474 2781639 3202462 2254031 1292294 1420516 1733680 778843 -897568 -1408161
40874 -1408161 -461603 210389 -496371 -1744468 -2495555 -2874020 -3114993 -2717449 -1630357
40865 -1630357 -1024250 -1738806 -2811299 -2578030 -666065 1867244 3799115 4504838 4053998
40856 4053998 3156729 2552934 2119657 1169549 -254658 -1303479 -1659961 -1740425 -1343661
40847 -1343661 281451 2385286 2566708 -614 -2658244 -2227735 1087312 4291885
40839 4291885 5245499 4213486 2635172 2099531 3954162 7997474 11616731 11884053 8743670
$$ packed form
40902B666380o54573j238497l56816O07160K55660r33844j549591j209649o17849
40893c031619k44041j9655j7991l58510n74162p9010Q28134J380712J554616J755000
40883A193474J588165M20823r48431r61737J28222L13164r54837j676411n10593
40874a408161R46558O71992p06760j248097p51087l78465k40973L97544J087092
40865a630357O06107p14556j072493K33269J911965K533309J931871P05723m50840
40856D053998q97269o03795m33277r50108j424207j048821l56482q0464L96764
40847a343661J625112K103835J81422k567322k657630M30509L315047L204573
40839D291885R53614j032013j578314n35641J854631M043312L619257K67322l140383
$$ plain form
40830 8743670 4969486 2981270 2801673 2995599 2367700 704926 -1044035 -1268501 692562
40821 692562 3504014 5213172 5339792 4677302 3631973 2151683 888885 776636 1460376
40812 1460376 1664677 1190968 1055066 1488512 1368736 44700 -1672242 -2832287 -3400610
40803 -3400610 -3488288 -2754432 -1223659 279528 1105853 1413338 1453826 1040465 51694
40794 51694 -1244404 -2475511 -3071265 -2201975 1869 1495081 258048 -2788960 -4631419
40785 -4631419 -4132701 -3113010 -2971725 -2633087 -1085014 312317 3658 -948296 -444117
40776 -444117 1310609 2199825 1298213 -413675 -2006288 -3321016 -3918985 -3236112 -1971468
40767 -1971468 -1677150 -2670858 -3816327 -4653576 -6141686 -8602582 -10376904 -9699360 -7087201
$$ packed form
40830H743670l774184j988216j79597J93926o27899j662774j748961k24466J961063
40821F92562K811452J709158J26620o62490j045329j480290j262798j12249O83740
40812A460376K04301m73709j35902M33446j19776j324036j716942j160045n68323
40803c400610q7678P33856J530773J503187Q26325L07485M0488m13361r88771
40794E1694j296098j231107n95754Q69290K203844J493212j237033l047008j842459
40785d631419M98718J019691J41285L38638J548073J397331l08659r51954N04179
40776d44117J754726Q89216r01612j711888j592613j314728n97969O82873J264644
40767a971468K94318r93708j145469q37249j488110k460896j774322O77544K612159
$$ plain form
40758 -7087201 -4689479 -3624442 -3031483 -1780530 -146387 776834 812621 964315 1795064
40749 1795064 2413684 1862494 971335 1552424 3688379 5201848 4456215 2492343 1399055
40740 1399055 1554734 1805186 1715780 2051470 3086237 3873872 3569163 2474748 1404485
40731 1404485 788490 727037 1217895 1932583 2255615 1836215 771761 -739622 -2364179
40722 -2364179 -3267399 -2600761 -669955 1042106 1410172 674385 -436646 -1882243 -3880199
40713 -3880199 -5751903 -6196607 -4878369 -3043674 -2153937 -2267217 -2209207 -1177925 327275
40704 327275 1282787 1391047 1155951 923265 384702 -831121 -2457358 -3745827 -4166356
40695 -4166356 -3808591 -3265914 -3230082 -3933088 -4731604 -4415751 -2297269 890383 3342422
$$ packed form
40758g087201K397722J065037N92959J250953J634143R23221L5787J51694Q30749
40749A795064O18620n51190q91159N81089K135955J513469p45633j963872j093288
40740A399055J55679K50452q9406L35690J034767P87635l04709j094415j070263
40731A404485o15995o1453M90858P14688L23032m19400j064454j511383j624557
40722b364179r03220O66638J930806J712061L68066p35787j111031j445597j997956
40713c880199j871704m44704J318238J834695Q89737j13280N8010J031282J505200
40704C27275R55512J08260k35096k32686n38563j215823j626237j288469m20529
40695d166356L57765N42677L5832p03006p98516L15853K118482L187652K452039
$$ plain form
40686 3342422 3687677 2330053 1207229 1887512 3846544 5067712 4515643 3335726 3100900
40677 3100900 3703934 4064888 4267320 5305190 6751995 6633952 4397238 2314191 2598776
40668 2598776 4323938 4790207 3195589 1234077 377016 336949 457572 1034712 2458199
40659 2458199 4007574 4388363 3122048 923426 -1033100 -1929611 -1684664 -833867 54622
40650 54622 901376 1903502 2892531 3261503 2617296 1255581 -117765 -1023246 -1555708
40641 -1555708 -2144034 -2878898 -3133554 -2184707 -249737 1594212 2727812 3641174 4894402
40632 4894402 6079151 6480138 6270103 6221076 6501854 6569320 6095666 5233388 4087029
40623 4087029 2732762 1694341 1498896 1661671 1033254 -530342 -1676596 -1237469 232369
$$ packed form
40686C342422L45255j357624j122824O80283J959032J221168n52069j179917k34826
40677C100900O03034L60954K02432J037870J446805j18043k236714k083047K84585
40668B598776J725162M66269j594618j961512q57061m0067J20623N77140J423487
40659B458199J549375L80789j266315k198622j956526q96511K44947Q50797Q88489
40650E4622Q46754J002126R89029L68972o44207j361715j373346r05481n32462
40641a555708n88326p34864k54656R48847J934970J843949J133600R13362J253228
40632D894402J184749M00987k10035m9027K80778O7466m73654q62278j146359
40623D087029j354267j038421j95445J62775o28417j563596j146254M39127J469838
$$ plain form
40614 232369 1167106 771716 -487922 -1775712 -2517012 -2285627 -923121 891935 1781472
40605 1781472 956800 -840449 -2182139 -2555381 -2482334 -2195674 -1296934 -115483 -122481
40596 -122481 -1844329 -3341893 -2477708 -267507 24343 -2678862 -5727312 -6324975 -4774378
40587 -4774378 -3079598 -2099108 -1650817 -1971967 -3087848 -3627875 -2290009 -43526 940314
40578 940314 236669 -723898 -1226981 -1957840 -2955198 -2852763 -881624 1795845 3488916
40569 3488916 3687637 2907947 1886181 1395419 1857898 2630176 2519795 1389299 405148
40560 405148 444399 1255105 2481976 4299685 6375230 7287277 5934265 2923109 -157201
40551 -157201 -2316854 -3430206 -3538467 -2720414 -1443357 -399587 54036 70921 32012
$$ packed form
40614B32369R34737l95390j259638j287790p41300K31385J362506J815056Q89537
40605A781472q24672j797249j341690l73242P3047K86660Q98740J181451o998
40596a22481j721848j497564Q64185K210201K91850k703205l048450n97663J550597
40587d774378J694780R80490M48291l21150j115881n40027J337866K246483R83840
40578I40314p03645r60567n03083p30859r97358J02435J971139K677469J693071
40569C488916J98721p79690j021766m90762M62479P72278j10381j130496r84151
40560D05148L9251Q10706J226871J817709K075545R12047j353012l011156l080310
40551a57201k159653j113352j08261Q18053J277057J043770M53623J6885l8909
$$ plain form
40542 32012 206803 560596 849076 950950 928818 709471 167813 -293619 11533 811725
40532 811725 837067 -226902 -848977 81689 1171671 381998 -1821380 -3099657 -2479474
40523 -2479474 -890832 1085315 3556245 5449809 4984876 2563875 752217 636415
40515 636415 603885 -377121 -856765 344769 1908181 2267736 1954407 1822713 1000968
40506 1000968 -1175991 -2967329 -2423612 -403220 1075325 2235938 4507452 6910075
40498 6910075 6571009 2973327 -887627 -2164818 -1063480 449950 1257757 1727736 2654952
40489 2654952 3941127 4075443 1625144 -2149701 -3567377 -906832 2794139 3397091
40481 3397091 1029845 -758171 -426310 106393 -563574 -1216657 -824414 -546970 -1357664
$$ packed form
40542C2012J74791L53793K88480J01874k2132k19347n41658m61432L05152Q00192
40532H11725K5342j063969o22075R30666J089982p89673k203378j278277O20183
40523b479474J588642J976147K470930J893564m64933k421001j811658j15802
40515F36415l2530r81006m79644J201534J563412L59555l13329j31694q21745
40506A000968k176959j791338N43717K020392J478545J160613K271514K402623
40498F910075l39066l597682l860954j277191J101338J513430Q07807M69979R27216
40489B654952J286175J34316k450299l774845j417676K660545L700971O02952
40481C397091k367246j788016L31861N32703o69967o53083L92243K77444q10694
$$ plain form
40472 -1357664 -2024933 -1318848 -380056 -834906 -1879951 -1409892 675168 2327420 2277705
40463 2277705 1303520 454319 -353441 -1347725 -1735547 -602246 1462153 2626701 1845843
40454 1845843 -39358 -1518107 -2065958 -1935551 -934758 1267474 3659292 4279108 2746979
40445 2746979 1072305 988844 1689554 1400293 64492 -1081909 -1733815 -2540346 -3383810
40436 -3383810 -3373166 -2403000 -1268922 -415960 143881 108455 -468206 -350208 1357156
40427 1357156 3353202 3712970 2873347 2891026 4005121 4361841 3168888 1563274 70450
40418 70450 -2078831 -4454917 -5029734 -3367029 -1649663 -1238768 -723271 1065198 2613461
40409 2613461 2292179 1135487 810797 755433 -210145 -1113566 -424502 841987 506971
$$ packed form
40472a357664o67269P06085R38792m54850j045045M70059K085060J652252m9715
40463B277705r74185q49201q07760r94284l87822J133301K064399J164548p80858
40454A845843j885201j478749n47851J30407J000793K202232K391818O19816j532129
40445B746979j674674q3461P00710k89261j335801j146401o51906q06531q43464
40436c383810J0644R70166J134078Q52962N59841l5426n76661J17998J707364
40427A357156J996046L59768q39623J7679J114095L56720j192953j605614j492824
40418G0450k149281k376086n74817J662705J717366M10895N15497J788469J548263
40409B613461l21282j156692l24690n5364r65578r03421O89064J266489l35016
$$ plain form
40400 506971 -1052336 -1453642 -291084 256865 -924338 -2152469 -1668590 -188098 282990
40391 282990 -987020 -2884617 -3827020 -3353028 -2670962 -3375950 -5189789 -5715008 -3317606
40382 -3317606 532059 2952593 2944995 1704502 479974 -201068 190796 1714632 2974786
40373 2974786 2494028 1048868 823684 2201373 3309392 2991603 2225759 2003462 1726097
40364 1726097 662938 -610703 -1337875 -1806945 -2286512 -1866195 289270 3193296 4758068
40355 4758068 3974273 1568401 -1132735 -3178551 -4079064 -3746613 -2578924 -1329403 -691242
40346 -691242 -759516 -718546 513354 2774697 4239168 3417361 1293660 292201 1135357
40337 1135357 2010523 1091017 -1412298 -4145492 -6226940 -7235802 -6781011 -5102866 -3308865
$$ packed form
40400E06971j559307m01306J162558N47949j181203j228131M83879J480492M71088
40391B82990j270010j897597r42403M73992O82066p04988j813839n25219K397402
40382c317606L849665K420534p598j240493j224528o81042L91864J523836J260154
40373B974786m80758j445160k25184J377689J108019l17789p65844k22297k77365
40364A726097j063159j273641p27172m69070m79567M20317K155465K904026J564772
40355D758068p83795k405872k701136k045816r00513L32451J167689J249521O38161
40346f91242o8274M0970J231900K261343J464471q21807k123701j001459Q43156
40337A135357Q75166r19506k503315k733194k081448j008862M54791J678145J794001
$$ plain form
40328 -3308865 -2123971 -1120288 40378 535169 -311635 -1396109 -927968 1125538 2987858
40319 2987858 3390064 2700984 1663474 331538 -1207425 -2158374 -1974028 -1395734 -1664119
40310 -1664119 -2947711 -4276060 -4832119 -4501186 -3183022 -600287 2695345 4949075
40302 4949075 4764610 2744354 747949 -303040 -988660 -1843562 -2369164 -1929781 -667401
40293 -667401 966702 2721423 4050095 4040115 2597009 897953 -110753 -840926 -1894600
40284 -1894600 -2847453 -3362309 -4383379 -6526235 -8120789 -6927087 -3429803 -278150
40276 -278150 1481677 3298444 5908100 7714621 7441708 6241577 5586232 4738294 2233839
40267 2233839 -1167147 -3009293 -2323698 -732144 -345550 -1643574 -3509438 -4563377
$$ packed form
40328c308865J184894J003683J160666M94791q46804j084474M68141K053506J862320
40319B987858M02206o89080j037510j331936j538963r50949J84346N78294k68385
40310a664119j283592j328349n56059L30933J318164K582735L295632K253730
40302D949075j84465k020256j996405j050989o85620q54902n25602M39383J262380
40293f67401J634103J754721J328672r980j443106j699056j008706p30173j053674
40284a894600r52853n14856j021070k142856j594554J193702L497284L151653
40276b78150J759827J816767K609656J806521k72913j200131o55345q47938k504455
40267B233839l400986j842146O85595J591554L86594j298024j865864j053939
$$ plain form
40259 -4563377 -4292532 -3233063 -2108993 -961621 347289 1049075 131358 -1715103 -2352890
40250 -2352890 -1180614 -381684 -1945956 -4658865 -5610654 -3861921 -988771 1404600
40242 1404600 2953363 3566018 2986495 1630680 550614 171876 -49473 -582652 -1288572
40233 -1288572 -1948790 -2444699 -2387979 -1419368 123304 1595232 2909490 4119145 4453481
40224 4453481 3018889 425981 -1540566 -2005698 -1599453 -949330 -8468 857515 708681
40215 708681 -369094 -947738 -427071 -136615 -1088854 -1922482 -760447 1682277 2775711
40206 2775711 1611169 113422 92967 786582 318079 -1448710 -2796077 -2521779 -1243559
40197 -1243559 -201056 281487 595945 760711 405837 -255809 -299534 733457 2130976
$$ packed form
40259d563377K70845J059469J124070J147372J308910P01786r17717j846461o37787
40250b352890J172276P98930j564272k712909r51789J748733K873150K393371
40242A404600J548763O12655n79523j355815j080066l78738k21349n33179p05920
40233a288572o60218m95909N6720R68611J542672J471928J314258J209655L34336
40224D453481j434592k592908j966547m65132M06245O50123R40862Q65983j48834
40215G08681j077775n78644N20667K90456r52239q33628J162035K442724J093434
40206B775711j164542j497747k0455O93615m68503j766789j347367K74298J278220
40197a243559J042503M82543L14458J64766l54874o61646m3725J032991J397519
$$ plain form
40188 2130976 2946835 3148217 3230258 3135307 2449810 1539631 1483295 2598730 3821864 3963865
40178 3963865 2999563 1741586 851842 657309 1343700 2616819 3508895 3235796 2126854
40169 2126854 1150606 658742 159967 -785049 -2071395 -3425001 -4624025 -5268505 -4985315
40160 -4985315 -4064290 -3251858 -2605951 -1231363 1316678 3966138 5215033 4851657 3690974
40151 3690974 1948831 -788707 -3782339 -4820971 -2736004 655724 2395824 1778875
40143 1778875 684223 704382 1322642 1228502 184671 -1076870 -1884208 -1800854 -521078
40134 -521078 1557775 3150151 3265036 2269848 1231134 717351 883354 1979765 3663584
40125 3663584 4341135 2665385 -334509 -2026459 -1370416 -19628 305179 179538 1111008
$$ packed form
40188B130976Q15859K01382Q2041r4951o85497r10179n6336J115435J223134J42001
40178C963865r64302j257977q89744j94533O86391J273119Q92076k73099j108942
40169B126854r76248m91864m98775r45016j286346j353606j199024o44480K83190
40160d985315R21025Q12432O45907J374588K548041K649460J248895l63376j160683
40151C690974j742143k737538k993632j038632K084967L391728J740100o16949
40143A778875j094652K0159O18260r4140j043831j261541q07338Q3354J279776
40134e21078K078853J592376J14885r95188j038714n13783J66003J096411J683819
40125C663584O77551j675750k999894j691950O56043J350788L24807j25641R31470
$$ plain form
40116 1111008 2783730 3237636 1703865 -83974 70039 2245269 4504171 5186361 4409016
40107 4409016 3287471 2373785 1418317 379073 -154202 152504 641420 376959 -662621
40098 -662621 -1629014 -1876699 -1457261 -617753 615903 2211050 3846839 5000627 5207305
40089 5207305 4412912 3274656 2722254 2786589 2308608 485721 -1700190 -2498529 -1562420
40080 -1562420 -88585 988274 1657398 1721090 639835 -970562 -1208337 729379 3139406
40071 3139406 3843397 2671589 833897 -1171997 -3527423 -5625359 -6331188 -5609555 -4493599
40062 -4493599 -3441559 -2018356 -213993 1321522 2554949 4147616 5823267 6095880
40054 6095880 4424453 2433418 1978922 2925547 3873268 4223060 4240287 3697699 2013598
$$ packed form
40116A111008J672722M53906j533771j787839J54013K175230K258902O82190p77345
40107D409016j121545r13686r55468j039244n33275L06706M88916k64461j039580
40098f62621r66393k47685M19438Q39508J233656J595147J635789J153788K06678
40089E207305p94393j138256n52402O4335m77981j822887k185911p98339R36109
40080a562420J473835J076859O69124O3692j081255j610397k37775J937716K410027
40071C139406P03991j171808j837692k005894k355426k097936p05829P21633J115956
40062d493599J052040J423203J804363J535515J233427J592667J675651K72613
40054F095880j671427j991035m54496R46625R47721L49792J7227n42588j684101
$$ plain form
40045 2013598 -324413 -1861123 -1953738 -1323102 -536272 859060 3041694 4832831 4976744
40036 4976744 3938218 3329828 3760887 4271838 3916078 2904525 1883898 972753 114478
40027 114478 -230466 475583 1919245 3075876 3286074 2821520 2435247 2640582 3281837
40018 3281837 3498157 2346522 -98326 -2490452 -3596878 -3702423 -3925805 -4355271 -3945466
40009 -3945466 -2447214 -1238769 -1530006 -2679068 -3257276 -3073254 -2925918 -2747036 -1456445
40000 -1456445 1109284 3374142 3765040 2473145 841473 -353421 -1255200 -2001701 -2314277
39991 -2314277 -1975321 -1095348 115110 1341347 1982121 1615656 797909 749443 1872356
39982 1872356 3125918 3416193 3125848 3441675 4404556 4733382 3863466 3068517 3718293
$$ packed form
40045B013598k338011j536710r2615O30636P86830J395332K182634J791137J43913
40036D976744j038526o08390M31059N10951l55760j011553j020627r11145q58275
40027A14478l44944P06049J443662J156631K10198m64554l86273K05335O41255
40018C281837K16320j151635k444848k392126j106426j05545k23382m29466M09805
40009c945466J498252J208445k91237j149062n78208J84022J47336J78882J290591
40000a456445K565729K264858L90898j291895j631672j194894r01779p46501l12576
39991b314277L38956Q79973J210458J226237O40774l66465q17747m8466J122913
39982A872356J253562K90275k90345L15827R62881L28826q69916p94949O49776
$$ plain form
39973 3718293 5141898 5364148 3725769 1620936 535923 483815 812030 1510655 2867292
39964 2867292 4462355 5450873 5600284 5330024 4952249 4583608 4580514 5182062 5704661 4979523
39954 4979523 2908262 921065 462421 1432441 2464324 2392930 1134438 -552479 -1761372
39945 -1761372 -2007619 -1392521 -232241 1398707 3446248 5216236 5546167 4093053 2099850
39936 2099850 1266160 1862090 2451126 1646738 -218801 -1501228 -1202295 -147022 24848
39927 24848 -1128312 -2299617 -2096238 -821803 -31443 -483617 -1326606 -1547363 -1422931
39918 -1422931 -1845190 -2712073 -2963069 -2205936 -1410575 -1620120 -2606531 -3308470 -3164376
39909 -3164376 -2413097 -1329370 129672 1856997 3372463 4319802 4787778 4906793 4552097
$$ packed form
39973C718293J423605K22250j638379k104833j085013n2108L28215O98625J356637
39964B867292J595063R88518J49411k70260l77775l68641l094O01548N22599p25138
39954D979523k071261j987197m58644R70020J031883p1394j258492j686917j208893
39945a761372k46247O15098J160280J630948K047541J769988L29931j453114j993203
39936B099850q33690N95930N89036q04388j865539j282427K98933J055273J71870
39927B4848j153160j171305K03379J274435P90360m52174q42989k20757J24432
39918a422931m22259q66883k50996P57133P95361k09545r86411p01939J44094
39909c164376P51279J083727J459042J727325J515466R47339M67976J19015l54696
$$ plain form
39900 4552097 3821904 3420972 3945244 4878188 4932943 3562783 1641422 369659 -86753
39891 -86753 -465493 -1175128 -1723296 -1462849 -586269 -147011 -1092752 -3308478 -5618148
39882 -5618148 -6745006 -6251524 -4565519 -2359124 -218306 1254920 1614699 1062176 335163
39873 335163 -161748 -723359 -1531595 -1956818 -1269219 192979 1236886 1233067 809672 1007919
39863 1007919 2100187 3332125 3545933 2037403 -850840 -3837994 -5605059 -5735368
39855 -5735368 -4827424 -3901156 -3764312 -4507521 -5238715 -4742634 -2979513 -1529697 -1744691
39846 -1744691 -2759608 -2439215 -312237 1674318 1763390 603689 53735 669653 1488525
39837 1488525 1853373 2260529 3271839 4387328 4355332 2380673 -968723 -3905024 -4765815
$$ packed form
39900D552097p30193m00932N24272R32944N4755j370160j921361j271763m56412
39891h6753l78740p09635n48168K60447Q76580M39258r45741k215726k309670
39882e618148j126858M93482J686005K206395K140818J473226L59779n52523p27013
39873C35163m96911n61611q08236m25223O87599J462198J043907l819m23395J98247
39863A007919J092268J231938K13808j508530k888243k987154j767065j30309
39855e735368R07944R26268J36844p43209p31194M96081J763121J449816k14994
39846a744691j014917L20393K126978J986555Q9072j159701n49954O15918Q18872
39837A488525L64848M07156J011310J115489l1996j974659l349396k936301q60791
$$ plain form
39828 -4765815 -3600181 -2208659 -2272958 -3712114 -5184301 -5703766 -5179330 -3861707 -2178105
39819 -2178105 -921818 -650311 -836326 -452184 495977 873590 78015 -1083822 -1600062
39810 -1600062 -1542436 -1548184 -1646978 -1346631 -530097 411995 1148681 1567982 1569573 1202590
39800 1202590 789146 401178 -464026 -1960561 -2924495 -1931832 459196 1634646 -144368
39791 -144368 -3434341 -5150526 -4028055 -1548223 420980 1646534 2747655 3534175
39783 3534175 3271170 2218591 1747502 2697997 4386661 5580554 5869433 5640904 5141610
39774 5141610 4145943 2454821 307604 -1755203 -3285761 -4227109 -4858618 -5295630 -5126773
39765 -5126773 -3991572 -2554814 -2195203 -3293281 -4459315 -4138299 -2493817 -880298
$$ packed form
39828d765815J165634J391522o4299j439156j472187n19465N24436J317623J683602
39819b178105J256287K71507j86015L84142R48161L77613p95575j161837n16240
39810a600062N7626n748r8794L00347Q16534R42092P36686M19301J591l66983
39800A202590m13444l87968q65204j496535r63934R92663K391028J175450j779014
39791a44368l289973j716185J122471K479832J969203J225554J101121P86520
39783C534175k63005j052579m71089R50495J688664J193893K88879k28529m99294
39774E141610r95667j691122k147217k062807j530558r41348o31509m37012J68857
39765e126773J135201J436758L59611j098078j166034L21016J644482J613519
$$ plain form
39757 -880298 131393 1089497 2156168 2580737 2077409 1604870 2019102 2729317 2558560
39748 2558560 1445907 412896 106508 252813 526432 1124709 2192607 3251295 3637439
39739 3637439 3285403 2735168 2440968 2373608 2375783 2589568 3144838 3541107 2990641 1656644
39729 1656644 843864 1270944 1798862 1026490 -233269 327724 3116326 5669884 5868407
39720 5868407 4531024 3587694 3160030 2315895 1680368 2921515 5817997 8083624 8469284
39711 8469284 8060517 7910864 7371783 5815550 4215609 3492826 2660858 416983 -2304511
39702 -2304511 -3304075 -2305165 -1319941 -1697563 -2467576 -2183906 -1087321 -516143 -945613
39693 -945613 -1594452 -1767452 -1815900 -2486525 -3563711 -3618576 -1580634 1491380 3023486
$$ packed form
39757h80298J011691R58104J066671M24569n03328m72539M14232P10215j70757
39748B558560j112653j033011l06388J46305K73619N98277J067898J058688L86144
39739C637439l52036n50235k94200o7360K175K13785N55270L96269n50466j333997
39729A656644q12780M27080N27918p72372j259759N60993K788602K553558J98523
39720E868407j337383r43330m27664q44135o35527J241147K896482K265627L85660
39711H469284m08767j49653n39081j556233j599941p22783q31968k243875k721494
39702b304511r99564R98910R85224l77622p70013K83670J096585N71178m29470
39693i45613o48839j73000m8448o70625j077186n4865K037942L072014J532106
$$ plain form
39684 3023486 1877308 15497 263442 2808179 5132573 5368830 4311245 3618714 3355739
39675 3355739 2446289 822939 -229468 151958 1332446 2180751 2410274 2439049 2405626
39666 2405626 2049371 1540594 1688859 2824330 3891356 3450782 1578380 -83539 -438390
39657 -438390 -147049 -92797 313697 1989515 4016537 4418424 3112839 2238612 2938157
39648 2938157 3554553 2193057 -334573 -1686561 -1166388 -8013 946541 2004544 3183207
$$ packed form
39684C023486j146178j861811K47945K544737K324394K36257j057585o92531k62975
39675C355739r09450j623350j052407L81426J180488Q48305K29523K8775l3423
39666B405626l56255n08777J48265J135471J067026m40574j872402j661919l54851
39657d38390K91341N4252M06494J675818K027022M01887j305585q74227O99545
39648B938157O16396j361496k527630j351988N20173J158375R54554J058003J178663
$$ [...]
##END NTUPLES=NMR SPECTRUM
##END=
