##TITLE=31Pdec_LR-795-C1-M
 CDCl3, 24 sc
 9.12.2024
##JCAMPDX= 6.0         $$ Bruker NMR JCAMP-DX V2.0
##DATA TYPE= NMR SPECTRUM
##DATA CLASS= NTUPLES
##ORIGIN= UXNMR, Bruker Analytische Messtechnik GmbH
##OWNER= root
$$ XWIN-NMR		Version 3.5
$$ Thu Jan  9 13:56:43 2025 Russian Standard Time (UT+4h)  she@DPX200
##.OBSERVE FREQUENCY= 81.013821
##.OBSERVE NUCLEUS= ^31P
##.ACQUISITION MODE= SIMULTANEOUS
##.ACQUISITION SCHEME= undefined
##.AVERAGES= 24
##.DIGITISER RES= 17
##SPECTROMETER/DATA SYSTEM= spect
##.PULSE SEQUENCE= zgpg30
##.SOLVENT NAME= D2O
##.SHIFT REFERENCE= (INTERNAL, D2O, 0, 198.062)
##AUDIT TRAIL= $$ (NUMBER, WHEN, WHO, WHERE, WHAT)
$$ ##TITLE= Audit trail, XWIN-NMR		Version 3.5
$$ ##JCAMPDX= 5.01
$$ ##ORIGIN= Bruker BioSpin GmbH
$$ ##OWNER= she
$$ F:/spectra/data/she/nmr/P31/2/pdata/1/auditp.txt
$$ ##AUDIT TRAIL=  $$ (NUMBER, WHEN, WHO, WHERE, WHAT)
(   1,<2025-01-09 13:55:30.06 +0400>,<she>,<DPX200>,
      <created by zg, POWCHK disabled, PULCHK disabled
       configuration hash MD5:
       00 E9 B6 7A A2 85 ED C7 34 08 36 98 17 FE 4E 26
       data hash MD5: 32K
       84 EB FB 7A FE 97 0A 3B B5 8F E6 44 07 C3 EC 47>)
(   2,<2025-01-09 13:55:34.39 +0400>,<she>,<DPX200>,
      <Start of raw data processing
       efp BC_mod = 2 LB = 1.5 FT_mod = 6 PKNL = 1 PHC0 = 2110.387 PHC1 = 98.88651 SI = 64K 
       data hash MD5: 64K
       B2 B8 BA 4D A3 64 5C C2 8C 01 3A 96 B6 3E 3F A5>)
(   3,<2025-01-09 13:55:55.50 +0400>,<she>,<DPX200>,
      <pk PHC0 = 369.5158 PHC1 = -995.6 
       data hash MD5: 64K
       A1 1B E2 EB 6F 1C FD 38 F1 C6 1B 4E CC BB 74 1D>)
(   4,<2025-01-09 13:56:11.23 +0400>,<she>,<DPX200>,
      <pk PHC0 = 2.399855 PHC1 = 0 
       data hash MD5: 64K
       FE 4C 44 EB 27 67 15 04 15 F1 0B 31 7F 01 CF 72>)
(   5,<2025-01-09 13:56:15.26 +0400>,<she>,<DPX200>,
      <abs ABSG = 5 
       data hash MD5: 64K
       A4 34 A8 2C FF B2 4F 53 3F 16 85 06 1A C3 10 89>)
$$ ##END=
$$ 
$$ hash MD5
$$ EC 48 0D FB 9D 15 FE 0C 3B EA 8E AA D6 00 2F A4
##$RELAX= 
##$RELAX= 
##$RELAX= 
##$RELAX= 
##$RELAX= 
##$RELAX= 
##$RELAX= 
##$RELAX= 
$$ Bruker specific parameters
$$ --------------------------
##$DU= <F:/spectra>
##$EXPNO= 2
##$NAME= <P31>
##$PROCNO= 1
##$TYPE= <nmr>
##$USER= <she>
##$AMP= (0..31)
100 100 100 100 100 100 100 100 100 100 100 100 100 100 100 100 100 100 
100 100 100 100 100 100 100 100 100 100 100 100 100 100 
##$AQSEQ= 0
##$AQ_mod= 1
##$AUNM= <au_zg>
##$AUTOPOS= <>
##$BF1= 81.014009
##$BF2= 200.13
##$BF3= 200.13
##$BF4= 200.13
##$BF5= 200.13
##$BF6= 200.13
##$BF7= 200.13
##$BF8= 200.13
##$BYTORDA= 1
##$CFDGTYP= 0
##$CFRGTYP= 5
##$CHEMSTR= <none>
##$CNST= (0..31)
1 1 145 1 1 1 1 1 1 1 1 1 1 1 1 1 1 1 1 1 1 1 1 1 1 1 1 1 1 1 1 1 
##$CPDPRG= <waltz16>
##$CPDPRG1= <>
##$CPDPRG2= <waltz16>
##$CPDPRG3= <>
##$CPDPRG4= <mlev>
##$CPDPRG5= <mlev>
##$CPDPRG6= <mlev>
##$CPDPRG7= <mlev>
##$CPDPRG8= <mlev>
##$CPDPRGB= <>
##$CPDPRGT= <>
##$D= (0..31)
0 1 0 0 0 0 0 0 0 0.06 0 0.03 2e-05 3e-06 0 0 0.0002 0 0 0 0 0 0 0 0 0 
$$ [...]
##$SUBNAM3= <"">
##$SUBNAM4= <"">
##$SUBNAM5= <"">
##$SUBNAM6= <"">
##$SUBNAM7= <"">
##$SUBNAM8= <"">
##$SUBNAM9= <"">
##$SW= 400.765351723535
##$SWIBOX= (0..15)
0 1 3 0 0 0 0 0 0 0 0 0 0 0 0 0 
##$SW_h= 32467.5324675325
##$TD= 32768
##$TD0= 1
##$TE= 0
##$TE2= 300
##$TE3= 300
##$TEG= 300
##$TL= (0..7)
0 120 53 12 22 120 120 120 
##$TP= (0..7)
150 150 150 150 150 150 150 150 
##$TP07= 0
##$TPNAME0= <>
##$TPNAME1= <>
##$TPNAME2= <>
##$TPNAME3= <>
##$TPNAME4= <>
##$TPNAME5= <>
##$TPNAME6= <>
##$TPNAME7= <>
##$TPOAL= (0..7)
0.5 0.5 0.5 0.5 0.5 0.5 0.5 0.5 
##$TPOFFS= (0..7)
0 0 0 0 0 0 0 0 
##$TUNHIN= 0
##$TUNHOUT= 0
##$TUNXOUT= 0
##$USERA1= <user>
##$USERA2= <user>
##$USERA3= <user>
##$USERA4= <user>
##$USERA5= <user>
##$V9= 5
##$VALIST= <valist>
##$VCLIST= <CCCCCCCCCCCCCCC>
##$VD= 0
##$VDLIST= <DDDDDDDDDDDDDDD>
##$VPLIST= <PPPPPPPPPPPPPPP>
##$VTLIST= <TTTTTTTTTTTTTTT>
##$WBST= 1024
##$WBSW= 4
##$XGAIN= (0..3)
0 0 0 0 
##$XL= 0
##$YL= 0
##$YMAX_a= 18835
##$YMIN_a= -23296
##$ZGOPTNS= <>
##$ZL1= 120
##$ZL2= 120
##$ZL3= 120
##$ZL4= 120
##$ABSF1= 198.0616
##$ABSF2= -202.7028
##$ABSG= 5
##$ABSL= 3
##$ALPHA= 0
##$AQORDER= 0
##$ASSFAC= 0
##$ASSFACI= 0
##$ASSFACX= 0
##$ASSWID= 0
##$AUNMP= <proc_1d>
##$AZFE= 0.1
##$AZFW= 0.5
##$BCFW= 0
##$BC_mod= 2
##$BYTORDP= 0
##$COROFFS= 0
##$CY= -3
##$DATMOD= 1
##$DC= 0
##$DFILT= <>
##$DTYPP= 0
##$F1P= 0
##$F2P= 0
##$FCOR= 1
##$FTSIZE= 65536
##$FT_mod= 6
##$GAMMA= 0
##$GB= 0
##$INTBC= 1
##$INTSCL= 9.790993e-09
##$ISEN= 30
##$LB= 1.5
##$LEV0= 0
##$LPBIN= 0
##$MAXI= 10000
##$MC2= 0
##$MEAN= 0
##$ME_mod= 0
##$MI= 50
##$NCOEF= 0
##$NC_proc= -6
##$NLEV= 6
##$NOISF1= 182.463
##$NOISF2= 159.3651
##$NSP= 0
##$NTH_PI= 0
##$NZP= 0
##$OFFSET= 198.0616
##$PC= 4
##$PHC0= 2482.303
##$PHC1= -896.7134
##$PH_mod= 1
##$PKNL= yes
##$PPARMOD= 0
##$PSCAL= 0
##$PSIGN= 0
##$REVERSE= no
##$SF= 81.0140089999434
##$SI= 65536
##$SIGF1= 159.3651
##$SIGF2= -187.1042
##$SINO= 113.3802
##$SIOLD= 16384
##$SREGLST= <1H.CDCl3>
##$SSB= 0
##$STSI= 65536
##$STSR= 0
##$SW_p= 32467.5324675325
##$SYMM= 0
##$S_DEV= 0
##$TDeff= 32768
##$TDoff= 0
##$TI= <>
##$TILT= no
##$TM1= 0
##$TM2= 0
##$TOPLEV= 0
##$USERP1= <user>
##$USERP2= <user>
##$USERP3= <user>
##$USERP4= <user>
##$USERP5= <user>
##$WDW= 1
##$XDIM= 65536
##$YMAX_p= 399456114
##$YMIN_p= -10778263
$$ End of Bruker specific parameters
$$ ---------------------------------
##NTUPLES= NMR SPECTRUM
##VAR_NAME=  FREQUENCY,     SPECTRUM/REAL,   SPECTRUM/IMAG
##SYMBOL=    X,             R,               I
##VAR_TYPE=  INDEPENDENT,   DEPENDENT,       DEPENDENT
##VAR_FORM=  AFFN,          ASDF,            ASDF
##VAR_DIM=   65536,         65536,           65536
##UNITS=     HZ,            ARBITRARY UNITS, ARBITRARY UNITS
##FACTOR=    0.49542278885378, 1,            1
##FIRST=     16045.7642231865, 0,            0
##LAST=      -16421.768244346, 0,            0
##MIN=       -16421.768244346, -10778263,    0
##MAX=       16045.7642231865, 399456114,    0
$$ Real data points
##PAGE= N=1
##DATA TABLE= (X++(R..R)), XYDATA
$$ [...]
44643b031438j21427K89027L15118J09424n2660q0842o198J30519K57369L03990
$$ -2031438 -2152865 -1863838 -1548720 -1439296 -1491956 -1572798 -1578996 -1448477 -1191108 -887118
44633h87118L04733L44245L80049K52122q6145m47250n71708l63416L8671L67302
$$ -887118 -582385 -238140 141909 394031 307886 -139364 -711072 -1074488 -1035817 -668515
44623f68515M24760K53031R5492J12502J61859k3625m35736p04977n01351M5203
$$ -668515 -243755 9276 104768 217270 379129 355504 -80232 -785209 -1286560 -1241357
44613a241357M26864K76248k44933o10252m69695J6219L92906L95371J59152J7117
$$ -1241357 -814493 -538245 -783178 -1393430 -1863125 -1846906 -1454000 -1058629 -899477 -882360
44603h82360J85970N92727Q75437O27816j42296q38348q48768l16692J6263j74235
$$ -882360 -696390 -103663 771774 1399590 1257294 418946 -429822 -746514 -730251 -904486
44593i04486l85797j47331K05687J06421k76373l21175j3029M0811l25586n23852
$$ -904486 -1290283 -1437614 -1231927 -1125506 -1401879 -1723054 -1736083 -1695272 -2020858 -2544710
44583b544710j78901K89075M04667L36861L95015L79938L2570l00708j43028K43938
$$ -2544710 -2723611 -2434536 -2029869 -1693008 -1297993 -918055 -885485 -1186193 -1329221 -1085283
44573a085283J94265k79542m79539j38735J73304k1641l97063l92117k8882K61443
$$ -1085283 -891018 -1170560 -1650099 -1788834 -1615530 -1637171 -2034234 -2426351 -2455233 -2193790
44563b193790L20026L35569L95984L58298J46396j06084k50825k87464k91507
$$ -2193790 -1873764 -1538195 -1142211 -783913 -637517 -743601 -994426 -1281890 -1573397
44554a573397k86475k27311p5656J21816K53375K79124K97505L81946M07430J95101
$$ -1573397 -1859872 -2087183 -2162839 -2041023 -1787648 -1508524 -1211019 -829073 -421643 -226542
44544b26542j86543m41896l99691j91588m5776m3280j09457j16339K0020K18007
$$ -226542 -413085 -854981 -1254672 -1446260 -1492036 -1535316 -1644773 -1761112 -1741092 -1523085
44534a523085K38591j4026k53957j21465K91528N18050L43179K6670j74078l29426
$$ -1523085 -1284494 -1298520 -1552477 -1673942 -1382414 -864364 -521185 -494515 -668593 -998019
44524i98019n15186n37669k68509L5916Q5814J6433J43414M13910M79716K52546
$$ -998019 -1513205 -2050874 -2319383 -2283467 -2197653 -2181220 -2037806 -1623896 -1144180 -891634
44514h91634K0035j5849k013j42769l66658m03860r9783L91375O82168M86653
$$ -891634 -871599 -887448 -889461 -1032230 -1398888 -1802748 -1902531 -1511156 -828988 -342335
44504c42335l1760l58136k13248Q6667O2878k54058l77200n6457L92722N28625
$$ -342335 -374095 -732231 -945479 -858812 -795934 -1049992 -1427192 -1483649 -1090927 -562302
44494e62302K95602l1867k26440k66428k23198j49064o6959J3911Q8675J40754
$$ -562302 -266700 -298567 -525007 -791435 -1014633 -1163697 -1230656 -1216745 -1128070 -987316
44484i87316J31472J5683j99625l81201l19575K5297L63180L47936L9736j26874
$$ -987316 -855844 -840161 -1039786 -1420987 -1740562 -1715265 -1352085 -1004149 -964413 -1091287
44474a091287Q0246L85335M21481K14961M6852L9356J15944J87433J34466j92106
$$ -1091287 -1011041 -625706 -204225 10736 57588 96944 212888 400321 534787 342681
44464C42681o70642q27731m13156J40598K49321n597q3997J15673J64067q7327
$$ 342681 -327961 -1155692 -1568848 -1428250 -1178929 -1184526 -1268523 -1152850 -988783 -1076110
44454a076110k35233l0326K18476K00324O2518K3018j1483j07448l0147K92116
$$ -1076110 -1311343 -1341669 -1123193 -922869 -860351 -837333 -848816 -956264 -986411 -694295
44444f94295M31259N9620m36033m58302q2890J01320j05134l12905k14795L6683
$$ -694295 -263036 -203416 -639449 -1097751 -1180641 -1079321 -1184455 -1497360 -1712155 -1675472
44434a675472J69673J12431p1557k25880q0844M43284R16719P93015J65020k93681
$$ -1675472 -1505799 -1393368 -1464925 -1690805 -1771649 -1328365 -411646 381369 546389 252708
44424B52708k30550j3730o7166k55600k18177M4681K57452K84375J39427j84642
$$ 252708 22158 8428 -58738 -314338 -532515 -487834 -230382 53993 193420 8778
44414H778n54361n72552l4081O02715O39828M7171m60582l56872O1603J85396
$$ 8778 -545583 -1118135 -1152216 -549501 90327 137498 -323084 -679956 -618353 -432957
44404d32957o0609k17102k3150K08260N7374l77187n53959j88871L24910L73600
$$ -432957 -493566 -710668 -733818 -525558 -468184 -845371 -1399330 -1588201 -1263291 -889691
44394h89691p7413m08531j64304L26509M24115R0013r6433J61655M37313K68383
$$ -889691 -967104 -1375635 -1539939 -1213430 -789315 -699302 -795735 -634080 -196767 71616
44384G1616j17770j83114O5969J23405j69749l63893j28549K34537K96611J52830
$$ 71616 -46154 -229268 -163299 -39894 -209643 -573536 -702085 -467548 -170937 -18107
44374a8107J78152L65111L40689l8047m99074p61730p80337n62568j09401L64020
$$ -18107 160045 525156 865845 827798 328724 -433006 -1213343 -1775911 -1885312 -1521292
44364a521292M89886K13378o6556j8909J84188J77462m4506j60402j8143J61577
$$ -1521292 -1031406 -818028 -884584 -903493 -719305 -541843 -586349 -746751 -764894 -603317
44354f03317R1646k24971m76205l44886J16429M34594K14238l05060m77991j40005
$$ -603317 -511671 -736642 -1212847 -1557733 -1441304 -1006710 -792472 -1097532 -1575523 -1715528
44344a715528J14531j86657o16731m32742L15520Q64081Q45593O63728O51003
$$ -1715528 -1600997 -1787654 -2404385 -2837127 -2521607 -1657526 -811933 -148205 502798
44335E02798N25467K8657m55762m40049j26901r0381l52707l72001O3286M81088
$$ 502798 1028265 1056922 601160 161111 34210 -56171 -408878 -780879 -717593 -236505
44325b36505M15116J2269k77030k92479j86748q8801k8980o3064j97473k52634
$$ -236505 178611 190880 -86150 -378629 -565377 -654178 -683158 -746222 -943695 -1196329
44315a196329n0456K65958L25645J188l87365m37390j22446K16689K80408J08763
$$ -1196329 -1246785 -980827 -655182 -653994 -1041359 -1478749 -1601195 -1384506 -1104098 -995335
44305i95335k9035K2485J28268N9313j63274k41849p396K66099J64714k66690
$$ -995335 -1024370 -1001885 -873617 -814304 -977578 -1219427 -1226823 -960724 -796010 -1062700
44295a062700n02328k33163J69537J45147k66204m73757j57731L18944M44216
$$ -1062700 -1565028 -1798191 -1628654 -1483507 -1749711 -2223468 -2381199 -2062255 -1618039
44286a618039K00400n3284j32134j61893k36227k31974l3387K45874L70426K31568
$$ -1618039 -1417639 -1470923 -1603057 -1764950 -2001177 -2233151 -2266538 -2020664 -1650238 -1418670
44276a418670p0760l32145l84287j89030J31935L51685K78244p6339m33003m37722
$$ -1418670 -1489430 -1821575 -2205862 -2394892 -2262957 -1911272 -1633028 -1709367 -2142370 -2580092
44266b580092l1555M11202M60677J35272j47096j24553M2957J32591J89050L04799
$$ -2580092 -2611647 -2200445 -1739768 -1604496 -1751592 -1876145 -1833188 -1700597 -1511547 -1206748
44256a206748L41307J67682j9281L2590J62598o225m42647o83831m83218j04466
$$ -1206748 -865441 -697759 -717040 -684450 -521852 -528077 -970724 -1654555 -2137773 -2242239
44246b242239J29403K18447K67031K26599P8218l094R2368J97807J36120n28m6949
$$ -2242239 -2112836 -1894389 -1627358 -1400759 -1322541 -1325635 -1233267 -1035460 -899340 -899868 -946817
44235i46817l7452n5367j5363J38084J95675n0141m27605n69880l88461r8659
$$ -946817 -984269 -1039636 -1054999 -916915 -721240 -771381 -1198986 -1768866 -2157327 -2255986
44225b255986J21443K16737J16678j57605l28305j59428J25533J03443j83300
$$ -2255986 -2134543 -1917806 -1801128 -1958733 -2287038 -2446466 -2320933 -2217490 -2400790
44216b400790k43953J10233M63415M08461Q0666j47084j77173j30467m0455J07448
$$ -2400790 -2644743 -2534510 -2071095 -1662634 -1581968 -1729052 -1906225 -2036692 -2077147 -1969699
44206a969699K12389J85894R7644J312j88754m30721m02641O8046O00286O52156
$$ -1969699 -1757310 -1571416 -1473772 -1472460 -1661214 -2091935 -2494576 -2426530 -1826244 -1174088
44196a174088K31529j40627j38517N4992J62399J76916J93978J69101K6461j63044
$$ -1174088 -942559 -1083186 -1221703 -1166711 -1004312 -827396 -633418 -464317 -437856 -600900
44186f00900k62498k27498j06477J5375L3827r0366k35203k35258j11288l1937
$$ -600900 -863398 -1090896 -1197373 -1181998 -1148171 -1238537 -1473740 -1708998 -1820286 -1852223
44176a852223l9856q632R2102J07777l5424j75516j40595M3195K74656N13660
$$ -1852223 -1892079 -1900711 -1808609 -1700832 -1736256 -1911772 -2052367 -2009172 -1734516 -1220856
44166a220856O58837N02652K3076m32635m91780j93858J17368K37875K15427J17271
$$ -1220856 -562019 -59367 -36291 -468926 -960706 -1154564 -1037196 -799321 -583894 -466623
44156d66623k8923r4059M8541K34307J15123l28358o42788m56144K1666K79887
$$ -466623 -495546 -589605 -541064 -306757 -191634 -519992 -1162780 -1618924 -1597258 -1317371
44146a317371J59407l5454l1622Q4383J07510N4884Q7627K06003K27277O8008
$$ -1317371 -1157964 -1193418 -1225040 -1140657 -1033147 -978263 -890636 -684633 -457356 -389348
44136c89348j17781j48166m8033J9091j3147n0726M131J12666J30952l3424k70216
$$ -389348 -507129 -655295 -703328 -684237 -697384 -748110 -743979 -631313 -500361 -533785 -804001
44125h04001k95745M1201M59930M62334k0829m32899l00550P7454N7543l66200
$$ -804001 -1099746 -1058545 -598615 -136281 -157110 -590009 -890559 -813105 -755562 -1121762
44115a121762n51790k15750J60445J61927P6161K66444M38186J55834k69514j59464
$$ -1121762 -1673552 -1889302 -1728857 -1566930 -1490769 -1224325 -786139 -630305 -899819 -1059283
44105a059283M06284O15635J41936l82543l48866r159M2078k39467m18776k71296
$$ -1059283 -652999 -37364 104572 -277971 -626837 -635996 -593918 -833385 -1252161 -1523457
44095a523457K447J22167J056k39175l48770j61409J58448K47805K2045k00356
$$ -1523457 -1521010 -1398843 -1397787 -1636962 -1985732 -2147141 -1988693 -1740888 -1718843 -1919199
44085a919199j57172L6697J66863K26791K57445J65039o9483k46837k34335j48204
$$ -1919199 -2076371 -2039674 -1872811 -1646020 -1388575 -1223536 -1293019 -1539856 -1774191 -1922395
44075a922395o0624J65579N20946O84869N15305L32175L53732K57883k15288o19351
$$ -1922395 -1983019 -1817440 -1296494 -611625 -96320 235855 589587 847470 632182 12831
44065A2831l94288J76211L18835o0704l10881j19698R0450j6589j79764j04909
$$ 12831 -381457 -205246 113589 52885 -257996 -377694 -287244 -303833 -483597 -588506
44055e88506N1528O5662L2044P6998R5267K0078k5629m1274j98177m02853k88632
$$ -588506 -536978 -471316 -439272 -362274 -267007 -246929 -272558 -313832 -512009 -914862 -1203494
44044a203494J41310L79386J93511m89J21917K60326J25536J3982J78860J95223
$$ -1203494 -1062184 -682798 -489287 -489776 -367859 -107533 18003 31985 210845 406068
44034D06068l18265q12624n17324K59815M87629m2133m87515l44030r5724j96815
$$ 406068 87803 -724821 -1242145 -982330 -494701 -536834 -1024349 -1368379 -1464103 -1660918
44024a660918k94713K5228M18035L25359j22135l54351k00574P6541L42663O19791
$$ -1660918 -1955631 -1930403 -1512368 -1187009 -1309144 -1663495 -1864069 -1787528 -1444865 -825074
44014h25074O95281K90101l57698n89317j57463M13123M82548L1222m60478o42888
$$ -825074 -129793 160308 -197390 -786707 -944170 -531047 -48499 -17277 -477755 -1120643
44004a120643n57364l84823k03015k1075J30342K36511L33332M17655L83742J52694
$$ -1120643 -1678007 -2062830 -2265845 -2286920 -2156578 -1920067 -1586735 -1169080 -785338 -632644
43994f32644j57092l04817j99621l001Q3476M4274O252M9830J35677J66354P9732
$$ -632644 -789736 -1094553 -1294174 -1297175 -1213699 -1169425 -1163173 -1113343 -977666 -811312 -731580
43983g31580n2945j9970K97129O50493N92080K5345o11472q64045p47060n20912
$$ -731580 -784525 -804495 -507366 143127 735207 760552 149080 -714965 -1462025 -1982937
43973a982937k53609P6737K80049J91215O7467K57215N35077L30049l19984o44259
$$ -1982937 -2236546 -2159809 -1879760 -1688545 -1621078 -1363863 -828786 -498737 -818721 -1462980
43963a462980k06668M47582N80007K39491o857K4536M3741r0923k04942k16743
$$ -1462980 -1669648 -1222066 -642059 -402568 -409425 -384889 -341148 -432071 -637013 -853756
43953h53756k39169k41664k9904L50242N48653L79250O3329j21365j76670k29830
$$ -853756 -1092925 -1334589 -1364493 -1014251 -465598 -86348 -23019 -144384 -321054 -550884
43943e50884k76284k49751j81531j27318o0849J9852m101k11240m53005m66228
$$ -550884 -827168 -1076919 -1258450 -1385768 -1446617 -1426765 -1430866 -1642106 -2095111 -2561339
43933b561339j54216L13870O49125O54312L66153L8937q5966l3394k6938j41053
$$ -2561339 -2715555 -2401685 -1752560 -1098248 -732095 -693158 -779124 -812518 -839456 -980509
43923i80509j75312K5035K81563K99503P9014j04936j04742n5458q6666r9027
$$ -980509 -1155821 -1130786 -849223 -549720 -470706 -575642 -680384 -735842 -822508 -921535
43913i21535M3377K52011L11951J61298q0225l06061m81063n32681l80944j21808
$$ -921535 -878158 -626147 -314196 -152898 -233123 -539184 -1020247 -1552928 -1933872 -2055680
43903b055680L166p4084j10193J16109M43160N02683K27159l2608L6936L00063
$$ -2055680 -2052514 -2126598 -2236791 -2120682 -1677522 -1174839 -947680 -980288 -943352 -643289
43893f43289L40043l1404n48537p73578n39612r2894J85613J73331Q8780J85280
$$ -643289 -303246 -334650 -883187 -1656765 -2196377 -2289271 -2103658 -1930327 -1841547 -1656267
43883a656267M39193O01210M88400J34619k81981n33062m28595j0026L49129K63902
$$ -1656267 -1217074 -615864 -127464 7155 -274826 -807888 -1236483 -1246509 -897380 -633478
43873f33478j69800m20148j81927K11956K36212j32098m23343l07979M8840K82080
$$ -633478 -803278 -1223426 -1405353 -1193397 -957185 -1089283 -1512626 -1820605 -1771765 -1489685
43863a489685K41997L6103j64765k49737k06423j34122j49725k17173j49639J45311
$$ -1489685 -1247688 -1211585 -1376350 -1626087 -1832510 -1966632 -2116357 -2333530 -2483169 -2337858
43853b337858M94886O28354M76131K13479K7710n8439j10117j21961k5879J60893
$$ -2337858 -1842972 -1214618 -738487 -525008 -497298 -555737 -665854 -787815 -813694 -652801
43843f52801K89076K31539L6154j47346k68101m00855n55389n81768l62198k4167
$$ -652801 -363725 -132186 -96032 -243378 -511479 -912334 -1467723 -2049491 -2411689 -2435856
43833b435856J68537J29524L7819Q2178K15852K36323N7270j81053k75056j74465
$$ -2435856 -2267319 -2137795 -2099976 -2017798 -1801946 -1565623 -1508353 -1689406 -1964462 -2138927
43823b138927j818J21009K08753L41032M94119N28612L68946J20563n4419j27482
$$ -2138927 -2140745 -2019736 -1810983 -1469951 -975832 -447220 -78274 42289 -12130 -139612
43813a39612j84934k45403k08426k0605J99122K81718K10974J09274K7503j34320
$$ -139612 -324546 -569949 -778375 -798980 -599858 -318140 -107166 2108 29611 -104709
43803a04709m28365o71182n95524j91085K36675L97789K95087R9574j20765l95267
$$ -104709 -533074 -1204256 -1799780 -1990865 -1754190 -1356401 -1061314 -961740 -1082505 -1477772
43793a477772o44096o64550l51655J73615O56731Q49054O28139J45398j94255
$$ -1477772 -2121868 -2786418 -3138073 -2964458 -2307727 -1458673 -830534 -685136 -879391
43784h79391j19439J39059J02205l07167o43900n50248j74818J73511M49961O73721
$$ -879391 -998830 -859771 -757566 -1064733 -1708633 -2258881 -2433699 -2260188 -1810227 -1136506
43774a136506O18348J25866m50875n90293l29047j87522l59980m68239k39341
$$ -1136506 -518158 -392292 -843167 -1433460 -1762507 -1950029 -2310009 -2778248 -3017589
43765c017589O9970J80104K64612N25519O51388K27130m85112p34053k71003L37574
$$ -3017589 -2947619 -2767515 -2502903 -1977384 -1325996 -1098866 -1583978 -2318031 -2589034 -2251460
43755b251460N20541L81527L21802L62441K34577n8039k01792q2884L3274p3435
$$ -2251460 -1730919 -1349392 -1027590 -665149 -430572 -488611 -690403 -773287 -740013 -813448
43745h13448k52995k30679K0374L05744M61165M28350K08614r1760k63101k03708
$$ -813448 -1066443 -1297122 -1276748 -971004 -509839 -81489 127125 35365 -227736 -431444
43735d31444o0622j9027n1664m8438p2144k37965m23643l96249j93333n5744J5464
$$ -431444 -492066 -511093 -562757 -611195 -683339 -921304 -1344947 -1741196 -1934529 -1990273 -1974809
43724a974809K54765O16109O84710K89251j96469m17041n05974o56131o18462
$$ -1974809 -1720044 -1103935 -419225 -129974 -326443 -743484 -1249458 -1905589 -2524051
43715b524051j22745M86304O09554K47549p0438j27640j88154l26539k46620P8411
$$ -2524051 -2646796 -2160492 -1550938 -1303389 -1373827 -1501467 -1689621 -2016160 -2262780 -2184369
43705b184369K15103O2j04545K32401N88651M03864j45301m07027j63702K17722
$$ -2184369 -1969266 -1969204 -2073749 -1841348 -1252697 -848833 -994134 -1401161 -1564863 -1347141
43695a347141M06360M12717L34033K03800Q9124K5350j01493l34120m31761k10453
$$ -1347141 -940781 -528064 -194031 9769 98893 124243 22750 -311370 -743131 -953584
43685i53584N6489J652j96318n9196L37196L62378j82382o75537n72010j73592
$$ -953584 -897095 -895443 -1091761 -1150957 -813761 -451383 -633765 -1309302 -1881312 -2054904
43675b054904p9561k61805k09306K14320N79932N31002J98582p4737j21385J1623
$$ -2054904 -2134465 -2396270 -2605576 -2391256 -1811324 -1280322 -1081740 -1156477 -1277862 -1266239
43665a266239J84427K52190J75926P8196R1113J78656K05185J02413j34496m72703
$$ -1266239 -1081812 -829622 -653696 -575500 -484387 -305731 -100546 1867 -132629 -605332
43655f05332p07737n08617J20812O00158L88037k37303m62645k6109M69189M66949
$$ -605332 -1313069 -1821686 -1700874 -1100716 -712679 -949982 -1412627 -1438736 -969547 -502598
43645e02598J76084P4399J40736M3735j95328k60680j45309j80659m37800n46538
$$ -502598 -326514 -252115 -111379 -67644 -262972 -523652 -668961 -849620 -1287420 -1833958
43635a833958k38120K69834N74764N19981K17644j10866k13299K3734L58580L82341
$$ -1833958 -2072078 -1802244 -1227480 -707499 -489855 -600721 -814020 -790286 -431706 -49365
43625d9365M5416k47964j99176J6329J19542J45241K02677J20807k54804o08389
$$ -49365 -3949 -251913 -451089 -434760 -315218 -169977 32700 153507 -101297 -709686
43615g09686m80861J1183K65924N0130k05075j05705J49689J76112K078q2484
$$ -709686 -1190547 -1179364 -913440 -863310 -1068385 -1174090 -1024401 -848289 -846211 -928695
43605i28695l1595k0512n7126J3349J66204K01338R3851K0026q645k00324n46955
$$ -928695 -960290 -980802 -1037928 -1024579 -858375 -657037 -563186 -543160 -551805 -752129 -1299084
43594a299084o66021l28721J01733J01658k59349l71297P5139O37171O76405J43012
$$ -1299084 -1965105 -2293826 -2192093 -2090435 -2349784 -2721081 -2645942 -2008771 -1332366 -1189354
43584a189354m12408n00470j64086J85192K46226J07950R6151L36970N17065K36788
$$ -1189354 -1601762 -2102232 -2266318 -2081126 -1834900 -1726950 -1630799 -1293829 -776764 -539976
43574e39976l80464o99875l67098J78071K86255j9935j80183P229J65907P0565
$$ -539976 -920440 -1620315 -1987413 -1809342 -1523087 -1543022 -1723205 -1715976 -1550069 -1479504
43564a479504K2328K45806M09753J44943l15138m49578j74168J58800L01501K56171
$$ -1479504 -1457176 -1211370 -801617 -656674 -971812 -1421390 -1595558 -1436758 -1135257 -879086
43554h79086M8307k25793k60482J01666M61820K83461l13367o51380m07977M7472
$$ -879086 -830779 -1056572 -1317054 -1215388 -753568 -470107 -783474 -1434854 -1842831 -1795359
43544a795359K89676L20099K79098J53839q314o277J51396J51095j20277l35184
$$ -1795359 -1505683 -1185584 -906486 -752647 -760961 -767238 -615842 -464747 -585024 -920208
43534i20208k59207j64398l67003o54585n75167j09080L24944M26841K64694N2250
$$ -920208 -1179415 -1343813 -1710816 -2365401 -2940568 -3049648 -2724704 -2297863 -2033169 -1980919
43524a980919m8952L0099J92940K00169n8092l84397m97700l21079M6838M54801
$$ -1980919 -2029871 -1999772 -1806832 -1606663 -1664755 -2049152 -2546852 -2867931 -2821093 -2366292
43514b366292O79917N41576K00459O2662J87661J32925l22183o72706l54836L67897
$$ -2366292 -1686375 -1144799 -944340 -881678 -694017 -561092 -883275 -1555981 -1910817 -1542920
43504a542920P18891M51935M0407j05093n8863J1178J30769K70861K41443K4114
$$ -1542920 -824029 -372094 -331687 -436780 -495643 -484465 -353696 -82835 158608 182722
43494A82722j14513j3975J40333J12828p6653k61698l36307k58494m2927J70900
$$ 182722 68209 54234 194567 307395 230742 -30956 -367263 -625757 -668684 -497784
43484d97784K17936J18647K1807n1354j87026l26629l09368j73951j19544j33953
$$ -497784 -279848 -161201 -139394 -190748 -377774 -704403 -1013771 -1187722 -1307266 -1441219
43474a441219R311L03519M12399J88694l0970J01820M11207M17765j5406n04485
$$ -1441219 -1431908 -1128389 -715990 -527296 -558266 -456446 -45239 372526 357120 -147365
43464a47365n96007k33235K48349M97426M58471L01202J17619j41765l98663l70943
$$ -147365 -743372 -976607 -728258 -230832 227639 528841 646460 504695 106032 -264911
43454b64911L0292M26845L77402o5410m63227n23889k52151K46491P45394Q44444
$$ -264911 -234619 192226 569628 504218 40991 -482898 -735049 -488558 256836 1101280
43444A101280L80899k15221m28420l84610n26907p14032l93067L03283M97175
$$ 1101280 1482179 1266958 838538 453928 -72979 -787011 -1180078 -876795 -379620
43435c79620j07501o50903l65741K87916L81750j03394l93382j14313L42342N30439
$$ -379620 -487121 -1138024 -1503765 -1215849 -834099 -937493 -1330875 -1445188 -1102846 -572407
43425e72407M12798J26630k14077m34839l90328j77603p173Q7119J74803J91717
$$ -572407 -159609 -32979 -247056 -681895 -1072223 -1249826 -1256999 -1169880 -995077 -803360
43415h03360O2560o0603P667J52160J28855j4407j9068J19148R4049k51443o49098
$$ -803360 -740800 -801403 -793736 -641576 -512721 -527128 -546196 -427048 -332999 -584442 -1233540
43404a233540o82495k46271L00759M48658Q7110l09246k51591Q5934J34194j55398
$$ -1233540 -1916035 -2162306 -1861547 -1412889 -1325779 -1635025 -1886616 -1800682 -1666488 -1821886
43394a821886k25889J08676K65751j35180n28002k26845M77116P46573M09415
$$ -1821886 -2047775 -1939099 -1673348 -1808528 -2336530 -2563375 -2086259 -1339686 -930271
43385i30271K1821q2467r5816j74294k22996k27031k44334j21971K51103N21280
$$ -930271 -908450 -990917 -1086733 -1261027 -1484023 -1711054 -1955388 -2077359 -1826256 -1304976
43375a304976K91141j47987j63247K09893L26070K859k28683n9131J67201J62720
$$ -1304976 -1013835 -1161822 -1325069 -1115176 -789106 -786247 -1014930 -1074061 -906860 -744140
43365g44140J25722J80483N3142l47583o07655m29192p5883J20796K08068K65928
$$ -744140 -618418 -437935 -384793 -732376 -1340031 -1769223 -1845106 -1724310 -1516242 -1250314
43355a250314J37167j56381k36760K1173J93118K081j82871K2666L65366M20391
$$ -1250314 -1113147 -1269528 -1506288 -1485115 -1291997 -1289916 -1472787 -1450121 -1084755 -664364
43345f64364K79350K41771J96308j14259m92287n21798k22092L8379J25239J75760
$$ -664364 -385014 -143243 53065 -61194 -553481 -1075279 -1297371 -1258992 -1133753 -957993
43335i57993J96750O7095j47786k43962j52515Q4909M21359O55519M81218l0172
$$ -957993 -761243 -694148 -841934 -1085896 -1238411 -1153502 -732143 -76624 404594 374422
43325C74422l58191k70039j85561l94352m52826J6565M50719J22640n74283o12714
$$ 374422 16231 -253808 -439369 -833721 -1286547 -1269982 -819263 -696623 -1270906 -1883620
43315a883620N7460M41216J02390k25860N9658M90592M07507M474j50551p6208
$$ -1883620 -1826160 -1384944 -1282554 -1508414 -1448756 -958164 -550657 -546183 -696734 -772942
43305g72942j76075m30878m43469j30774J57742J56004o7314l16055m22239k69740
$$ -772942 -949017 -1379895 -1823364 -1954138 -1796396 -1640392 -1707706 -2023761 -2446000 -2715740
43295b715740O8918K95085K16289J9926j2307O0162k7897k51667k66457P4570
$$ -2715740 -2646822 -2351737 -2135448 -2115522 -2127829 -2067667 -2095564 -2347231 -2613688 -2539118
43285b539118M44564M29656M3222k96198k50656Q8235L41550K51510r7538m09029
$$ -2539118 -2094554 -1664898 -1621676 -1917874 -2168530 -2080295 -1738745 -1487235 -1584773 -1993802
43275a993802m39594j60945K21083L90873K04878r6976j12362K10944M62117K99553
$$ -1993802 -2433396 -2594341 -2373258 -1982385 -1777507 -1874483 -1986845 -1775901 -1313784 -1014231
43265a014231q9844k58094o4028K54561M42562M08206J52273k04627l88939k34120
$$ -1014231 -1104075 -1362169 -1426197 -1171636 -729074 -320868 -168595 -373222 -762161 -996281
43255i96281O9355K15315J93573K05386K64713J93966l3515k49605l56745l67595
$$ -996281 -926926 -711611 -518038 -312652 -47939 146027 112512 -137093 -493838 -861433
43245h61433k58699p4390m8379k65197l54955J3413M68363L50581k42090m91998
$$ -861433 -1120132 -1194522 -1242901 -1508098 -1863053 -1849640 -1381277 -1030696 -1272786 -1764784
43235a764784o0358M25505L48004n3158j89419K5551K59153L04939J47599j87467
$$ -1764784 -1825142 -1399637 -1051633 -1104791 -1294210 -1268659 -1009506 -704567 -556968 -744435
43225g44435m99394m50490n8551K00613R2527L637K44543M48891J95583j88574
$$ -744435 -1243829 -1694319 -1752870 -1552257 -1459730 -1456093 -1211550 -762659 -567076 -755650
43215g55650j03924L28291M48799R2925k48218k69965k07263k71595l10761j80932
$$ -755650 -859574 -531283 -82484 10441 -237777 -507742 -715005 -986600 -1297361 -1478293
43205a478293M502J45967K93365M00769L06095N0347j22763j57009k27930l38479
$$ -1478293 -1473791 -1327824 -1034459 -633690 -327595 -277248 -400011 -557020 -784950 -1123429
43195a123429k50286P5587L34787L20461J86858J27388Q7485m2073j98858k68094
$$ -1123429 -1373715 -1298128 -963341 -642880 -456022 -328634 -241149 -283222 -482080 -750174
43185g50174k34925j30729j1688m182j45512k16393k8437J85532O8952k12031
$$ -750174 -985099 -1115828 -1127516 -1131698 -1277210 -1493603 -1522040 -1336508 -1267556 -1479587
43175a479587j40112K74442L85967r6305o01826n47342j62234J2189K737J97738
$$ -1479587 -1619699 -1345257 -959290 -1055595 -1657421 -2204763 -2366997 -2354808 -2352071 -2154333
43165b154333N59774O71516M37609J75850N2515o9349k24764k65499k17753k74014
$$ -2154333 -1594559 -923043 -485434 -309584 -257069 -326418 -551182 -816681 -1034434 -1308448
43155a308448l66594j95749K02765L64285P2658k65277k05145Q9678J26849j96229
$$ -1308448 -1675042 -1870791 -1668026 -1303741 -1231083 -1496360 -1701505 -1611827 -1484978 -1681207
43145a681207n04649m82554j78800K02465N23261O61574M82862J5564m58496o30066
$$ -1681207 -2185856 -2668410 -2847210 -2644745 -2121484 -1459910 -977048 -961484 -1419980 -2050046
43135b050046m54619j47373P8355J89756K69380L61088M09655L07960M828l68360
$$ -2050046 -2504665 -2652038 -2573683 -2383927 -2114547 -1753459 -1343804 -1035844 -1031016 -1399376
43125a399376n03361k01960K95430M64123J22035k95620l26446j46291k50815
$$ -1399376 -1902737 -2104697 -1809267 -1345144 -1223109 -1518729 -1845175 -1991466 -2242281
43116b242281n80822n15231J47288P62455P27105L22589J99476L79816L69566
$$ -2242281 -2823103 -3338334 -3191046 -2428591 -1701486 -1378897 -1179421 -799605 -430039
43107d30039O2710j39097j01535j86486n29901o85276l22396J80682K74096N4734
$$ -430039 -367329 -506426 -607961 -794447 -1324348 -2009624 -2332020 -2151338 -1877242 -1822508
43097a822508P5123M76666P71689N23456r8327n63614n75227k75590L4732K27358
$$ -1822508 -1747385 -1270719 -499030 24426 -73901 -637515 -1212742 -1488332 -1453600 -1226242
43087a226242L52503M07243K70918m9151k77259j85146N2954Q7512q6153j63872
$$ -1226242 -873739 -466496 -195578 -244729 -521988 -707134 -654180 -566668 -652821 -816693
43077h16693p1495n7556j69089r7526K42810M40050K17822p4124l0621J18466
$$ -816693 -888188 -945744 -1114833 -1212359 -969549 -529499 -311677 -385801 -416422 -297956
43067b97956p0135m22852l88395K0441K10164k7231j89210J00938M98167M81199
$$ -297956 -368091 -790943 -1179338 -1158897 -948733 -975964 -1165174 -1064236 -566069 -84870
43057h4870P2373l08678m06862k67351n0607N8658l5095j57324l5122K33952K12982
$$ -84870 -12497 -321175 -728037 -995388 -1045995 -987337 -1022432 -1179756 -1214878 -980926 -767944
43046g67944k02565n16629l08893J55292L26065J07639j62829k58633k17963j06862
$$ -767944 -970509 -1487138 -1796031 -1640739 -1314674 -1207035 -1369864 -1628497 -1846460 -1953322
43036a953322L0498Q5365J9163l1318M548j9303j46571j18646K03337N08543N05982
$$ -1953322 -1922824 -1837459 -1818296 -1849614 -1845066 -1864369 -2010940 -2129586 -1926249 -1417706 -911724
43025i11724M24471N75364O99696L38740l32283o84883n62420l71469k86493p3365
$$ -911724 -487253 88111 787807 1126547 794264 109381 -453039 -824508 -1111001 -1184366
43015a184366K27095J87238k17137m02227q7145K19322M1616l17626l26669l9477
$$ -1184366 -957271 -770033 -987170 -1389397 -1476542 -1257220 -1215604 -1533230 -1859899 -1899376
43005a899376J58647K33464L76541M74148K54334j82426m46508l79560j32071
$$ -1899376 -1740729 -1507265 -1130724 -656576 -402242 -584668 -1031176 -1410736 -1542807
42996a542807J34155K70838N6070n02772r08403o46563J23232P13301P15209L49790
$$ -1542807 -1408652 -1137814 -1081744 -1584516 -2492919 -3139482 -3016250 -2302949 -1587740 -1237950
42986a237950O1013P1972L19127N52651N14306K15569l3696l8152J4557r2834
$$ -1237950 -1176937 -1104965 -785838 -233187 281119 496688 462992 424840 439397 346563
42976C46563k28387j89438j15378k36055m13931l69022j87757j37707j22986J45045
$$ 346563 118176 -71262 -186640 -422695 -836626 -1205648 -1393405 -1531112 -1654098 -1509053
42966a509053N19557N36822J71982r4474m9120k2918k29331l57853j05564K98608
$$ -1509053 -989496 -452674 -280692 -375166 -424286 -447204 -676535 -1034388 -1139952 -841344
42956h41344M02782Q3830m30436q35267q79269m94772L0684K61462J37921N0470
$$ -841344 -438562 -354732 -785168 -1620435 -2499704 -2994476 -2963792 -2702330 -2564409 -2513939
42946b513939K72604N88027O21360K97994j47328m00359k41677K49741O22017
$$ -2513939 -2241335 -1653308 -1031948 -733954 -881282 -1281641 -1523318 -1273577 -651560
42937f51560M78806K4324j59896P2196K44925j0116m60386o74505n33977j73896
$$ -651560 -172754 -148430 -308326 -236130 8795 -1321 -461707 -1136212 -1670189 -1844085
42927a844085K12986L53121O5265l78973m69892j75350K4911l8830L8018M20132
$$ -1844085 -1631099 -1277978 -1212713 -1591686 -2061578 -2236928 -2212017 -2250847 -2212829 -1792697
42917a792697O13427K97211l9216J28434M59808K97382k64831n64857l85264j11402
$$ -1792697 -1179270 -882059 -921275 -792841 -333033 -35651 -300482 -865339 -1250603 -1362005
42907a362005j8551r203J3697L1437J02709K44353K45287p560k24497j46281j114
$$ -1362005 -1380556 -1389759 -1376062 -1344625 -1241916 -997563 -752276 -759836 -984333 -1130614 -1131728
42896a131728o2509j06223J09124K10844j86783n91405k57345N08298O86478J42028
$$ -1131728 -1194237 -1300460 -1191336 -980492 -1167275 -1758680 -2016025 -1507727 -821249 -679221
42886f79221k08354N4914K69131n581k03938J34227M43391J01614m40622l77715
$$ -679221 -887575 -832661 -563530 -569111 -773049 -638822 -195431 -93817 -534439 -912154
42876i12154J42912L24029n657k77965j91408n3166j16761k15457j44076N4963
$$ -912154 -769242 -445213 -450870 -728835 -920243 -973409 -1090170 -1305627 -1449703 -1394740
42866a394740K48077L08369Q9720l47920n57793j55189N63403Q52027M32979j63677
$$ -1394740 -1146663 -838294 -748574 -1096494 -1654287 -1809476 -1246073 -394046 38933 -124744
42856a24744k95917L4677K94431J20665k72958l97924j14572J63241o270m58001
$$ -124744 -420661 -385984 -91553 29112 -243846 -641770 -756342 -593101 -599371 -1057372
42846a057372n78287j30694L95291M31337N1699k03932m0445L26662N13336L54859
$$ -1057372 -1635659 -1766353 -1371062 -939725 -888026 -1091958 -1132403 -805741 -292405 62454
42836F2454L105k26148j57702M0647P2776q2978k03523k25067k73969k71847L3572
$$ 62454 65559 -160589 -318291 -277644 -204868 -287846 -491369 -716436 -990405 -1262252 -1228680
42825a228680N07298O08282J96053j59187m9205J04570k17274o79000n46642J65673
$$ -1228680 -721382 -113100 82953 -76234 -125439 -20869 -238143 -917143 -1463785 -1298112
42815a298112P06323O38946K48589p2796k50732l01004k10563j21363j88572k29914
$$ -1298112 -591789 47157 295746 222950 -27782 -328786 -539349 -660712 -849284 -1079198
42805a079198L4879M00466L48799j37723m72370l12402o50N1102m5390L2662K73410
$$ -1079198 -1044319 -643853 -295054 -432777 -905147 -1217549 -1218199 -1167097 -1212487 -1179825 -906415
42794i06415M09606L18288R8008j01226j74886j23517q1794j51062k30130k01063
$$ -906415 -496809 -178521 -80513 -181739 -356625 -480142 -561936 -712998 -943128 -1144191
42784a144191j77281k77289k87959L2707M17848L72613k9604k05682K7685K25607
$$ -1144191 -1321472 -1598761 -1886720 -1854013 -1436165 -1063552 -1093156 -1298838 -1271153 -1045546
42774a045546J38767R1673K57545K32745k16302n72660l08352K47076L98014J16830
$$ -1045546 -906779 -815106 -557561 -324816 -541118 -1113778 -1422130 -1175054 -777040 -660210
42764f60210n3978O7381J07300j74717n48382p05929n78700k26796K39611N99677
$$ -660210 -714188 -646807 -539507 -714224 -1262606 -1968535 -2547235 -2774031 -2534420 -1934743
42754a934743O71854N37663L89385K14164j15669n01785o45065l99962R0093N49005
$$ -1934743 -1262889 -725226 -335841 -121677 -237346 -739131 -1384196 -1784158 -1694065 -1145060
42744a145060P00971M04063j25861l93266j84814J21165R2352j20014o0534K82791
$$ -1145060 -444089 -40026 -165887 -559153 -743967 -622802 -530450 -650464 -710998 -428207
42734d28207M70782K94529J1765j23756j57871j79452j26178K3820J26419N3987
$$ -428207 42575 337104 348869 225113 67242 -112210 -238388 -214568 -88149 -34162
42724c4162j54259l42339l09943N7879N39190O32147J61435l59310l56273l189
$$ -34162 -188421 -530760 -840703 -782824 -243634 388513 549948 190638 -165635 -168824
42714a68824Q9448j54233k37048l944J00428j47481l41621j71546L6556p4161
$$ -168824 -79376 -233609 -470657 -474601 -374173 -521654 -863275 -1034821 -998265 -1072426
42704a072426k39288l8262L46803L85171J1105l17264k83097j6176K27030L32548
$$ -1072426 -1311714 -1349976 -1003173 -618002 -606897 -924161 -1207258 -1223434 -996404 -663856
42694f63856K78379J02962m7963l8426Q8535J77816J40663j6749k11155k49191
$$ -663856 -385477 -282515 -330478 -368904 -280369 -102553 38110 21361 -189794 -438985
42684d38985R209L33681K54171k81186o84426m73762M0897K16267j6339j91984
$$ -438985 -429776 -96095 158076 -123110 -807536 -1281298 -1240401 -1024134 -1040473 -1232457
42674a232457j18028p1347j72290j24832K23188N08974L41018j25993l91529k26733
$$ -1232457 -1350485 -1421832 -1594122 -1718954 -1495766 -986792 -645774 -771767 -1163296 -1390029
42664a390029J36142L38318K47077J5977j17027j12963j81095m31488n63592j80736
$$ -1390029 -1253887 -915569 -668492 -652515 -769542 -882505 -1063600 -1495088 -2058680 -2239416
42654b239416N52847R07616M49614l35793n73169m0897O11061O94035K58272j06072
$$ -2239416 -1686569 -778953 -329339 -665132 -1238301 -1279198 -668137 25898 284170 178098
42644A78098p5872N6462j10861m63369n11406j11272K93144L10607J74987L33329
$$ 178098 102226 158688 47827 -415542 -926948 -1038220 -745076 -434469 -259482 73847
42634G3847O61087N78749m1708n98679n93219l03056k82176n18033n44718k29247
$$ 73847 734934 1313683 1271975 673296 80077 -222979 -505155 -1023188 -1567906 -1797153
42624a797153N1426L2056q1210p560K03466L65357M77230N97743N92357L07637
$$ -1797153 -1745727 -1713671 -1794881 -1802441 -1598975 -1233618 -756388 -158645 433712 741349
42614G41349q8956k39474o9511J25483J13936m835p3657j61045l53383m52478
$$ 741349 652393 412919 343408 468891 582827 577992 504335 343290 -10093 -462571
42604d62571j96719K64974M44558J37952k93049m11069k54218j79219l02220l73391
$$ -462571 -659290 -394316 50242 188194 -104855 -515924 -770142 -949361 -1251581 -1624972
42594a624972j92356R6893K12462Q8964p9989r0454O2320K15457K39319J76903
$$ -1624972 -1817328 -1720435 -1507973 -1419009 -1498998 -1589452 -1527132 -1311675 -1072356 -895453
42584h95453J57622J99071J81009L4760j46633k42164k41576j77730l9106J41334
$$ -895453 -737831 -538760 -357751 -322991 -469624 -711788 -953364 -1131094 -1170200 -1028866
42574a028866K22873J23408l7408r7976o6247l2798L957M3005m8750l12225m52138
$$ -1028866 -805993 -682585 -719993 -817969 -884216 -917014 -913057 -870052 -918802 -1231027 -1683165
42563a683165j50764L97461O15397K72800k23323l68000j09100K52502M42684
$$ -1683165 -1833929 -1436468 -821071 -548271 -771594 -1139594 -1248694 -996192 -553508
42554e53508L59627Q9954q3769O7310L43591K78048j84900n12485l11579J18153
$$ -553508 -193881 -103927 -187696 -120386 223205 501253 316353 -196132 -507711 -389558
42544c89558K78799J88682J77337K38767J20838q4116j8061K68323K80661j45615
$$ -389558 -110759 77923 255260 494027 614865 530749 512688 781011 1061672 916057
42534I16057n37425m79114j87922q9106j61938r6155J08614J17704j93740n02295
$$ 916057 378632 -100482 -288404 -377510 -539448 -635603 -526989 -409285 -603025 -1105320
42524a105320m33710k3547L16271K45177j24319l21282n3827M03971N43556L26742
$$ -1105320 -1539030 -1562577 -1246306 -1001129 -1125448 -1446730 -1500557 -1096586 -553030 -226288
42514b26288K52722N80234Q27632M14456m06868p61477l09430L00850L40684o0122
$$ -226288 26434 606668 1434300 1848756 1441888 680411 370981 671831 1012515 952393
42504I52393k49423l0787J90944J38364o29n3893j80010m54626n84344m08411
$$ 952393 702970 672183 863127 1001491 1000862 946969 766959 312333 -272011 -680422
42494f80422l01291n57066o80906j3408J038924J255931L07767o18527m05160
$$ -680422 -981713 -1538779 -2219685 -2233093 -1194169 61762 369529 -248998 -654158
42485f54158M68958P19730R7614m60829l29276Q5679K08593N9202j27146l68288
$$ -654158 -185200 534530 632144 171315 -157961 -72282 136311 195513 68367 -299921
42475b99921o38842o22359j75925L30673M96071L78414K09235M397j86176n1321
$$ -299921 -938763 -1561122 -1737047 -1406374 -910303 -531889 -322654 -318257 -504433 -555754
42465e55754M85402Q80167O24341M0471j56561Q0563J52792j58322l68112j22288
$$ -555754 -70352 809815 1434156 1474627 1318066 1398629 1551421 1393099 1024987 902699
42455I02699K65162L77751L02846L29331M15082L33872J06521o5923j35820j67931
$$ 902699 1167861 1545612 1848458 2177789 2592871 2926743 3033264 2967341 2831521 2663590
42445B663590r4356J83791N10667N60359K06633l65851q68412j054767p62866
$$ 2663590 2569234 2753025 3263692 3824051 4030684 3664833 2796421 1741654 978788
42436I78788q2445N32728O07308J84564k05627k25477j35593l29583o80966o94827
$$ 978788 896343 1429071 2036379 2220943 2015316 1789839 1654246 1324663 643697 -51130
42426e1130k56033J52669J08539j86154k49186j7622J33589q056k29583k72826
$$ -51130 -307163 -154494 -45955 -232109 -481295 -498917 -365328 -373384 -602967 -875793
42416h75793j58246j0633J59875L32180L64442K09847M7566J737o2181k26967
$$ -875793 -1034039 -1044672 -884797 -552617 -188175 21672 69238 70975 8794 -218173
42406b18173k42136J05879N14512M82254M8675k26968p4258J41810M2405j97997
$$ -218173 -460309 -354430 160082 642336 691011 464043 389785 531595 574000 376003
42396C76003j86844O7922K10598O9267j67944k63284j74905J0897K02060L10716
$$ 376003 189159 257081 467679 536946 369002 105718 -69187 -58290 143770 454486
42386D54486K69428J08325l2111k4692Q4220O4438k50311o50788o33800J1225
$$ 454486 723914 832239 800128 775436 859656 924094 673783 22995 -610805 -599580
42376e99580P78735Q90872K04401n91910p88744m09684R447J46254J23009J47777
$$ -599580 179155 1070027 1274428 682518 -106226 -515910 -506463 -360209 -237200 -89423
42366h9423K30975K73856K30976J29973M0971M1530J30486J97909J67214J25950
$$ -89423 141552 415408 646384 776357 817328 858858 989344 1187253 1354467 1480417
42356A480417J99542L18305K49052j01477n09638o30554l51489Q0654K88273J19686
$$ 1480417 1679959 1998264 2247316 2145839 1636201 1005647 654158 734812 1023085 1142771
42346A142771k27260m37909l93391k06293l169K08145M46536O53833P46795P11807
$$ 1142771 915511 477602 84211 -122082 -125251 82894 529430 1183263 1930058 2641865
42336B641865O02917M80000L58290J87274q9308l98551n32566l90178j64069j30290
$$ 2641865 3244782 3724782 4083072 4270346 4181038 3782487 3249921 2859743 2695674 2565384
42326B565384k80807l41938j63384Q4575J35957q6576m27741o19845m74266r0828
$$ 2565384 2284577 1942639 1779255 1863830 1999787 1913211 1485470 865625 391359 300531
42316C00531J85502J79452J40555L46273O04515N27673K07254J32537M12030N86803
$$ 300531 486033 665485 806040 1152313 1756828 2284501 2491755 2624292 3036322 3623125
42306C623125L50904l4674k39763k96287k96736j51359N7478k9118m31895n98049
$$ 3623125 3974029 3939355 3699592 3403305 3106569 2955210 3012688 2983570 2551675 1953626
42296A953626k10260K48057K47184N8697K16567N41783M65204N6186q8876J20430
$$ 1953626 1743366 1991423 2238607 2297304 2513871 3055654 3520858 3577044 3488168 3608598
42286C608598J47417k27443n68580n09761j87917J72898N29032P38311N74847
$$ 3608598 3756015 3528572 2959992 2450231 2262314 2435212 2964244 3702555 4277402
42277D277402J82928J5343J85008L53114L39871L19597L28618J58281j39374k27725
$$ 4277402 4460330 4475673 4660681 5013795 5353666 5673263 6001881 6160162 6020788 5793063
42267E793063j01629j12695k41121l3575N30233Q58479P22641O19155P69362O15788
$$ 5793063 5691434 5578739 5337618 5304043 5834276 6692755 7415396 8034551 8803913 9419701
42257I419701j06235o34369l13681K36720M0137o71776q50773k92595J52212l5287
$$ 9419701 9313466 8679097 8365416 8602136 8642273 7970497 7119724 6827129 6979341 6944054
42247F944054m17947m83378l29896k56186l10802m68096p35717r14129o99807
$$ 6944054 6526107 6042729 5712833 5456647 5145845 4677749 3942032 3027903 2328096
42238B328096j68766K30654K49965N2208j45154k45202j24632K40944N21037L59326
$$ 2328096 2159330 2389984 2639949 2692157 2547003 2301801 2177169 2418113 2939150 3298476
42228C298476n3713k04017j3844J37384J09882J17507J31559j50364o12090o86226
$$ 3298476 3244763 3040746 3026902 3164286 3274168 3391675 3523234 3372870 2760780 2074554
42218B074554k53952P6636r0422l41091j90131J50335K23446P9282N4863J67635
$$ 2074554 1820602 1897238 1806816 1465725 1275594 1425929 1649375 1728657 1783520 1951155
42208A951155K32444K81595L82884L15370o7552l85016j82158L09003M13114k4279
$$ 1951155 2183599 2465194 2848078 3163448 3095896 2710880 2528722 2837725 3250839 3226560
42198C226560m35289l50280M2926L13689L85900M64937N77545M81349N9481l74237
$$ 3226560 2791271 2440991 2483917 2797606 3183506 3648443 4225988 4707337 4766818 4392581
42188D392581l54870J14314M34369J24924m89664o70137k74241R1994J795k45751
$$ 4392581 4037711 4152025 4586394 4711318 4221654 3551517 3277276 3369270 3371065 3125314
42178C125314k33614o0030P043N3497K24324K72568n8581m68445m70564j44914
$$ 3125314 2891700 2831670 2838713 2892210 3116534 3389102 3330521 2862076 2391512 2246598
42168B246598L5687j4331K6374K00439J80040j01482k91995j95781p846J17516
$$ 2246598 2282285 2267954 2294328 2494767 2674807 2573325 2281330 2085549 2077703 2195219
42158B195219K28357K08098j87692p33671p51871n5238O29783N94581P8642k00955
$$ 2195219 2423576 2631674 2443982 1710311 958440 903202 1532985 2127566 2206208 2005253
42148B005253r3852k2690j55683j96366r548Q8421j50931m69487m24128M5758
$$ 2005253 1911401 1888711 1733028 1536662 1527114 1615535 1464604 995117 570989 616747
42138F16747N59106O99192L60233k24391o81474p54632m58438k6047K91009L97295
$$ 616747 1175853 1875045 2235278 2010887 1329413 574781 116343 90296 381305 778600
42128G78600L81322L86931M29449L61689Q7756k34922l49694k48896j70338j90180
$$ 778600 1159922 1546853 1976302 2337991 2425747 2190825 1841131 1592235 1421897 1231717
42118A231717n9626L77815Q07324P60458K37158k65575l59412j58101k194p757
$$ 1231717 1172091 1549906 2357230 3117688 3354846 3089271 2729859 2571758 2569564 2561807
42108B561807k4326R2605L13845M83136M34683J24728k56842l67906m7908M28104
$$ 2561807 2537481 2630086 2943931 3427067 3861750 3986478 3729636 3361730 3313822 3741926
42098C741926N66590J93456l19409m63923j73685J39982J19115j46572l42618
$$ 3741926 4308516 4501972 4182563 3718640 3544955 3684937 3804052 3657480 3314862
42089C314862l80456m12669m62843l26210N4344L47870K04782k33738m51891j98233
$$ 3314862 2934406 2521737 2058894 1732684 1787028 2134898 2339680 2105942 1654051 1455818
42079A455818K15845L45198J56467j0463P6701K79147K95795R566l93805n81291
$$ 1455818 1671663 2016861 2173328 2162865 2239566 2518713 2814508 2824074 2430269 1848978
42069A848978l63301R2128L72889K61382J5156M2995L28409M33847J56420j20413
$$ 1848978 1485677 1577805 1950694 2212076 2227232 2270227 2598636 3032483 3188903 3068490
42059C068490L3935M39654N40368J82431k40117m23661n10994o65614o91153l65995
$$ 3068490 3102425 3542079 4082447 4264878 4024761 3601100 3090106 2424492 1733339 1367344
42049A367344J25791M37923N44527O27068O29249L43099j08898l22865k11281
$$ 1367344 1493135 1931058 2475585 3102653 3731902 4075001 3966103 3643238 3431957
42040C431957j24297k24762j84108K02055M94042J82858m43440n84560p0285L54223
$$ 3431957 3307660 3082898 2898790 3100845 3594887 3777745 3334305 2749745 2679460 3033683
42030C033683Q5936m84962n66537q0335L09481J67917k02160k94499l6068K92335
$$ 3033683 3119619 2634657 2068120 1987785 2297266 2465183 2263023 1968524 1932456 2224791
42020B224791M71348M52617K67563O6283R7127M05109O49413M62324n4483m04241
$$ 2224791 2696139 3148756 3416319 3482602 3579729 3984838 4634251 5096575 5042092 4637851
42010D637851k53196K48677O70911O67331J89703m75528q97638q76797o02202
$$ 4637851 4384655 4633332 5304243 5971574 6161277 5685749 4788111 3911314 3309112
42001C309112l45418j43241N1964J33416O4266J39395N83888J010426Q05986N0705
$$ 3309112 2963694 2820453 2872417 3005833 3070099 3209494 3793382 4803808 5609794 5660499
41991E660499n15320n22409l60824l64878k87655L3677J35778l55408r37394q37730
$$ 5660499 5145179 4622770 4261946 3897068 3609413 3643090 3778868 3423460 2486066 1648336
41981A648336j26465M23781M01739O2063k88399n58039n74848j74334L49377M50338
$$ 1648336 1521871 1945652 2347391 2409454 2121055 1563016 988168 813834 1163211 1613549
41971A613549R3111j96671j28483K7241K2636k179O8186N3679j27693k40760j63785
$$ 1613549 1706660 1509989 1381506 1408747 1431383 1429204 1497390 1551069 1423376 1182616 1018831
41960A018831j14486j79074n1653M20075Q28813P50294L74330J75363K09947J81727
$$ 1018831 904345 725271 673618 1093693 1922506 2672800 3047130 3222493 3432440 3614167
41950C614167K3361l8023P9886K05104K30645K28555K41795K17724J49613P9899
$$ 3614167 3637528 3599505 3679391 3884495 4115140 4343695 4585490 4803214 4952827 5032726
41940E032726q034j14902j07640J09572L62560L82950K01432J28617L04979M78072
$$ 5032726 5024692 4909790 4802150 4911722 5274282 5657232 5858664 5987281 6292260 6770332
41930F770332L25660j30330n42931o18835l82789n7045K31066N04956P16377O69654
$$ 6770332 7095992 6965662 6422731 5803896 5421107 5364062 5595128 6100084 6816461 7486115
41920G486115L10358p6107j82760q0206l0558k1996J41480L40848J92262l19770
$$ 7486115 7796473 7720366 7537606 7457400 7426842 7404846 7546326 7887174 8079436 7759666
41910G759666p01842o18096l06213j30288j05393j08115j75422k86721j94592
$$ 7759666 7057824 6439728 6133515 6003227 5897834 5789719 5614297 5327576 5132984
41901E132984J75144M49532L02211l7145j45048l7606k7262j34519r1015J56019
$$ 5132984 5308128 5757660 6059871 6022726 5877678 5840072 5812810 5678291 5587276 5743295
41891E743295L46619L00882J02546q5333j48908l4101J66282K48381K00608K82773
$$ 5743295 6089914 6390796 6493342 6408009 6259101 6225000 6391282 6639663 6840271 7123044
41881G123044N95517Q24137O91731M03097K97198L20920K53700K15650M75802
$$ 7123044 7718561 8542698 9234429 9637526 9934724 10255644 10509344 10724994 11200796
41872A1200796R19097J194546J292857J498116J825577J985850J917612J932681
$$ 11200796 12119893 13314439 14607296 16105412 17930989 19916839 21834451 23767132
41864B3767132K286916K952368L837187M914436O094669P217061Q214107R196300
$$ 23767132 26054048 29006416 32843603 37758039 43852708 51069769 59283876 68480176
41856F8480176J0458044J2402966J5215558J8659710K2613548K7503072L3047173
$$ 68480176 78938220 91341186 106556744 125216454 147830002 175333074 208380247
41849B08380247L6411722L3362991K2722718Q839742j827394o235675o032968
$$ 208380247 244791969 278154960 300877678 309717420 307890026 301654351 295621383
41842B95621383m538264m228703o223514r587920j0991170p327006Q67742J0423318
$$ 295621383 291083119 286854416 280630902 271042982 260051812 252724806 253592548 264015866
41834B64015866J9710369K8815650L5089061L2594562J8942761K87845j3753516
$$ 264015866 283726235 312541885 347630946 380225508 399168269 399456114 385702598
41827C85702598j9081032j8660493j6960969j6483728j8896624k5047432l2487924
$$ 385702598 366621566 347961073 331000104 314516376 295619752 270572320 238084396
41820B38084396l6157254l3497828k7146314k1320008j7370443j4239386j1404951
$$ 238084396 201927142 168429314 141283000 119962992 102592549 88353163 76948212
41813G6948212r322964p939137o654492n430178m625323m071620l365337k702237
$$ 76948212 67625248 59686111 53031619 47601441 42976118 38904498 35539161 32836924
41805C2836924k460871k349882j902124j434285j565993k086927k222830j800627
$$ 32836924 30376053 28026171 26124047 24689762 23123769 21036842 18814012 17013385
41797A7013385j292297r15930n45409l35532n70538r76259r89590o60083n25937
$$ 17013385 15721088 14805158 14259749 13924217 13353679 12377420 11387830 10727747 10201810
41788A0201810o60918o30844l65819k53947l22113j57182K18966K23852k85117
$$ 10201810 9540892 8910048 8544229 8290282 7968169 7810987 8029953 8253805 7968688
41779G968688o58927m56980j09353j59436m42492m87174k37223J05378N21950
$$ 7968688 7309761 6852781 6743428 6583992 6141500 5654326 5417103 5522481 6044431
41770F044431R54180J002715M01354m32267q21722o56398l58329j91259p6335
$$ 6044431 6998611 8001326 8402680 7970413 7148691 6492293 6133964 5942705 5866370
41761E866370J0665l0352q6452R6859M08147L73437j37550n81713m12231J78942
$$ 5866370 5877035 5846683 5760231 5857090 6265237 6638674 6501124 5919411 5507180 5686122
41751E686122N35070M20031K49043M03851O74679O00948J53435k26257k14934
$$ 5686122 6221192 6641223 6890266 7294117 7968796 8569744 8723179 8496922 8281988
41742H281988N6103K99134M15497M03204J97744j39896k91284o7749K15295J31983
$$ 8281988 8338091 8637225 9052722 9455926 9653670 9513774 9222490 9154741 9370036 9502019
41732I502019j86158k42841j7597l5914m45321o50990k64630J52808q3819o23303
$$ 9502019 9315861 9073020 9055423 9019509 8574188 7923198 7658568 7811376 7727557 7104254
41722G104254n36992K16377O44432J66284n91188p87686m85567k59710k16919
$$ 7104254 6567262 6783639 7428071 7594355 7003167 6215481 5729914 5470204 5253285
41713E253285n8499J81144J50096j46468l00639j75568q9271k12536k83956j27369
$$ 5253285 5194786 5375930 5526026 5379558 5078919 4903351 4814080 4601544 4317588 4190219
41703D190219K745r9848j38934K54280Q59968J076666P32651L05755K80748O08416
$$ 4190219 4192964 4093116 3954182 4208462 5068430 6145096 6877747 7183502 7464250 8072666
41693H072666R44148J166603J400873J631651J611147J267954R74349J128544
$$ 8072666 9016814 10183417 11584290 13215941 14827088 16095042 17069391 18197935
41685A8197935J543912J600135J087122N33449M60961O80284P44416P82523J229093
$$ 18197935 19741847 21341982 22429104 22962553 23423514 24103798 24848214 25630737 26859830
41676B6859830J832925J724357O66969m75807r06342q94482j100009j466082j502783
$$ 26859830 28692755 30417112 31084081 30608274 29701932 28807450 27707441 26241359 24738576
41667B4738576j291241j376710j789080j958705j658263j335112j357966j532442
$$ 24738576 23447335 22070625 20281545 18322840 16664577 15329465 13971499 12439057
41659A2439057j557788j435357j217174q44054m53021l60095m95164l53816J86418
$$ 12439057 10881269 9445912 8228738 7384684 6931663 6571568 6076404 5722588 5909006
41650E909006N15903J75669l70236l78505R3619L47501R7996k28010k22706m17
$$ 5909006 6424909 6600578 6230342 5851837 5945456 6292957 6390953 6162943 5940237 5939820
41640E939820J28966R3834K7228O5544K92292O91787J083005J240936J131494
$$ 5939820 6068786 6162620 6189848 6255392 6547684 7239471 8322476 9563412 10694906
41631A0694906R44754R15496J166870J628084K024242K103733J990180K103925
$$ 10694906 11639660 12555156 13722026 15350110 17374352 19478085 21468265 23572190
41623B3572190K570429K950819K795676K207448J541672Q23877r5958j018683
$$ 23572190 26142619 29093438 31889114 34096562 35638234 36462111 36366153 35347470
41615C5347470j579246j889109k425751l220915l702360l505093k947200k468094
$$ 35347470 33768224 31879115 29453364 26232449 22530089 19024996 16077796 13609702
41607A3609702k042596j465310q54161n06129m81404o31127q37724r69013q24695
$$ 13609702 11567106 10101796 9247635 8741506 8260102 7628975 6791251 5822238 4997543
41598D997543m31818j91713l97371p55569p32859k70573J87200L05554J54136
$$ 4997543 4565725 4374012 3976641 3221072 2488213 2217640 2404840 2710394 2864530
41589B864530o4439k18701j76203R8771L06727M4549n78531r02298n18569J69000
$$ 2864530 2800091 2581390 2405187 2503958 2810685 2855234 2276703 1374405 855836 1024836
41579A024836M58726K02381j60192k45659n6045K41452M79596M33966r769n22690
$$ 1024836 1483562 1685943 1525751 1280092 1224047 1465499 1945095 2379061 2369292 1846602
41569A846602n25514Q0819O72550O51756J89263j02312l1624O1886k3160o4156
$$ 1846602 1321088 1401907 2074457 2726213 2915476 2813164 2781540 2843426 2820266 2756110
41559B756110R8328K27073Q7213j46392j84229r5610j52370l38555l68779j61768
$$ 2756110 2854438 3081511 3168724 3022332 2838103 2742493 2590123 2251568 1882789 1721021
41549A721021K8925Q605r5795o5635J03777K35870J97009J8608j22164l2233K72612
$$ 1721021 1749946 1758551 1662756 1597121 1700898 1936768 2133777 2152385 2030221 1997988 2270600
41538B270600M79057K82790j78630l96083j07873L17219K99657k34761p64131
$$ 2270600 2749657 3032447 2853817 2457734 2349861 2667080 2966737 2731976 1967845
41529A967845p95057l86628K7392J78468J54029J21584R8708P1270J31942L09080
$$ 1967845 1172788 786160 813552 992020 1146049 1267633 1366341 1437611 1569553 1878633
41519A878633L84950J40098k58855l95056j64958P7897M6168j07160j20874m8511
$$ 1878633 2263583 2403681 2144826 1749770 1584812 1662709 1708877 1601717 1480843 1432332
41509A432332p2542j25301m2700N7814n4561k46791j32368L01364N74100L62041
$$ 1432332 1359790 1234489 1191789 1249603 1195042 948251 815883 1117247 1691347 2053388
41499B053388n9021k17266m8636J21357M3355k07905l69844k41268J36997M63498
$$ 2053388 1994367 1777101 1728465 1849822 1893177 1685272 1315428 1074160 1211157 1674655
41489A674655M22329K7981l50074l65576k8054L65489N30910M01985J44531P363
$$ 1674655 2096984 2124965 1774891 1409315 1381261 1746750 2277660 2679645 2824176 2831539
41479B831539Q6475K43229L27846L98855N68350P35727P31929O76547Q74407J324465
$$ 2831539 2918014 3161243 3489089 3887944 4456294 5192021 5923950 6600497 7474904 8799369
41469H799369J645191J569336J213838P68789K57150k44687n00762m71632m73305
$$ 8799369 10444560 12013896 13227734 13996523 14253673 14008986 13508224 13036592 12563287
41460A2563287p02553q79568o89566l39841k88327n73974q21153q27270p38370
$$ 12563287 11860734 10981166 10291600 9951759 9663432 9089458 8268305 7441035 6702665
41451F702665o47163m20686l2152K61123K43113M1648l9587J38861M82917Q32131
$$ 6702665 6055502 5634816 5602664 5863787 6106900 6148548 6108961 6247822 6730739 7562870
41441G562870J105434J329292J558723J748096J740007J446499R82918N28738
$$ 7562870 8668304 9997596 11556319 13304415 15044422 16490921 17473839 18002577
41433A8002577J14224l44092q43035j236431j350562j108458o44138l50020o08249
$$ 18002577 18116801 17772709 16929674 15693243 14342681 13234223 12590085 12240065 11631816
41424A1631816j299438j765243j515797q37819m03590l84405l27786R0612N99571
$$ 11631816 10332378 8567135 7051338 6213519 5809929 5425524 5097738 5188350 5787921
41415E787921P60776N50902L01752K58672M10608O43398Q63803R89841R36910
$$ 5787921 6548697 7099599 7401351 7660023 8070631 8714029 9577832 10567673 11504583
41406A1504583O50464J68360l22402n68064n07706l94677m95962p08890o84966
$$ 11504583 12155047 12323407 12001005 11432941 10925235 10530558 10034596 9325706 8640740
41397H640740l41241j7635n1082l88359p17990q18998o77058m12043k15358k36994
$$ 8640740 8299499 8281864 8230782 7842423 7124433 6305435 5628377 5216334 5000976 4763982
41387D763982m07903m60219k27651J49001M03790M56250M42416M84650N30567
$$ 4763982 4356079 3895860 3668209 3817210 4221000 4677250 5119666 5604316 6134883
41378F134883M38296J94463J5962J68652O55217J181168J500139J648800J699586
$$ 6134883 6573179 6767642 6783604 6952256 7607473 8788641 10288780 11937580 13637166
41369A3637166J469048P63326j80606q40595r94444q45878n83416k17227P5861
$$ 13637166 15106214 15869540 15688934 14848339 13853895 13008017 12424601 12207374 12283235
41360A2283235q6943p45723j380563j531336j328723j122630r15452n53379k06050
$$ 12283235 12196292 11450569 10070006 8538670 7209947 6087317 5171865 4618486 4412436
41351D412436j77026l74350m23167k38510o9924k5898K0385O5156m7140k40544
$$ 4412436 4235410 3861060 3437893 3199383 3129459 3103561 3123946 3189102 3141962 2901418
41341B901418k36617m8287j2438k05388k70842k5980J99355J10400n9931L8617
$$ 2901418 2664801 2616514 2604076 2398688 2127846 2101866 2301221 2411621 2351690 2390307
41331B390307K88801L22892Q6372j95109m02763m94811l01075K07231O04297M55967
$$ 2390307 2679108 3002000 3088372 2893263 2490500 1995689 1694614 1901845 2506142 2962109
41321B962109j9009k40585j48430k10868n43922o81072l94721r9807j27370j96951
$$ 2962109 2943100 2702515 2554085 2343217 1799295 1118223 723502 623695 496325 299374
41311B99374l1098P1184j68645l23271J33144Q56163J024949N41348Q4623K4820
$$ 299374 268276 339460 170815 -152456 -19312 836851 1861800 2403148 2487771 2512591
41301B512591M6627p8832j14986L9870P5496j14529j79613k327M158k99973l42748
$$ 2512591 2559218 2480386 2365400 2405270 2480766 2366237 2186624 2184297 2188455 1888482 1545734
41290A545734K20992P28490M01534m19722p51088l89213p790L3745Q8859L75502
$$ 1545734 1766726 2495216 2896750 2477028 1725940 1336727 1328937 1362682 1451541 1827043
41280A827043N66730M50489K83738K04022o4476n61864p39697k25642M97391O70667
$$ 1827043 2393773 2844262 3128000 3332022 3267546 2705682 1965985 1740343 2237734 2908401
41270B908401K29748k41620l13293p3321J50820R6310k89153p34503q07043m10516
$$ 2908401 3138149 2896529 2583236 2509915 2660735 2757045 2467892 1733389 926346 515830
41260E15830M3122J65057O8746P2025J81694K16135K25785L83231N76363N19431
$$ 515830 558952 724009 792755 864780 1046474 1262609 1488394 1871625 2447988 2967419
41250B967419K24954n215m8652p5151j74185k01864o0623J55156L59244N50415
$$ 2967419 3192373 3187158 3138506 3063355 2889170 2687306 2626683 2781839 3141083 3691498
41240C691498O13314L22219l00635q34290q59837m31457j8538p740l31900n88545
$$ 3691498 4304812 4627031 4326396 3492106 2632269 2200812 2182274 2174534 1842634 1254089
41230A254089m96842j85275M6178J75710M29320P62136P28016J28359n12009n38761
$$ 1254089 757247 571972 618150 793860 1223180 1985316 2713332 2841691 2329682 1790921
41220A790921o9215J84753n5876l19835j99206M6885o725k47888k28806J40255
$$ 1790921 1721706 1906459 1850583 1530748 1331542 1378427 1371702 1123814 895008 1035263
41210A035263M89438N14977K91603N2903r1657j53689j45581o8105K9749M9150
$$ 1035263 1524701 2039678 2331281 2384184 2292527 2138838 1993257 1925152 1954901 2004051
41200B004051n8346j77434r1586K41527N36778M68317Q9890k30443l03852k98392
$$ 2004051 1945705 1768271 1676685 1918212 2454990 2923307 3013197 2782754 2478902 2180510
41190B180510l54396l21522p8846J33626M592l54002n01816k27427K28246M87305
$$ 2180510 1826114 1504592 1425746 1559372 1563964 1209962 708146 480719 708965 1196270
41180A196270L63613q8930o13240q27708n16862Q9961N19522N70832M35010K99545
$$ 1196270 1559883 1470953 857713 30005 -486857 -396896 122626 693458 1128468 1428013
41170A428013J27605q2121j45559o257Q6388k6314r9577R7077K84664M2662m62270
$$ 1428013 1555618 1473497 1327938 1321681 1408069 1381755 1282178 1379255 1663919 1706581 1244311
41159A244311o24495k63702J73945L42884L77143L79870J29638l69878o00067
$$ 1244311 619816 356114 530059 872943 1250086 1629956 1759594 1389716 789649
41150G89649k63792J49241Q2781k16290j96023J1873q9736l16817m2291N65838
$$ 789649 525857 675098 757879 541589 345566 357439 267703 -49114 -91405 474433
41140D74433N85640j77825p63124m99177P4144K84950L97531Q19347J058818N01481
$$ 474433 1060073 882248 119124 -380053 -305909 -20959 376572 1195919 2254737 2756218
41130B756218l29589m16588J40679K83060l02625p29087l31130M06754O74499
$$ 2756218 2426629 2010041 2150720 2433780 2131155 1402068 1070938 1477692 2152191
41121B152191L48510j61052m82276m10247J5655L31782M8455n97372q26557m06356
$$ 2152191 2500701 2339649 1857373 1447126 1462781 1794563 1843018 1245646 419089 12733
41111A2733O2679J35752R0391J97231J75861j38880k80105P5504L90624M2793
$$ 12733 75412 211164 301555 498786 674647 535767 255662 331166 721790 764583
41101G64583o17541p41111k22603K72197L45314K21762J46292R4952J05728L06877
$$ 764583 147042 -594069 -816672 -544475 -199161 22601 168893 263845 369573 676450
41091F76450N37942M33103l1538m71764o08414m77948j62014K67184N34680L51673
$$ 676450 1214392 1647495 1615957 1144193 535779 57831 -104183 163001 697681 1049354
41081A049354j07072l11219n4818L05592L57579O9006l10499m74467j93260M32841
$$ 1049354 942282 631063 576245 881837 1239416 1308422 997923 523456 330196 763037
41071G63037Q63738O36100p540l89934k82849p3742m7248m0048O7955O8554j25505
$$ 763037 1626775 2262875 2255335 1865401 1582552 1508810 1461562 1421514 1489469 1558023 1432518
41060A432518k22591l6986J76946J75506J24064K12539K33106o7550m94378o58102
$$ 1432518 1209927 1172941 1349887 1525393 1649457 1861996 2095102 2027552 1533174 875072
41050H75072n13845k86199n5014K13198L86466L07709J16499Q2582J91540K12963
$$ 875072 361227 75028 20014 233212 619678 927387 1043886 1126468 1318008 1530971
41040A530971J06432L9616N8164N8572O2034J97681L99102M07340J27737k39035
$$ 1530971 1637403 1677019 1735183 1793755 1855789 2053470 2452572 2859912 2987649 2748614
41030B748614m48223m06350j49811J47329J89053j47435n42697n42521j43872
$$ 2748614 2300391 1894041 1744230 1891559 2080612 1933177 1390480 847959 704087
41021G04087K17622K77311J88184Q9746j53645n60755p47470l92939K23800N23909
$$ 704087 921709 1199020 1387204 1476950 1323305 762550 15080 -377859 -154059 369850
41011C69850L52177N1920j12620k18784l29740k67634N8606L70245L28992k527
$$ 369850 722027 773947 661327 442543 112803 -154831 -96225 274020 603012 600485
41001F00485k45589j81741O6583K93882M27284M53192L27827O6223j88576k77204
$$ 600485 354896 173155 239738 533620 960904 1414096 1741923 1808146 1619570 1342366
40991A342366j55490J07858L79838M93119L47923L9768k07175k70754k00567o6806
$$ 1342366 1186876 1294734 1674572 2167691 2515614 2555382 2348207 2077453 1876886 1810080
40981A810080Q9544J42018m7689l64192n09404m53801m92745o60071m94451K24022
$$ 1810080 1899624 2041642 1993953 1629761 1120357 666556 173811 -486260 -980711 -756689
40971g56689Q83710P72076J60986l6982L76131O44927K92499k08872l32126l13025
$$ -756689 127021 899097 1060083 1023101 1399232 2044159 2336658 2127786 1795660 1482635
40961A482635n31191o87389l09208L15753M67595O7006k77431k18934j5463Q4718
$$ 1482635 951444 264055 -45153 270600 738195 805201 527770 308836 293373 378091
40951C78091J71541K71992J76480j42330l83382l75877k97403k75343j59883J20398
$$ 378091 549632 821624 998104 855774 472392 96515 -200888 -476231 -636114 -515716
40941e15716L45272L55622K91092K74989J89167k1281j45166n5836L5419o3679
$$ -515716 -170444 185178 476270 751259 940426 919145 773979 718143 753562 689883
40931F89883k04055j99172j53763j80967r3437K41965N05441L31554o9585j82212
$$ 689883 485828 286656 132893 -48074 -141511 100454 605895 937449 867864 685652
40921F85652K7901R8105j68039m13037k96514O3777L58735M40288K68517j47561
$$ 685652 713553 811658 643619 230582 -65932 -2155 356580 796868 1065385 917824
40911I17824n74291o29968k61680J02444R8186j04909j19138Q6247K26778J87770
$$ 917824 343533 -286435 -548115 -445671 -347485 -452394 -571532 -485285 -258507 -70737
40901g0737J37966J79925J86473O3459m8151K4506J97819K04939m7153l16813
$$ -70737 67229 247154 433627 497086 448935 473441 671260 876199 829046 512233
40891E12233l11822q1585K9929j28059k60029m3115L43519M06383K5151l77614
$$ 512233 200411 118826 148755 20696 -239333 -282448 61071 467454 492605 114991
40881A14991m19829j83958P7286L18796N47980N90264L33402k644j67601k68367
$$ 114991 -304838 -488796 -411510 -92714 455266 1045530 1378932 1376288 1208687 940320
40871I40320m97587o50818l64707K38711O18412N40722K89199J04218r3755k88518
$$ 940320 442733 -208085 -572792 -334081 284331 825053 1114252 1218470 1124715 836197
40861H36197j95152K19517M83853K43521k06104l65482j99113J2055J74711K99184
$$ 836197 641045 860562 1344415 1587936 1381832 1016350 817237 829292 1004003 1303187
40851A303187J88541k63486o49568m82334N1403L30707K25877J62605K58988J12552
$$ 1303187 1491728 1228242 578674 96340 147743 478450 704327 866932 1125920 1238472
40841A238472l67089o19251k94799J42960J51357n8967K5144L34567M03573J75098
$$ 1238472 871383 252132 -42667 100293 251650 192683 217827 552394 955967 1131065
40831A131065j4496j02146l13010n56984m37343O2961M58691M61438L14824K83496
$$ 1131065 1116569 1014423 701413 144429 -292914 -229953 228738 690176 1005000 1288496
40821A288496K82336K08235J80882J98713j6898n16278q33215n69788K2773M11868
$$ 1288496 1570832 1779067 1959949 2158662 2141764 1625486 792271 222483 245256 657124
40811F57124M67337L88673K00106j95474n85183n75304j76091J56579J36222m4360
$$ 657124 1124461 1513134 1713240 1517766 932583 357279 181188 337767 473989 429629
40801D29629j02637m3581j4456l7812m1102J1873J14269K08374J63610o6693k74270
$$ 429629 326992 283411 268955 231143 190041 201914 316183 524557 688167 621474 347204
40790C47204k08876L2039J00001p8272j85362k4525J86202K07415J40590J42998
$$ 347204 138328 170367 270368 192096 6734 -17791 168411 375826 516416 659414
40780F59414P8189k01095m36438k45505K56592N06765J93484l95479p68269p09642
$$ 659414 737603 536508 100070 -145435 111157 617922 811406 415927 -352342 -1061984
40770a061984l17966J78964N36156N99774M09718J09584k29669n54739o65328
$$ -1061984 -1379950 -1200986 -664830 -65056 344662 454246 224577 -330162 -995490
40761i95490l61245K23922O83196P83213O27892L63536L1040k17337j32347J97603
$$ -995490 -1356735 -1132813 -449617 333596 961488 1325024 1356064 1138727 1006380 1203983
40751A203983K72768j59908o62688o75189k82170J0959P9405K27522M94738N07803
$$ 1203983 1476751 1316843 654155 -21034 -303204 -292245 -212840 14682 509420 1017223
40741A017223J73868k0410K77989O84220N98051P2687k85674j74874P6125N2346
$$ 1017223 1191091 1170681 1448670 2132890 2730941 2803628 2517954 2343080 2419205 2471551
40731B471551k43931n38216o44045n30705k47450M8497J36375k6034k01179j62199
$$ 2471551 2227620 1689404 1045359 514654 267204 315701 452076 426042 224863 62664
40721F2664K184L8541q3197j38817m282J74596K36514K28872K42310J96386O721
$$ 62664 64848 103389 20192 -118625 -122907 51689 288203 517075 759385 955771 962492
40710I62492j45018N386L49350M33692O3575l83127m48837j92154n958J5051J41076
$$ 962492 817474 822860 1172210 1605902 1669477 1286350 837513 645359 639401 654452 795528
40699G95528M33461N12579J07035m52611n99151k61447P5090L2637k07972k16867
$$ 795528 1228989 1741568 1848603 1395992 796841 535394 610484 643121 435149 218282
40689B18282J17624M91511N75628L56359Q0701m5213n6088j46370m08823o65856
$$ 218282 335906 827417 1403045 1759404 1840105 1794892 1738804 1592434 1183611 517755
40679E17755o05524j37680M07913N42651J40820l73105m68651j07337K44538K09106
$$ 517755 -87769 -225449 182464 725115 865935 492830 24179 -83158 161380 370486
40669C70486p8182k30952j25884L4562P4037K7876j3549l8316m3425M195P7964
$$ 370486 292304 61352 -64532 -29970 44067 71943 58394 20078 -23347 -19152 58812
40658E8812R2658L9937M39m461k6972l3741Q1252K57170K41830o0456l81023l90872
$$ 58812 151470 191407 191846 187385 160413 126672 207924 465094 706924 646468 265445 -125427
40646a25427j02803J77475K12435J5690k37853l60234k84923j47161j36147k10390
$$ -125427 -228230 -50755 161680 177370 -60483 -420717 -705640 -852801 -988948 -1199338
40636a199338j33322J21961K56382J13038k1577J13117K42823l8940n13540n20402
$$ -1199338 -1332660 -1210699 -954317 -841279 -862856 -749739 -506916 -545856 -1059396 -1579798
40626a579798Q3825O71895O99621L44984O8806k2875m6150N4485L22723M54405
$$ -1579798 -1495973 -824078 -124457 220527 289333 266458 220308 274793 597516 1051921
40616A051921J37803l60655m27548M6786M78940L86688k629j68502k8334P6864
$$ 1051921 1189724 829069 401521 448307 927247 1313935 1311306 1142804 1114470 1191334
40606A191334k2698j17695l7454M6775p9783k73680k02327J29697L07535O6902
$$ 1191334 1168636 1050941 1013487 1060262 980479 706799 504472 634169 941704 1008606
40596A008606k95487k89957J02714L98035K37327j94374m63283m02921k01172
$$ 1008606 713119 423162 525876 923911 1161238 966864 503581 100660 -100512
40587a00512j04276j79121l00661k68689L454L39831M27990J82051j22342j93121
$$ -100512 -204788 -383909 -684570 -953259 -949805 -609974 -181984 67 -122275 -315396
40577c15396r3670r6278k32470k18423J24897N61791O79937L62610r7009l49733
$$ -315396 -409066 -505344 -737814 -956237 -831340 -269549 410388 772998 675989 326256
40567C26256l57459l32235l59600k52699J09930M47456L41185j60741m94740k76206
$$ 326256 -31203 -363438 -723038 -975737 -865807 -418351 -77166 -237907 -732647 -1008853
40557a008853K06276M12654K62515J12583J35760J03524j54491l97329k66789
$$ -1008853 -802577 -389923 -127408 -14825 120935 224459 69968 -327361 -594150
40548e94150K23598O55834O17150R0580n03426o58161k72005K24577L43228Q5047
$$ -594150 -370552 285282 902432 993012 489586 -168575 -440580 -216003 127225 212272
40538B12272j50824j26835L2880J72934K84952K83616o117m45321n39771j06107
$$ 212272 61448 -65387 -32507 140427 425379 708995 702878 257557 -282214 -388321
40528c88321L43288K67590j18566k01151Q3433K16819l6162l20274l32490k08773
$$ -388321 -45033 222557 103991 -97160 -13727 203092 166930 -153344 -485834 -694607
40518f94607r2302J32680M01434L07807k13894n40492k18173K56999J72786k13600
$$ -694607 -786909 -654229 -252795 55012 -158882 -699374 -917547 -660548 -487762 -701362
40508g01362m7753O75044R55653K85146n47799n99001o2215J85967j07187l98859
$$ -701362 -749115 -74071 881582 1166728 618929 19928 -42287 143680 36493 -362366
40498c62366k85565K8195J95330J58932K9570j12037j94320j83181j69099k28782
$$ -362366 -647931 -619736 -424406 -265474 -235904 -347941 -542261 -725442 -894541 -1123323
40488a123323k45613j01577L7792n8055k40489j30892K74344N47494M66798L06366
$$ -1123323 -1368936 -1470513 -1432721 -1490776 -1731265 -1862157 -1587813 -1040319 -573521 -267155
40478b67155L16300L06481L8490k83239k94138o3306L05k05901l04466q590M22446
$$ -267155 49145 355626 394116 110877 -183261 -246567 -246262 -452163 -756629 -765219 -342773
40467c42773N05419J74639j33845o1662K05895K22699o1653k09327N2985L80779
$$ -342773 162646 337285 203440 141778 347673 570372 508719 299392 352377 733156
40457G33156K90641r8011k04223J56127M79068K77510k73522o21830n13919j40997
$$ 733156 1023797 925786 721563 877690 1356758 1634268 1360746 738916 224997 84000
40447H4000K01726L41602K26951n5944k91110l12690j54228M8253K00265K24234
$$ 84000 285726 627328 854279 798335 507225 194535 40307 88560 288825 513059
40437E13059M7228k60756m74579m71352l69012k91979j67538Q8264L46545M15764
$$ 513059 560287 299531 -175048 -646400 -1015412 -1307391 -1474929 -1386665 -1040120 -624356
40427f24356K86912O5748j86701l73336l10353O661K52989J63860o6110p2031
$$ -624356 -337444 -271696 -458397 -831733 -1142086 -1135425 -882436 -718576 -784686 -856717
40417h56717J12567J34750o9886j33021J86972N98852O06938J08171m63669n64132
$$ -856717 -744150 -609400 -679286 -812307 -625335 -26483 580455 688626 224957 -339175
40407c39175j09452L65814K40602m38396r31621o87864j7864L68037K73390J03029
$$ -339175 -448627 -82813 157789 -280607 -1212228 -1900092 -1917956 -1549919 -1276529 -1173500
40397a173500J76421L67436M06207J85092k33747o09030n72650l8564N03811N04368
$$ -1173500 -997079 -629643 -223436 -38344 -272091 -881121 -1453771 -1492335 -988524 -484156
40387d84156J09304n7122J56289K52207n0375l73010l41724j55415j48861k32565
$$ -484156 -374852 -431974 -275685 -23478 -73853 -446863 -788587 -944002 -1092863 -1325428
40377a325428j47931P6513K82066M61148N44460K78165k88169n70072k02687L00140
$$ -1325428 -1473359 -1396846 -1114780 -653632 -109172 168993 -119176 -689248 -891935 -591795
40367e91795K22472k72350m09743k5969K20815o1919m08044k61511K17278M85796
$$ -591795 -369323 -641673 -1051416 -1077385 -856570 -918489 -1326533 -1588044 -1370766 -884970
40357h84970L75292J33836l2914j13704j31162j12663j32875j84481j08090J72393
$$ -884970 -509678 -375842 -408756 -522460 -653622 -766285 -899160 -1083641 -1191731 -1019338
40347a019338M56292M91357L00091J08169L3975K7483M3653Q1881Q7385l185j21536
$$ -1019338 -563046 -71689 228402 336571 370546 398029 441682 523563 610948 607763 486227
40336D86227j30247k8842M2747N474r3352k04673l01959k84545o9886J72050J26480
$$ 486227 355980 327138 369885 375359 282007 77334 -224625 -509170 -579056 -407006 -280526
40325b80526j94631l43021l0094L78158K97390k52859o44933m64786L2832L64773
$$ -280526 -475157 -818178 -848272 -470114 -172724 -425583 -1070516 -1535302 -1502470 -1137697
40315a137697L52284Q6607k63003m06977p9665M88878O12035L1485n87829n32088
$$ -1137697 -785413 -698806 -961809 -1368786 -1448451 -959573 -347538 -316053 -903882 -1435970
40305a435970q8863p5357n10208n59251J22452P92696O90301N5716l60686l12205
$$ -1435970 -1524833 -1600190 -2110398 -2669649 -2547197 -1754501 -1064200 -1008484 -1369170 -1681375
40295a681375p5908J64803M03980M92750K65574p8012j45418R6513K70436J03573
$$ -1681375 -1757283 -1592480 -1188500 -695750 -430176 -508188 -653606 -557093 -286657 -183084
40285a83084k60352m81398l83534j07614L909k27249n09269l59655K06281N78920
$$ -183084 -443436 -924834 -1308368 -1415982 -1412073 -1639322 -2148591 -2508246 -2301965 -1723045
40275a723045L54100j11877k61006j09837k9946k5962K11831O43979Q24792N46434
$$ -1723045 -1368945 -1480822 -1741828 -1851665 -1881611 -1907573 -1695742 -1051763 -226971 319463
40265C19463R3205k14455l50118l90402l42218k47963j88039j32817k5416K7844
$$ 319463 412668 198213 -151905 -542307 -884525 -1132488 -1320527 -1453344 -1478760 -1450916
40255a450916p8307j79336o9929R9985O1075m6073J20542M14571L15805j95969
$$ -1450916 -1529223 -1708559 -1778488 -1678503 -1617428 -1663501 -1542959 -1128388 -812583 -1008552
40245a008552n09605l16283n1384r7700j55685J33227M54654L05279j35545k46202
$$ -1008552 -1518157 -1834440 -1885824 -1983524 -2139209 -2005982 -1551328 -1246049 -1381594 -1627796
40235a627796R4526L85981K79545k9816k12804j85420k2208J53520J32772j95050
$$ -1627796 -1533270 -1147289 -867744 -897560 -1110364 -1295784 -1317992 -1164472 -1031700 -1226750
40225a226750n42338m25524K02128P88624Q15936L79373l9518j85404j74583j41054
$$ -1226750 -1769088 -2194612 -1992484 -1203860 -387924 -8551 -48069 -233473 -408056 -549110
40215e49110l8891J46230K34020Q1889j46018j70173j9163M600j63460j90724
$$ -549110 -588001 -441771 -207751 -125862 -271880 -442053 -461216 -456616 -620076 -810800
40205h10800R1551K71665j05578p59160r30574m28164J02124J14888j10541j1168
$$ -810800 -719249 -447584 -553162 -1312322 -2242896 -2671060 -2568936 -2454048 -2564589 -2575757
40195b575757L74085N15425K01996k15697l70311k86324j73487j05129m1457R038
$$ -2575757 -2201672 -1686247 -1484251 -1699948 -2070259 -2356583 -2530070 -2635199 -2676656 -2667618
40185b667618J2725L0747J86251M77702O80279N26824L1617m52349o00323m59389
$$ -2667618 -2654893 -2624146 -2437895 -1960193 -1279914 -753090 -721473 -1173822 -1774145 -2233534
40175b233534k85286j46677N9746K65936K47282K4437j01234k8002j0445j58283
$$ -2233534 -2518820 -2665497 -2605751 -2339815 -2092533 -2068096 -2169330 -2197332 -2207777 -2366060
40165b366060j65451J58051M28370J86349l65413n87620k69967J73230L57663
$$ -2366060 -2531511 -2373460 -1945090 -1758741 -2124154 -2711774 -2981741 -2808511 -2450848
40156b450848L47009L40756L38286K86963K67215L21578L06198J14172j06063
$$ -2450848 -2103839 -1763083 -1424797 -1137834 -870619 -549041 -242843 -128671 -234734
40147b34734j54978r0373j14639k15659j69368O3584J92340N094k65069k44512
$$ -234734 -389712 -480085 -594724 -810383 -979751 -916167 -723827 -718733 -983802 -1228314
40137a228314P447P4412j41702k30374M4321K78904L6986l99993m23438n6313
$$ -1228314 -1220867 -1146455 -1288157 -1518531 -1474210 -1195306 -1158320 -1558313 -1981751 -2038064
40127b038064J06173j07726j81176J95866N94349N28069J53620r3420j44210j75128
$$ -2038064 -1931891 -2039617 -2220793 -2024927 -1430578 -902509 -748889 -842309 -986519 -1161647
40117a161647j86702j16801j00169k31083l06423j48174O9881J43781J96662L62221
$$ -1161647 -1348349 -1465150 -1565319 -1796402 -2102825 -2250999 -2181118 -2037337 -1840675 -1478454
40107a478454M28788K05855o4591j04377q8428k45292l03779N7240M85486L83748
$$ -1478454 -1049666 -843811 -908402 -1012779 -1101207 -1346499 -1650278 -1593038 -1107552 -723804
40097g23804r9957k45239J20936M01426J92263k00913l54585k53422o4630J00698
$$ -723804 -823761 -1069000 -948064 -546638 -354375 -555288 -909873 -1163295 -1227925 -1127227
40087a127227O8034k66100n71100l58335K70125O65293N34039K49304J27542N407
$$ -1127227 -1059193 -1325293 -1896393 -2254728 -1984603 -1319310 -785271 -535967 -408425 -403018
40077d03018k31061k93176r611K86768K43950k9928k57098l71620l62448j47184
$$ -403018 -634079 -927255 -936866 -650098 -406148 -436076 -693174 -1064794 -1427242 -1574426
40067a574426J52593K32965J29986K44799O06493O63162J45119m26109n17209
$$ -1574426 -1421833 -1188868 -1058882 -814083 -207590 455572 600691 174582 -342627
40058c42627l32255k90219k84536o7518R2392j48316m39658j71105M94955P56724
$$ -342627 -674882 -965101 -1249637 -1317155 -1224763 -1373079 -1812737 -1983842 -1488887 -732163
40048g32163L18832k39868l21087m643K36121J32116j85223l50897j21246K80279
$$ -732163 -413331 -653199 -974286 -978929 -742808 -610692 -795915 -1146812 -1268058 -987779
40038i87779L21280j42499n90274n35311j72109O3522K12711N14159P04953L04953
$$ -987779 -666499 -808998 -1399272 -1934583 -2106692 -2043170 -1830459 -1316300 -611347 -306394
40028c06394n06991r89671q33970m50293k13542k8179K25852L75817K93614J17936
$$ -306394 -813385 -1803056 -2637026 -3087319 -3300861 -3329040 -3103188 -2727371 -2433757 -2315821
40018b315821k0671j15958n1399L08195P02507O41461J34116k30389j19411J09059
$$ -2315821 -2336492 -2452450 -2503849 -2195654 -1493147 -851686 -717570 -947959 -1067370 -958311
40008i58311N4779j18604o7763J33988J79257K9263j36243k67980m08732m57562
$$ -958311 -903532 -1022136 -1089899 -955911 -776654 -747391 -883634 -1151614 -1560346 -2017908
39998b017908k83156J4151J97070J85915Q6543P956q7Q3696K10446K58590J70246
$$ -2017908 -2301064 -2286913 -2089843 -1903928 -1817385 -1809429 -1809516 -1725820 -1515374 -1256784 -1086538
39987a086538L0200l8754P647J18569J62247J9939k09760k27836M3083K28868
$$ -1086538 -1056338 -1095092 -1087445 -968876 -806629 -786690 -996450 -1224286 -1181203 -952335
39977i52335J3853k95700j72547K76208M22360R9074j53033K5840L03608L09457
$$ -952335 -938482 -1234182 -1406729 -1130521 -708161 -609087 -762120 -736280 -432672 -123215
39967a23215K07791K32803J76984j76490n39706n56603m10645m65498n79325l35484
$$ -123215 84576 317379 494363 317873 -221833 -778436 -1189081 -1654579 -2233904 -2569388
39957b569388K27519O46171O69928M03764l6445n14739o59169k17494M07729N19983
$$ -2569388 -2341869 -1695698 -1025770 -622006 -658451 -1173190 -1832359 -2049853 -1642124 -1122141
39947a122141M8523l94389m04382j98092m6234J35154L99456M87220K65553N4826
$$ -1122141 -1073618 -1468007 -1872389 -2070481 -2116715 -1981561 -1582105 -1094885 -829332 -774506
39937g74506J46623L07604J69624j18538r8500K25735L11766j11835n64174m33296
$$ -774506 -627883 -320279 -150655 -269193 -367693 -141958 169808 57973 -506201 -939497
39927i39497J44710M22229O1539l82119k51556K34830K65571l67718r11225o90512
$$ -939497 -794787 -372558 -311019 -693138 -944694 -709864 -444293 -812011 -1723236 -2413748
39917b413748k4611K97267R7396j42022j07532L4502J23044K64162N01068O45237
$$ -2413748 -2438359 -2141092 -2043696 -2185718 -2293250 -2258748 -2135704 -1871542 -1370474 -725237
39907g25237N76741L86722J39728j68040l63687k21812O8115J8615l93486n70754
$$ -725237 -148496 238226 377954 209914 -153773 -375585 -307470 -288855 -682341 -1253095
39897a253095j86895K56257J89201j43288j30916J80020J97575j92397m21474
$$ -1253095 -1439990 -1183733 -994532 -1137820 -1268736 -1088716 -891141 -1083538 -1505012
39888a505012j57691K08714K56540J71657L03475M88187L17375j16231k57914
$$ -1505012 -1662703 -1453989 -1197449 -1025792 -722317 -234130 83245 -32986 -290900
39879b90900J09420N17065M05142j99527p66366q61209n13965q9824O6262r5492
$$ -290900 -181480 335585 740727 541200 -225166 -1086375 -1600340 -1690164 -1623902 -1719394
39869a719394l01957k24716J56769M95335M46526N7307k92223k96991R255L57526
$$ -1719394 -2021351 -2246067 -2089298 -1593963 -1147437 -1090130 -1382353 -1679344 -1670089 -1312563
39859a312563M94119L39343K4841j98046j86169o3299n7904j86171k39285j08490
$$ -1312563 -818444 -479101 -454260 -652306 -838475 -901774 -959678 -1145849 -1385134 -1493624
39849a493624N9223J11723J14202J80692K42249J70473J8824o4667q9552j73283
$$ -1493624 -1434401 -1322678 -1208476 -1027784 -785535 -615062 -596238 -660905 -750457 -923740
39839i23740k83501k58407r3525M720q8725k30275j80956J26489N08258O39604
$$ -923740 -1207241 -1465648 -1559173 -1554453 -1643178 -1873453 -2054409 -1927920 -1419662 -780058
39829g80058L07932l00295o47802m04524R1657K12277j26668l56763r2795K95797
$$ -780058 -472126 -772421 -1420223 -1824747 -1733090 -1520813 -1647481 -2004244 -2097039 -1801242
39819a801242K25091k57833n47263l07326J30797K57367N901k50244j77829J92046
$$ -1801242 -1576151 -1833984 -2381247 -2688573 -2557776 -2300409 -2294508 -2544752 -2722581 -2530535
39809b530535N79575P61774P05223M75422J59226r4923j26959J0535J6155k67801
$$ -2530535 -1950960 -1189186 -483963 -8541 150685 55762 -71197 -60662 -44507 -312308
39799c12308n33929l57245J82983N50529M43318R9410j57358l04004m02138l77189
$$ -312308 -846237 -1203482 -1020499 -469970 -26652 72758 -84600 -388604 -790742 -1167931
39789a167931k50691k42086l50786j83095M36401R99268R17818L52564p4451k11106
$$ -1167931 -1418622 -1660708 -2011494 -2194589 -1758188 -758920 158898 511462 437011 225905
39779B25905m33378q35477r91332o47275j27119J50488J47546L0583r0943p9338
$$ 225905 -207473 -1042950 -2034282 -2681557 -2808676 -2658188 -2510642 -2480059 -2571002 -2650340
39769b650340J93651N32763N17193J19423j55758L440K40935J05799k50541l51742
$$ -2650340 -2456689 -1923926 -1406733 -1287310 -1443068 -1439628 -1198693 -1092894 -1343435 -1695177
39759a695177j26308N1615p5671l73103n10362k24110M51591J036902R57524K77662
$$ -1695177 -1821485 -1769870 -1845541 -2218644 -2729006 -2953116 -2501525 -1464623 -507099 -229437
39749b29437k50089j69733M8128j91410o01649m81905R3441L64455R2342j54775
$$ -229437 -479526 -649259 -601131 -792541 -1394190 -1876095 -1782654 -1418199 -1325857 -1480632
39739a480632k9096R8324n4902j32218J54842L96921J33706l27121l51784N4671
$$ -1480632 -1509728 -1411404 -1466306 -1598524 -1443682 -1046761 -913055 -1240176 -1591960 -1537289
39729a537289L28223K21528K0829n9799j54602l31584l54003n6313L26542M22172
$$ -1537289 -1209066 -987538 -966709 -1026508 -1181110 -1512694 -1866697 -1923010 -1596468 -1174296
39719a174296J79552j00254j54204n9214p8648k43617k59460L8409L28152K19766
$$ -1174296 -994744 -1094998 -1249202 -1308416 -1387064 -1630681 -1890141 -1851732 -1523580 -1303814
39709a303814r5275r5259J62553J1688o91336j058160l44156Q44144J233030N36310
$$ -1303814 -1399089 -1494348 -1331795 -1320107 -2011443 -3069603 -3413759 -2569615 -1336585 -800275
39699h00275k99864m40633m0557L22386M43784M48453M06040L08476J85574N0297
$$ -800275 -1100139 -1540772 -1581329 -1258943 -815159 -366706 39334 347810 533384 583681
39689E83681r9783j84025j65704k35522n40819p84079n33116N6698L44939J33124
$$ 583681 483898 299873 134169 -101353 -642172 -1426251 -1959367 -1902669 -1557730 -1424606
39679a424606o9247Q4095K29688j091k65576m9482M40729N46101J42723k35611
$$ -1424606 -1493853 -1409758 -1180070 -1181161 -1446737 -1496219 -1055490 -509389 -366666 -602277
39669f02277k37668j14056j81466l14569k19381M7216J15622j83790n39071m93034
$$ -602277 -839945 -954001 -1135467 -1450036 -1669417 -1622201 -1506579 -1690369 -2229440 -2722474
39659b722474k6946L54364K47384j00956j58290P7812Q3456l02808n29105j66089
$$ -2722474 -2749420 -2395056 -2147672 -2248628 -2406918 -2329106 -2245650 -2548458 -3077563 -3243652
39649c243652L80151M63641J68655J11976M48643O80697M69003R0894o2967k3952
$$ -3243652 -2863501 -2399860 -2231205 -2119229 -1670586 -989889 -520886 -429992 -492959 -516911
39639e16911n7814k27193l60771l03278n3448K46610L97303L17216J45274N7914
$$ -516911 -574725 -801918 -1162689 -1465967 -1519415 -1272805 -875502 -558286 -413012 -355098
39629c55098J7709j39698l95520n12255l34381J4314K60737K33121J3595j02730
$$ -355098 -337389 -477087 -872607 -1384862 -1719243 -1704929 -1444192 -1211071 -1197476 -1300206
39619a300206R8837M36098M84018J54102j27269j8244K35951K05747o6652k06449
$$ -1300206 -1201369 -765271 -281253 -127151 -254420 -272664 -36713 169034 102382 -104067
39609a04067j13840l55L9761L9187j30486n34104p50286k86365N56632Q72279
$$ -104067 -217907 -218262 -178501 -139314 -269800 -803904 -1554190 -1840555 -1283923 -411644
39599d11644L49873l23486m83431k96895k15684k10125m1250J47953P7701j06452
$$ -411644 -61771 -385257 -868688 -1165583 -1381267 -1591392 -1632642 -1484689 -1406988 -1513440
39589a513440m7945K07476K90933J14031k8923O3955K62524L29874J35248k99354
$$ -1513440 -1561385 -1353909 -1062976 -948945 -977868 -913913 -651389 -321515 -186267 -485621
39579d85621p31846p77198l16808K40659L60756n899m24485n01206j90165L13188
$$ -485621 -1217467 -1994665 -2311473 -2070814 -1710058 -1715957 -2140442 -2641648 -2831813 -2518625
39569b518625P18930P50517L72504j03015l32826l12165k49744j94608m8763J31359
$$ -2518625 -1799695 -1049178 -676674 -779689 -1112515 -1424680 -1674424 -1869032 -1917795 -1786436
39559a786436J53219J2134p1065J6443J22373O4886j37424l24997l73838k78017
$$ -1786436 -1633217 -1621083 -1692148 -1675705 -1553332 -1488446 -1625870 -1950867 -2324705 -2602722
39549b602722j17135O0485L13781O55355Q35453N36456j17184n50507m52951j92606
$$ -2602722 -2719857 -2659372 -2345591 -1690236 -854783 -318327 -435511 -986018 -1438969 -1631575
39539a631575k07013k97293n827N03103N32668j46762q95084r55929k62628O27364
$$ -1631575 -1838588 -2135881 -2141708 -1638605 -1105937 -1252699 -2147783 -3103712 -3366340 -2738976
39529b738976J098539Q89350K48220k10579p0298L93385N38151J87645k11534
$$ -2738976 -1640437 -751087 -502867 -713446 -783744 -390359 147792 335437 123903
39520A23903l08401k80657l75244m50636k82517Q236J78320K56780L61471L36377
$$ 123903 -184498 -465155 -840399 -1291035 -1573552 -1565316 -1386996 -1130216 -768745 -432368
39510d32368j5179m50728m80087o2601K64427P9346l91105o17504m43298j69909
$$ -432368 -447547 -898275 -1378362 -1440963 -1176536 -1097190 -1488295 -2105799 -2549097 -2719006
39500b719006m4024O1496L41483O26163N26611K6302l47194j33894M43945P37329
$$ -2719006 -2763030 -2701534 -2360051 -1733888 -1207277 -1180975 -1528169 -1662063 -1218118 -480789
39490d80789M63201l7430l21798l23648k29797j53384r4665n1474j5512L2163
$$ -480789 -17588 -55018 -376816 -700464 -930261 -1083645 -1178310 -1229784 -1245296 -1213133
39480a213133L7413q2195k43659k20934M0454K92965K85080N4634j66755k00220
$$ -1213133 -1175720 -1257915 -1501574 -1722508 -1682054 -1389089 -1104009 -1049375 -1216130 -1416350
39470a416350M45L33842N24280L16318j69093m65669k99291R1392L24353L49643
$$ -1416350 -1415905 -1082063 -557783 -241465 -410558 -876227 -1175518 -1084126 -759773 -410130
39460d10130L48248L57042K62352L8571k58253o25873r97295j092720o75331P7587
$$ -410130 -61882 295160 557512 596083 337830 -288043 -1285338 -2378058 -3053389 -2975802
39450b975802O93491Q67569O24575J29172l89312n95348k77989L12841O25019
$$ -2975802 -2282311 -1414742 -790167 -660995 -1050307 -1645655 -1923644 -1610803 -985784
39441i85784L91148j22035m76454m68841j56289K68841N36922M49752R9035k01998
$$ -985784 -594636 -716671 -1193125 -1661966 -1818255 -1549414 -1012492 -562740 -463705 -665703
39431f65703k75316k17955j51528n2252P0713N8114j49521l03144j09885L53616
$$ -665703 -941019 -1158974 -1310502 -1362754 -1292041 -1233927 -1383448 -1686592 -1796477 -1442861
39421a442861O78050N69047J37469k56357l57243k05240l1123Q554k9692k6340
$$ -1442861 -764811 -195764 -58295 -314652 -671895 -877135 -908258 -899704 -929396 -955736
39411i55736j7341j28382l06094l06372l5066K60033K77367L9189j66869j62206
$$ -955736 -973077 -1101459 -1407553 -1713925 -1748991 -1488958 -1211591 -1172402 -1339271 -1501477
39401a501477m5925p542r7710k03485j74524L5953L02478M01878K04499j96299
$$ -1501477 -1547402 -1554944 -1652654 -1856139 -2030663 -1994710 -1692232 -1290354 -1085855 -1282154
39391a282154n45093n97204k75851K33080N42481L77908r3227l85887k54667J6315
$$ -1282154 -1827247 -2424451 -2700302 -2467222 -1924741 -1546833 -1640060 -2025947 -2280614 -2264299
39381b264299K0976k25659l67013k11564J12427M49964P47118Q60815N87575L0164
$$ -2264299 -2243323 -2468982 -2835995 -3047559 -2935132 -2485168 -1738050 -877235 -289660 -259496
39371b59496l54005k83775j0779P7325j1630l2580m516j55949m29910m68594j71240
$$ -259496 -613501 -897276 -908055 -830730 -842360 -874940 -879456 -1035405 -1465315 -1933909 -2105149
39360b105149J10894J03585O554J19069L29710K92816l2489l33365l77726k26879
$$ -2105149 -1994255 -1890670 -1884116 -1765047 -1435337 -1142521 -1175010 -1508375 -1886101 -2112980
39350b112980l3929J18595J64865O6558q3061j52711j78613k64221k82886J5026
$$ -2112980 -2146909 -2028314 -1863449 -1796891 -1879952 -2032663 -2211276 -2475497 -2758383 -2743357
39340b743357N18285P22903L93361n3290j31288J8246m7776k35913l05O75782
$$ -2743357 -2225072 -1502169 -1108808 -1162098 -1293386 -1275140 -1322916 -1558829 -1559134 -883352
39330h83352J008133M60822m14796o93907l16787q734j11938k06849n97J22162
$$ -883352 124781 585603 170807 -523100 -839887 -848621 -960559 -1167408 -1168005 -1045843
39320a045843j81773n18033l48905R1541J40938k19962l52308k2378K35516L3454
$$ -1045843 -1227616 -1745649 -2094554 -2003013 -1862075 -2082037 -2434345 -2456723 -2221207 -2187753
39310b187753k29953l2181M52297O59471M37668Q3179j90003l66042l80806k00928
$$ -2187753 -2417706 -2449887 -1997590 -1338119 -900451 -817272 -1007275 -1373317 -1754123 -1955051
39300a955051m7988j42447l09298k21872O3166K35859L02107N19802P77324N93268
$$ -1955051 -2003039 -2145486 -2454784 -2676656 -2613490 -2377631 -2075524 -1555722 -778398 -185130
39290a85130j16181p55261p68612k74377K33585M72836M40783K21858j0397m3972
$$ -185130 -301311 -1056572 -1825184 -2099561 -1865976 -1393140 -952357 -730499 -740896 -784868
39280g84868R4853J31661k7982j32761k3855P8147l4081j82922j24764K8550L7410
$$ -784868 -690015 -558354 -586336 -719097 -742952 -664805 -698886 -881808 -1006572 -978022 -940612
39269i40612m2918j6544N6653k5749k27825l39816l21270k75000j80583M1516
$$ -940612 -983530 -1000074 -943421 -969170 -1196995 -1536811 -1858081 -2133081 -2313664 -2272148
39259b272148K83908L60193K88566K15175J57032P1651L9730R2838K3477k92794
$$ -2272148 -1988240 -1628047 -1339481 -1124306 -967274 -895623 -855893 -763055 -739578 -1032372
39249a032372n47353l76187L4257J74262j5844q4017K03402N48936O33704N01260
$$ -1032372 -1579725 -1955912 -1921655 -1747393 -1763237 -1847254 -1643852 -1094916 -461212 40048
39239D0048L02661O4097j33752j19597M5112L9896k44227n21143n51892m39659
$$ 40048 342709 406806 273054 153457 198569 238465 -5762 -526905 -1078797 -1518456
39229a518456l18550j12520J70334K61056M0507j73928o4831K18020L35826K57049
$$ -1518456 -1837006 -1949526 -1779192 -1518136 -1477629 -1651557 -1716388 -1498368 -1162542 -905493
39219i05493J40825l3433l22723m93657k83607J11220K54609J35838J49739L75518
$$ -905493 -764668 -798101 -1120824 -1614481 -1898088 -1786868 -1532259 -1396421 -1246682 -871164
39209h71164L81198n4799m82758m02979l5399n797l90708n81312j97001L18662
$$ -871164 -489966 -544765 -1027523 -1430502 -1465901 -1471698 -1862406 -2443718 -2640719 -2322057
39199b322057L26427p8775k15623J85601O18610N66234J91212m1126q4495k10918
$$ -2322057 -1995630 -2074405 -2290028 -2104427 -1485817 -919583 -728371 -769497 -853992 -1064910
39189a064910l89181k96112O0960K45485N2187j71176p7912J74684K50102J50183
$$ -1064910 -1454091 -1750203 -1689243 -1443758 -1391571 -1562747 -1640659 -1465975 -1215873 -1065690
39179a065690Q2969M3284j21488l62296m79620m52914m15730l38897m2877M34355
$$ -1065690 -982721 -939437 -1060925 -1423221 -1902841 -2355755 -2771485 -3110382 -3153259 -2718904
39169b718904P42809O07115J56990k25430l01011j47317M842L1715n895j2883
$$ -2718904 -1976095 -1368980 -1211990 -1437420 -1738431 -1885748 -1880906 -1849191 -1855086 -1867969
39159a867969r58j4503K059J27148L03158M16673M84526N52910M76190R9755l50641
$$ -1867969 -1868927 -1883430 -1881371 -1754223 -1451065 -1034392 -549866 3044 479234 578989 228348
39148B28348m46263k00736j16080m08111o30307l71860Q1099J94791l2031k06774
$$ 228348 -217915 -418651 -534731 -942842 -1573149 -1945009 -1863910 -1669119 -1701150 -1907924
39138a907924k03688j78327j16924Q4838K20555K0237k67074j37479L17336M61034
$$ -1907924 -2111612 -2289939 -2406863 -2322025 -2101470 -2081233 -2348307 -2485786 -2168450 -1707416
39128a707416J12056j74736m8531R0139j29218l37240o0456M02023M09522M215
$$ -1707416 -1595360 -1770096 -1818627 -1728488 -1857706 -2194946 -2255402 -1853379 -1443857 -1439642
39118a439642j98624k6152N9355j55229k40224J17023N08483L82745j19402l69109
$$ -1439642 -1638266 -1664418 -1605063 -1760292 -2000516 -1883493 -1375010 -992265 -1111667 -1480776
39108a480776j33583J75113J31660j79336l82707l10790j13200J7798P8306K11880
$$ -1480776 -1614359 -1439246 -1307586 -1486922 -1869629 -2180419 -2293619 -2275821 -2197515 -1985635
39098a985635M93083P59378O93708J58479n55843r34700p45207k47210J41487
$$ -1985635 -1492552 -733174 -39466 119013 -436830 -1371530 -2116737 -2363947 -2222460
39089b222460K57451J84694P896k21278l64410k95947j22469p0652j24879k4537
$$ -2222460 -1965009 -1780315 -1772419 -1993697 -2358107 -2654054 -2776523 -2847175 -2972054 -2996591
39079b996591K88417M75262K37433k40335n05537l82286q7122J19522J74150J27884
$$ -2996591 -2708174 -2232912 -1995479 -2235814 -2741351 -3123637 -3210759 -3091237 -2917087 -2789203
39069b789203L7489j6466N1925K34505M14961M74127L77651J94169O4598Q4235
$$ -2789203 -2751714 -2768180 -2716255 -2481750 -2066789 -1592662 -1215011 -1020842 -956244 -872009
39059h72009J65750J16283q7464k35677j93115j06084j47281k21104j43372K3770
$$ -872009 -706259 -589976 -677440 -913117 -1106232 -1212316 -1359597 -1580701 -1724073 -1700303
39049a700303Q5760O3678J15148J55731p8135n32110p53204m69237K8600K94792
$$ -1700303 -1614543 -1550865 -1435717 -1279986 -1358121 -1890231 -2643435 -3112672 -3084072 -2789280
39039b789280L10763L98910O69882Q38454O28627J66593j62088j90468j59192
$$ -2789280 -2478517 -2079607 -1409725 -571271 57356 223949 61861 -128607 -287799
39030b87799l44861o02278n07284o143L64833J60050k84071k38431L85094Q44795
$$ -287799 -632660 -1234938 -1742222 -1748365 -1383532 -1223482 -1507553 -1745984 -1360890 -516095
$$ [...]
##END NTUPLES=NMR SPECTRUM
##END=
