##TITLE=31Pdec_LR-794-Q-C4
 CDCl3, 24 sc
 17.1.2025
##JCAMPDX= 6.0         $$ Bruker NMR JCAMP-DX V2.0
##DATA TYPE= NMR SPECTRUM
##DATA CLASS= NTUPLES
##ORIGIN= UXNMR, Bruker Analytische Messtechnik GmbH
##OWNER= root
$$ XWIN-NMR		Version 3.5
$$ Fri Jan 17 14:12:00 2025 Russian Standard Time (UT+4h)  she@DPX200
##.OBSERVE FREQUENCY= 81.013821
##.OBSERVE NUCLEUS= ^31P
##.ACQUISITION MODE= SIMULTANEOUS
##.ACQUISITION SCHEME= undefined
##.AVERAGES= 24
##.DIGITISER RES= 17
##SPECTROMETER/DATA SYSTEM= spect
##.PULSE SEQUENCE= zgpg30
##.SOLVENT NAME= DMSO
##.SHIFT REFERENCE= (INTERNAL, DMSO, 0, 198.062)
##AUDIT TRAIL= $$ (NUMBER, WHEN, WHO, WHERE, WHAT)
$$ ##TITLE= Audit trail, XWIN-NMR		Version 3.5
$$ ##JCAMPDX= 5.01
$$ ##ORIGIN= Bruker BioSpin GmbH
$$ ##OWNER= she
$$ F:/spectra/data/she/nmr/P31/2/pdata/1/auditp.txt
$$ ##AUDIT TRAIL=  $$ (NUMBER, WHEN, WHO, WHERE, WHAT)
(   1,<2025-01-17 14:11:01.42 +0400>,<she>,<DPX200>,
      <created by zg, POWCHK disabled, PULCHK disabled
       configuration hash MD5:
       00 E9 B6 7A A2 85 ED C7 34 08 36 98 17 FE 4E 26
       data hash MD5: 32K
       72 CC 0F 28 A2 9D 7C 3B C2 C8 72 49 C8 55 E8 12>)
(   2,<2025-01-17 14:11:03.82 +0400>,<she>,<DPX200>,
      <Start of raw data processing
       efp BC_mod = 2 LB = 1.5 FT_mod = 6 PKNL = 1 PHC0 = 1739.392 PHC1 = 163.0858 SI = 64K 
       data hash MD5: 64K
       23 7F F6 B1 7B A0 AC A5 B0 47 2E 70 8F 0F F4 8C>)
(   3,<2025-01-17 14:11:23.73 +0400>,<she>,<DPX200>,
      <pk PHC0 = 39.60652 PHC1 = -103.8 
       data hash MD5: 64K
       26 34 1F 93 A7 55 5A 3B 78 53 FF 0E F5 BC D1 7E>)
(   4,<2025-01-17 14:11:26.78 +0400>,<she>,<DPX200>,
      <abs ABSG = 5 
       data hash MD5: 64K
       BF F0 A3 B9 6F 27 61 C1 2E 7B 02 15 02 A0 09 6B>)
$$ ##END=
$$ 
$$ hash MD5
$$ 3B BD 25 01 FA A9 C0 51 DE 86 1D D9 AE F8 84 45
##$RELAX= 
##$RELAX= 
##$RELAX= 
##$RELAX= 
##$RELAX= 
##$RELAX= 
##$RELAX= 
##$RELAX= 
$$ Bruker specific parameters
$$ --------------------------
##$DU= <F:/spectra>
##$EXPNO= 2
##$NAME= <P31>
##$PROCNO= 1
##$TYPE= <nmr>
##$USER= <she>
##$AMP= (0..31)
100 100 100 100 100 100 100 100 100 100 100 100 100 100 100 100 100 100 
100 100 100 100 100 100 100 100 100 100 100 100 100 100 
##$AQSEQ= 0
##$AQ_mod= 1
##$AUNM= <au_zg>
##$AUTOPOS= <>
##$BF1= 81.014009
##$BF2= 200.13
##$BF3= 200.13
##$BF4= 200.13
##$BF5= 200.13
##$BF6= 200.13
##$BF7= 200.13
##$BF8= 200.13
##$BYTORDA= 1
##$CFDGTYP= 0
##$CFRGTYP= 5
##$CHEMSTR= <none>
##$CNST= (0..31)
1 1 145 1 1 1 1 1 1 1 1 1 1 1 1 1 1 1 1 1 1 1 1 1 1 1 1 1 1 1 1 1 
##$CPDPRG= <waltz16>
##$CPDPRG1= <>
##$CPDPRG2= <waltz16>
##$CPDPRG3= <>
##$CPDPRG4= <mlev>
##$CPDPRG5= <mlev>
##$CPDPRG6= <mlev>
##$CPDPRG7= <mlev>
##$CPDPRG8= <mlev>
##$CPDPRGB= <>
##$CPDPRGT= <>
##$D= (0..31)
0 1 0 0 0 0 0 0 0 0.06 0 0.03 2e-05 3e-06 0 0 0.0002 0 0 0 0 0 0 0 0 0 
0 0 0 0 0 0 
##$DATE= 1737108660
##$DBL= (0..7)
120 120 120 11 120 120 24 19 
##$DBP= (0..7)
150 150 150 150 150 150 150 150 
##$DBP07= 0
##$DBPNAM0= <>
##$DBPNAM1= <>
$$ [...]
##$SUBNAM3= <"">
##$SUBNAM4= <"">
##$SUBNAM5= <"">
##$SUBNAM6= <"">
##$SUBNAM7= <"">
##$SUBNAM8= <"">
##$SUBNAM9= <"">
##$SW= 400.765351723535
##$SWIBOX= (0..15)
0 1 3 0 0 0 0 0 0 0 0 0 0 0 0 0 
##$SW_h= 32467.5324675325
##$TD= 32768
##$TD0= 1
##$TE= 0
##$TE2= 300
##$TE3= 300
##$TEG= 300
##$TL= (0..7)
0 120 53 12 22 120 120 120 
##$TP= (0..7)
150 150 150 150 150 150 150 150 
##$TP07= 0
##$TPNAME0= <>
##$TPNAME1= <>
##$TPNAME2= <>
##$TPNAME3= <>
##$TPNAME4= <>
##$TPNAME5= <>
##$TPNAME6= <>
##$TPNAME7= <>
##$TPOAL= (0..7)
0.5 0.5 0.5 0.5 0.5 0.5 0.5 0.5 
##$TPOFFS= (0..7)
0 0 0 0 0 0 0 0 
##$TUNHIN= 0
##$TUNHOUT= 0
##$TUNXOUT= 0
##$USERA1= <user>
##$USERA2= <user>
##$USERA3= <user>
##$USERA4= <user>
##$USERA5= <user>
##$V9= 5
##$VALIST= <valist>
##$VCLIST= <CCCCCCCCCCCCCCC>
##$VD= 0
##$VDLIST= <DDDDDDDDDDDDDDD>
##$VPLIST= <PPPPPPPPPPPPPPP>
##$VTLIST= <TTTTTTTTTTTTTTT>
##$WBST= 1024
##$WBSW= 4
##$XGAIN= (0..3)
0 0 0 0 
##$XL= 0
##$YL= 0
##$YMAX_a= 16716
##$YMIN_a= -19327
##$ZGOPTNS= <>
##$ZL1= 120
##$ZL2= 120
##$ZL3= 120
##$ZL4= 120
##$ABSF1= 198.0616
##$ABSF2= -202.7028
##$ABSG= 5
##$ABSL= 3
##$ALPHA= 0
##$AQORDER= 0
##$ASSFAC= 0
##$ASSFACI= 0
##$ASSFACX= 0
##$ASSWID= 0
##$AUNMP= <proc_1d>
##$AZFE= 0.1
##$AZFW= 0.5
##$BCFW= 0
##$BC_mod= 2
##$BYTORDP= 0
##$COROFFS= 0
##$CY= -3
##$DATMOD= 1
##$DC= 0
##$DFILT= <>
##$DTYPP= 0
##$F1P= 0
##$F2P= 0
##$FCOR= 1
##$FTSIZE= 65536
##$FT_mod= 6
##$GAMMA= 0
##$GB= 0
##$INTBC= 1
##$INTSCL= 9.790993e-09
##$ISEN= 30
##$LB= 1.5
##$LEV0= 0
##$LPBIN= 0
##$MAXI= 10000
##$MC2= 0
##$MEAN= 0
##$ME_mod= 0
##$MI= 50
##$NCOEF= 0
##$NC_proc= -7
##$NLEV= 6
##$NOISF1= 182.463
##$NOISF2= 159.3651
##$NSP= 0
##$NTH_PI= 0
##$NZP= 0
##$OFFSET= 198.0616
##$PC= 4
##$PHC0= 1778.999
##$PHC1= 59.2858
##$PH_mod= 1
##$PKNL= yes
##$PPARMOD= 0
##$PSCAL= 0
##$PSIGN= 0
##$REVERSE= no
##$SF= 81.0140089999434
##$SI= 65536
##$SIGF1= 159.3651
##$SIGF2= -187.1042
##$SINO= 113.3802
##$SIOLD= 16384
##$SREGLST= <1H.CDCl3>
##$SSB= 0
##$STSI= 65536
##$STSR= 0
##$SW_p= 32467.5324675325
##$SYMM= 0
##$S_DEV= 0
##$TDeff= 32768
##$TDoff= 0
##$TI= <>
##$TILT= no
##$TM1= 0
##$TM2= 0
##$TOPLEV= 0
##$USERP1= <user>
##$USERP2= <user>
##$USERP3= <user>
##$USERP4= <user>
##$USERP5= <user>
##$WDW= 1
##$XDIM= 65536
##$YMAX_p= 461917182
##$YMIN_p= -40370128
$$ End of Bruker specific parameters
$$ ---------------------------------
##NTUPLES= NMR SPECTRUM
##VAR_NAME=  FREQUENCY,     SPECTRUM/REAL,   SPECTRUM/IMAG
##SYMBOL=    X,             R,               I
##VAR_TYPE=  INDEPENDENT,   DEPENDENT,       DEPENDENT
##VAR_FORM=  AFFN,          ASDF,            ASDF
##VAR_DIM=   65536,         65536,           65536
##UNITS=     HZ,            ARBITRARY UNITS, ARBITRARY UNITS
##FACTOR=    0.49542278885378, 1,            1
##FIRST=     16045.7642231865, 0,            0
##LAST=      -16421.768244346, 0,            0
##MIN=       -16421.768244346, -40370128,    0
##MAX=       16045.7642231865, 461917182,    0
$$ Real data points
##PAGE= N=1
##DATA TABLE= (X++(R..R)), XYDATA
$$ [...]
45168g41790l5710j95023J67227N60091M84535M5301j02864L78551Q83440N62287
45158B006045m24095r70107m68920M23317P28027K83442m01369r01531j039086
45149g64277p26320j41310K52072K87328L82232Q32333J202419R57137L64160
45140B645774J19194K63995J65486m48004j057574j076735n25376J46637N29268
45131G62665M48403M4281k32317l613N27245O82710N5276r79179j557347j107962
45121a359838P3853R74923P94594j28450n72102J67713J406618J889810J191152
45112D438273o2930j053883j361167r38473j15981M27268K41005l16757n07129
45103G50226j70796J98842K69029K00093J50811K0130k02094l19711k90045k67212
$$ plain form
45168 -741790 -777500 -972523 -805296 -245205 239330 284631 181767 560318 1443758 2006045
45158 2006045 1581950 611843 142923 566240 1294267 1577709 1176340 274809 -764277
45149 -764277 -1490597 -1631907 -1379835 -1092507 -710275 122058 1324477 2281614 2645774
45140 2645774 2764968 3028963 3194449 2746445 1688871 612136 86760 233397 762665
45131 762665 1211068 1255349 1023032 1019419 1546664 2229374 2284650 1305471 -251876 -1359838
45121 -1359838 -1285985 -311062 483532 355082 -217020 -49307 1357311 3247121 4438273
45112 4438273 4375343 3321460 1960293 1021820 905839 1333107 1574112 1257355 750226
45103 750226 579430 778272 1047301 1247394 1398205 1418335 1216241 896530 606485 339273
45093C39273k29264l6969J09545j43030n63443m49520K81950P77564L96696m05107
45083G7695q01950o88260m88293k93766J38799P19115R84384P56345L95207L13809
45073A113085N06100O08815K90024l89252r28247q45581k58743K18245K34454
45064E48900L1098j22532l61798p55363q42095k02024P45047J122652P30537K26095
45054A120517J04963O0244l73399r65756j023156l30587N45496R60295Q91409
45045I90026P42922O71572M69593Q6620j72572j55540j48057l16098k79059K27296
45035B116703O25895K00906o63223q64988k39577J77861j93347o24450m32099
45026A03681j62666n38498j040151o59723M25771J081739Q66087L68919L8656
$$ plain form
45093 339273 110009 73040 182585 39555 -523888 -973408 -691458 86106 482802 77695
45083 77695 -724255 -1412515 -1900808 -2194574 -2055775 -1336660 -352276 404069 799276 1113085
45073 1113085 1619185 2228000 2518024 2128772 1200525 354944 96201 314446 548900
45064 548900 579998 457466 95668 -659695 -1501790 -1703814 -958767 163885 894422 1120517
45054 1120517 1225480 1285724 912325 -53431 -1076587 -1407174 -861678 98617 990026
45045 990026 1732948 2404520 2874113 2960733 2788161 2632621 2484564 2168466 1889407 2116703
45035 2116703 2742598 2943504 2280281 1415293 1175716 1353577 1160230 535780 103681
45026 103681 -58985 -597483 -1637634 -2297357 -1871586 -789847 76240 445159 483815
45017D83815k40080l93378q1953M39351M05810k25373n79292k46094R1291j33172
45007d79075m78291m20401k59741l30994j61226N85924J029401J75785j287418
44998a626036j650992n92705L98683K73515j71983K25570J146182J358455N44198
44989i5113m04535o65284k68030L00733O05226M00902j52439m29107j4700O08154
44979a14193O31769J16821j24533J03202L0086p03066j218112o41718N05099J012770
44969d01875O24310P2282k04063l84311m46711r2404L91229K20563n91521r55223
44959a767724k26048P66621Q41736L5520o01682l68180N11952J349599J514687
44950B056481P91940l19653r21803p03519k89326k81032m36739k64390Q0129J05089
$$ plain form
45017 483815 243735 -149643 -231596 207755 613565 388192 -191100 -437194 -345903 -479075
45007 -479075 -957366 -1377767 -1637508 -1968502 -2129728 -1543804 -514403 -338618 -1626036
44998 -1626036 -3277028 -3869733 -3471050 -3197535 -3369518 -3143948 -1997766 -639311 -95113
44989 -95113 -499648 -1164932 -1432962 -1132229 -527003 -126101 -278540 -707647 -722347 -114193
44979 -114193 517576 634397 509864 613066 643152 -59914 -1278026 -1919744 -1414645 -401875
44969 -401875 222435 294717 90654 -293657 -740368 -832772 -441543 -220980 -812501 -1767724
44959 -1767724 -1993772 -1227151 -385415 -349895 -951577 -1319757 -807805 541794 2056481
44950 2056481 2848421 2528768 1606965 903446 614120 333088 -103651 -368041 -287912 -182823
44940a82823k09794n44280q14545j003491q05439j16602N02472N70143M71663
44931b132696O97552P68751k6307j155300j327860l81737N29992P21349P35982
44922a570274J075181J326402J010988L40800l09000q24168r10393j88213Q52376
44913H03699R96411l3519j001877q77519j97797K4288j45322l3182L23199L42497
44903B00878n2966m39406o24500o69840n21693k26013j06822j94014j2675N03618
44893b143433N98853q7375o65882l03671L37320J00640q00430j160429o15545
44884d739952J58445P67823J316606J513706R27157P6441n3094M02339M02061
44875G71532j81834m13582q7263p1074m90048k47487R29853J585010P08940n76370
$$ plain form
44940 -182823 -392617 -936897 -1751442 -2754933 -3560372 -3676974 -3174502 -2604359 -2132696
44931 -2132696 -1435144 -666393 -692700 -1848000 -3175860 -3557597 -3027605 -2306256 -1570274
44922 -1570274 -495093 831309 1842297 2183097 1874097 1049929 139536 -48677 803699
44913 803699 1800110 1766591 764714 -112805 -310602 -286314 -431636 -464818 -141619 200878
44903 200878 147912 -291494 -915994 -1585834 -2107527 -2333540 -2440362 -2634376 -2647051 -2143433
44893 -2143433 -1544580 -1631955 -2297837 -2601508 -2264188 -2163548 -2963978 -4124407 -4739952
44884 -4739952 -4581507 -3813684 -2497078 -983372 -56215 20226 -32868 369471 771532
44875 771532 589698 176116 88853 17779 -472269 -719756 210097 1795107 2504047 1927677
44865A927677p57439j56026P166k08288J20139P62115M73974r20350k082216j995835
44855b829083j066003j32029N52500R84661R56596M49562q2785k24672k0714K80489
44845a131478M78125L24635k89032q98138p67765J17893Q75548Q41622M03878
44836d4712L14637N63740M73366k40180j022374j183694p01252j30037J14341
44827a856165J50826K93475N23478N23396K05316q3762k6673K37891L93807M47693
44817H09282O04439P48459M73168k89385j006514j088358n04139K49308O12339
44808F08599L31544l76091q78118o11434K24859O68751N7925j006832j238899
44799b219696l00896O72622N72511j23083p774J181492K075795J565122L13905
$$ plain form
44865 1927677 1170238 1014212 1021378 813090 933229 1695344 2169318 1248968 -833248 -2829083
44855 -2829083 -3895086 -4027115 -3474615 -2489954 -1533358 -1083796 -1166581 -1391253 -1411967 -1131478
44845 -1131478 -653353 -328718 -617750 -1515888 -2283653 -2165760 -1290212 -448590 -44712
44836 -44712 269925 833665 1307031 1066851 44477 -1139217 -1840469 -1970506 -1856165
44827 -1856165 -1705339 -1411864 -888386 -364990 -159674 -243436 -270109 -32218 361589 809282
44817 809282 1413721 2162180 2635348 2345963 1339449 251091 -253048 -3740 608599
44808 608599 940143 564052 -314066 -925500 -700641 -31890 26035 -980797 -2219696
44799 -2219696 -2520592 -1847970 -1275459 -1398542 -1406316 -224824 1850971 3416093 3729998
44790C729998l16966k03393k80755p50420p22383J44870Q20918L65923o34544
44781B153248r30378l64161J15816o4258m60449m46509j4142M02564M61084J63635
44771A016450j44291o0576L41275M37128j58611r45240j098230m69925M33805
44762f48215J203832J637987J367214K34927r81376j154570l13989K96958k9540
44753A613228n57850m40586m6445j52676n27706l59749K86604N36963J54611j14820
44743C91574J66578M06249k6096p56642q99712k08407P30517J225841J053357
44734B083259M71263m7539k13131k14656m53537q99980j048850o96516l37011
44725a356698m20811o13458l33138K45957L99074j6015l28748o9643M37658P40340
$$ plain form
44790 3729998 3413032 3209639 2928884 2178464 1456081 1600951 2421869 2787792 2153248
44781 2153248 1222870 858709 974525 910267 449818 3309 -10833 391731 852815 1016450
44771 1016450 872159 811583 1152858 1589986 1431375 486135 -612095 -1082020 -648215
44762 -648215 555617 2193604 3560818 3795745 2814369 1659799 1345810 1642768 1613228
44753 1613228 1055378 614792 568347 415671 -112035 -471784 -185180 351783 506394 391574
44743 391574 558152 964401 938305 181663 -718049 -926456 -195939 1029902 2083259
44734 2083259 2554522 2506983 2293852 2079196 1625659 725679 -323171 -1019687 -1356698
44725 -1356698 -1777509 -2390967 -2724105 -2478148 -2079074 -2095089 -2423837 -2493480 -2055822 -1315482
44715a315482Q99034J080008J041153N56449k8704k52256k87140o16650j109144
44706c2732j106138m75052R7857J12395k983M33890J279118J628111Q98648m71192
44696B361922j462453j455023p05066P5550M67792N53634N06475L55834K66791
44687I65456N78326J184872J301565M38026o90825r67117m31824j84714o91965
44678A501800j151530q54126k57906j34324l81365m02399j47503l6122j61675
44669b025150k37573j44280p105R5712J19214K1142N3926O13466J395500J352428
44659A237280J58732r18409n42518P60992J257833L19064j018549j680880j594599
44650b021054j043099j52163O76579Q26215L75803J39027M38793O31176K15070
$$ plain form
44715 -1315482 -416448 663560 1704713 2261162 2232458 1980202 1693062 1076412 -32732
44706 -32732 -1138870 -1613922 -1516065 -1403670 -1406653 -972763 306355 1934466 2833114 2361922
44696 2361922 899469 -555554 -1260620 -1185070 -717278 -163644 342831 698665 965456
44687 965456 1543782 2728654 4030219 4468245 3777420 2810303 2378479 2193765 1501800
44678 1501800 350270 -503856 -761762 -896086 -1277451 -1679850 -1827353 -1863475 -2025150
44669 -2025150 -2262723 -2407003 -2414108 -2318396 -2199182 -2178040 -2124114 -1510648 -115148 1237280
44659 1237280 1396012 477603 -64915 696077 1953910 2272974 1254425 -426455 -2021054
44650 -2021054 -3064153 -3216316 -2539737 -1713522 -1337719 -1198692 -759899 -128723 86347
44641H6347l61065m30895K0961N92148R21843O40671l85551j452866j487388m87536
44631b343331L68410M28534L33087N50292M00181n20271j116030l30378R63526
44622a265980J114446J78210l26807J31708N19140J58389l01363k11561P8418
44613G4600Q2171n295R4642J64848J0062j57501k42294m65011p00412m00251M16612
44602a127829Q90613N22403j05523l06129j88652p275M95464J260817J268754
44593B702643j26905j751578j779201j72054J257718J268505N12504J69713L46540
44584B427885M14855J47359j95531m48288n95549n40304l07212k15725m09068
44575B78422m89140j13622L04090J11955m89059n82664J31374Q35511P43598J53163
$$ plain form
44641 86347 -274718 -705613 -684652 -92504 829339 1470010 1084459 -368407 -1855795 -2343331
44631 -2343331 -1974921 -1546387 -1213300 -663008 -262827 -783098 -1899128 -2229506 -1265980
44622 -1265980 -151534 26676 -300131 -168423 350717 509106 207743 -3818 74600
44613 74600 156771 151476 246118 410966 421028 263527 21233 -443778 -1144190 -1544441 -1127829
44602 -1127829 -237216 285187 179664 -126465 -315117 -322392 173072 1433889 2702643
44593 2702643 2575738 824160 -955041 -1127095 130623 1399128 1911632 2081345 2427885
44584 2427885 2842740 2990099 2794568 2346280 1750731 1210427 903215 687490 278422
44575 278422 -210718 -324340 -20250 91705 -397354 -980018 -848644 -13133 730465 883628
44565H83628j55195j00096j85562m47703l41106K28230N26932L7909o84517p29063
44555i66543n1244N61840N63041J61073j58897j50402J61422N34392N53857J1503
44545A220042o91253q65654l22880M86153J117514J484023J488854Q48406m03352
44536D361853j595924j976648j441498n38200O7771L2342m61130p81465m29832
44527b762731L31071P66744O67980N38953O04755L32253n55825j234994p52828
44518b064622N09827J208742P41898j97548p38258p25179m19610n5534R4786j43689
44508a789187m05498n9661Q27256J385291J087253M17772L9226j20794m44475
44499I37183p74713o19233L9863O63379P53500K05413o94484j297584r63179J61867
$$ plain form
44565 883628 728433 628337 442775 -4928 -346034 -117804 409128 447037 -237480 -966543
44555 -966543 -1017787 -455947 107094 268167 109270 -41132 120290 654682 1208539 1220042
44545 1220042 528789 -336865 -659745 -173592 943922 2427945 3916799 4765205 4361853
44536 4361853 2765929 789281 -652217 -1190417 -1122646 -1090304 -1551434 -2332899 -2762731
44527 -2762731 -2431660 -1664916 -996936 -457983 146772 479025 -76800 -1311794 -2064622
44518 -2064622 -1554795 -346053 395845 198297 -539961 -1265140 -1684750 -1740284 -1645498 -1789187
44508 -1789187 -2194685 -2254346 -1427090 -41799 1045454 1463226 1502452 1381658 937183
44499 937183 162470 -456763 -416900 246479 999979 1205392 510908 -786676 -1749855 -1587988
44489a587988J034559Q55845L0407n02549n43924n73996o86893m32334K63011
44480b143862P95779P20499L00638R855l8133L0086J18071J37587N3886K7386
44470A1792J78872K62117K088l46568l42419j42491k26445m19289j09017N05222
44460f26138M86319k19385m38200L45772R64487L71362n99578n35949L08646N44298
44450F01634o5414m01626N5331N69996N90855M73990M44596P5563p23076j255256
44440C66593j094104o69922l52638J13295P65206R95697N99671L13379N79351
44431A616528O87429L0309o43451l34699N02020N95167j87402p69025o06033k82563
44421F08280k74975k48215Q7250L45416J72560q6200N6120M31231M38750j41880
$$ plain form
44489 -1587988 -553429 302416 332823 -169726 -713650 -1287646 -1974539 -2406873 -2143862
44480 -2143862 -1348083 -627584 -326946 -317091 -355224 -325138 -207067 -69480 -15594 11792
44470 11792 190664 452781 454869 108301 -234118 -376609 -603054 -1022343 -1131360 -626138
44460 -626138 -139819 -359204 -797404 -451632 512855 884217 284639 -251310 57336 601634
44450 601634 536220 134594 189925 759921 1350776 1824766 2269362 2344925 1621849 366593
44440 366593 -727511 -1397433 -1750071 -1636776 -871570 124127 723798 1037177 1616528
44431 1616528 2303957 2334266 1690815 1356116 1858136 2453303 2265901 1496876 890843 608280
44421 608280 333305 85090 172340 517756 690316 604116 660236 1091467 1530217 1388337
44411A388337q77599j142325p29878o4615K31039M7440j24591M8882K63601J86830
44401g72879J28076N11492R73290P29546k31012j034492j046264m80083J51072
44392a071254N36781M52020j50294p46854o31085N6121L57768j22674n82413k32803
44382b134687M99807O56796J80158j03956K36444O73831N01860k91883j059470
44373h41100j130829l76869O52965J143406P33618j61786q22849r17691o26986
44364b348121k40572J38527N12625Q04707Q54737N90265J50558k47664n70352
44355c55290r06754j074902o16810M94083J433162J346120M79351j03872M0198
44346G35286K30143k03229r03922j054739n31181K5219J13092p0230L4248O77286
$$ plain form
44411 1388337 510738 -631587 -1361465 -1426080 -1195041 -1147601 -1272192 -1223310 -959709 -772879
44401 -772879 -644803 -133311 839979 1569525 1338513 304021 -742243 -1222326 -1071254
44392 -1071254 -534473 -82453 -232747 -979601 -1610686 -1554565 -1196797 -1319471 -1901884 -2134687
44382 -2134687 -1634880 -978084 -797926 -901882 -665438 8393 510253 218370 -841100
44373 -841100 -1971929 -2348798 -1695833 -552427 181191 19405 -803444 -1721135 -2348121
44364 -2348121 -2588693 -2450166 -1937541 -1132834 -278097 312168 462726 215062 -355290
44355 -355290 -1262044 -2336946 -2953756 -2459673 -1026511 319609 798960 695088 735286
44346 735286 965429 762200 -141722 -1196461 -1727642 -1702423 -1589331 -1659561 -1625313 -948027
44336i48027J473646J699271J022077p2920p69054p77323m53651j64010M1848
44327A051857J40135K5869j88930k30392j43064k55151n51631o09466l20027j05140
44317a185940j87704k42757o0090O9908j1342L4144L17125K99003l06210q13342
44307b087205m73759L81295Q71442Q36256P45037O52891J84795n22493p72038
44298a83779l61647K2508k59342r37353j167331n10593N38624R68007L39539n22166
44288b073533l75234P64843J477760Q77864r2346p0311P41341J066465N39279
44279B856128n7061l23893o97107j272460j423082r06640k86425J13568O47059
44270a349913J297842J238460J19554j055943j154442l92885J79609J84490Q1123
$$ plain form
44336 -948027 525619 2224890 3246967 3174047 2404993 1627670 1174019 1010009 1051857
44327 1051857 1191992 1217861 1028931 798539 655475 400324 -151307 -760773 -1080800 -1185940
44317 -1185940 -1373644 -1616401 -1676491 -1606583 -1617925 -1583781 -1266656 -967653 -1273863 -2087205
44307 -2087205 -2560964 -2179669 -1308227 -471971 273066 925957 1110752 588259 -183779
44298 -183779 -545426 -522918 -782260 -1719613 -2886944 -3397537 -2858913 -1890906 -1551367 -2073533
44288 -2073533 -2448767 -1683924 -206164 671700 579354 509043 1250384 2316849 2856128
44279 2856128 2799067 2475174 1778067 505607 -917475 -1824115 -2110540 -1996972 -1349913
44270 -1349913 -52071 1186389 1305943 250000 -904442 -1297327 -1117718 -933228 -852105
44261h52105J54275J74666K9868K1059L80154Q78926J066523P34829J11504l51316
44251B348383m23751l06626k78237k81616j55966j01124m07151p90523o30528
44242a027139M1064M41313J51465k98961k88002N4101K84262M07345O67063R41356
44232A373867Q81991M67353J1645k39443k54953j43772j36670m22247q53244j081670
44222c97143j058141j011432q74706k83860O72015J298169J181966O64605J46340
44213C37813l98788q24323n20823N99798J482102J117738q1919q93880q70295
44204e2577m86379o4772M60630Q51968O44840J2529l10425j42690j04783n07809
44194C00532p64400l37254L50817N31054K26941J54971O05636J002894P45574
$$ plain form
44261 -852105 -697830 -523164 -493296 -472237 -92083 786843 1853366 2588195 2699699 2348383
44251 2348383 1924632 1618006 1339769 1058153 902187 801063 393912 -396611 -1027139
44242 -1027139 -986075 -544762 -393297 -692258 -980260 -926159 -641897 -234552 432511 1373867
44232 1373867 2255858 2723211 2734856 2495413 2240460 2096688 1960018 1537771 684527 -397143
44222 -397143 -1455284 -2466716 -3341422 -3625282 -2953267 -1655098 -473132 191473 337813
44213 337813 -60975 -885298 -1406121 -806323 675779 1793517 1711598 817718 -52577
44204 -52577 -538956 -603728 -143098 708870 1353710 1366239 1055814 913124 808341 300532
44194 300532 -463868 -801122 -450305 80749 307690 462661 1068297 2071191 2816765
44185B816765Q2724k35276m7397l3640o83987j460734j467853o81996J11802M82470
44175a117122P00372R02917P85205L72085K16468L96673J86425o77930j255207
44166E09886p26860K75856O16211L04261J47013K35117k7332o15141p83649k91782
44156c56420K58484L65115R3254l66312q21613q80727m39344j66422o14545j142276
44146d070806q06121j5372N3128m98676m39495L40337N52493p7750m9643J324994
44136c686911K368071J484971k63956p39062J40727O63169J45593l60286q5542
44127c33226L93748L90409J19270O6396K58781M91264O01334L80844j45441l81703
44117A841676J39484P83110M70434o26364j099216l12177O50041N98219j19669
$$ plain form
44185 2816765 2899489 2664213 2616816 2583176 1899189 438455 -1029398 -1711394 -1599592 -1117122
44175 -1117122 -416750 486167 1271372 1643457 1859925 2256598 2443023 1765093 509886
44166 509886 -216974 58882 675093 979354 1126367 1361484 1334152 719011 -64638 -356420
44156 -356420 -97936 267179 360433 -5879 -827492 -1708219 -2147563 -2313985 -2928530 -4070806
44146 -4070806 -4876927 -4892299 -4839171 -5337847 -5777342 -5437005 -4884512 -4962262 -5011905 -3686911
44136 -3686911 -1318840 166131 -97825 -836887 -696160 -32991 112602 -247684 -333226
44127 -333226 60522 450931 570201 636597 895378 1386642 1987976 2368820 2223379 1841676
44117 1841676 1981160 2764270 3234704 2608340 1509124 1196947 1846988 2445207 2325538
44108B325538l85857l5097J37637k64869q00228j015827r22736n91833n938M98297
44098a060913L16460n24317j089714o61279K47200N70143J19105l52105l85999
44089b821419k95796k72323P2126P90146J059101L39471n60511n62366q111q0679
44079b340361p38432o48118N66119J422667O72084q34518j367017o23424K70834
44070c620166N61341N22249N08374M21698K38552K41552M83258N88177L03953
44061B48988j58926m79858n75729m74734j36811M15655Q88339P84963j27167j274615
44051h89895j492245l13554J111182J194839N9710n24744L16150J281671R18767
44042A661881k36079p11757l57028q6610m7798L05028O60226J28785r43756j166678
$$ plain form
44108 2325538 1939681 1904584 2042221 1777352 977124 -38703 -961439 -1553272 -1559210 -1060913
44098 -1060913 -744453 -1268770 -2358484 -3019763 -2772563 -2202420 -2083315 -2435420 -2821419
44089 -2821419 -3117215 -3389538 -3317412 -2527266 -1468165 -1128694 -1689205 -2251571 -2259682 -2340361
44079 -2340361 -3078793 -3726911 -3160792 -1738125 -1066041 -1900559 -3267576 -3891000 -3620166
44070 -3620166 -3058825 -2536576 -2028202 -1606504 -1367952 -1126400 -643142 -54965 248988
44061 248988 90062 -389796 -965525 -1440259 -1577070 -1161415 -273076 511887 384720 -889895
44051 -889895 -2382140 -2695694 -1584512 -389673 -329963 -854707 -538557 743114 1661881
44042 1661881 1425802 714045 357017 270407 222609 527637 1187863 1316648 372892 -793786
44032g93786l31693K19790j41901m04845R1792M26459j30912o38591q8064P63048
44022a028703O59109k8877p3413M11233K83716m59901o14478Q9742M40705k40390
44012e61257r75943p14776R6173L80887P4145l6113L36901O50558M44084q1269
44002c86610m56807m86645k66776P4187M80637Q75642J083021R45085N38619J58412
43992B558765l63l6228j27686k73799l74033l93929k93237J1595M11637N43074
43982B025796K03783l63049q26923j148277j330032j140955n06008J38576L74949
43973b572140L97426N28025M93948n0521n73592k48127N73163O16825l28490q71828
43963b035311n2475J165562J325895N36575l4553j10610m06285r80831q94820
$$ plain form
44032 -793786 -1125479 -905689 -1047590 -1452435 -1360643 -934184 -1065096 -1703687 -1791751 -1028703
44022 -1028703 -369594 -398471 -471884 -60651 223065 -236836 -851314 -761572 -320867 -561257
44012 -561257 -1537200 -2251976 -2155803 -1774916 -1700771 -1736884 -1399983 -749425 -305341 -386610
44002 -386610 -843417 -1330062 -1596838 -1522651 -1042014 -166372 916649 1861734 2400353 2558765
43992 2558765 2558402 2522174 2394488 2120689 1746656 1352727 1059490 1071085 1482722 2025796
43982 2025796 2229579 1866530 1039607 -108670 -1438702 -2579657 -3085665 -2947089 -2572140
43973 -2572140 -2174714 -1646689 -1152741 -1203262 -1776854 -2024981 -1451818 -834993 -1163483 -2035311
43963 -2035311 -2087786 -922224 403671 940246 905693 795083 388798 -592033 -1486853
43954a486853J90814J226616J172167L69294j22941L3086L60496M99366N09311
43945B751356M11330P1588m29167p63789p55479n02145j40173J89246J97706l02598
43935G27875r40477r82692j96197P57018J007869L99682m45819q31921n81357
43926a086019l4352L47545L51320P6556k77716n72415o47594l17166L19687P56457
43916a083697O44518L51209M57581P59416M50948n34237j137172n91589M50167
43907b32856Q78096O45771M72305M44794N969p62180j000967m89543j63509o78146
43897h80266j272016p92675O51884J797311J741999P83564j45279m29376j84182
43888A270964L4095m8314k9701N24564J139864Q20925m27067j268417p24556N32475
$$ plain form
43954 -1486853 -1296039 -69423 1102744 1472038 1349097 1382183 1742679 2242045 2751356
43945 2751356 3162686 3234274 2805107 2041318 1285839 783694 643521 832767 1030473 727875
43935 727875 -212602 -1195294 -1391491 -634473 373396 773078 327259 -504662 -1086019
43926 -1086019 -1120371 -772826 -421506 -344950 -622666 -1195081 -1842675 -2159841 -1840154 -1083697
43916 -1083697 -439179 -87970 369611 1129027 1579975 1045738 -91434 -683023 -232856
43907 -232856 645240 1291011 1763316 2208110 2214079 1451899 450932 -38611 -202120 -880266
43897 -880266 -2152282 -2944957 -2293073 -495762 1246237 2029801 1884522 1455146 1270964
43888 1270964 1305059 1256745 1227044 1751608 2891472 3712397 3285330 2016913 1292357 1824832
43878A824832J241253J224449J112699R49775K18853r25173j570647j306917o68608
43869B100516j83403K02252N71518O92303M73395J23590k97282q37251j122336
43860A723302p06666o5769k30928j119852j334135k11131J000170Q97609o1878
43851a09278m30041L5775L38613M5409k13999l1785K11920K59680L74407N24508
43841A005209J95961n22118o35353K79250J102136N91803p46940j250902l69929
43832c50883O83452P03743k2127m60234l31595j40117r4344J41882O13854P57290
43822A500921K23884n13996p83368n42176j75979J64539M94084N68749J99704
43813A136362j70884N3574N96112N46121k49924q58532o08281K8084L17378K54912
$$ plain form
43878 1824832 3066085 4290534 5403233 6353008 6571861 5646688 4076041 2769124 2100516
43869 2100516 1917113 2119365 2690883 3383186 3856581 3980171 3682889 2845638 1723302
43860 1723302 1016636 950867 719939 -399913 -1734048 -1945179 -945009 -47400 -109278
43851 -109278 -539319 -503544 -164931 -119522 -333521 -365306 -153386 106294 480701 1005209
43841 1005209 1201170 679052 43699 322949 1425085 2016888 1269948 19046 -350883
43832 -350883 332569 1036312 1014185 553951 222356 82239 -12105 129777 743631 1500921
43822 1500921 1724805 1210809 427441 -114735 -290714 -126175 367909 936658 1136362
43813 1136362 965478 1019052 1615164 2161285 1911361 1052829 444548 472632 790010 1044922
43803A044922J22606j85390o83462q12483k73187K32783J4832l88353q4967N21547
43793d91152K79170o97550j008628j40394P51810P11705L44060N52442R90391
43784A291854P56648q5368o81793o59330l52833l8298K81917M64749K54205k84857
43774I46894p77058r19533o20602q8N19449M92990J06784J03512P06754J137685
43764A696787O72456l24818r75319j009819p19623k74277K05725L30423k9387
43755d27852k61239J45425O43438L95573l43835o16730k82610n4492j43888n2307
43745i98517K52638J83097k24962j27571O55702J116139N61570l45125o57771
43736D15200l47908J69394P64902J134320N76791q15458j575564o07476J068730
$$ plain form
43803 1044922 1167528 982138 298676 -513807 -786994 -554211 -539379 -927732 -1012699 -491152
43793 -491152 -211982 -909532 -1918160 -2058554 -1306744 -595039 -250979 301463 1291854
43784 1291854 2048502 1963134 1281341 622011 269178 230880 512797 977546 1231751 946894
43774 946894 169836 -749697 -1370299 -1370387 -850938 -357948 -251164 -147652 559102 1696787
43764 1696787 2369243 2044425 1069106 59287 -660336 -934613 -728888 -398465 -427852
43755 -427852 -689091 -543666 99772 495345 151510 -465220 -747830 -802322 -946210 -998517
43745 -998517 -745879 -562782 -787744 -915315 -259613 856526 1418096 1072971 415200
43736 415200 67292 236686 1001588 2135908 2712699 1897241 321677 -285799 782931
43727G82931J509457M27033o24549n07019K39222N34163J52272l85981o24651
43718A502878m95097k25364j45891l45149n24986m43392l08216l64432l59984
43709a709633O3608O85566R92838R36829P74484M02698l60189r93942p13874K68101
43699C46486Q46127N60156J20322J07210J03869l45314p55304m36789L49973P48222
43689A644958M70212p4746n60969r73061j175205r07824k68844K96814N73227
43680i75438P26192P82596L89115o17766j652390j794990q21100M60736J090674
43671b412371R87753P90720Q07823O77047K01227j37324K4706J75485k97961r60354
43661a43249q63326p6491L22530j12004n74672l70433M4405m4001m24280l75156
$$ plain form
43727 782931 2292388 2719421 2094872 1587853 1827075 2361238 2513510 2127529 1502878
43718 1502878 1007781 782417 636526 291377 -233609 -677001 -985217 -1349649 -1709633
43709 -1709633 -1646025 -960459 32379 969208 1743692 2146390 1786201 792259 78385 346486
43699 346486 1192613 1752769 1873091 1980301 2084170 1738856 983552 546763 896736 1644958
43689 1644958 2115170 2040424 1479455 506394 -668811 -1576635 -1845479 -1548665 -975438
43680 -975438 -249246 533350 922465 304699 -1347691 -3142681 -3963781 -3503045 -2412371
43671 -2412371 -1424618 -633898 173925 850972 1052199 914875 939581 1115066 817105 -143249
43661 -143249 -1006575 -1083066 -760536 -872540 -1447212 -1817645 -1773240 -1817241 -2241521 -2616677
43651b616677K34754R20392J305681J306390Q74086Q4189o95911j095127j021578
43642g03801n05907L24371R41356P08078j75287o69001k90459J95181N9398k09509
43632c25580J39877P01893N53227j53362m27776m9554K27560J3940k79756l80657
43622A9812m67762m51908M370N83674N04220j25752k47861M35886P93428m9737
43612I98370j306194j618271q38631R7015N28631N05127K65202M3914J45357N85059
43602e94421Q62657N72915j7558m16242n55885n51422k64725L06852O44254M01938
43592C88363J19362M53899R89241P18340l66241j097439p18169J48065M23152
43583A058573j23775q39104j023526n24010J96354L99079k19519j058182j189221
$$ plain form
43651 -2616677 -2381923 -1461531 -155850 1150540 2024626 2108815 1412904 317777 -703801
43642 -703801 -1209708 -885337 56019 764097 588810 -80191 -370650 -175469 -116071 -325580
43632 -325580 -185703 516190 1069417 916055 488279 438725 666285 680225 400469 19812
43622 19812 -447950 -899858 -895488 -311814 192406 66654 -181207 254679 1048107 998370
43612 998370 -307824 -1926095 -2764726 -2667711 -2139080 -1633953 -1368751 -1324837 -1179480 -594421
43602 -594421 268236 841151 823593 407351 -148534 -699956 -964681 -657829 -13575 388363
43592 388363 507725 961624 1950865 2669205 2302964 1205525 487356 635421 1058573
43583 1058573 934798 95694 -927832 -1451842 -1255488 -856409 -1075928 -2134110 -3323331
43574c323331m62829L85985P87204R23418J062684R55443L94065j27235o882M40603
43564A029125K92489o10143j265627p80261M23784J077142N21936o66656j422299
43555a400510j207432k84432O97767J209246J104103N98160J6670m53767p42865
43546d63060p33487l51337J67079L91833K36208J05449K91053N05311L60523M7216
43536E56788L6779K50857J29263m37932q62510p42903m24721l42123l06723P2005
43526b071220O28730Q57141O84538N03378N09564M91174K78391k6918l25339o26034
43516I03405p65827m00084M82973J274408J260096L82206o84903j209982j035355
43507B06937n37069j20343J00880J89034J92237J83103K91606M91888N01560J53263
$$ plain form
43574 -3323331 -3786160 -3400175 -2612971 -1689553 -626869 328574 722639 595404 588522 1029125
43564 1029125 1321614 711471 -554156 -1334417 -910633 166509 688445 21789 -1400510
43555 -1400510 -2607942 -2892374 -2194607 -985361 118742 716902 733572 279805 -463060
43546 -463060 -1196547 -1547884 -1380805 -988972 -752764 -647315 -356262 149049 509572 556788
43536 556788 593567 844424 973687 535755 -326755 -1069658 -1494379 -1836502 -2143225 -2071220
43526 -2071220 -1442490 -585349 99189 602567 1112131 1603305 1881696 1854778 1529439 903405
43516 903405 137578 -262506 220467 1494875 2754971 3137177 2452274 1242292 206937
43507 206937 -330132 -450475 -349595 -160561 31676 214779 506385 998273 1499833 1653096
43497A653096k52942k92720l2481Q6490m7323q2720J47494L21837J65609j21026
43487A545314k15809j27712p9535k14868n44798q56995o47174L37689J385780
43478E81892J335327J05465r88169r06243j85004M7287l05687m85081j92754J90190
43468h02777M43138O89546Q46026O49934J92483j98028m78306p03163n71927J07315
43458A74241P33468N43365j87243m34162J14167P13858O84159Q0878p03569j190445
43448E28717p76162N67473J592723R13424r99608k094597j293894L26270J237925
43439B271J172822O52416n107n00383l88430J54173K77646j83750k85642M05318
43429A301334Q97221M13446j88104J47014Q05900N30805m47232q77590o06300
$$ plain form
43497 1653096 1400154 1107434 1074953 1161443 1114120 1031400 1178894 1500731 1666340 1545314
43487 1545314 1329505 1201793 1122258 907390 362592 -494403 -1141577 -803888 581892
43478 581892 1917219 2022684 1034515 128272 -56732 -9445 -315132 -800213 -992967 -802777
43468 -802777 -359639 329907 1175933 1825867 2018350 1820322 1342016 638853 66926 174241
43458 174241 907709 1451074 1263831 829669 943836 1657694 2341853 2422731 1719162 528717
43448 528717 -247445 320028 1912751 2826175 1826567 -268030 -1561924 -1235654 2271
43439 2271 1175093 1827509 1822402 1322019 933589 1087762 1365408 1181658 896016 1301334
43429 1301334 2198555 2612001 2423897 2570911 3376811 3907616 3460384 2582794 1976494
43420A976494n89044j001932r58811j93523M45319M37470K46956K32977R6392
43411F92298k21638k10192J96662L05761j35246l89728L7222N11911L11130k01627
43401H96553k28913J74299K88311q6914l80824j42114L64911N60329K62434j40419
43391A567653k10892o2628j94565o53047q21923m02931m2563k91152m73558L40715
43381a244891J559327J603390K80118p95379n61290Q1338m3937n36518l23912
43372A8246M92263R02960N82732J31046L6228K90098P37685J015220N08538p76742
43362C938274j679942j182550M7275M52001k44848q00222m09811K64152L24504
43353G08833j46066o03467r22573j141544r70204k28975O17228R54532P99802
$$ plain form
43420 1976494 1387450 385518 -573293 -766816 -321497 115973 362929 595906 692298
43411 692298 470660 260468 457130 762891 627645 237917 275139 787050 1098180 896553
43401 896553 667640 841939 1130250 1043336 662512 520398 885309 1445638 1708072 1567653
43391 1567653 1356761 1294133 1099568 446521 -375402 -778333 -820896 -1112048 -1585606 -1244891
43381 -1244891 314436 1917826 2197944 1402565 841275 922613 878676 342158 18246
43372 18246 510509 1413469 1996201 2127247 2163475 2453573 3191258 4206478 4715016 3938274
43362 3938274 2258332 1075782 1123057 1575058 1330210 529988 120177 384329 708833
43353 708833 562767 -40700 -963273 -2104817 -3075021 -3303996 -2686768 -1732236 -932434
43344i32434O20616O14834O26280N94730O12842N92449L04632j84749m50324k26732
43334B172144J97793K72840j96936q60802j241854j193082q41296k70203M17916
43325a543480P86328L29203o92846j161395l55122J003220J566635J065199M81069
43316A478811N39023Q48466Q20929O32002O64112N74524k60704j589981k356028
43307A351154j981836r83830j68891K42762M61779N72835N14962L46669J71543
43298E27147m7690l19725m36314k59444l5143m9346j02123J96916O44938N52547
43288F71763j91115p58018m83043J64606K59212k85739p45053o96984m02897j27707
43278b594975J80363M22682K86461r0013n4349N67092R98261N40604l87333q02836
$$ plain form
43344 -932434 -311818 303016 929296 1524026 2136868 2729317 3033949 2849200 2398876 2172144
43334 2172144 2369937 2642777 2445841 1585039 343185 -849897 -1691193 -1961396 -1543480
43325 -1543480 -757152 -427949 -1120795 -2282190 -2637312 -1634092 -67457 997742 1478811
43316 1478811 2017834 2866300 3687229 4319231 4983343 5557867 5297163 3707182 1351154
43307 1351154 -630682 -1614512 -1783403 -1540641 -1078862 -506027 8935 355604 527147
43298 527147 479457 159732 -276582 -536026 -571169 -620515 -722638 -525722 119216 671763
43288 671763 480648 -277370 -760413 -595807 -336595 -622334 -1367387 -2064371 -2467268 -2594975
43278 -2594975 -2414612 -1991930 -1705469 -1795482 -1849831 -1282739 -284478 256126 -131207 -934043
43268i34043m28607J58620M31955M00339K74936J44398J7591j19886k91014m14076
43258g59787l63959k65470l82158n30071j30650P76273J197858N13324m39984
43249c84624m77836K03097M95855K66137M25537J108266J239815L75133l99478
43240B851902j94199K29596k07956j050361j072979l23161q799n54721j086129
43231a416807r26332m12650M8795O26052J270352J266814L10115o72771n92803
43222d99235L42111J007858Q92997M48890Q4030l14174p53912q44699m68262j21154
43212b25550j51834j53943L46765R70100Q88741P826q77228j090412o79147K2012
43202i42670P90081J266662R57600o0913q93245q22864k54476r6032m31358m86380
$$ plain form
43268 -934043 -1362650 -1204030 -772075 -371736 -96800 47598 65189 -54697 -345711 -759787
43258 -759787 -1123746 -1389216 -1771374 -2301445 -2432095 -1655822 -457964 55360 -384624
43249 -384624 -862460 -659363 -163508 102629 528166 1636432 2876247 3251380 2851902
43240 2851902 2657703 2887299 2679343 1628982 556003 232842 224043 -330678 -1416807
43231 -1416807 -2343139 -2755789 -2706994 -2080942 -810590 456224 766339 93568 -499235
43222 -499235 -157124 850734 1743731 2192621 2276651 1962477 1208565 363866 -104396 -225550
43212 -225550 -377384 -531327 -184562 785538 1674279 1682105 804877 -285535 -964682 -942670
43202 -942670 -152589 1114073 2071673 2010760 1117515 294651 40175 -55857 -487215 -973595
43192i73595J10527P42977P24245K48477J2595K06328L39414J4722m94389n83180
43182C48121q6485M80617N26087J04835j84568k5318K27523J58191o4070k7461
43172A457472J95965J84171p4801j21028K10136M81776L09845j06135l53305l55641
43162A828455k86298k24726j95395l19261o10259p67439m91829L0003K48368o2165
43152h50546m31720k03637N99932J147078P44893k17973o80099k85662J94432
43143A6698Q9795j46804K29990Q86208P82692k15685j046942r13642k18357K41025
43133b95022K97787K58170K78060K93493J91325j77667p61271j012110m17483
43124a344718N71396Q68179K29920l89761k92331L8732k9260k07333J8372L72994
$$ plain form
43192 -973595 -863068 -120091 604154 852631 865226 1071554 1410968 1425690 931301 348121
43182 348121 261636 742253 1268340 1373175 1188607 1163289 1390812 1549003 1484933 1457472
43172 1457472 1653437 1837608 1762807 1641779 1851915 2333691 2643536 2537401 2184096 1828455
43162 1828455 1542157 1317431 1122036 802775 192516 -574923 -1066752 -1036749 -788381 -850546
43152 -850546 -1282266 -1485903 -885971 261107 1006000 788027 107928 -177734 16698
43143 16698 106493 -40311 189679 1075887 1858579 1642894 595952 -317690 -536047 -295022
43133 -295022 2765 260935 538995 832488 1023813 846146 84875 -927235 -1344718
43124 -1344718 -773322 94857 324777 -64984 -357315 -318583 -347843 -555176 -536804 -163810
43114a63810L31522Q3435J00376K40285J31902k6872O0600O149n75195j020455
43104h32063m24728P34536R94824n6128j259957j537591j024707l36706L12002
43095c430518Q65751J091630R11495N45091J11892l96308p03409m63853N3090
43086a415139J97227q1818k25448o2453M2172Q4793M54497Q88491N45427m64207
43076c6458q02131J52784J163034Q60378k76244p59048k52551K89045K69002M3250
43066F51061m8673j81745m29110m98601l22197k47695l99182m05048m1061L24120
43056a598131K69684k8085q4841J27519J49087j76751l04520K57787J029642R98542
43046F39933O3283o56273l60775K68781J97982k74378p8642O81138P27208k97882
$$ plain form
43114 -163810 167712 251147 351523 591808 723710 696838 757438 763587 188392 -832063
43104 -832063 -1256791 -522255 472569 416441 -843516 -2381107 -3405814 -3742520 -3430518
43095 -3430518 -2564767 -1473137 -561642 -16551 95341 -300967 -1004376 -1468229 -1415139
43086 -1415139 -1217912 -1299730 -1525178 -1587631 -1545459 -1460666 -1006169 -117678 427749 -36458
43076 -36458 -838589 -685805 477229 1337607 1061363 302315 49764 338809 607811 651061
43066 651061 602388 420643 -8467 -507068 -829265 -1076960 -1476142 -1881190 -1922251 -1598131
43056 -1598131 -1328447 -1356532 -1441373 -1313854 -1164767 -1341518 -1646038 -1388251 -358609 639933
43046 639933 703216 46943 -313832 -45051 152931 -121447 -200089 481049 1208257 910375
43036I10375j113881p16552J92317M51171J00445j04474o163J16502L50667P51143
43026I31550O67769m25777j748884j934269q16768M24233Q55836O78334N07393
43017h60583N35766N47021K56228l96396r70373p90242J18966P79949M97999j34871
43007d16536j70081K81292M54544K84973K75661L43663O892m33035j80849N32790
42997I79314N20657n02566j339631j015820J47P50124R61012P37808N1129p99718
42987C42456j018983l15073N56608Q32102O78030N37526K64294l67388r00858
42978F08714p56750j41486L21779N04060O35949O23052K24107l25971n48195m21837
42968G23422k91275k52699j68750r8665j79784k63811j70238p0306j01826Q3381
$$ plain form
43036 910375 -203506 -920058 -727741 -276570 -176125 -280599 -286762 -170260 180407 931550
43026 931550 1599319 1173542 -575342 -2509611 -3326379 -2902146 -2046310 -1367976 -860583
43017 -860583 -324817 222204 478432 82036 -888337 -1678579 -1559613 -779664 -281665 -416536
43007 -416536 -586617 -305325 149219 434192 709853 1053516 1060408 627373 446524 979314
42997 979314 1499971 997405 -342226 -1358046 -1357899 -607775 353237 1091045 1142174 342456
42987 342456 -676527 -991600 -434992 397110 1075140 1612666 1876960 1509572 608714
42978 608714 -148036 -289522 32257 536317 1172266 1795318 2019425 1693454 1145259 723422
42968 723422 432147 179448 10698 -87967 -267751 -531562 -701800 -772106 -873932 -790551
42958g90551P20472J167890O05619n81751j045954k67055P53434R35901M74215
42949A972220K01314K57601J65577j28055j60907J02198N1860n31785q75793k13777
42939H40453R77174J428849P12664k46354m51373k2783K53614N8094l15822o12646
42929B621870q07172p95130m68280p0937R316j96272l07328j68320P9255L74768
42919B71770O63650N78861j45068r87174j098815n00073o1820j72127k43816J77137
42909a517475O24144M70462j67422p07470p41972j20995R53085J642871J075480
42900A510708l87848j300425r92196l74883l41896m31947N0095O07973M35399
42891a225020o1519M7018N44901M69776j50209l53300Q8002L97153K22312O9628
$$ plain form
42958 -790551 -70079 1097811 1703430 1121679 75725 -191330 562104 1498005 1972220
42949 1972220 2173534 2431135 2596712 2468657 2307750 2409948 2461808 1930023 1054230 840453
42939 840453 1817627 3246476 3959140 3712786 3261413 3238630 3492244 3550338 3234516 2621870
42929 2621870 1814698 1019568 551288 480351 489667 293395 -13933 -182253 -102998 271770
42919 271770 935420 1514281 1369213 382039 -716776 -1216849 -1278669 -1450796 -1694612 -1517475
42909 -1517475 -893331 -422869 -590291 -1297761 -2039733 -2160728 -1207643 435228 1510708
42900 1510708 1122860 -177565 -1169761 -1544644 -1886540 -2318487 -2268392 -1660419 -1225020
42891 -1225020 -1286539 -1239521 -694620 -224844 -375053 -728353 -640351 -243198 -20886 48742
42881D8742J68317R9704k06957k25072J34170K80484L4611p3388Q5016q8415o94413
42870d37201q67621j32203P44583R19613O03739L32283J1991m61836m84835L15398
42860E43911J060504O87322l75438p53565j45429L69511P6997m30282l84414q19
42850F48298M8658k64934l66607K2594N09039N54978J29223k61342j52165L40208
42840A207950O85861O38830M94909N16665M51448j7222n99210o90866k63032O6763
42830B492096q2596l91141m35246k95510k55381k53593o7677J59373N4641l53153
42820E71813n84501l79063p909K42388M60497O74011M66885l92975j210039r96813
42810a155706J35528R87325Q80958M76138N39015O87271J52560p68235j050175
$$ plain form
42881 48742 217059 316763 109806 -115266 18904 299388 333999 260611 345627 257212 -437201
42870 -437201 -1304822 -1437025 -692442 227171 830910 1163193 1175184 713348 228513 543911
42860 543911 1604415 2291737 1916299 1162734 1017305 1386816 1463813 1033531 649117 648298
42850 648298 696956 432022 65415 88009 597048 1152026 1281249 1019907 867742 1207950
42840 1207950 1893811 2532641 3027550 3544215 3995663 3978441 3379231 2688365 2425333 2492096
42830 2492096 2409500 2018359 1583113 1287603 1032222 778629 710952 870325 924966 571813
42820 571813 -12688 -391751 -399660 -157272 303225 977236 1444121 1051146 -158893 -1155706
42810 -1155706 -1020178 -32853 848105 1324243 1863258 2550529 2703089 1934854 884679
42801H84679n25642r0642k35766l49486J51988Q17140Q50041K65478k50728l22333
42791A194729j69779o0952M9918L10234O78673R01924O95087K3951p15586r43592
42781A964607m56082L39897Q27440P39234K94605j00582k36688k37815l15834
42772B818782m09686k52759J49586M21044L66477K34184J34079k96938j100030
42763B064739j390992m55316Q46517Q95228m04638j312903o19849P35255J109094
42754A467135L75190k36126l4679M01808L42772q6166k88285j18250j7801k90277
42744A515321n53808k19602N24309P17956n4999q81522p11686P3851K25259m49790
42734A85289q52130l75659K55309L08202R4632J28713K24044J20021J24035L71910
$$ plain form
42801 884679 359037 268395 32629 -316857 -164869 652271 1502312 1767790 1517062 1194729
42791 1194729 1024950 963998 1013916 1324150 2002823 2904747 3599834 3623785 2908199 1964607
42781 1964607 1508525 1848422 2675862 3415096 3709701 3609119 3372431 3134616 2818782
42772 2818782 2409096 2156337 2305923 2726967 3093444 3327628 3461707 3164769 2064739
42763 2064739 673747 218431 1064948 1960176 1555538 242635 -377214 358041 1467135
42754 1467135 1842325 1606199 1571520 1973328 2316100 2229934 1941649 1823399 1805598 1515321
42744 1515321 961513 741911 1266220 1984176 1929177 1047655 335969 409820 635079 185289
42734 185289 -666841 -1042500 -787191 -478989 -384357 -255644 -31600 88421 212456 584366
42724E84366K71335m75587j052587o70339J33975L60390J57154M33581J198210
42715I40498J444897O68921m46231r53886n93882J92749O85613M20049k93192
42706B065536o31535l69163k01388n21649o31877O9175Q62716P10955j01252m76564
42696G74954k23831o2048k15787k50175j44693l23565o77671o72926l56764j81847
42686b334353n920N44636R29515L12477p57066q10983K73375J031377O91978J02289
42676b2675n0554k80697q56130q80603J79170J316776J372449N79856j55320n08214
42666F94058m33931K86792J261473J330021K31580o19679j33905P45015O05230
42657C966654j97984m10284j21971l64764r80259p70055L08100Q47933J56413
$$ plain form
42724 584366 855701 380114 -672473 -1342812 -1208837 -848447 -691293 -257712 940498
42715 940498 2385395 3054316 2608085 1654199 1060317 1253066 1938679 2358728 2065536
42706 2065536 1434001 1064838 863450 341801 -290076 -220901 641815 1352770 1251518 774954
42696 774954 551123 489075 273288 23113 -121580 -445145 -1122816 -1795742 -2152506 -2334353
42686 -2334353 -2340273 -1795637 -866122 -553645 -1310711 -2121694 -1848319 -816942 -124964 -22675
42676 -22675 -73229 -353926 -1210056 -2090659 -1911489 -594713 777736 1357592 1202272 694058
42666 694058 260127 546919 1808392 3138413 3369993 2750314 2616409 3361424 3966654
42657 3966654 3768670 3358386 3236415 2871651 1891392 1121337 1429437 2277370 2433783
42648B433783p72904q64405l06640J85551M14237M58755K10987k90040o13792
42639H55532m64710p7759J50684R1876j46893l34532j95300K74616O59239O44001
42629A456754M72842M77456M90975K74330J16156K88810L17093l06714j015505
42620B572197q41236M089L92008O6173r8829K44113L41222j74784n17726j28874
42610A858353L07008N1291m30221l21298J98072M32320L95209N44288P21876L84325
42600D141223l43355p93330q31966r32628j183537j068513l77793L83237P13971
42591b92691O69753M98027K64488O6882J10879K89623J46380m10972p79388m56445
42581A06536J97589N11973N42855Q73817J428426J285088M0734j272177j302667
$$ plain form
42648 2433783 1660879 796474 489834 675385 1089622 1548377 1759364 1469324 855532
42639 855532 390822 313063 463747 555623 408730 74198 -121102 153514 812753 1456754
42629 1456754 1929596 2407052 2898027 3172357 3288513 3577323 3894416 3587702 2572197
42620 2572197 1730961 1735050 2127058 2193231 2094402 2338515 2679737 2504953 1987227 1858353
42610 1858353 2165361 2216652 1786431 1465133 1663205 2095525 2490734 3035022 3756898 4141223
42600 4141223 3797868 3004538 2172572 1239944 56407 -1012106 -1389899 -1006662 -292691
42591 -292691 377062 875089 1139577 1206459 1317338 1606961 1753341 1342369 562981 106536
42581 106536 304125 816098 1358953 2232770 3661196 4946284 4987018 3714841 2412174
42572B412174j42643P51040M13332n29967q78024l87233K06714L44057J95148
42563B384598R4159l0370m08641q78502q95980j67613Q24619J126428L27216q12571
42553A563343j072692j67685R26770J183198O30165m5711n40569r99771j304427
42544A72621j017212j31556O84891Q21345L32948l46715r11066j129434o65253
42535b189431N25343J667166J621630K43483j043234o50958J148093K293680J420140
42526E035912l99119j135018m78147J24520j13287l40892J39673N80736J81266
42517C595644m01067j34997N85023N23803m69486j340454j372912p76372L6818
42508B46000P34354Q54504L30258k4482M26571R49223M87477m83220o17600J9804
$$ plain form
42572 2412174 2269531 3020571 3433903 2903936 2025912 1638679 1845393 2189450 2384598
42563 2384598 2478757 2448387 2039746 1161244 265264 97651 922270 2048698 2375914 1563343
42553 1563343 490651 322966 1249736 2432934 3063099 3017388 2476819 1477048 172621
42544 172621 -844591 -976147 -291256 530089 863037 516322 -394744 -1524178 -2189431
42535 -2189431 -1664088 3078 1624708 1868191 824957 173999 1322092 3615772 5035912
42526 5035912 4636793 3501775 3023628 3148148 3034861 2693969 2833642 3414378 3595644
42517 3595644 3194577 3059580 3644603 4168406 3698920 2358466 985554 209182 246000
42508 246000 980354 1834858 2165116 2140634 2567205 3516428 4003905 3520685 2903085 2922889
42498B922889M5448q03929j128112j77031J011204J425295J414501J419396R49751
42489G079412j59233r03080o68969l68719q28016j276447p54339J37423L54847
42480B612879K28445N67763Q77012K36413p46113p42650J7128K07657j42336K77497
42470C393695J483631J795129N39823o73229k47631J253077K162372J816640P54179
42461A2277686l02908q69810p60600l39515j75312j40538M07281J297211J390674
42452A2784169K47375j022458j239531o47580j88294m6326K15357O11332P07548
42443A1421592L82920k4375j42399K40844J053599J687812J370973J69879r16525
42434A5244320j237657j207339j304131j172288m22598M17047O34695M20938K99148
$$ plain form
42498 2922889 2968337 2164408 1036296 859265 1870469 3295764 4710265 6129661 7079412
42489 7079412 6920179 6017099 5348130 4979411 4151395 2874948 2120609 2258032 2612879
42480 2612879 2841324 3409087 4286099 4522512 3776399 3033749 3050877 3258534 3116198 3393695
42470 3393695 4877326 6672455 7212278 6539049 6291418 7544495 9706867 11523507 12277686
42461 12277686 11974778 11104968 10344368 10004853 9829541 9689003 10096284 11393495 12784169
42452 12784169 13031544 12009086 10769555 10121975 9933681 9887355 10102712 10714044 11421592
42443 11421592 11804512 11780137 11637738 11878582 12932181 14619993 15990966 16160845 15244320
42434 15244320 14006663 12799324 11495193 10322905 9900307 10317354 10952049 11372987 11672135
42425A1672135L9262p67688j474727r71801N96896J870012K060574J629448J091473
42416A5745584L39020m87076n83537L60700J375352J328018L61781m20954l68423
42407A7650465K04182O87953Q44200Q39516R52008J253850J484483J355503R92204
42398B6264364Q08639R19978J043081J047431J152656J422587J561965J489684
42390C5710385J630562K264572L014272L404196L545586L811844M215097M619015
42382F2215529N180589N955984O455667O415788O736149Q597288J1622996J4058894
42374A27238884J5147258J6233532J8790927K2268819K4994521K6698951K8872297
42367B80245189L2513550L6444123L8068472L5111630K6553596J2980622l078202
$$ plain form
42425 11672135 11711397 10943709 9468982 8497181 9094077 10964089 13024663 14654111 15745584
42416 15745584 16084604 15597528 15013991 15374691 16750043 18078061 18439842 18018888 17650465
42407 17650465 17854647 18542600 19386800 20226316 21178324 22432174 23916657 25272160 26264364
42398 26264364 27073003 27992981 29036062 30083493 31236149 32658736 34220701 35710385
42390 35710385 37340947 39605519 42619791 46023987 49569573 53381417 57596514 62215529
42382 62215529 67396118 73352102 79807769 86223557 92959706 101556994 113179990 127238884
42374 127238884 142386142 158619674 177410601 199679420 224673941 251372892 280245189
42367 280245189 312758739 349202862 387271334 422382964 448936560 461917182 458838980
42360D58838980j7578048k6765540k9192620k6195075k0601145j4864257r861680
42353C13780615n017708M02917O117766J1193575J5435510J9529494K3256110
42346C84698279K4276796J9753986R187419m947658j9132518l0581988l7490884
42339C45763432l9157705l6702379l2727200k9221027k6114805k2495805j8582716
42332A40761795j5479905j3418568j1574773r689854q567728q503513q377363
42325F5150091p129394n287110m061093l546427k935081k131512j876115k255568
42317C5927791k352110j743230j249762j580665k156754k080116j542478j322682
42309B1899994j398104j114994m87998k48761n90024q48388n97484j52486K46083
$$ plain form
42360 458838980 441260932 414495392 385302772 359107697 338506552 323642295 313780615
42353 313780615 308762907 309165824 315283590 326477165 341912675 361442169 384698279
42346 384698279 408975075 428729061 437916480 432968822 413836304 383254316 345763432
42339 345763432 306605727 269903348 237176148 207955121 181840316 159344511 140761795
42332 140761795 125281890 111863322 100288549 90598695 82030967 73527454 65150091
42325 65150091 58020697 52733587 48672494 45126067 42190986 40059474 38183359 35927791
42317 35927791 33575681 31832451 30582689 29002024 26845270 24765154 23222676 21899994
42309 21899994 20501890 19386896 18898898 18650137 18060113 17211725 16614241 16461755 16707838
42300A6707838Q17527J406329J198806l2004j134214r02879K53799Q52164K71788
42291A9439154p23787j302903j478939j525736j302421o46903M1804J60312l08254
42282A2352327p48722o58847j92013J19734L5600j79839k30581k39929m66324
42273I791406p23413n50062O221L42829K69446L82682R72620J180081J18715j503254
42263A0287271j971578q56557L34099K19085o50052p94643J9165O36338L75330
42254G598458k5538K99979Q96259O07983o29070j497861j038633K0000K55958
42245F487535n32888j199786r48246l01784j15887l76765m98982k83757Q247J90745
42235B428432K27740O8354j26610N8545O09297P68758M6068q60100r16006k14108
$$ plain form
42300 16707838 17525365 18931694 20130500 20098496 18964282 18061403 18315202 19167366 19439154
42291 19439154 18715367 17412464 15933525 14407789 13105368 12458465 12500269 12660581 12352327
42282 12352327 11603605 10944758 10752745 10872479 10908079 10728240 10497659 10257730 9791406
42273 9791406 9067993 8517931 8524152 8866981 9136427 9519109 10491729 11671810 11790525 10287271
42263 10287271 8315693 7459136 7793235 8012320 7362268 6567625 6586790 7223128 7598458
42254 7598458 7572920 7872899 8769158 9377141 8748071 7250210 6211577 6231577 6487535
42245 6487535 5954647 4754861 3806615 3504831 3388944 3012179 2513197 2229440 2237687 2428432
42235 2428432 2656172 2724526 2597916 2656461 3265758 4034516 4080584 3220484 2304478 2090370
42225B090370K82124K18383J09110K21152K29251N4659L9242J03185k76440r61190
42215B109846j012459r3452Q72253R51471L36198k74465o71836r47745r77757
42206B92054o96386l66978j18776K32900N65785L90886j83568l14793J95105L69441
42196C65670l14498p91270q369J205522J254947K05048m06233K4979M46151j793
42186A980154p26407p47862p8615N02048M81261J8178l56474k74652L7115m190
42176H30556m19333m17390M15654J194776Q21464l95920j159316r49950l65465
42167d44924J02522M92787O48195K71057j92270R9428R55178J252573P17586L40320
42157D242452O09414O80456m152n57140j03191O59183N24180l43499p95866m75319
$$ plain form
42225 2090370 2372494 2590877 2699987 2921139 3150390 3205049 3244291 3347476 3071036 2109846
42215 2109846 1097387 1003935 1876188 2827659 3163857 2889392 2217556 1269811 292054
42206 292054 -404332 -771310 -890086 -657186 -91401 299485 115917 -198876 -3771 365670
42196 365670 51172 -740098 -748467 457055 1712002 1917050 1510817 1535796 1981947 1980154
42186 1980154 1253747 505885 427270 929318 1410579 1428757 1072283 797631 834746 830556
42176 830556 411223 -6167 409487 1604263 2425727 2029807 870491 -79459 -444924
42167 -444924 -342402 150385 798580 1069637 877367 976795 1931973 3184546 3902132 4242452
42157 4242452 4851866 5532322 5528170 4971030 4867839 5527022 6051202 5707703 4911837 4436518
42147D436518n2666K9703L991P0617J22114J36299J51692k7843m41568m96585
42137C932272L18765J364715J391385K61279p10734m57850M94776Q73490L56831
42128G824929k01673j05974K71872J94061k33914j65106O38334J245737Q52072
42119A0320338Q3289J40390R24805J151445M07627j68131K45549Q46122O58851
42110A4610285K21583N71060J300431J104735o9606r06669p50558l38935k53610
42101A5488716n106P40324J180280N13986o93253j189290o38017K37849P92114
42092A6427603R61900Q01293K68361m29206q34663p75387n45473m37115m11729
42083A5025584l71858m30882o54966p73484n11899j40345k74815r96620j541830
$$ plain form
42147 4436518 4383852 4413555 4417546 4488163 4610277 4746576 4898268 4870425 4428857 3932272
42137 3932272 4251037 5615752 7007137 7268416 6557682 6099832 6594608 7468098 7824929
42128 7824929 7623256 7517282 7789154 7983215 7749301 7584195 8222529 9468266 10320338
42119 10320338 10403627 10544017 11468822 12620267 13027894 12859763 13105312 13951434 14610285
42110 14610285 14831868 15402928 16703359 17808094 17738488 16831819 16081261 15742326 15488716
42101 15488716 15483610 16223934 17404214 17918200 17224947 16035657 15397640 15635489 16427603
42092 16427603 17389503 18190796 18459157 18029951 17195288 16419901 15874428 15437313 15025584
42083 15025584 14653726 14222844 13567878 12794394 12282495 12142150 11867335 10870715 9328885
42074I328885j195646k60579K97496P2161m01343n26518l86824l79344n41309
42065F006979n92483l99801j13818j50k54539p26034p91651J2311J100695J227057
42055E468566J12058r88207q89912j3522M23076J58957j08943o7643l6123l8319
42045D019988K55380O18429L78264l62976o44758j25606L21299k9890o71839p51483
42035C006808l19869p698m992o0104r8094j88424j75252Q9466L56181L00368L4008
42024B932398j18164j29727j65548j98137j27452o8048j42272k01288j01119j3744
42014A666899j07724j92101p5096M428k26584m75954k06745N45183J135741J059722
42004C127769L87139m62490j057770j165343r15953o63919n01735j72584L34748
$$ plain form
42074 9328885 8133239 7872660 8170156 8242317 7840974 7314456 6927632 6548288 6006979
42065 6006979 5414496 5014695 4900877 4900727 4646188 3920154 3128503 3140814 4241509 5468566
42055 5468566 5580624 4592417 3702505 3688983 4112059 4271016 4162073 4094430 4058307 4019988
42045 4019988 4275368 4893797 5272061 4909085 4264327 4138721 4460020 4430130 3758291 3006808
42035 3006808 2686939 2679241 2674249 2614145 2516051 2327627 2152375 2241841 2598022 2898390 2932398
42024 2932398 2814234 2684507 2518959 2320822 2193370 2125322 1983050 1781762 1680643 1666899
42014 1666899 1559175 1367074 1291978 1296406 1069822 593868 387123 932306 2068047 3127769
42004 3127769 3514908 3052418 1994648 829305 -86648 -750567 -1252302 -1424886 -1090138
41995a090138N50668K78153R7365N14972J011127O91607l57573j173828j244763
41986g22410q98231m12072L38841J165479J365858O43207l93466r88555r88208
41977h89557o16310j12521J51622j37684n87003l19465P18267J385684Q74612
41968D67645p7570k75306K08173L45430j68557o16210n42859l01733j71300J11327
41958a020960N89427O93036J29182m60780l28153L28814P25753O12594M35862
41949A704775N10730N85767K91351l44775r17897j001101n20039Q6239K53876
41940F48926L6833J52815R09194J435693O77869r78377j932248j395984l42739
41931g88018J7473j13814K10155R70355J213364O10294r6306l45675m72385p91835
$$ plain form
41995 -1090138 -539470 -261317 -163952 351020 1362147 2053754 1696181 522353 -722410
41986 -722410 -1620641 -2032713 -1693872 -528393 837465 1480672 1087206 98651 -889557
41977 -889557 -1505867 -1618388 -1466766 -1604450 -2191453 -2510918 -1792651 -406967 467645
41968 467645 390075 114769 322942 668372 499815 -116395 -659254 -960987 -1132287 -1020960
41958 -1020960 -431533 261503 390685 -70095 -398248 -69434 656319 1268913 1704775
41949 1704775 2215505 2801272 3092623 2747848 1829951 828850 308811 395050 648926
41940 648926 685759 838574 1747768 3183461 3861330 2882953 950705 -445279 -788018
41931 -788018 -770545 -884359 -674204 296151 1509515 2119809 2023503 1677828 1205443 413608
41921D13608q56636k46747N56504Q12090N82626M15332L04107j90365r18980j107928
41911b36389m74715L22953N81381L24080m9460l34945m21615j08449N42954R88994
41901A134789P60423N9627n17999o88894o18560n27571m74879m30923k98449N9723
41891a542713N94583R71094R03037M86221J5326l75701o57355o58380k16015M56580
41881b3323Q35522N74556j84560r19791j051187l67412O39440J069050N58835
41872A131130k23152l75344J11025M53252J79485m03323q22941r21301n97910
41863a469079K83768J381412J783741R45519n48450j566225j583295r39219k20967
41854a932795J85705J47933j13968o4084N64236J272503J315632O72941L8951
$$ plain form
41921 413608 -443028 -689775 -133271 678819 1261445 1676777 1980884 1790519 871539 -236389
41911 -236389 -711104 -388151 193230 517310 467850 132905 -288710 -397159 145795 1134789
41901 1134789 1895212 1954839 1436840 747946 129386 -398185 -873064 -1303987 -1602436 -1542713
41891 -1542713 -948130 22964 926001 1412222 1427548 1051847 394492 -263888 -479903 -23323
41881 -23323 812199 1386755 1202195 282404 -768783 -1136195 -496755 572295 1131130
41872 1131130 907978 532634 643659 1096911 1276396 873073 50132 -871169 -1469079
41863 -1469079 -1185311 196101 1979842 2925361 2376911 810686 -772609 -1711828 -1932795
41854 -1932795 -1747090 -1599157 -1713125 -1777209 -1212973 59530 1375162 2048103 2087054
41845B087054j44813j21925j99061k61679j68316j32351l27011m63643j76973
41836I1282L91586P54416O56086K13345l08593n80088l47783J44845J76645n29544
41826F62197j170899p71967M21924J169382Q46659Q3375l52594n05165p07096
41817c24184q37740o52156l06996r53M22126R33707R16090N8517p86871n86311
41807a164771K94249N31837j75673o80276j50897P86893J127694P78672J93762
41798A541490m57133j029776j012699k41721M91013L93198j53936k35594J38172
41789e66986J93668j97129l40786L3233M09893N53091Q87084J429141J336266
41780C737475J64310j185740j526525q55541o7894L29768M45431K97839k23346
$$ plain form
41845 2087054 1942241 1820316 1621255 1359576 1191260 1058909 731898 268255 91282
41836 91282 482868 1237284 1893370 2106715 1798122 1218034 870251 1015096 1191741 662197
41826 662197 -508702 -1280669 -858745 310637 1157296 1240671 888077 382912 -324184
41817 -324184 -1161924 -1814080 -2121076 -2122029 -1699903 -766196 149894 208411 -578460 -1164771
41807 -1164771 -870522 -338685 -514358 -1194634 -1345531 -558638 569056 1347728 1541490
41798 1541490 1084357 54581 -958118 -1199839 -708826 -315628 -469564 -705158 -566986
41789 -566986 -373318 -570447 -911233 -878000 -468107 84984 972068 2401209 3737475
41780 3737475 3901785 2716045 1189520 333979 266085 595853 1041284 1339123 1115777
41771A115777p65882o92278O075N85415N39699K21795K25170N25960N73454Q4666
41761B419851n18031n29639J99532R39742Q03334j88123j099926j301958j216565
41752d91783j439960j609046r18172M40852J276158R82011L03331J66328M77671
41743h12610O22420N53557O56292Q66719O96363N9680n79451r18564j082630j083712
41733a021936o26247K69157R65977R62110N80355M29021M43141P9531o02550p76953
41723G01606m6885P77961O29440m24381j328745j424864j017413n53602r603N85169
41713b111317P36287K27076k38799O0415O30208L89093n32047p54010K32048J056396
41703c04650M51605o65732m44109R73508J421792n2320j526362q70550J064394
$$ plain form
41771 1115777 349895 -342383 -336308 249107 788806 1010601 1235771 1761731 2335185 2419851
41761 2419851 1901820 1372181 1571713 2511455 3314789 3126666 2026740 724782 -491783
41752 -491783 -1931743 -3540789 -4458961 -4018109 -2741951 -1759940 -1456609 -1290281 -812610
41743 -812610 -190190 363367 1019659 1886378 2582741 2642421 2062970 1144406 61776 -1021936
41733 -1021936 -1648183 -1379026 -413049 549061 1129416 1558437 2001578 2081109 1478559 701606
41723 701606 654721 1432682 2062122 1637741 308996 -1115868 -2133281 -2686883 -2696486 -2111317
41713 -2111317 -1375030 -1147954 -1386753 -1326338 -696130 -307037 -839084 -1593094 -1361046 -304650
41703 -304650 146955 -518777 -962886 10622 1432414 1380094 -146268 -1016818 47576
41694D7576J566617o4332j605050j199294J62655M85937k31956l99833M60500
41685g77180J133609P74774k4463n37725q46688r52765l12573R08904J342907
41676G08800K71324j022717j000048r7528K24912n5316K17018J003225R30878
41667A180548k79621j123070o58482R3994k3352n15141l55255K65578N30302M46073
41657d38426M78235M25596j13729o79204n61853r6483j54950o22730n76131J32850
41647b206825O14594L13980l49265p97493q72457n45273R9028N50212L87207J02889
41637b703403N10093J323423J379319M20243m42080l86049O2874J48044O4028
41628C76492L05139O07081L59594l93767j061247j291611j141421p62691l45310
$$ plain form
41694 47576 1614193 1549861 -55189 -1254483 -1091828 -605891 -837847 -1237680 -777180
41685 -777180 356429 1131203 1106740 569015 -277673 -1230438 -1543011 -634107 708800
41676 708800 980124 -42593 -1042641 -1140169 -915257 -970573 -753555 249670 1180548
41667 1180548 900927 -222143 -880625 -786631 -809983 -1325124 -1680379 -1414801 -884499 -438426
41657 -438426 39809 465405 351676 -327528 -889381 -985864 -1140814 -1763544 -2339675 -2206825
41647 -2206825 -1592231 -1278251 -1627516 -2425009 -3297466 -3842739 -3743711 -3193499 -2806292 -2703403
41637 -2703403 -2193310 -869887 509432 929675 487595 101546 164420 312464 376492
41628 376492 681631 1288712 1648306 1254539 193292 -1098319 -2239740 -3002431 -3347741
41619c347741p8148J24045M92502Q30360O40133O4162m9164N41186Q83323K34507
41609C35165o69238o29436K55989Q34889N79065O103m34856q50837j158522q25738
41599b557416K19001J102059R60857K6964o88449o12936j46637Q068k37531l18124
41589b244144J59559Q51241J171486J094808R77060P30238p8639j179162j503911
41580b1464o15026N09153P53663K92770k8995j28737m68103p99107l62114O53026
41570b14934J014130J52498r75596j204012n84446N1401L53030N78340P73370
41561e6219N61361j48197p26990m73777L77632O81786k60135j571558j654935
41552c271032k85027R19362N95895n45985q70076j94976J75656l65368q39730
$$ plain form
41619 -3347741 -3425889 -3301844 -2809342 -1978982 -1338849 -1274687 -1323851 -782665 100658 335165
41609 335165 -334073 -963509 -707520 127369 706434 712537 277681 -573156 -1731678 -2557416
41599 -2557416 -2338415 -1236356 -275499 -248535 -936984 -1549920 -1696557 -1688489 -1926020 -2244144
41589 -2244144 -2084585 -1233344 -61858 1032950 2010010 2740248 2661609 1482447 -21464
41580 -21464 -636490 -127337 626326 919096 890101 761364 293261 -505846 -867960 -214934
41570 -214934 799196 951694 -23902 -1227914 -1812360 -1760959 -1407929 -829589 -56219
41561 -56219 505142 356945 -370045 -843822 -466190 215596 -44539 -1616097 -3271032
41552 -3271032 -3556059 -2636697 -2040802 -2586787 -3456863 -3651839 -3476183 -3841551 -4681281
41543d681281l07224P17566J100621O17588K421j00717K79741O41376M74687k21901
41533a477123p65360m92593K95051O03684P5111n54897n27548K9199N42775P47846
41523a523855O61535L57613Q9914J17652J76461k22339p43819l83709Q67484J521026
41513I17963N65186r32442j258564m15251J88107l1595k93500q0235P8547k07285
41503a469069l57679K10957J055253J286007P31324n705l67466k97296m3316J46680
41493H89690J48374m2353l55031o25499n68206l2925N98152O30611n0043o70708
41483g7938n32940Q3529M41240L72933J87893p6871n47680q99508o76662j08332
41473a834336J94424K32717M48740O91866L94847k07269j90076N13539Q49104
$$ plain form
41543 -4681281 -4988505 -4270939 -3170318 -2552730 -2550309 -2651026 -2371285 -1729909 -1255222 -1477123
41533 -1477123 -2242483 -2735076 -2440025 -1836341 -1761230 -2316127 -2843675 -2814476 -2271701 -1523855
41523 -1523855 -862320 -504707 -414793 -297141 -120680 -343019 -1086838 -1470547 -603063 917963
41513 917963 1483149 550707 -707857 -1123108 -935001 -966596 -1260096 -1340331 -1261784 -1469069
41503 -1469069 -1826748 -1615791 -560538 725469 1456793 1451088 1083622 786326 743010 889690
41493 889690 1038064 995711 640680 15181 -553025 -585950 12202 642813 592770 -77938
41483 -77938 -610878 -527349 -86109 286824 474717 397846 -149834 -1049342 -1726004 -1834336
41473 -1834336 -1639912 -1407195 -958455 -266589 128258 -79011 -269087 244452 1093556
41464A093556K98582l72457n42635o80203j104010j021127J10134J269193J217425
41455B68458M01401J50169N46800N75301L9105k41091j01946l50965j135400j419488
41445a267656o15269M43907P72139M81334J42481j84257n57608n60085J11177
41436a233837R76978J347420J106300M37900o20401j764781k196557j541414n05643
41427c994035P2363L07222O82152R81469P45363L01569K70191L80379o5094p51022
41417a069443o32947L24541R47181O05565j1630k07369j96362k48678m9271M48437
41407h9976N66307M6073k99360J01256N33098K06790l68546l41020m7828k72684
41397C4110o10150r6988Q88874J000598J38088l62350J8978J92505n16319j095894
$$ plain form
41464 1093556 1392138 1019681 477046 -203157 -1307167 -2328294 -2218160 -948967 268458
41455 268458 669859 820028 1366828 1942129 1981234 1740143 1638197 1287232 151832 -1267656
41445 -1267656 -1882925 -1439018 -666879 -185545 -43064 -227321 -784929 -1345014 -1233837
41436 -1233837 -256859 1090561 2196861 2634761 2014360 249579 -1946978 -3488392 -3994035
41427 -3994035 -3921672 -3614450 -2932298 -1950829 -1205466 -903897 -633706 -253327 -318421 -1069443
41417 -1069443 -1702390 -1377849 -430668 174897 163267 -44102 -240464 -489142 -538413 -89976
41407 -89976 476331 522404 223044 324300 857398 1064188 695642 354622 306794 34110
41397 34110 -576040 -673028 215846 1216444 1354532 992182 1011160 1203665 687346 -408548
41387d08548n27253N14522P60874K41292q8313L5488R7391n1094m5453J55083
41377F83989K02124P2968R3248K72339K54255q6755n12787q04008q52670n82247
41367a259544j95924j71032n04640m21469M75642J252156P90882m44264r18310
41358a396503j86729O30910O25023J48116j92233m10156n08076p1563P85870J014504
41348D39163K7745j213198j387728m99910M75707J040572J267078R38593j80408
41339I07614j346599j324187r9974Q57915M38067p53317j284989n91806O47450
41330b549826J417489J252460M51468k86194n09926l46847q1372L59514J080211
41321G86977J587808J192677P2725q06288j020589j145874j529342j480053m07847
$$ plain form
41387 -408548 -935801 -421279 339595 580887 492574 528062 625453 574359 528906 683989
41377 683989 886113 959081 1052329 1324668 1578923 1492168 979381 175373 -677297 -1259544
41367 -1259544 -1455468 -1626500 -2131140 -2552609 -2076967 -824811 -33929 -478193 -1396503
41358 -1396503 -1583232 -952322 -327299 -179183 -371416 -781572 -1289648 -1361211 -575341 439163
41348 439163 466908 -746290 -2134018 -2633928 -2158221 -1117649 149429 1088022 907614
41339 907614 -438985 -1763172 -1863146 -1005231 -567164 -1320481 -2605470 -3197276 -2549826
41330 -2549826 -1132337 120123 571591 285397 -224529 -571376 -652748 -293234 786977
41321 786977 2374785 3567462 3640187 2833899 1813310 667436 -861906 -2341959 -2749806
41312b749806R17296J226815N24207k6015J23519K93148n6317l59667O5348P73373
41302G31901P19490k52302j147203j042745q0740Q45213J035103M92499k39393
41293A061823n57937k37874M21148Q35334N89593k37683j105596j404654r78705
41284a614551l08295m1245k68703m21524j6459O54104Q33742K82645l31946j92486
41274a424718O63834J341725J114936K19322n52421q32970q70141p95383k95285
41265a431101O75016J379656J124760L03862j10162K370j68561r12732j405917
41256e42809r69420q9833M11547M97394M78673J48643o87433j314073q56415K92979
41246b630747Q98459O52289M01203N59581N06225j27800p14901o90758l75214
$$ plain form
41312 -2749806 -1832510 -605695 -81488 -107503 16016 309164 252847 -106820 -41472 731901
41302 731901 1451391 1199089 51886 -990859 -1071599 -226386 808717 1301216 1061823
41293 1061823 503886 266012 687160 1522494 2112087 1874404 768808 -635846 -1614551
41284 -1614551 -1922846 -1964091 -2232794 -2654318 -2670777 -2016673 -1182931 -900286 -1232232 -1424718
41274 -1424718 -760884 580841 1695777 1915099 1362678 529708 -340433 -1135816 -1431101
41265 -1431101 -756085 623571 1748331 2052193 1942031 1944401 1775840 863108 -542809
41256 -542809 -1512229 -1602062 -1190515 -693121 -214448 -65805 -753238 -2067311 -2923726 -2630747
41246 -2630747 -1732288 -1079999 -678796 -119215 387010 259210 -455691 -1146449 -1521663
41237a521663j68837J37614O10381O47463j3536n88164l98210M8304N8828K7766
41227a160054N51749R99167L95093p22538r14752j59629Q9248o59104j085008
41218b665828k28224R46673J050782K33807l45788k19310J83070M50344M56907
41209a37567J53108j84851M3220Q24971J146652L43061p10482p45148o161J66550
41199H93353n20956q98651k42327O29887P03916K15237j923J07793k9217m77113
41189C79999o62968k98821K65540O56195Q68460R28562O73267J09201l83360m99202
41179B036873m16306m79402o63232o45522k97213J89709N89245P73911O33668
41170A721731J94251k22475l32815l60833o90376j024074n80918N81807J214774
$$ plain form
41237 -1521663 -1690500 -1552886 -942505 -295042 -308578 -896742 -1294952 -1246648 -1187820 -1160054
41227 -1160054 -608305 390862 785955 63417 -851335 -1010964 -921716 -1580820 -2665828
41218 -2665828 -2894052 -1947379 -896597 -662790 -1008578 -1227888 -1044818 -594474 -137567
41209 -137567 15541 -169310 -126090 698881 1845533 2188594 1478112 732964 726803 893353
41199 893353 372397 -526254 -768581 -138694 565222 780459 778536 886329 857112 379999
41189 379999 -282969 -581790 -316250 339945 1208405 2136967 2810234 2919435 2536075 2036873
41179 2036873 1620567 1141165 477933 -167589 -464802 -275093 314152 1088063 1721731
41170 1721731 1915982 1693507 1360692 999859 309483 -714591 -1295509 -713702 501072
41161E01072M92863o39256o50238M36687J164160P88630J36795J02319M22131
41152B755163M75860L34211K76120K2599o92498j323781j170409m96946j71288
41143I031m01326o10157m26041m9417K88949N27959M77018q60n27496n90073l32731
41132a635144k58303k27608L36056J184163J250907K91110n17154k41838M27218
41123F09407L24946l74245n41404R5631O19639L50246l37858p49652o69374k65663
41113i38327J59278J85565l39836q07040m04336O40070J119594M73462m15566
41104c27136n30448o3617K40665L79613P57177J037262M96230o05009j135158
41095B49579o91714m3764K33508M72989Q47092P13824j98117q79793l26835Q81496
$$ plain form
41161 501072 993935 354679 -295559 141128 1305288 2093918 2230713 2333032 2755163
41152 2755163 3231023 3565234 3841354 3863953 3171455 1847674 677265 180319 9031
41143 9031 -392295 -1002452 -1428493 -1477910 -1188961 -661002 -183984 -184844 -712340 -1302413 -1635144
41132 -1635144 -1893447 -2121055 -1784999 -600836 650071 941181 424027 182189 609407
41123 609407 934353 560108 18704 114335 733974 1084220 746362 -3290 -672664 -938327
41113 -938327 -779049 -593484 -933320 -1740360 -2144696 -1504626 -385032 88430 -327136
41104 -327136 -857584 -921201 -680536 -300923 456254 1493516 1989746 1384737 249579
41095 249579 -442135 -485899 -252391 220598 1067690 1781514 1583397 703604 376769 1258265
41085A258265J322770O48205k40559o30456n83173k66606K26491M16348j43522
41076B007763q76472o61328M71996J172154O71204j61003k34401K13116K43037
41067B846066l12105q28786q87174n63059p7792K27494p7774r11088j438791j023272
41057c046281r0842M99582N83483N58528M94557J44896l48223n11503k56762O9971
41047a902594K82894M30306L84554j9010m70929m20721J34894N96841N23464K6750
41037d33551n23624p45752l13368O84609J497825J359772M08356m63881o53400
41028H16986l49295q6448j96977n93675p52419j43278R67013J549431J118506
41019B329844M43150K84043J32516p28269j555793j052614L39420P62051k84777
$$ plain form
41085 1258265 2581035 3229240 2988681 2358225 1775052 1508446 1734937 2151285 2007763
41076 2007763 1131291 469963 941959 2114113 2785317 2624314 2389913 2603029 2846066
41067 2846066 2533961 1705175 818001 254942 177150 404644 326870 -584218 -2023009 -3046281
41057 -3046281 -3137123 -2637541 -2054058 -1495530 -1000973 -856077 -1204300 -1715803 -1972565 -1902594
41047 -1902594 -1619700 -1189394 -804840 -823850 -1294779 -1715500 -1580606 -983765 -460301 -433551
41037 -433551 -957175 -1702927 -2016295 -1331686 166139 1525911 1934267 1470386 816986
41028 816986 467691 381243 184266 -409409 -1161828 -1305106 -338093 1211338 2329844
41019 2329844 2772994 3057037 3189553 2461284 905491 -147123 192297 954348 669571
41010F69571j179165o69886M76888J074720J244017J499192J431845N98121k80406
41001D864897l50012r9214m72759j148986j101288m22829j30933l76964l16220
40992D45692K14870L05821m47878j202337j181051p27314m73354k68937L84950
40983b949538J327464J780661J236152N778r89614r67131r2190N39617J26073
40974A7272p85191j019679l93794J71674J35729j5142J55762K89092Q0548L603
40964a360126M46101Q38115N37343M8288L01413J001840Q83787k97987j191029
40955A207745p50043K24458K61658o52896j109007k90859R60999J351738P08768
40946A912561r5270l71568k25158p8848q1080r7072k6759K1760j43097m75022
$$ plain form
41010 669571 -509594 -1179480 -702592 372128 1616145 3115337 4547182 5145303 4864897
41001 4864897 4514885 4415671 3942912 2793926 1692638 1269809 1138876 761912 445692
40992 445692 660562 966383 518505 -683832 -1864883 -2592197 -3065551 -3334488 -2949538
40983 -2949538 -1622074 158587 1394739 1400517 410903 -556228 -648418 -108801 17272
40974 17272 -767919 -1787598 -2181392 -2009718 -1873989 -1889131 -1733369 -1444277 -1363729 -1360126
40964 -1360126 -914025 -75910 461433 509721 811134 1812974 2696761 2398774 1207745
40955 1207745 457702 682160 943818 290922 -818085 -1108944 -147945 1203793 1912561
40946 1912561 1817291 1445723 1220565 1141717 1060637 963565 936806 958566 815469 340447
40936C40447n56275p2665N08431K30031r88225j767893q21176J149643K065914
40927H8232J094388l35637n57587K31121O55765K24720l37342m85269n02623o99003
40917f23235q57339p58265n92600n08234k25750N23065J446717J872168J364880
40908A641407J14043j120382j486094p81065K49187O47352K75976j98046k67232
40899i24854m0324K80703P52592J250816J229986L85821p64978j389925j218394
40890d38557n98470M7394M39325L79401l2787k68469N2790N39601N02173J1737
40880F34138j32203L75167Q03569M35289l91411q27937p25360o38471p91136p52147
40870b010502k36076L75474N56512K53435k36042o13874o18620j43480M30841
$$ plain form
40936 340447 -215828 -288493 219938 449969 -538256 -2306149 -3127325 -1977682 88232
40927 88232 1182620 846983 289396 520517 1176282 1401002 1063660 578391 75768 -623235
40917 -623235 -1480574 -2238839 -2831439 -3339673 -3565423 -3042358 -1595641 276527 1641407
40908 1641407 1755450 635068 -851026 -1632091 -1382904 -735552 -459576 -657622 -924854
40899 -924854 -965178 -684475 68117 1318933 2548919 2934740 2169762 779837 -438557
40890 -438557 -1037027 -989633 -550308 -170907 -203694 -472163 -419373 120228 622401 634138
40880 634138 501935 877102 1680671 2115960 1724549 896612 171252 -467219 -1258355 -2010502
40870 -2010502 -2246578 -1871104 -1314592 -1061157 -1297199 -1911073 -2529693 -2673173 -2242332
40861b242332M76825J2567j49700M06673R07219M60889n07703p88506j35743M91272
40851a068539M62736K58365M27981O71582M65972o4328m63573o45652p62080p55096
40841a472632n16264j92909M3785K52594M66031N45640N46101P56236J079492
40832A508074R31821J57851n53632o82402o63168r79194j111167l35897Q70340
40823h57374J325437Q66085M70296O02745N44727k62672j151582j139105l27689
40814G0868K71117O8986m77769n64333j6467N60560N36827J6963l22850j16432
40804B7470K95500M45475L05365L6494l65659p84154p86798k46035K45585J94427
40794f32330N8732N20289J199435J033670j08773j130375j192405o74438l38617
$$ plain form
40861 -2242332 -1765507 -1752940 -1902640 -1495967 -588748 -127859 -635562 -1424068 -1559811 -1068539
40851 -1068539 -605803 -347438 80543 752125 1218097 1153769 690196 44544 -717536 -1472632
40841 -1472632 -1988896 -2181805 -2138020 -1885426 -1419395 -873755 -327654 428582 1508074
40832 1508074 2439895 2597746 2044114 1361712 698544 -280650 -1391817 -1727714 -857374
40823 -857374 468063 1334148 1804444 2407189 2951916 2689244 1537662 398557 70868
40814 70868 341985 410971 -66798 -631131 -647598 -87038 449789 466752 143902 27470
40804 27470 322970 768445 1073810 1110304 744645 -39509 -826307 -1072342 -826757 -632330
40794 -632330 -573598 -53309 1146126 2179796 2071023 940648 -251757 -926195 -1264812
40785a264812k54970k9834L76337N82236L78978N0820O4231M91728Q12973M98523
40775A706210k05056n14943k85653k85756q82470j219538m94404O12975Q51766
40766g16869K79189J5611L75692N55402J79269j46132m7914L3049j78738k93334
40756E5225j10598j0083j28334p6267J94033J97573p5169K7903N96890P88983
40746A460156J78063n25484o42956m35954k92058j6611M22790M47885j12523n01572
40736a8264k59367j0503k63843m38506K0174N40268M32846N6858q7790m61153
40726d89280j422251j957295r56647Q35993J644674J054519J95415j44441j77984
40717a417297q8859K45812N11104K07252l15441k57744J83667R937q39341j220835
$$ plain form
40785 -1264812 -1519782 -1549616 -1173279 -591043 -212065 -161245 -97014 394714 1207687 1706210
40775 1706210 1501154 986211 700558 414802 -467668 -1687206 -2181610 -1568635 -716869
40766 -716869 -437680 -422069 -46377 509025 688294 542162 494248 527297 348559 55225
40756 55225 -55373 -65456 -193790 -270057 -76024 121549 46380 74283 671173 1460156
40746 1460156 1638219 1112735 469779 33825 -258233 -274844 147946 595831 483308 -18264
40736 -18264 -277631 -288134 -551977 -990483 -970309 -430041 2805 59663 -28127 -489280
40726 -489280 -1911531 -3868826 -4825473 -3989480 -2344806 -1290287 -1094872 -1239313 -1417297
40717 -1417297 -1506156 -1260344 -749240 -541988 -857429 -1115173 -931506 -921569 -1760910 -2981745
40707b981745n74631K10404K18142k00814j72663M02516R41812J109818J085500
40698C8339J064898Q72834J85538q17640j196703j90286J468082J979661P16040
40689D120763q20327j023619k85797Q248k46658r7942M56513L68109n69439j260345
40679F49506r76628j90208N15440J132047J506971J115931J5209r27489j146051
40670A694728r24441o39927l24258j14664k15318k96757R8525N08048K5203j083895
40660a272756j474904o48355M69480J100833J418843J468395P99621k64672n07680
40651A088805K70471O63318j21854q95579m75121L06284J3948j009524j264945
40642a424197m46797L42366L94702R1423o9790n9808K1771N5655k17790p91517
$$ plain form
40707 -2981745 -3556376 -3345972 -3127830 -3328644 -3501307 -3098791 -2156979 -1047161 38339
40698 38339 1103237 1976071 2161609 1343969 147266 -43020 1425062 3404723 4120763
40689 4120763 3300436 2276817 1991020 1999268 1752610 1654668 2111181 2479290 1909851 649506
40679 649506 -327122 -517330 -1890 1130157 2637128 3753059 3768268 2840779 1694728
40670 1694728 770287 130360 -193898 -308562 -523880 -820637 -722112 -214064 -188861 -1272756
40660 -1272756 -2747660 -3396015 -2926535 -1825702 -406859 1061536 1861157 1596485 1088805
40651 1088805 1359276 2022594 1900740 1005161 530040 836324 850272 -159252 -1424197
40642 -1424197 -1870994 -1528628 -1133926 -1042503 -1112293 -1172101 -1150330 -1094675 -1312465 -2103982
40632b103982j106470p44999o2855M12033P43507J150110J322799Q76941P2567
40623E59651n15455o20638j49383Q89819J813330J521317Q1526q88659l83631
40614B307877M02903j19964j416463j650246n00032N25845M58430k5871n2932
40605g0453K48496L82763K89849J03100j47354l06830j62208J28516J87690Q560
40595F62129o9982J39038O13603J244897J555834Q41343p30811j763300j251555
40586A241196N059N87930M26663L88120M92544K0319r17469j425166j298076j015011
40576a493891m46344Q18127J940503J468409k76329j277507p46286j33670n48189
40567f95177j023955m30333N53017P44007M37800N97888J026054Q08789m6723
$$ plain form
40632 -2103982 -3210452 -3955451 -4018306 -3606273 -2862766 -1712656 -389857 487084 559651
40623 559651 44196 -576442 -725825 163994 1977324 3498641 3580167 2691508 2307877
40614 2307877 2710780 2590816 1174353 -475893 -975925 -450080 8350 -17521 -70453
40605 -70453 178043 560806 850655 953755 806401 499571 337363 465879 653569 662129
40595 662129 592147 731185 1344788 2589685 4145519 4986862 4256051 2492751 1241196
40586 1241196 1246255 1834185 2260848 2648968 3141512 3161831 2244362 819196 -478880 -1493891
40576 -1493891 -1940235 -1122108 818395 2286804 2010475 732968 -13318 -146988 -695177
40567 -695177 -1719132 -2149465 -1596448 -852441 -414641 183247 1209301 2018090 1971367
40558A971367p34709r50229r45702p14997j53526L42114L56654J56574J07768
40549e64686o5674n58672o62785K22104J286609J282280M30499K0421K97586K11146
40539A898828o32986j230360q51650j90708j22885l27117n0774M52456K87175
40530g68021n47103r39191j33805J222326J831791J236058K09714k77411j77129
40521A657229k29177q45116j509132j476902p87194j99024j85264l83104j87342
40512d145026M02781Q29904P85788O20628P70022J025118P66654r4944q63605
40503I7320r26393m69717l5960K15386L65032K51296k56262p71620q46510o95077
40493c072505p45018o95570N8148J152690J474492P93515J16786J13101K50407
$$ plain form
40558 1971367 1236658 286429 -659273 -1374270 -1527796 -1185682 -829028 -672454 -564686
40549 -564686 -630360 -1189032 -1851817 -1629713 -343104 939176 1369675 1390096 1687682 1898828
40539 1898828 1265842 35482 -816168 -1006876 -1129761 -1456878 -1507652 -1055196 -768021
40530 -768021 -1315124 -2254315 -2388120 -1165794 665997 1902055 2111769 1834358 1657229
40521 1657229 1428052 582936 -926196 -2403098 -3190292 -3389316 -3574580 -3957684 -4145026
40512 -4145026 -3742245 -2912341 -2126553 -1505925 -735903 289215 1055869 960925 97320
40503 97320 -829073 -1298790 -1334750 -1119364 -754332 -503036 -759298 -1530918 -2377428 -3072505
40493 -3072505 -3817523 -4513093 -4454945 -3302255 -1827763 -1034248 -917462 -804361 -553954
40484e53954l7175l70657k59515J5269Q1183K07945O01082P49980K91662k20156
40474E05664k37634j34525l06016k20316N11178R62735K02601q82697o93493N32275
40464B39772J014396K11117m75778o9174N98692N03654j3520j64259o6789k72085
40454A506026p40262j082433j192096j024852l97625M51999Q08339N21473L49739
40445g99692O74245P38688k9926p85844m22166O42986J034614M37212j73664k20427
40435A096026k25743o05269q32711l29522N45562R79555P43414K46952j59695
40426A458569m60121o45743n35440n8612M61204N12876l1477o47317o51152J5703
40416e81510P03120Q14016M02108j00006m32888n51047m01080j8220L06086K88072
$$ plain form
40484 -553954 -591129 -961786 -1221301 -1206032 -1124849 -916904 -315822 434158 725820 505664
40474 505664 268030 133505 -172511 -392827 118351 1081086 1283687 400990 -292503 239772
40464 239772 1254168 1465285 989507 920333 1519025 2022679 2009159 1844900 1778111 1506026
40454 1506026 765764 -316669 -1508765 -2533617 -2931242 -2479243 -1670904 -1149431 -799692
40445 -799692 -125447 613241 583315 -202529 -624695 18291 1052905 1490117 1316453 1096026
40435 1096026 870283 265014 -567697 -897219 -351657 627898 1371312 1618264 1458569
40426 1458569 998448 352705 -182735 -241347 219857 732733 701256 53939 -597213 -581510
40416 -581510 121610 935626 1337734 1237728 804840 253793 -147287 -165507 140579 428651
40406D28651J9471j58546m7203L16013P44929Q72782L42587o15565j106229n65188
40396B31702L95942P27640L63103J83977N65168P80601J85084p05272q70336j24004
40386A733605P43491R44620L65987n76346j306615j375157p84519r4276O4762
40377b84448l59041q31535q49198l82852K51198P32164Q95916P20876K75078k93212
40367a25054o97114n60276K18077J121610J382713Q58550J93928j22731l99199
40358A870504r72456j297828o43900N26069R05876K14752l48354L0245N06317
40349G91225J2972q93365q43586J35971O12484l4333p20155m07060M12904P19743
40339b13200N44037N75807P74488M68434l34679p76506m54371o2553l47127j015714
$$ plain form
40406 428651 448122 289576 242373 558386 1303315 2176097 2518684 1903119 796890 231702
40396 231702 627644 1355284 1718387 1902364 2467532 3248133 3433217 2727945 1857609 1733605
40386 1733605 2477096 3421716 3787703 3211357 1904742 529585 -254934 -349210 -284448
40377 -284448 -643489 -1475024 -2324222 -2707074 -2455876 -1723712 -827796 -106920 168158 -125054
40367 -125054 -822168 -1382444 -1164367 -42757 1339956 2198506 2392434 2269703 1870504
40358 1870504 898048 -399780 -1043680 -517611 388265 603017 254663 284908 791225
40349 791225 804197 -89168 -932754 -796783 -184299 -218632 -938787 -1345847 -932943 -213200
40339 -213200 330837 906644 1681132 2149566 1814887 1038381 584010 521457 174330 -841384
40329h41384j193190o39938N285J47413j8418J41819P97136J371699J241987N09475
40319A521884j78009m92341p19040j077441j198917o65304K25648P36864O40663
40310a205993M07390M18579M57955J76803k66758l28865K21891Q78909P78681
40301A538592l25045j475300j322322J85616J392477Q43777p28756j234406K0606
40292a104761J464815J466619L58528m47623n11418n00840p47735p89290l16954
40283a128659L27063P38052Q52499O75903K50704k2367L02529R42726J078745
40274D017195M81076k28833o14490r22334j239804j067852l18389J20758l44875
40265a17548q89367m25496O46620J033596N75259L55209Q02848J058446N65918
$$ plain form
40329 -841384 -2034574 -2674512 -2669227 -2521814 -2540232 -2398413 -1601277 -229578 1012409 1521884
40319 1521884 1343875 851534 132494 -944947 -2143864 -2809168 -2583520 -1846656 -1205993
40310 -1205993 -798603 -380024 77931 254734 -12024 -340889 -118998 759911 1538592
40301 1538592 1213547 -261753 -1584075 -1398459 -5982 837795 109039 -1125367 -1104761
40292 -1104761 360054 1826673 2185201 1737578 1226160 725320 -22415 -811705 -1128659
40283 -1128659 -801596 -63544 788955 1464858 1715562 1693195 1995724 2938450 4017195
40274 4017195 4498271 4269438 3654948 2732614 1492810 424958 106569 227327 -117548
40265 -117548 -1006915 -1432411 -785791 247805 823064 1178273 1981121 3039567 3605485
40256C605485J7155O8839J96188l30161j143328j369740r29493l71223J07849
40247a48429N86805P55821K66963m61828o59354k86782O0031J53866K27816K46374
40237G41283p520k32521L0399L97239Q3553o12715n09869N01439J018119K36220
40227A645627p44840o26672J41676K61647l41124o00070m1732P39952J142252
40218A576716J064421N05464l79317r06415m94173L42438N11541j36255o88030
40209A396390n70157j08326L80948R73115J353331Q03914m79667j122530m11061
40200B215957M95353J73386r50753j282924m55211K80684Q2123l19285O3317R57150
40190A259797J338007Q48277k2525p97916j299690j255043m43592O28035R29742
$$ plain form
40256 3605485 3622640 3691479 3887667 3557506 2414178 1044438 114945 -256278 -148429
40247 -148429 438376 1194197 1461160 999332 339978 53196 113227 267093 494909 741283
40237 741283 733763 501242 531641 928880 1012433 399718 -110151 391288 1409407 1645627
40227 1645627 900787 274115 415791 677438 336314 -263756 -305488 434464 1576716
40218 1576716 2641137 3146601 2767284 1860869 1366696 1709134 2220675 2084420 1396390
40209 1396390 826233 717907 1098855 2071970 3425301 4229215 3749548 2627018 2215957
40200 2215957 2711310 2884696 1933943 651019 195808 476492 558615 239330 302647 1259797
40190 1259797 2597804 3446081 3423556 2625640 1325950 70907 -372685 255350 1185092
40181A185092J82095o09814m28300L40168M59202l41604r34943m05535O40613
40172H6974R36392K89386k43194J62350J065654J413321Q05189k10529r11029
40163C394514j102423j004313p48547l08491J49849K67053K9065o5965K64883
40154H75625N26252J40420n36252o00380N1199N36474K74092l02123n43583l72674
40144D9050o35L86848L76207l82323j265113j056068K33495J038750M80814k89575
40134d28550m6528M90756R9946o15538k95031N58733K87089r17978j119064J01747
40124a884418Q97829K84243l18389K85623J013899N33600m16261m20728K37434
40115B12832L46945q9977j94727M2322k2605k61401o7151L49370L37730P7741
$$ plain form
40181 1185092 1367187 757373 329073 669241 1128443 786839 -148104 -553639 86974
40172 86974 1023366 1312752 1069558 1231908 2297562 3710883 4516072 4305543 3394514
40163 3394514 2292091 1287778 539231 230740 380589 647642 676707 610742 875625
40154 875625 1401877 1542297 1006045 405665 456864 993338 1267430 965307 421724 49050
40144 49050 48415 435263 811470 429147 -835966 -1892034 -1658539 -619789 -138975 -428550
40134 -428550 -475078 15678 115624 -499914 -794945 -236212 50877 -867101 -1986165 -1884418
40124 -1884418 -986589 -702346 -1020735 -735112 278787 812387 396126 -24602 212832
40115 212832 559777 469800 275073 317395 294790 33389 -33762 315608 653338 731079
40105G31079J45925K54668j84129o54145k00792P94810J067227M93575M2327j75494
40095B315051r56389j944500j529192N03730K027903J381175l14179r03726j66386
40086D13487L88698j4820o22448o13292j43805K19215K88733K39736K60036L82231
40076G97771M67409L78290K50590L63255O18666N05714j80082r16378j053602
40067A231633n71728K9218L43054L01664L3209k61580m25238m72804m70957l15137
40057e78666Q1506M35635L78900Q7833O0401J95818j82202j096623j467837m93409
40047b578644J039192J542224N43986p64075q95995L45869J669022J587745N7238
40038B546562j276660q81363O96287J404339L36725j160480j488960q50429m05465
$$ plain form
40105 731079 877004 1131672 947543 293398 92606 887416 1954643 2448218 2490545 2315051
40095 2315051 1358662 -585838 -2115030 -1611300 416603 1797778 1483599 579873 413487
40086 413487 802185 787365 164917 -448375 -592180 -372965 -84232 155504 415540 797771
40076 797771 1265180 1643470 1894060 2257315 2875981 3381695 3201613 2285235 1231633
40067 1231633 659905 689123 1032177 1333841 1367050 1105470 680232 207428 -263529 -578666
40057 -578666 -497160 -61525 317375 405208 465609 661427 479225 -617398 -2085235 -2578644
40047 -2578644 -1539452 2772 546758 -217317 -1113312 -767443 901579 2489324 2546562
40038 2546562 1269902 388539 1084826 2489165 2825890 1665410 176450 -673979 -1079444
40029a079444k88679K31267J103204J445115J068085P05735N75742J7427j057479
40020B720973j606741j008700j13189O4898j90739n2219M08320N82784N18717
40011A324104N67973L09832q12346j985151j671895M9296J272639Q86230p666
40002f6984p5352K29338j51042q07100n82807L01096N79735J47860J78189R33325
39992F86258J197202L72340m66981m12037j81671o90781j344123j022162P8607
39983a783348Q56070R31612O85133K30404m17666o45150j4581O41630K65762n89830
39973A60036m75807N45387Q78501k2996p50709j99099P76527Q10363p4401r33795
39963G14007j276477j053069j60785J047039J472626N32136p81857j028184j34254
$$ plain form
40029 -1079444 -1368123 -1136856 -33652 1411463 2479548 3185283 3761025 3778452 2720973
40020 2720973 1114232 105532 -7657 57241 -133498 -185717 222603 805387 1324104
40011 1324104 1892077 2201909 1389563 -595588 -2267483 -2218187 -945548 -59318 -66984
40002 -66984 -142336 87002 -64040 -871140 -1453947 -1152851 -573116 -425256 -247067 686258
39992 686258 1883460 2255800 1788819 1376782 1195111 504330 -839793 -1861955 -1783348
39983 -1783348 -927278 4334 689467 919871 502205 -142945 -157526 484104 749866 160036
39973 160036 -315771 229616 1108117 1085121 334412 135313 911840 1722203 1647802 714007
39963 714007 -562470 -1615539 -1776324 -729285 743341 1275477 493620 -534564 -668818
39954f68818P43120Q20370L21616k31040n58666n58503l23783j64296j95470j26924
39944i42394J85865L70027J47054j50474j92569k64341o15658p10469M7342J186299
39934i39318J629516J100713K90846k24279m61179n17586l53078j24263j23079
39925B78293l23648m38949l64342j80612O9955K09535j06676p48947r21369k69285
39915b796045L66105J62372k67217J86412J169799J235277J06434q31629n51786
39906a220278L66745R00022Q59085N38817J09028j27904K10948P78323O20051
39897C034837m02697j218173j087799n87354m27230k94978K93952Q78854P59795
39888I49207J34140m04795q60503j367991j384816m61169O75119R62244N65953
$$ plain form
39954 -668818 74302 894672 1216288 985248 426582 -131921 -455704 -620000 -815470 -942394
39944 -942394 -756529 -386502 -239448 -389922 -582491 -846832 -1462490 -2172959 -2125617 -939318
39934 -939318 690198 1790911 2081757 1857478 1396299 878713 525635 401372 278293
39925 278293 -45355 -484304 -848646 -1029258 -959303 -749768 -856444 -1605391 -2526760 -2796045
39915 -2796045 -2429940 -2267568 -2534785 -2348373 -1178574 56703 163137 -668492 -1220278
39906 -1220278 -853533 46489 905574 1444391 1553419 1425515 1636463 2414786 3034837
39897 3034837 2632140 1413967 326168 -261186 -688416 -983394 -689442 189412 949207
39888 949207 1083347 678552 -181951 -1549942 -2934758 -3395927 -2720808 -1758564 -1192611
39879a192611M34523O27375M00399k04710l00262J89959K57015l79924n53546
39870g21782M89462J628100J299283l24505j621894j574138n88889M75189J151964
39861B12790J211877N24209n74206j277957j076798l20917K30508L03542L11373
39852d55579O53227J040181P81745k27979j129118j019388r8539N59516L91072
39843D95138j1977J40840P14246R16201M07877l54095p94380p85162n07405j43516
39833G7767J45130K05790M6282j28897j49738o0330k698j3268p334Q2553K03210
39822C98467K20151Q8150j9425J39674N39204Q35435P64910M31876M7255l92707
39812C052990q74993j039595n75595J00578J44215n67480j116633o97522L66146
$$ plain form
39879 -1192611 -758088 -130713 269686 64976 -235286 -45327 211688 -168236 -721782
39870 -721782 -232320 1395780 2695063 2370558 748664 -825474 -1414363 -939174 212790
39861 212790 1424667 1948876 1374670 96713 -980085 -1301002 -1070494 -766952 -455579
39852 -455579 197648 1237829 2019574 1791595 662477 -356911 -455450 104066 495138
39843 495138 483161 624001 1338247 2254448 2662325 2308230 1513850 728688 221283 77767
39833 77767 222897 428687 474969 346072 196334 136004 133306 120038 112704 195257 398467
39822 398467 618618 706768 687343 827017 1366221 2201656 2966566 3398442 3445697 3052990
39812 3052990 2177997 1138402 562807 663385 807600 240120 -876513 -1574035 -1207889
39803a207889J169184J371611J236887Q55201R7529o94702p62201N6083R39593
39794C061296J082941O37475K57934R1676k29037p53688r76503n78395L560M4922
39784B642181n76655j217771j197333m96356L56914R23961J139514J042574O21950
39775C238979P6579j70136n2922j20459p31329j289039r55337J2006M66471K4973
39765D99786l70853P2286P96952Q25469K50576n2767J58452K67290q9659m71839
39755A885693l35131K79723R02347J062176N12873n37968j350086j230520l38227
39746H50880M20048M21225k8161j80681K71106R22157J102734N36330l64535r08344
39736C042759q80635o77639n83237l28616K73289O90450L09626n10936p57333
$$ plain form
39803 -1207889 -38705 1332906 2569793 3424994 3522523 2827821 2065620 2121703 3061296
39794 3061296 4144237 4781712 5039646 5131322 4902285 4148597 3172094 2593699 2597259 2642181
39784 2642181 2065526 847755 -349578 -845934 -489020 434941 1574455 2617029 3238979
39775 3238979 3315558 3145422 3092500 2972041 2240712 951673 -3664 8342 474813 499786
39765 499786 128933 201219 998171 1823640 2074216 2021449 2179901 2447191 2357532 1885693
39755 1885693 1550562 1830285 2732632 3794808 4307681 3769713 2419627 1189107 850880
39746 850880 1270928 1692153 1663992 1483311 1754417 2676574 3779308 4315638 3951103 3042759
39736 3042759 2162124 1484485 901248 572632 845921 1536371 1845997 1335061 577728
39727E77728j31769N61154N32094o4404n13534l79414K27730Q11736P61956j24426
39717B258851j213478j500719o96690M47176J011205Q01097K96565N2921K60393
39708A717321O03260M91571l00004j242284j590844j214470n37755J34148P06900
39699a232157R05077M93688j39004l27297r5217q1439m55030o61488l60230J34339
39689a818758M65996N45305K15935n01721q37345p2117R87579P32663p01876j228478
39679b212817Q5978J383985P73553p76326j039063Q3237Q11387M88868J67788
39670b33410L20104Q9412p58796r89452J76701J651477J910692R10025k13991
39661B862762o44837m04241Q3059L60055K37092N5040K68697O36368M00817n49874
$$ plain form
39727 577728 445959 1007113 1539207 1474803 961269 581855 809585 1621321 2383277 2258851
39717 2258851 1045373 -455346 -1152036 -704860 306345 1107442 1404007 1456928 1717321
39708 1717321 2320581 2812152 2512148 1269864 -320980 -1535450 -2073205 -1939057 -1232157
39699 -1232157 -327080 166608 27604 -299693 -394910 -476349 -931379 -1592867 -1953097 -1818758
39689 -1818758 -1352762 -807457 -591522 -1093243 -1930588 -2002705 -1015126 -282463 -984339 -2212817
39679 -2212817 -2126839 -742854 30699 -745627 -1784690 -1701453 -890066 -401198 -233410
39670 -233410 86694 176106 -582690 -1572142 -1395441 256036 2166728 3076753 2862762
39661 2862762 2217925 1813684 1896743 2256798 2493890 2548930 2817627 3453995 3854812 3304938
39651C304938j362791j329580o89399m0212M13325O73059O07116K20159j76652
39642A619963l72911m15433j99852M94373J329434J463986O77265j88250l54067
39633D054508q3519m3859k82979m54068n68228q20962r83696o51060N3792N73251
39623G93180O14068L27308m9745l09425j99906L08534P69406O69873N1863n74038
39613B401118q33517p12219l09288K66718P76108R22436O14579M1061m74901o34708
39603B057387l40262J62111M56639L89512J91810J21964J82313K38952J90630
39594C651056k8138l63212n46923l78033o7094N8717J17113M27245P53110M68343
39584D092184m16123j107096j125987q18177n04803K9986P69438J055380N86109
$$ plain form
39651 3304938 1942147 612567 -76832 -117044 296281 969340 1576456 1796615 1619963
39642 1619963 1247052 831619 631767 1126140 2455574 3919560 4596825 4408575 4054508
39633 4054508 3970989 3927130 3644151 3190083 2621855 1800893 817197 166137 219929 793180
39623 793180 1407248 1734556 1684811 1375386 1175480 1484014 2253420 2923293 2975156 2401118
39613 2401118 1567601 855382 546094 812812 1588920 2511356 3125935 3166996 2692095 2057387
39603 2057387 1717125 1879236 2335875 2725387 2917197 3039161 3221474 3460426 3651056
39594 3651056 3622918 3259706 2712783 2334750 2267656 2326373 2443486 2870731 3623841 4092184
39584 4092184 3676061 2568965 1442978 624801 119998 149984 919422 1974802 2560911
39575B560911L9349j7746n6234n72331r41867l84530N76671Q80035O53994P75187
$$ plain form
39575 2560911 2600260 2582514 2526280 1953949 1012082 627552 1204223 2084258 2738252 3513439
$$ [...]
##END NTUPLES=NMR SPECTRUM
##END=
