##TITLE=31Pdec_LR-794-O-C3-2
 CDCl3, 24 sc
 24.12.2024
##JCAMPDX= 6.0         $$ Bruker NMR JCAMP-DX V2.0
##DATA TYPE= NMR SPECTRUM
##DATA CLASS= NTUPLES
##ORIGIN= UXNMR, Bruker Analytische Messtechnik GmbH
##OWNER= root
$$ XWIN-NMR		Version 3.5
$$ Tue Dec 24 14:19:49 2024 Russian Standard Time (UT+4h)  she@DPX200
##.OBSERVE FREQUENCY= 81.013821
##.OBSERVE NUCLEUS= ^31P
##.ACQUISITION MODE= SIMULTANEOUS
##.ACQUISITION SCHEME= undefined
##.AVERAGES= 24
##.DIGITISER RES= 17
##SPECTROMETER/DATA SYSTEM= spect
##.PULSE SEQUENCE= zgpg30
##.SOLVENT NAME= CDCl3
##.SHIFT REFERENCE= (INTERNAL, CDCl3, 0, 198.062)
##AUDIT TRAIL= $$ (NUMBER, WHEN, WHO, WHERE, WHAT)
$$ ##TITLE= Audit trail, XWIN-NMR		Version 3.5
$$ ##JCAMPDX= 5.01
$$ ##ORIGIN= Bruker BioSpin GmbH
$$ ##OWNER= she
$$ F:/spectra/data/she/nmr/P31/2/pdata/1/auditp.txt
$$ ##AUDIT TRAIL=  $$ (NUMBER, WHEN, WHO, WHERE, WHAT)
(   1,<2024-12-24 14:18:44.84 +0400>,<she>,<DPX200>,
      <created by zg, POWCHK disabled, PULCHK disabled
       configuration hash MD5:
       00 E9 B6 7A A2 85 ED C7 34 08 36 98 17 FE 4E 26
       data hash MD5: 32K
       99 33 81 99 B9 8B 9C 9B 1B 74 54 84 37 2B 1C AC>)
(   2,<2024-12-24 14:18:48.29 +0400>,<she>,<DPX200>,
      <Start of raw data processing
       efp BC_mod = 2 LB = 1.5 FT_mod = 6 PKNL = 1 PHC0 = 2102.684 PHC1 = 137.486 SI = 64K 
       data hash MD5: 64K
       37 AA E2 E1 BC A3 A0 D5 CE 9E 0F 38 8D 6D B5 C4>)
(   3,<2024-12-24 14:19:03.43 +0400>,<she>,<DPX200>,
      <pk PHC0 = 0.5301021 PHC1 = 0 
       data hash MD5: 64K
       FC E8 07 D4 5F 76 93 F2 8F D2 D2 8C 52 18 77 FA>)
(   4,<2024-12-24 14:19:09.96 +0400>,<she>,<DPX200>,
      <abs ABSG = 5 
       data hash MD5: 64K
       43 1B 7B B7 A4 3B AF 4A EB 04 0F D3 2F 87 8B 58>)
$$ ##END=
$$ 
$$ hash MD5
$$ DD 0F 6F CD 2D F3 43 E4 28 9E 7F 83 3E 96 E2 E3
##$RELAX= 
##$RELAX= 
##$RELAX= 
##$RELAX= 
##$RELAX= 
##$RELAX= 
##$RELAX= 
##$RELAX= 
$$ Bruker specific parameters
$$ --------------------------
##$DU= <F:/spectra>
##$EXPNO= 2
##$NAME= <P31>
##$PROCNO= 1
##$TYPE= <nmr>
##$USER= <she>
##$AMP= (0..31)
100 100 100 100 100 100 100 100 100 100 100 100 100 100 100 100 100 100 
100 100 100 100 100 100 100 100 100 100 100 100 100 100 
##$AQSEQ= 0
##$AQ_mod= 1
##$AUNM= <au_zg>
##$AUTOPOS= <>
##$BF1= 81.014009
##$BF2= 200.13
##$BF3= 200.13
##$BF4= 200.13
##$BF5= 200.13
##$BF6= 200.13
##$BF7= 200.13
##$BF8= 200.13
##$BYTORDA= 1
##$CFDGTYP= 0
##$CFRGTYP= 5
##$CHEMSTR= <none>
##$CNST= (0..31)
1 1 145 1 1 1 1 1 1 1 1 1 1 1 1 1 1 1 1 1 1 1 1 1 1 1 1 1 1 1 1 1 
##$CPDPRG= <waltz16>
##$CPDPRG1= <>
##$CPDPRG2= <waltz16>
##$CPDPRG3= <>
##$CPDPRG4= <mlev>
##$CPDPRG5= <mlev>
##$CPDPRG6= <mlev>
##$CPDPRG7= <mlev>
##$CPDPRG8= <mlev>
##$CPDPRGB= <>
##$CPDPRGT= <>
##$D= (0..31)
0 1 0 0 0 0 0 0 0 0.06 0 0.03 2e-05 3e-06 0 0 0.0002 0 0 0 0 0 0 0 0 0 
0 0 0 0 0 0 
##$DATE= 1735035524
##$DBL= (0..7)
120 120 120 11 120 120 24 19 
##$DBP= (0..7)
150 150 150 150 150 150 150 150 
##$DBP07= 0
##$DBPNAM0= <>
##$DBPNAM1= <>
$$ [...]
##$SUBNAM3= <"">
##$SUBNAM4= <"">
##$SUBNAM5= <"">
##$SUBNAM6= <"">
##$SUBNAM7= <"">
##$SUBNAM8= <"">
##$SUBNAM9= <"">
##$SW= 400.765351723535
##$SWIBOX= (0..15)
0 1 3 0 0 0 0 0 0 0 0 0 0 0 0 0 
##$SW_h= 32467.5324675325
##$TD= 32768
##$TD0= 1
##$TE= 0
##$TE2= 300
##$TE3= 300
##$TEG= 300
##$TL= (0..7)
0 120 53 12 22 120 120 120 
##$TP= (0..7)
150 150 150 150 150 150 150 150 
##$TP07= 0
##$TPNAME0= <>
##$TPNAME1= <>
##$TPNAME2= <>
##$TPNAME3= <>
##$TPNAME4= <>
##$TPNAME5= <>
##$TPNAME6= <>
##$TPNAME7= <>
##$TPOAL= (0..7)
0.5 0.5 0.5 0.5 0.5 0.5 0.5 0.5 
##$TPOFFS= (0..7)
0 0 0 0 0 0 0 0 
##$TUNHIN= 0
##$TUNHOUT= 0
##$TUNXOUT= 0
##$USERA1= <user>
##$USERA2= <user>
##$USERA3= <user>
##$USERA4= <user>
##$USERA5= <user>
##$V9= 5
##$VALIST= <valist>
##$VCLIST= <CCCCCCCCCCCCCCC>
##$VD= 0
##$VDLIST= <DDDDDDDDDDDDDDD>
##$VPLIST= <PPPPPPPPPPPPPPP>
##$VTLIST= <TTTTTTTTTTTTTTT>
##$WBST= 1024
##$WBSW= 4
##$XGAIN= (0..3)
0 0 0 0 
##$XL= 0
##$YL= 0
##$YMAX_a= 19002
##$YMIN_a= -19566
##$ZGOPTNS= <>
##$ZL1= 120
##$ZL2= 120
##$ZL3= 120
##$ZL4= 120
##$ABSF1= 198.0616
##$ABSF2= -202.7028
##$ABSG= 5
##$ABSL= 3
##$ALPHA= 0
##$AQORDER= 0
##$ASSFAC= 0
##$ASSFACI= 0
##$ASSFACX= 0
##$ASSWID= 0
##$AUNMP= <proc_1d>
##$AZFE= 0.1
##$AZFW= 0.5
##$BCFW= 0
##$BC_mod= 2
##$BYTORDP= 0
##$COROFFS= 0
##$CY= -3
##$DATMOD= 1
##$DC= 0
##$DFILT= <>
##$DTYPP= 0
##$F1P= 0
##$F2P= 0
##$FCOR= 1
##$FTSIZE= 65536
##$FT_mod= 6
##$GAMMA= 0
##$GB= 0
##$INTBC= 1
##$INTSCL= 9.790993e-09
##$ISEN= 30
##$LB= 1.5
##$LEV0= 0
##$LPBIN= 0
##$MAXI= 10000
##$MC2= 0
##$MEAN= 0
##$ME_mod= 0
##$MI= 50
##$NCOEF= 0
##$NC_proc= -6
##$NLEV= 6
##$NOISF1= 182.463
##$NOISF2= 159.3651
##$NSP= 0
##$NTH_PI= 0
##$NZP= 0
##$OFFSET= 198.0616
##$PC= 4
##$PHC0= 2103.214
##$PHC1= 137.486
##$PH_mod= 1
##$PKNL= yes
##$PPARMOD= 0
##$PSCAL= 0
##$PSIGN= 0
##$REVERSE= no
##$SF= 81.0140089999434
##$SI= 65536
##$SIGF1= 159.3651
##$SIGF2= -187.1042
##$SINO= 113.3802
##$SIOLD= 16384
##$SREGLST= <1H.CDCl3>
##$SSB= 0
##$STSI= 65536
##$STSR= 0
##$SW_p= 32467.5324675325
##$SYMM= 0
##$S_DEV= 0
##$TDeff= 32768
##$TDoff= 0
##$TI= <>
##$TILT= no
##$TM1= 0
##$TM2= 0
##$TOPLEV= 0
##$USERP1= <user>
##$USERP2= <user>
##$USERP3= <user>
##$USERP4= <user>
##$USERP5= <user>
##$WDW= 1
##$XDIM= 65536
##$YMAX_p= 434166671
##$YMIN_p= -7597391
$$ End of Bruker specific parameters
$$ ---------------------------------
##NTUPLES= NMR SPECTRUM
##VAR_NAME=  FREQUENCY,     SPECTRUM/REAL,   SPECTRUM/IMAG
##SYMBOL=    X,             R,               I
##VAR_TYPE=  INDEPENDENT,   DEPENDENT,       DEPENDENT
##VAR_FORM=  AFFN,          ASDF,            ASDF
##VAR_DIM=   65536,         65536,           65536
##UNITS=     HZ,            ARBITRARY UNITS, ARBITRARY UNITS
##FACTOR=    0.49542278885378, 1,            1
##FIRST=     16045.7642231865, 0,            0
##LAST=      -16421.768244346, 0,            0
##MIN=       -16421.768244346, -7597391,     0
##MAX=       16045.7642231865, 434166671,    0
$$ Real data points
##PAGE= N=1
##DATA TABLE= (X++(R..R)), XYDATA
$$ [...]
41505C54817j81842l73647l73442j06593J95193K84733J64542p298j51668k71376
41495d66581k87109o4273L45044O38796N70647K55925M2947Q6305J83599J00548
41485A405848p0952o0250J08144M7243m40552r59283r50154m27106N3093J51332
41475a142637J06444K34975M51172N13546M38256L75092L01138J24030j06281
41466A295735l48371o94349j052226r95568l42615L68164M81869J18939q6999
41457a255421J2544O675j92155j43639K73603N13521J91330l09832m37461j95208
41447a536043J13362M12276O76911O21158Q6107n00509n50774p5406L88075M98444
41437A33601L96176L37510L66148L43920J27059k33671m15847j75945J64905r414
$$ y = [354817, 172975, -200672, -574114, -680707, -485514, -200781, -36239, -43537, -195205, -466581, -753690, -817963, -472919, 165877, 736524, 992449, 1035396, 1121701, 1305300, 1405848, 1334896, 1274646, 1382790, 1430033, 989481, 30198, -919956, -1347062, -1293969, -1142637, -1036193, -801218, -350046, 163500, 601756, 976848, 1277986, 1402016, 1295735, 947364, 253015, -799211, -1794779, -2137394, -1769230, -1287361, -1168422, -1255421, -1242877, -1236202, -1428357, -1571996, -1298393, -784872, -593542, -903374, -1340835, -1536043, -1422681, -1010405, -333494, 287664, 373771, -126738, -677512, -752918, -364843, 133601, 529777, 867287, 1233435, 1577355, 1704414, 1470743, 1054896, 878951, 1043856, 1034442]
41427A034442o65873r48112l27812N48291P10613J82276k20768j47146k0786j68520
41417b3395l67690l60816k11043J532L16175N81300M97494J29724p7545M7045
41407E32781J82366J07645L2771J07252P8751k24073m68248k77552J60846L50574
41397E83113J77439j2577N6643K76961L59425J65445j70432l77531l43611k47222
41387D67653k74733k92599n7118L14732M46295K71800Q4012k8280k68851n23741
41377A39170k94933M01833O92708j3802j008336j120561k91853M60136N15269
41368e20369K64483J82057J16939j53922l45086j50919J34065L5965l24004m17477
41358a178268j41841O8545j7767p7267J97215N62680N70076K16420q6927j08658
$$ y = [1034442, 368569, -579543, -907355, -359064, 351549, 533825, 313057, 165911, 145125, -23395, -391085, -751901, -962944, -961412, -645237, -63937, 433557, 563281, 485736, 532781, 715147, 822792, 855563, 962815, 1041566, 817493, 349245, 71693, 232539, 583113, 760552, 747975, 804618, 1081579, 1441004, 1606449, 1436017, 1058486, 714875, 467653, 192920, -99679, -156797, 157935, 604230, 876030, 960042, 931762, 662911, 139170, -155763, 246070, 938778, 924976, -83360, -1203921, -1495774, -1035638, -520369, -255886, -73829, 43110, -110812, -455898, -606817, -472752, -436787, -760791, -1178268, -1320109, -1251564, -1269331, -1346598, -1149383, -586703, -16627, 199793, 112866, 4208]
41348D208k2691j6229m871J06802J55944k1652k37749j74990J06358K21713L4802
41337A51645j68828j76423j68974l46767n32160m32818r9856J76109K86684L29406
41327i81982L23780K22004J36070K21428L50935K45457l9388j17463J24338K83242
41317G68421K5389l75014l97150r172L02812K05764j05536k88230l31617m43382
41307f47715n96189m81031J4277N00587M83426N68l88626l14878n4795q7404l86358
41296a958138m64591q2182M16058N70222L65641J60657K11114M32434N49903L68402
41286E69520k7892k69274l4241M95326O91709K04521n21099p41957l51893M3818
41276E8538J1379j77304r0265J76756K37710Q8763O3482J99438J56917j52366
$$ y = [4208, -18483, -34712, -39583, 67219, 223163, 201511, -36238, -211228, -104870, 116843, 151645, -17183, -193606, -362580, -709347, -1241507, -1674325, -1774181, -1598072, -1311388, -981982, -658202, -436198, -300128, -78700, 272235, 517692, 478304, 360841, 485179, 768421, 793810, 418796, 21646, 12474, 315286, 521050, 415514, 127284, -204333, -647715, -1243904, -1724935, -1710658, -1210071, -726645, -726077, -1114703, -1429581, -1484376, -1571780, -1958138, -2422729, -2504911, -2088853, -1518631, -1152990, -992333, -781219, -348785, 201118, 569520, 541628, 272354, 238113, 733439, 1425148, 1629669, 1108570, 366613, 14720, 58538, 69917, -107387, -197652, -20896, 216814, 305577, 369059, 568497, 725414, 573048]
41266E73048l39843j64956L3005j35283m68044m70698q4398L13028M93369N10106
41256B59334L34910j07755n06806l25361L98692Q93827N98928j20976n34329m63192
41246D27272k39800m5689J90133L72634K45239j54507m51661m24655k25136n4274
41236c60444P3855J70757J64450O3609J489K5595N2428Q8043K43387M44859M05942
41225A373970M4937l09553l30744j20419o045o7445j21680r5349j38404l41642
41215a12374n54445n75042l97833j75397n205J39643K76449L18402J90602j1005
41205i06205r4721k0009M9411j3201j26973j49882o1741J04353L55876O00543
41195b62549N71890J48509l41210m12825j0350M42270N58067L19215p1840l83260
$$ y = [573048, 233205, 68249, 101254, -34029, -502073, -972771, -1057169, -744141, -250772, 259334, 594244, 486489, -20317, -345678, 53014, 946841, 1545769, 1424793, 890464, 427272, 187472, 141783, 331916, 704550, 949789, 795282, 343621, -81034, -306170, -360444, -286589, -115832, 48618, 112227, 113716, 139311, 191739, 279782, 523169, 968028, 1373970, 1418907, 1109354, 778610, 658191, 652146, 584701, 463021, 367672, 229268, -112374, -666819, -1241861, -1639694, -1815091, -1820296, -1680653, -1404204, -1085802, -895200, -906205, -1000926, -1020935, -971524, -984725, -1111698, -1261580, -1323321, -1218968, -863092, -262549, 309341, 457850, 116640, -296185, -306535, 135735, 693802, 1013017, 941177, 557917]
41185E57917l91818m7764L32424L31029l4779l28755l15767k26762k82026l21214
41175g27515j32048J72516L72750M70105N24322M16720Q3033k35401l01363k61161
41165C81958l72611n08236l13838K06563O30398O48438L63676M1194j90292l50120
41155E37130m94590o10510n46955j76830K83767L76363K9362k18660M1463M37071
41145c42389L69218n0556k27876p6221m8327j97517l1320M88166O14115n4341
41135D42952p80315o49836J37778O06924L42650j75672m32824m18382k88742n1934
41125a267401K52638M42155M13987K47137L6600j50489j85349k0619J16056j3960
41115a29245k42389k13854p717p1592m35054n08608M6702O93386O93458J22491
$$ y = [557917, 166099, 118335, 450759, 781788, 747009, 418254, 102487, -124275, -406301, -727515, -859563, -687047, -314297, 155808, 680130, 1096850, 1179883, 944482, 643119, 381958, 9347, -498889, -812727, -606164, 24234, 672672, 1036348, 1077542, 887250, 537130, 42540, -567970, -1114925, -1291755, -1007988, -631625, -602263, -820923, -779460, -342389, 26829, -23727, -251603, -327824, -376151, -573668, -604988, -116822, 497293, 442952, -337363, -987199, -849421, -242497, 100153, -75519, -508343, -926725, -1215467, -1267401, -1014763, -572608, -158621, 88516, 125116, -25373, -210722, -231341, -115285, -129245, -371634, -585488, -593205, -664797, -1099851, -1608459, -1561757, -868371, -174913, -52422]
41105e2422k76867j20104K23777K68999Q487k59913l67472l32998k00213k0131
41095a128857J13595J55124J56627J49020Q7160l768K2013K02774L36250K51887
41085C41825Q6219N8852Q1851r7265l90721l82349M1972M28236L51090r308j91346
41074C19056j17941m9151k9642J28492L26129J71781l38038o18728k94136J94311
41064c07867J89223k51975n13519l44561q4694J1438J10676L13232L47082O1029
41054d69936j76972J6107L92693L78738r6364n06957m59684j24804J30983K01872
41044g14324J98023K08892K63824L36391K84040j4785l81682m50587j74394P0928
41034c73674N0239l155J22047J75833q8002l40329j41182K38745J48159l50743
$$ y = [-52422, -329289, -449393, -225616, 43383, 51870, -208043, -575515, -908513, -1108726, -1128857, -1015262, -860138, -703511, -554491, -467331, -471099, -449086, -246312, 89938, 341825, 428044, 486896, 568747, 471482, 80761, -301588, -259616, 168620, 519710, 510402, 319056, 201115, 151964, 122322, 250814, 576943, 748724, 410686, -208042, -502178, -307867, -118644, -370619, -884138, -1228699, -1313393, -1301955, -1191279, -878047, -530965, -469936, -646908, -630801, -238108, 140630, 44266, -462691, -922375, -1047179, -916196, -714324, -516301, -307409, -43585, 292806, 576846, 562061, 180379, -270208, -444602, -373674, -323435, -326590, -204543, -28710, -116712, -457041, -598223, -359478, -211319, -562062]
41024e62062m84045l106L63022N6783m13805k86694L02226O38652N04094K32179
41014C47244k9692l76554o09567l84117J16464L25552J37141m1972j02856l58679
41004i77036p29598o02894J64538Q24693P68207L56049K15079K69396Q7570k50617
40994A25387l11654n0957K23035M12937N81188N37231Q5367m45551n18051j60968
40984D77964J22027J31456P8004j1560l26135o76892n61245J5161M07952K61189
40974h2079q456N9143K91573L02250J30689M9125O9312M3181j213J8367m015j66050
40962G01827l15148k86516j87415j81471j98792j23904m8887n8449P105K59576
40952d32074M51696L08898j0800j53158j01113p9150o3579J54976M60959M35637
$$ y = [-562062, -1046107, -1049213, -686191, -629408, -1043213, -1329907, -1027681, -389029, 115065, 347244, 317552, -59002, -668569, -1052686, -936222, -610670, -473529, -515501, -618357, -977036, -1706634, -2309528, -2144990, -1320297, -552090, -196041, 19038, 288434, 376004, 125387, -186267, -237224, -14189, 398748, 979936, 1517167, 1602534, 1156983, 638932, 477964, 599991, 731447, 809451, 797891, 471756, -205136, -766381, -751220, -343268, -82079, -90535, -31392, 260181, 562431, 693120, 742245, 811557, 854738, 853525, 871892, 867877, 701827, 386679, 100163, -87252, -268723, -467515, -591419, -640306, -698755, -691650, -432074, 19622, 328520, 317720, 164562, 63449, -15701, -79280, 75696, 536655, 972292]
40942I72292j8259m55794m49982j01157J64906J15167j02560j64943J07065N44715
40932F11450P39339M50658j19548n56224o55124n02078k62117q0659p5975k01776
40922f52054k13020O911K11731J50457O302J22564M12694M78208K61000R3776
40912H78569P9128n3410l48487m27479j33253J32467M9762j00818K6532K05181
40902C08192N3819k29063j58862J78854K01947k52959o77752o45869k90210J16707
40892a395196N43333R09496Q81832L32201l16126n77269n08212m65630m70800
40883a066371k58703J36516L23067J52505k0755J31111L99492L03076k67323q76019
40873a043404r97885n38797J06381M78611N11241M97176N96088N76321K27401
$$ y = [972292, 954033, 498239, 48257, -52900, 112006, 227173, 124613, -40330, 66735, 611450, 1350789, 1801447, 1681899, 1125675, 470551, -31527, -293644, -374303, -450278, -652054, -865074, -858163, -646432, -495975, -489673, -367109, 45585, 523793, 784793, 878569, 957697, 904287, 555800, 128321, -4932, 127535, 177297, 76479, 103011, 308192, 362011, 132948, -25914, 152940, 354887, 101928, -575824, -1221693, -1511903, -1395196, -851863, 57633, 939465, 1271666, 955540, 378271, -129941, -595571, -1066371, -1325074, -1188558, -865491, -712986, -733741, -602630, -203138, 99938, -167385, -1043404, -2041289, -2580086, -2473705, -1995094, -1483853, -986677, -390589, 185732, 413133]
40864D13133j76391j90373J04597J81216r6980k26667J11165M68073K83626k52362
40854F19037n06258l16268m6755J10444K83348M16840K50357j20925k54843q8826
40844C46151q7645m42277o86248m28015N8868L60485N36712P42197O99136J45741
40834A245105n19876o79852l74521j33155r2174O9478L86930M73910J99219r6545
40824D78519j87376k32455l14135k23648Q2949K79000J68806P053P1599K59236
40814C89548L41835L11967K46106J11116p8731j76439j53947j65430k11265p0624
40804E44136K47988L53456K4392m10167n13509k67425R5317M44778O37715M06864
40794A563545k25081o94789m98790J37248N73154N50231K87104j4081k96893m19491
$$ y = [413133, 236742, 46369, 150966, 332182, 235202, 8535, 119700, 587773, 871399, 619037, 112779, -203489, -250244, -139800, 143548, 560388, 810745, 689820, 434977, 346151, 258506, -183771, -870019, -1298034, -1239166, -878681, -341969, 400228, 1099364, 1245105, 725229, 45377, -329144, -462299, -554473, -484995, -98065, 375845, 575064, 478519, 291143, 58688, -255447, -479095, -396146, -117146, 51660, 58713, 130312, 389548, 731383, 1043350, 1289456, 1400572, 1321841, 1145402, 991455, 826025, 614760, 544136, 792124, 1145580, 1169972, 759805, 246296, -21129, 74188, 518966, 1156681, 1563545, 1338464, 643675, 144885, 282133, 855287, 1405518, 1692622, 1678541, 1381648, 962157]
40784I62157k78054j20582k90961o49461o62816j37054M93010P00143M17252j9925
40774D13709k58283j95962k2274J164j20513j24703N8205J36345l6003j25410
40764b73725J17425K98900n1100n99080n91958l3261K91044N5611j17329K73893
40754f29580P44805N42741k22125p23371m89375J21792M48460K27822k09155l09692
40744d97678Q1785M88342L69925j37891m00748j83573R5493R9374L3106J46586
40734I4721K85852K61837K07027K04482J9680l70995m51379P7019O03745L50795
40724A282784m47725q28820m51951O5516J97166J69052L50699N91189N32631J97267
40714A657808j00386j99798j65527o2745R7642K52696K83459J17572j87674m32504
$$ y = [962157, 684103, 563521, 272560, -376901, -1039717, -1176771, -683761, 16382, 433634, 413709, 155426, -40536, -62810, -61646, -182159, -306862, -248657, -112312, -148315, -273725, -156300, 142600, 91500, -507580, -1099538, -1132799, -841755, -786144, -903473, -629580, 115225, 657966, 435841, -287530, -776905, -655113, -206653, 21169, -187986, -497678, -415893, 72449, 442374, 304483, -96265, -279838, -184345, -84971, -51865, 94721, 380573, 642410, 849437, 1053919, 1073599, 702604, 251225, 328244, 931989, 1282784, 835059, 6239, -445712, -380196, -183030, -13978, 336721, 927910, 1460541, 1657808, 1557422, 1357624, 1192097, 1129352, 1226994, 1479690, 1763149, 1880721, 1693047, 1260543]
40704A260543m04478j20633J33652J29937l8051j51606j78374j91213j50374k8322
40694B61081J7144r8215j31729J10775L36710J80134j03079M4201N12895N76662
40684A706579L1313m20103k14286K83287M49288K94004J65705M1926k68423n53634
40674A515656m85872k73709l67234o08261l65720M05397Q94206M97360l36114
40665H75709o97479l57390Q5158Q0500k17026k76784M1825L02711J21575k42241
40655b83442k00449L17104P09758N21789K7856k55610k81453l01080k86749m9997
40645h2273K33341J97122n4280l9071K91436M19195R5653k57496k48923r0581
40635D64123j08306j52574L8207K59526J59668j12080j29061P8571O6946k68647
$$ y = [1260543, 856065, 735432, 869084, 999021, 960970, 809364, 630990, 439777, 289403, 261081, 278225, 180010, 48281, 159056, 495766, 675900, 572821, 617022, 1129917, 1706579, 1737892, 1317789, 1103503, 1386790, 1836078, 2130082, 2295787, 2337713, 2069290, 1515656, 1029784, 756075, 388841, -219420, -585140, -179743, 714463, 1211823, 875709, 178230, -179160, -94002, -13502, -230528, -507312, -465487, -162776, -41201, -283442, -483891, -166787, 542971, 1064760, 1092616, 837006, 555553, 254473, -32276, -82273, 151068, 348190, 293910, 254839, 546275, 965470, 1061123, 803627, 554704, 464123, 355817, 203243, 241450, 500976, 660644, 548564, 419503, 498074, 565020, 296373]
40625B96373n07104l48693K059K37343L37700L78591K80445n916k88820l38985
40615D2993j68471M7633J94230K34331J54108L6052O0557K79742M75085L79286
40605A735546k186l73957m18828p3845L65131M32364l4998n99107o34622j10246
40595B85252L19650J48115l57058n96396m24708j49818L6071J95306L20191L13225
40585H9830K76223L89590M77625J59018m59293p28983l41533J80469K10994j40829
40575A13111l35420k28993q7622J3837K30105M44260L10004j20892l36641j04157
40565a02408J92629J72221l1455j65698l30240o25629o84890j18503P34366J071546
40555A11939O51531M8463k00417k13655l25725m64456l33963K6227K55532J86408
$$ y = [296373, -210731, -559424, -557365, -320022, 17678, 396269, 676714, 670798, 381978, 42993, -125478, -77845, 116385, 350716, 504824, 540876, 601433, 881175, 1356260, 1735546, 1733360, 1359403, 940575, 866730, 1231861, 1664225, 1629227, 1030120, 395498, 285252, 604902, 753017, 395959, -200437, -625145, -774963, -738892, -543586, -223395, 89830, 366053, 755643, 1233268, 1392286, 932993, 204010, -137523, 42946, 253940, 113111, -222309, -451302, -538924, -525087, -294982, 149278, 459282, 338390, 1749, -102408, 90221, 262442, 230987, 65289, -264951, -890580, -1575470, -1693973, -959607, 111939, 763470, 811933, 611516, 397861, 72136, -392320, -726283, -700056, -444524, -258116]
40545b58116M3888R7612L13729M31802K98855N3375m5736K8600j0980l65227p48844
40534a61042o58159p2559M17838L45908m7864k14970n4050P5200k8821j55167
40524e53686o5023J75238L31889K72419M0288j78062j52531J47346M10046K75317
40514G03241k20763o69257p34456l91422J96614P50090Q82858M24022k26649m45639
40504B68639j72890M4695r1914k09242P1392N10929O55422M63196J29528l25037
40494A344718q04725q51239k37379M12544L21401k41698k52488N24818J107275
40485A323227O94994k29120o83170n05077k77869k86102k22804J15408M01594
40476C31081K22873l38751p65285o73905k28797P1205J6279n9587J94974N61437
$$ y = [-258116, -214228, -116616, 197113, 628915, 927770, 981145, 935409, 964009, 953029, 587802, -161042, -819201, -891760, -473922, -128014, -175878, -390848, -444898, -369698, -398519, -553686, -618709, -443471, -111582, 160837, 201125, 23063, -129468, 17878, 427924, 703241, 482478, -186779, -921235, -1312657, -1116043, -365953, 516905, 940927, 714278, 268639, 95749, 140444, 48530, -160712, -89320, 421609, 1077031, 1540227, 1669755, 1344718, 539993, -311246, -548625, -136081, 185320, -56378, -308866, 215952, 1323227, 2018221, 1789101, 1105931, 600854, 322985, 36883, -185921, -70513, 331081, 553954, 215203, -550082, -1223987, -1452784, -1381579, -1365300, -1424887, -1229913, -668476]
40466f68476N52262K00773N4115L15523N24954L03991q4561k37002k16592k71190
40456D73797l31384k23130n6895K4246J64307M14339L91632j23793n79008l15486
40446a61375L65985N49771K9038m70022m14541o8675J59366K51094K26553o8447
40436C98747n04431n88135j98000J24692j2475k55373j33362J80256K20533k9469
40426g97017k41991k98328k82934j72980M4839J82839J59104K20489M74085N44079
40416a67815J81079j46407J05193O01090N50226o6728m79910l43436j59324l09998
40406b36030m29905j10104L77784N21574L10586J02246N3360P2064R8182R2626
40396H52383m5846k59493k46706J03642M16296L01480p4604k62399k17061k85302
$$ y = [-668476, -116214, 84559, 138674, 454197, 979151, 1283142, 1198581, 961579, 744987, 473797, 142413, -80717, -137612, -113366, 50941, 465280, 856912, 733119, 154111, -161375, 204610, 754381, 783419, 313397, -101144, -169819, -10453, 240641, 467194, 398747, -105684, -693819, -891819, -767127, -779602, -1034975, -1168337, -988081, -767548, -797017, -1039008, -1337336, -1620270, -1793250, -1748411, -1565572, -1406468, -1185979, -711894, -167815, 13264, -133143, -27950, 573140, 1123366, 1056638, 576728, 233292, 73968, -236030, -665935, -776039, -398255, 123319, 433905, 536151, 589511, 661575, 759757, 852383, 806537, 547044, 300338, 403980, 820276, 1121756, 1047152, 784753, 567692, 282390]
40386B82390n51240o34693k52379L43764O61868N15506J36807j25025r7779J36537
40376D15756L37459K80595r0222o10017r54423q34516k82520K62933L54017P5632
40366a045306k9116L09069O84999N77070P5748k80736k55048r6805j8378Q0632
40356B129K58754K96381M8888k37342k35258l63J33296K8551j16178p4580J41502
40345B45780L25422K73815l0799l52430l94054j63393l6846k91496o69182o41424
40335a734607q9401N22523P00257M28278L5487k36317l59636l50461j84597J09154
40325a159320L93281N01887L65465Q3531j27187j29279k2855j6860j33036j74375
40315d18748l2477J37343J43804R084j27605j97984j54893Q2917M32392N68353
$$ y = [282390, -268850, -903543, -1155922, -812158, -150290, 365216, 502023, 376998, 279219, 415756, 753215, 1033810, 943588, 333571, -620852, -1455368, -1737888, -1474955, -1120938, -1045306, -1074422, -765353, -80354, 496716, 572464, 291728, 36680, -60125, -78503, 2129, 260883, 557264, 606152, 368810, 133552, 133189, 266485, 295036, 178858, 104278, 245780, 571202, 845017, 814218, 461788, 67734, -95659, -132505, -424001, -1093183, -1734607, -1824008, -1301485, -601228, -172950, -137463, -373780, -733416, -1083877, -1268474, -1159320, -766039, -264152, 101313, 184844, 57657, -71622, -94477, -111337, -244373, -418748, -451225, -313882, -170078, -160994, -288599, -486583, -641476, -558559, -126167, 442186]
40305D42186L11940m7530j27663j2159m6592j85290n8821K89695L33580p1691
40295H27655l46330r0480K07003p5206o36011o65974j12239K49233L2901k22298
40285h31746R281M11093L66333j04221m27177k64699J94180N85085O60802L46039
40275I44970j66738m45766k53387Q8218N4170l84073p14603n55552o8553L66497
40265a134817N88907O19021M45528R9869j90309j74595J05614L41474L01072L8305
40255A040069k19188k66366k8805L58932N52737K60964l74548p97327o08065m0954
40245a22551L21724K64234J17420J89607L16240J76353j64327l35758k08610m1319
40235E13013n3280j36761j10926l4195p9214k26788k73188j04753J68973L59060
$$ y = [442186, 754126, 706596, 578933, 566774, 520182, 334892, 276071, 565766, 899346, 827655, 481325, 390845, 597848, 522642, -113369, -779343, -891582, -642349, -609448, -831746, -822465, -411372, -45039, -149260, -576437, -841136, -646956, -61871, 598931, 944970, 778232, 332466, 79079, 167297, 221467, -162606, -877209, -1432761, -1501314, -1134817, -545910, 73111, 518639, 618508, 428199, 253604, 359218, 700692, 1001764, 1040069, 820881, 554515, 525710, 884642, 1437379, 1698343, 1323795, 526468, -81597, -122551, 199173, 463407, 580827, 770434, 1086674, 1263027, 1098700, 762942, 554332, 513013, 459733, 322972, 212046, 177851, 98637, -128151, -401339, -506092, -337119, 21941]
40225B1941L96678L66500L48257K45879j18162o47328q64419m34111K56252M13684
40215a4829j44642o67905m30439L04795O78981L86026o3894j82500p8047l9898
40205b52352p822K11849M73821M24307L0069l32784l50146j19130L6982m0145
40195G4649k24579l12336k62266k03171k14082j74247O3336L78412M51239K07638
40185b15407R155K00909N82141N94569M7726n95473p58503l83662J11585L50283
40175e6677K83304O6701j22256j53663j5265J49650J98225J75912K01547J96724
40165I24202k8163l74103m38438p9474K67829J31897l18606m94619k01905J56107
40155d55273K16686J00701O9237Q6398k3183k17298l08216k50152j25500L8039
$$ y = [21941, 418619, 785119, 1133376, 1379255, 1261093, 613765, -250654, -684765, -428513, -14829, -159471, -827376, -1257815, -953020, -274039, 111987, 48093, -134407, -212454, -252352, -260174, -48325, 425496, 849803, 879872, 547088, 196942, 77812, 114794, 74649, -149930, -462266, -724532, -927703, -1141785, -1316032, -1252696, -874284, -423045, -215407, -206252, -5343, 576798, 1171367, 1219093, 623620, -134883, -518545, -406960, -56677, 226627, 293328, 171072, 17409, 2144, 151794, 350019, 525931, 727478, 924202, 896039, 521936, 83498, 4024, 271853, 403750, 85144, -409475, -611380, -455273, -238587, -137886, -68649, 17749, -5434, -222732, -530948, -781100, -906600, -868561]
40145h68561K25684L23634K60356J57041J33323R0110p1630j52834R6377N00815
40135F94315N95789K55256j64685l69630m51952n41432m93060j68460K38467M33648
40125B8256M00522K99209J59685n2081k01353j27342N0605P1301m7369k7276K02226
40114G56383L56789K22170l4176j45541j45810k71683n58183p41322n80982j57811
40104a300166K03304K73871J56304J46154L43249M86273K93118j01243k63299
40095B37565m3725K08765J49963p8709j13345N7231J11275n6222j62512j1891
40085B98395J67257O2363k56776m54951l97097k49514j59651p5222P7966K27470
40075g59760K56683J72443R3772J25140K72012M31781M60482L08108Q5957o4427
$$ y = [-868561, -642877, -319243, -58887, 98154, 231477, 321587, 249957, 97123, 193500, 694315, 1290104, 1545360, 1380675, 1011045, 559093, 17661, -475399, -643859, -405392, 28256, 428778, 727987, 887672, 835591, 634238, 506896, 557501, 628802, 581433, 554157, 756383, 1113172, 1335342, 1301166, 1155625, 1009815, 738132, 179949, -561373, -1142355, -1300166, -1096862, -822991, -666687, -520533, -177284, 308989, 602107, 500864, 237565, 193840, 402605, 552568, 473859, 360514, 417745, 529020, 472798, 310286, 298395, 465652, 528015, 271239, -183712, -580809, -830323, -989974, -1065196, -987230, -759760, -503077, -330634, -236862, -111722, 160290, 592071, 1052553, 1360661, 1446618, 1382191]
40065A382191j48850k76997m62268n87273n76763m77831l42485j59740N4803K30916
40055a364297L52316M54945M65841K26204k04603m43543j87271L60231O60520
40046C20343M24321j22656n37305n80649l39497n7441J01897J59751J99799J72652
40036b58785n5492m22064o12668m26198n8541J50103J36348Q9522J12799J41836
40026a203140J40328J41047J22237N6119L2996J12255J24724r3054l31919k28067
40016a126474J65525M17242L66385L02235L86030L74047J46718L8763K77981M95786
40006A844238K52299k51018m75882l42156j98221j53588j2628J71418O6872l17444
39996E83890n11718k65585R5443K01217J18486N7241k4709k07898l01534j00935
$$ y = [1382191, 1233341, 956344, 494076, -93197, -669960, -1147791, -1490276, -1650016, -1595213, -1364297, -1011981, -557036, -91195, 135009, -69594, -513137, -700408, -340177, 320343, 744664, 622008, 84703, -495946, -835443, -892884, -790987, -631236, -431437, -258785, -314277, -736341, -1349009, -1775207, -1833748, -1683645, -1547297, -1457775, -1344976, -1203140, -1062812, -921765, -799528, -743409, -710413, -598158, -473434, -566488, -898407, -1126474, -960949, -543707, -177322, 124913, 510943, 884990, 1031708, 1070471, 1348452, 1844238, 2096537, 1845519, 1369637, 1027481, 829260, 675672, 663044, 834462, 901334, 583890, 72172, -193413, -97970, 103247, 221733, 278974, 254265, 46367, -255167, -356102]
39986c56102K40017M15477M01929L88605L94485K64597k65j85498j48762K1397
39976A435880J36891Q1339j05916k32811j53466m1296k44927p11810q50816l01944
39966i88876M05839M52339j23386m33393J9861O70183P19202J86289k71761k89819
39956C46478q2224O6988J43070J83805Q7224j94655m67953m77574k12365P5142
39946e32064J45503K4486m3132R1456K49806J19855k95600n80684l81866J32483
39936a069757M63597L77021J13044K780P5860J39992J06046Q0777J66101K95103
39926G50564L25817K40966J59309J35747O5004j22009k76098k28491j02838j60191
39916G87780l30942k52920R8692K20676j73705n76247l28427L74484O97654L26317
$$ y = [-356102, -116085, 299392, 701321, 1089926, 1484411, 1749008, 1748743, 1563245, 1414483, 1435880, 1572771, 1654110, 1548194, 1315383, 1161917, 1120621, 875694, 163884, -686932, -988876, -583037, -130698, -254084, -687477, -667616, 2567, 721769, 908058, 636297, 346478, 264254, 331242, 474312, 658117, 745341, 550686, 82733, -394841, -607206, -532064, -386561, -362075, -405207, -313751, -63945, 55910, -239690, -820374, -1202240, -1069757, -606160, -229139, -116095, -113315, -37455, 102537, 208583, 289360, 455461, 750564, 1076381, 1317347, 1476656, 1612403, 1677407, 1555398, 1279300, 1050809, 947971, 787780, 456838, 203918, 302610, 523286, 349581, -226666, -555093, -180609, 517045, 843362]
39906H43362j92727l52280l06914l39411k86960N7524M03656L55453P1932k58
39896B53377J28001P8015j43804r8604K91220M90505J59124k66232j89642K66379
39886I68339M56203J33317k84455l90642l11317l59462m70949l20260R2226L25400
39876a61600R0408l01858l28616N4139M12731M79052M27402M27784L20098p681
39866A411859k45904o5701K96947L09429p0153l33804k00030L228r0257l19052
39856F96562k86712M0528L48694M49678M39773M27408L60900J77761l7605j34063
39846B482924p9767p068m9803j56850j52995k2274J3928j58659k83820q2445K40811
39835A743982K12134j79456l85242p6105L84909M99196K94525Q3224j20858m67710
$$ y = [843362, 650635, 298355, -8559, -347970, -634930, -577406, -173750, 181703, 253635, 253377, 381378, 459393, 315589, 216985, 508205, 998710, 1157834, 891602, 701960, 968339, 1424542, 1557859, 1273404, 882762, 571445, 211983, -258966, -579226, -487000, -161600, -71192, -373050, -701666, -647527, -234796, 244256, 671658, 1099442, 1419540, 1411859, 1165955, 1100254, 1397201, 1706630, 1636477, 1302673, 1102643, 1105871, 1015614, 696562, 409850, 450378, 799072, 1248750, 1688523, 2115931, 2476831, 2654592, 2616987, 2482924, 2403157, 2396089, 2346286, 2189436, 2036441, 2014167, 2028095, 1869436, 1585616, 1503171, 1743982, 1956116, 1776660, 1391418, 1315313, 1700222, 2199418, 2493943, 2577167, 2456309, 1988599]
39825A988599p41326n22618R7908M77643K65134j13291o8068L47824N75316L31536
39815B638657r4452l13832k88557j98161j07767O819M3751j19639l14150j86096
39805A066573K64999N59407L78074M7159K5007J42975j19538o89510q55935l09817
39795E09394L55687M77819J58923j01512j60958j61289q0216J09537J17149k57748
39785I66786o00600l70857K16869M34503J08910k12144j89436q5885p6947J18084
39775C09283N83297Q06976L94734k81567o10342n31477l45116j09165K21070L48758
39765G86451k0606n18666m52203J62075N08212R8752n26905n47081O3785N83370
39755A37184M90334R715k73616r5710K68612L65201P2147k65168k44475Q6111
$$ y = [1988599, 1247273, 724655, 822563, 1300206, 1565340, 1452049, 1383981, 1731805, 2307121, 2638657, 2544205, 2230373, 1941816, 1743655, 1635888, 1642707, 1686458, 1566819, 1252669, 1066573, 1331572, 1890979, 2269053, 2316212, 2341219, 2484194, 2364656, 1675146, 819211, 509394, 865081, 1342900, 1501823, 1400311, 1239353, 1078064, 997848, 1107385, 1224534, 966786, 366186, -4671, 212198, 646701, 755611, 543467, 354031, 268146, 191199, 309283, 892580, 1699556, 2094290, 1812723, 1202381, 670904, 325788, 216623, 437693, 786451, 765845, 247179, -205024, -42949, 465263, 564015, 37110, -509971, -446186, 137184, 627518, 637233, 363617, 267907, 536519, 901720, 973867, 708699, 464224, 550335]
39745E50335K70522L0592l69250m88037k95846j50673k28967k81143o9445K20634
39735h11278K60178R9260P4982K47591L05068J08402m9250O0928J85638n805l51983
39724A23731m34372k23974n5613l1549P3687K83837K85052k3284k73983j69537
39714d46005P9811J32233L1121L5572J66840K51418K57789K82286L09879K62157
39704A363101J85190J36601l184l29441o18805n50666j89120O4412J8057j00445
39694b4300m3939J12201J57439P5575K2525P8690J66618J84525J26659N9047K0124
39683I35164j5481o4711q0184l3602p250q4060j79906j46987k2282L9547P1922
39672D12170K42357M45534L23533j38928m27828k00540J76152J70852j32029k63500
$$ y = [550335, 820857, 851449, 482199, -5838, -301684, -452357, -681324, -962467, -1031912, -811278, -551100, -451840, -376858, -129267, 175801, 284203, 234953, 295881, 481519, 475714, 123731, -310641, -534615, -590228, -621777, -548090, -264253, 20799, -2485, -276468, -446005, -366194, -233961, -202840, -167268, -428, 250990, 508779, 791065, 1100944, 1363101, 1548291, 1684892, 1681708, 1352267, 733462, 182796, -6324, 58088, 76145, -24300, -68239, 43962, 201401, 276976, 299501, 378191, 544809, 729334, 855993, 915040, 935164, 919683, 854972, 774788, 741186, 733936, 649876, 469970, 322983, 300701, 340248, 412170, 654527, 1100061, 1423594, 1284666, 856838, 656298, 832450, 1003302, 871273, 607773]
39662F07773j44038p6563r9199N5065L55540M21316J73889q322M5589J5152k82315
39651A063887m87950k84267L7419J6344k76737m12298k63793p5427k376K8775
39641f56423P6542J37070K74514M90267N38755K09328k49538l43607o94L00203
39631G76417J47810l28055o94191o76461k79859L11041P90864Q70656N38855J10344
39621A567421q2546K5236K76722M57968L57498j18860p26110r50972n40673J27798
39611C93482M36567K37243o1634r8162L0867M2943j02937k32237k40294j49688
39601B56150J7503K27964L55819K97302J28873j8201j75889m05211m98432j50943
39591C4935M87698P80689L57710l41518n73285j94186K51832K80700k5734k92889
$$ y = [607773, 463735, 387172, 287973, 343038, 698578, 1119894, 1293783, 1285461, 1331050, 1346202, 1063887, 575937, 291670, 329089, 345433, 68696, -343602, -607395, -682822, -685198, -656423, -579881, -442811, -168297, 321970, 860725, 1070053, 820515, 476908, 476214, 776417, 924227, 596172, -98019, -774480, -1054339, -743298, 47566, 918222, 1457077, 1567421, 1484875, 1510111, 1786833, 2244801, 2602299, 2483439, 1757329, 806357, 265684, 393482, 830049, 1067292, 1005658, 907496, 938363, 981306, 878369, 646132, 405838, 256150, 273653, 501617, 857436, 1154738, 1283611, 1265410, 1089521, 684310, 185878, 34935, 522633, 1303322, 1661032, 1319514, 746229, 552043, 803875, 1084575, 1058841, 765952]
39581G65952l32246k09455l4991J32530K49767K91241K84875K79933K66416J53961
39571A847983j20471m28389m74842j43542K20831J40421l13251m86526p395O33033
39561H67852P15610K56376j32384j87664k35450m78643o29845m41045j17490M9007
39551c33676O7085K2522j45460l65820l16152P4366L46839J32388k52022k70586
39541a040516K3611J49872n847r9235L2501J61224J28516O0075O2868J12794K73117
39530a41020N91261P46431L17184m65772p78370k85947L26495K84627k32401m51040
39520h8552j03492L60112N07181L60982J36370k0778k234J80340K49658m4990
39510A534597m55825m44079M9198M39890K82812j62561l98435l63677k88989j70119
$$ y = [765952, 433706, 224251, 189260, 321790, 571557, 862798, 1147673, 1427606, 1694022, 1847983, 1727512, 1299123, 824281, 680739, 901570, 1041991, 728740, 242214, 234819, 867852, 1583462, 1839838, 1707454, 1519790, 1284340, 805697, 175852, -265193, -382683, -333676, -266591, -244069, -389529, -755349, -1071501, -997135, -650296, -517908, -769930, -1040516, -1016905, -867033, -872880, -972115, -939614, -778390, -649874, -589799, -526931, -414137, -141020, 450241, 1196672, 1513856, 1048084, 269714, -16233, 310262, 594889, 362488, -88552, -192044, 168068, 675249, 1036231, 1172601, 1151823, 1149589, 1329929, 1579587, 1534597, 1078772, 634693, 683891, 1123781, 1406593, 1244032, 845597, 481920, 192931, 22812]
39500B2812J42012M61203L84430o4717l45535j04841L58365N09856J96408l26557
39490A233436p25036p41438k79866L78574O45163K47912l27382l68753J46372
39481B08982N40385L59839q3315k36390k5181K01140K11010Q9295O006L5317J64716
39470A471804K91746K34146q7675m77390o16828m19711j21174K2895L3632J27587
39460D59032L66633N01116K67742j90216l95599j36516K03738J45952k13687l74504
39450F33691j89727o311m825Q4816L93304N43038K49546j33349j59499l5978k29857
39439A144849n78178m97478k765K37588k6370k33852L0082L60945K53836p2613
39429F16044j36479n0720k58540o49185o34185q4450M27187M45951J97111J23138
$$ y = [22812, 164824, 626027, 1010457, 945740, 600205, 495364, 853729, 1363585, 1559993, 1233436, 508400, -233038, -512904, -134330, 510833, 758745, 431363, 62610, 208982, 749367, 1109206, 1025891, 789501, 764320, 965460, 1176470, 1265765, 1271771, 1307088, 1471804, 1763550, 1997696, 1910021, 1432631, 815803, 396092, 274918, 297813, 331445, 459032, 825665, 1326781, 1594523, 1404307, 1008708, 872192, 1075930, 1221882, 1008195, 633691, 443964, 437653, 432828, 517644, 910948, 1453986, 1703532, 1570183, 1410684, 1374706, 1144849, 566671, 69193, 66428, 304016, 277646, 43794, 73876, 434821, 688657, 616044, 479565, 428845, 170305, -478880, -1113065, -1197515, -770328, -324377, -127266, -4128]
39419d128K51007K87786R8840j61555k69803j16118K36299N63271O33228M15749
39409A934576O5518k89776o00872p55815o14042k42206R2296K42950K97671L02258
39399D32558J36795j81136l41263j39893J65466J89003l4890j45701j9505R2059
39389A53493m720j64779j31976J53910N22322O78170L68402l23343q58798p18313
39379c25632n7698M00669K42745j70497k77152m6729J36033Q4232m0466q0232
39369a34727n2838J3639J42023K64494K29665J0974k26004k97846j57438J08165
39359i9893L42608M15782L35861K21349J21221j8287j56740j32068M5275J05146
39349A180254p5269k16646n6664K12417K61270J53449J45301J58765l7718k62193
$$ y = [-4128, 246879, 534665, 633505, 471950, 202147, 86029, 322328, 885599, 1518827, 1934576, 2000094, 1710318, 1109446, 353631, -260411, -502617, -410321, -167371, 130300, 432558, 569353, 388217, 46954, -92939, 72527, 261530, 226640, 80939, 61434, 153493, 148773, -16006, -147982, 5928, 528250, 1206420, 1574822, 1251479, 392681, -325632, -383330, 17339, 260084, 89587, -187565, -234294, -98261, -14029, -54495, -134727, -187565, -173926, -31903, 232591, 462256, 473230, 247226, -50620, -208058, -99893, 242715, 658497, 994358, 1215707, 1336928, 1318641, 1161901, 1029833, 1075108, 1180254, 1104985, 888339, 831675, 1044092, 1305362, 1458811, 1604112, 1762877, 1725159, 1462966]
39339A462966j30991J99809J58099k93393n02991j42629K78588K48441m223l5851
39329A237825P4768L6897m3485O4266J74262k933k65387k13929O1454J58502N9618
39318A341858O7397J59285J1178l65662n85433n09667l84969l27108j72584J11676
39308f54029L55421N42955P41765O92865R2854o62210p33946n6802M21302P1491
39298H11666n22158n02162K8418L54363K80138J81650J87666N6154j98540k34835
39288D42360j7240N2841j98945m00096k03715J80681K94146L6377k74895l23611
39278d12097q9101K07989L20929J72380q5451k15200j13591J32479L66719M72230
39268G57286M06521K31924Q7698L3341m7577k70230n10902n09982k30294N3725
$$ y = [1462966, 1331975, 1531784, 1689883, 1396490, 893499, 750870, 1029458, 1277899, 1273676, 1237825, 1312593, 1349490, 1306005, 1370271, 1544533, 1541600, 1276213, 1062284, 1123738, 1282240, 1341858, 1409255, 1568540, 1579718, 1214056, 628623, 118956, -266013, -593121, -765705, -654029, -298608, 244347, 986112, 1678977, 1771831, 1109621, 375675, 318873, 740175, 811666, 289508, -212654, -184236, 170127, 450265, 631915, 819581, 875735, 677195, 442360, 425120, 477961, 279016, -121080, -324795, -144114, 150032, 186409, -88486, -412097, -501198, -293209, 27720, 200100, 114649, -100551, -214142, -81663, 285056, 757286, 1163807, 1395731, 1483429, 1516770, 1469193, 1198963, 688061, 178079, -52215, 1510]
39258A510R7465k0473n1799Q1054K33295K59797J34631j19097m31369n90623l65257
39247g70866J52092N12540M27135J57735J19100K28474N6768l97809n98341l06418
39237d19590l0589k70752p07758o40224N645O18269P38632M72863J27035r0924
39227a97393o060M13759Q11654P21585J85371k69392l16924j27440M5761J40382
39217A401303R2382j63528l95838k48294J57521K73460o3460l80203l29319j58597
39207A85427j40836q3484K11030M82504M41581K51646J72758J25275J2976M8555
39197A707432L03051L72881J5049l19500j75304J06186l7903l81279k72818K24708
39187A542503M11360Q5865k20100j82885r1453j81057k57844j76372q7071k4244
$$ y = [1510, 98975, 78502, 26703, 107757, 341052, 600849, 735480, 616383, 185014, -405609, -770866, -618774, -106234, 320901, 478636, 597736, 826210, 882978, 485169, -113172, -419590, -450179, -720931, -1428689, -2068913, -2063268, -1444999, -706367, -233504, -106469, -197393, -203453, 210306, 1021960, 1743545, 1928916, 1659524, 1342600, 1215160, 1260921, 1401303, 1493685, 1330157, 934319, 686025, 843546, 1117006, 1053546, 673343, 344024, 185427, 44591, -38893, 172137, 654641, 1096222, 1347868, 1520626, 1645901, 1658877, 1707432, 2010483, 2383364, 2398413, 2078913, 1903609, 2009795, 1971892, 1590613, 1317795, 1542503, 1953863, 2039728, 1819628, 1636743, 1545290, 1364233, 1106389, 930017, 842946, 818702]
39177H18702J91727M72513M46332J14282m2972J51304K34626j47131o61694q06507
39167G71182n73667k52758M0073K70966K68406j6481k83125k61930j03029p5165
39157b15528j06922K1796K10219J47339j62709l25000o2277M13339O33126L96605
39147I49988q521j34794J03907L51927K91642J8003j97037k83662k84092j29304
39137F78057J54865K48743k5632k79875q8879K46439J16694l28715l21374K58332
39127F58655N98207K03766l70190m61334k52006k18943k33433J01554O01886O82629
39117A310791K30792k45730k93948J3652K35850J2371n09399o77912j05048O01447
39107E72866M80684l20379n59585K85602J139588R10516P7094k27083O217n7426
$$ y = [818702, 1010429, 1482942, 1929274, 2043556, 2000584, 2151888, 2386514, 2239383, 1577689, 771182, 197515, -55243, -15170, 255796, 524202, 507721, 224596, -37334, -140363, -215528, -322450, -300654, -90435, 56904, -105805, -430805, -493082, -79743, 553383, 949988, 941467, 806673, 910580, 1262507, 1554149, 1572152, 1375115, 1091453, 807361, 678057, 832922, 1081665, 1056033, 776158, 687279, 933718, 1050412, 721697, 400323, 658655, 1256862, 1460628, 1090438, 629104, 377098, 158155, -75278, 26276, 628162, 1310791, 1541583, 1295853, 1001905, 1015557, 1251407, 1263778, 754379, 76467, -28581, 572866, 1053550, 733171, 173586, 459188, 1598776, 2509292, 2586386, 2359303, 2365520, 2308094]
39097B308094n02625o18667k74006j10110l18162l55426n1520P2634j36808j19557
39087a06153K96203M27307r0941n53722k85302K55457K42774k14979l70557n1177
39077d51090K49271K87846L03986L76018K42726j22255l06303l0576M27449N66926
39067A543998K16080l38085o28210m06167J02242L87473K30967k5939K8684K76595
39057A387638K60953j02195l74277k20700J33592K36854k6282l96625o10866n91411
39047c03319l46960O4862M32897M66870J28240k28423k19602J10852L72005L30037
39037H07459J20997m4470j25361j20450J9491J88385J13726k23947m32491k57665
39027D5674j5773r9120l08592j76688K26937M05190K75054K45353M02785L19107
$$ y = [2308094, 1805469, 1186802, 912796, 802686, 484524, 129098, 77578, 150212, 13404, -106153, 190050, 617357, 526416, -27306, -312608, -57151, 185623, -29356, -399913, -451090, -201819, 86027, 390013, 766031, 1008757, 886502, 580199, 549623, 977072, 1543998, 1760078, 1421993, 793783, 387616, 489858, 877331, 1108298, 1082359, 1111043, 1387638, 1648591, 1546396, 1172119, 951419, 1085011, 1321865, 1295583, 898958, 288092, -303319, -650279, -585417, -152520, 314350, 442590, 214167, -5435, 105417, 477422, 807459, 928456, 883986, 758625, 638175, 657666, 846051, 959777, 735830, 303339, 45674, 29901, -69219, -377811, -554499, -327562, 77628, 352682, 598035, 1000820, 1319927]
39017A319927j17103l65861j11278J48125r4869m72667l10369K68442N08580J47774
39007I20701k89285l13684j452L73184O99797Q62986O60032J26702l56770m86575
38997B195636l39705j36739M4275J79044J79941N4546j4600P6349J83348J51136
38987B573231N1253K2959M0308J7826k414K6687k3184k77518n77398o15899l32472
38976I03379L6565K83615L94303L88709K35181j0205j73401j64538p0029R065
38966A832644M7799j6126k64739n60985n58649j37463L50746M76656K25979j03578
38956A292284l25235m22356l41611n8424K31619L11642K70017K95612K42233j55240
38946A340541o52174o27974L079N30444L66574k05470n13655l36630Q1186M83865
$$ y = [1319927, 1202824, 836963, 725685, 873810, 778941, 306274, -4095, 264347, 772927, 920701, 631416, 317732, 316280, 689464, 1389261, 2252247, 2912279, 3038981, 2682211, 2195636, 1855931, 1719192, 1763467, 1942511, 2122452, 2176998, 2162398, 2238747, 2422095, 2573231, 2624484, 2647443, 2687751, 2705577, 2703163, 2729850, 2706666, 2429148, 1851750, 1235851, 903379, 939944, 1223559, 1617862, 2006571, 2241752, 2231547, 2058146, 1893608, 1823579, 1832644, 1880443, 1864317, 1599578, 1038593, 479944, 342481, 693227, 1169883, 1395862, 1292284, 967049, 544693, 203082, 144658, 376277, 687919, 957936, 1253548, 1495781, 1340541, 688367, 60393, 63472, 593916, 960490, 755020, 241365, -95265, -14079, 469786]
38936D69786O70250M32016j15802l97108m2105N11523N69311J54576j01046O5700
38926B217101K54931J05667k29462m24347l83226j90166J9796P3384p4525j96586
38916A172567j06898k2040k16975m32023j51886N26811Q84047N60750K1374j70323
38906B065404n4238J1289p3413j65801j86592j46038o1547j832k9198n7964n978
38895A294092l3643k81834m57230j67954L65647N21284K20652M047P1522J2813
38885A549396k89678l22891R1248L08794q8256m98344k54691K69306L16990n321
38875A076553k6550K98200L99917J15473j43105j62829j31944j13009J0228J02114
38865A425048o7291k85898j57243J64555J61297j62230k71772m812K22181J86956
$$ y = [469786, 1140036, 1572052, 1456250, 1059142, 1017037, 1528560, 2097871, 2252447, 2151401, 2217101, 2472032, 2577699, 2348237, 1923890, 1540664, 1350498, 1370294, 1443678, 1369153, 1172567, 1065669, 1043629, 826654, 394631, 242745, 769556, 1653603, 2214353, 2235727, 2065404, 2011166, 2022455, 1949042, 1783241, 1596649, 1450611, 1389064, 1387232, 1358034, 1300070, 1294092, 1260449, 978615, 521385, 353431, 719078, 1240362, 1461014, 1465061, 1536583, 1549396, 1259718, 936827, 1028075, 1336869, 1248613, 750269, 495578, 764884, 1081874, 1076553, 1050003, 1348203, 1748120, 1863593, 1720488, 1557659, 1425715, 1312706, 1322934, 1425048, 1357757, 1071859, 914616, 1079171, 1240468, 1078238, 806466, 801654, 1023835, 1210791]
38855A210791J50725K37901J95352l7246j40800j5594K5694j13371q7254K22536
38845A648734M00305J89157n3013K6804J87407N1291k51118l37379j63470N2288
38835A751006K43662M51623N59470M15246R0138k22479m15582m14717j51196K23343
38825B530514L52847J24168j42785j59560o5272j27698l02580l58188k40436o9558
38815A541452O1379R3882o819j16327l1966J68666J44331j50504k70862P0061
38805A503293M86802M37813J2044k27804n3992J93328J55716j18735l53140l83248
38795A652077k32427j836K18542L59410L36491R3941k30942l13746l1860K57848
38785B107498J46686j92581k14480J64502M36562K98998M4126l4164p0519j84737
$$ y = [1210791, 1361516, 1599417, 1794769, 1757523, 1616723, 1601129, 1626823, 1513452, 1426198, 1648734, 2049039, 2238196, 2185183, 2211987, 2399394, 2450685, 2199567, 1862188, 1698718, 1751006, 1994668, 2446291, 3005761, 3421007, 3511145, 3288666, 2873084, 2458367, 2307171, 2530514, 2883361, 3007529, 2864744, 2705184, 2639912, 2512214, 2209634, 1851446, 1611010, 1541452, 1602831, 1696713, 1689894, 1573567, 1541601, 1710267, 1854598, 1704094, 1433232, 1503293, 1990095, 2427908, 2439952, 2212148, 2158156, 2351484, 2507200, 2388465, 2035325, 1652077, 1419650, 1417814, 1636356, 1995766, 2332257, 2426198, 2195256, 1881510, 1849650, 2107498, 2254184, 2061603, 1847123, 2011625, 2448187, 2747185, 2791311, 2757147, 2686628, 2501891]
38775B501891j62977M5979N7465k67034l90636Q1485O36022N75801J12473k7623
38765C162846K00826K02847j56960l62954j95591n6148j70580j93189J20995M53145
38755C005237M47400K21942O1281P86k9957j5362j7092j68751l30799j49437L45047
38744C370295O25255L94402p13j69868k46899m71827o14084l21139K19509M91010
38734C275941L85178K50889K76178K88850J88281J40818K31168K65412Q4694j73297
38724E214112k89006k57131k16405k13541j81503p8633O0649J67403J65108K8474
38714D399527j10653j4680L61638O87128N71917R2631k32037j18852O5349j59419
38704E542549o11793o45328j20754L15368J40477l01464l52238M913K49028J92366
$$ y = [2501891, 2338914, 2384893, 2442358, 2175324, 1784688, 1866173, 2502195, 3077996, 3190469, 3162846, 3363672, 3566519, 3409559, 3046605, 2851014, 2794866, 2624286, 2431097, 2552092, 3005237, 3452637, 3674579, 3735860, 3736646, 3706689, 3691327, 3674235, 3505484, 3174685, 3025248, 3370295, 3995550, 4389952, 4389239, 4219371, 3972472, 3500645, 2886561, 2565422, 2784931, 3275941, 3661119, 3912008, 4188186, 4477036, 4665317, 4806135, 5037303, 5302715, 5387409, 5214112, 4925106, 4667975, 4451570, 4238029, 4056526, 3977893, 4038542, 4205945, 4371053, 4399527, 4288874, 4274194, 4635832, 5322960, 5894877, 5987508, 5755471, 5636619, 5701968, 5542549, 4930756, 4285428, 4164674, 4480042, 4620519, 4319055, 3966817, 3971730, 4220758, 4413124]
38694D413124J80897M36857P29433Q09746P26521N62845K71937m4472r3150J42228
38684H135966K58550L1296j99318p3934J87098J60533n7060j4335L28495N36109
38674I293400M25239L42724N48570P53073N61208R3672j70467l8841K07126K40750
38664A2256454N8566j25118j72543j15471m4469L81M6092J42770L00209M48817
38654A2795688M79239L51504J62408O6238J03277J36559J7678j79798j77802J71034
38644A3926025O12977P11064L85294P3228J88427N42359N91915K50442O5207L91544
38634A7738482P68824N51706n4443j67896N32204J315334J381732Q63421M88597
38625B3417961O06523R77036J292850J448357J390138J116103Q12973O89186P13079
$$ y = [4413124, 4594021, 5030878, 5760311, 6570057, 7296578, 7859423, 8131360, 8086888, 7993738, 8135966, 8394516, 8425812, 8226494, 8152560, 8339658, 8500191, 8443131, 8428796, 8757291, 9293400, 9718639, 10061363, 10609933, 11363006, 11924214, 12017886, 11847419, 11808578, 12015704, 12256454, 12315020, 12189902, 12017359, 11901888, 11857419, 11857800, 11903892, 12046662, 12346871, 12795688, 13274927, 13626431, 13788839, 13855077, 13958354, 14094913, 14112591, 13932793, 13754991, 13926025, 14539002, 15250066, 15635360, 15708588, 15897015, 16439374, 17031289, 17281731, 17346938, 17738482, 18507306, 19059012, 19004569, 18836673, 19368877, 20684211, 22065943, 22929364, 23417961, 24024484, 25001520, 26294370, 27742727, 29132865, 30248968, 31061941, 31751127, 32464206]
38616C2464206P72731R61723J376783J782332J894476J884063K108424K412875
38608D5657613K289990J792523J646306K210004K896599L006928K685148K609768
38600F4794879L070447L797527M472087M979894N314199N596520O072251O780969
38592A04878773P393650P693628Q026697Q882501J0167011J1314851J2058256
38585A70415367J2667745J3446173J4397862J5443144J6567748J7654834J8505822
38578B79098695J9142573J9768158K0285978K0172786J9043083J7093683J4744082
38571D09349038J2017349Q562509M237775n62241n198033r276195j2805144j5923411
38563C90401647j8538123k0298617k0972956k0781166k0232358j9649975j8988775
$$ y = [32464206, 33236937, 34198660, 35575443, 37357775, 39252251, 41136314, 43244738, 45657613, 47947603, 49740126, 51386432, 53596436, 56493035, 59499963, 62185111, 64794879, 67865326, 71662853, 76134940, 81114834, 86429033, 92025553, 98097804, 104878773, 112272423, 119966051, 127992748, 136875249, 147042260, 158357111, 170415367, 183083112, 196529285, 210927147, 226370291, 242938039, 260592873, 279098695, 298241268, 318009426, 338295404, 358468190, 377511273, 394604956, 409349038, 421366387, 429928896, 434166671, 433604430, 428406397, 419130202, 406325058, 390401647, 371863524, 351564907, 330591951, 309810785, 289578427, 269928452, 250939677]
38556B50939677j8107547j7032995j5877153j4656343j3344161j2039959j0941472
38549A48940047j0127582r443726q662905p766636p008142o605729o391431n939507
38541H6994389n129719m379020m102230m114385l900847l396886l060638l091538
38533E5819126l047800k534510j901494j808307k273993k629753k395020j778668
38525C7449581j248556j000598j002694j203087j450218j475210j225284j009974
38517B7833960j050944j096461q17286m11504l86191p92912j130780j064291q06705
38508B0276886o61058o02971n32779n43419o41467n59210k09768r737l00410p11837
38498A5504230o49251k46481j91020n97579p47120j89926M89663M50219k51435
$$ y = [250939677, 232832130, 215799135, 199921982, 185265639, 171921478, 159881519, 148940047, 138812465, 129368739, 120705834, 112939198, 105931056, 99325327, 92933896, 86994389, 81864670, 77485650, 73383420, 69269035, 65368188, 61971302, 58910664, 55819126, 52771326, 50236816, 48335322, 46527015, 44253022, 41623269, 39228249, 37449581, 36201025, 35200427, 34197733, 32994646, 31544428, 30069218, 28843934, 27833960, 26783016, 25686555, 24869269, 24457765, 24071574, 23278662, 22147882, 21083591, 20276886, 19615828, 19012857, 18480078, 17936659, 17295192, 16735982, 16526214, 16516477, 16216067, 15504230, 14854979, 14608498, 14417478, 13819899, 13072779, 12882853, 13372516, 13822735, 13571300]
38489A3571300p82187o35242j47158Q2935p8953k87308k30432J7294J50178M4987
38479A1705414r0740k2436J92058L27434L18253K48569J11300j37861l38416k75760
38469A2037815q4837j42045m88000p28101o20699l89068k94276k78631k33598
38460H778560k44198l24811k80697j04425j32072m80306p05038m18344Q8247K75125
38450F452041J15985l7187q4734j66232k29630j43273p8604k54101m36821k48271
38440D889173J45108K30963k4383j59512j7060P3427k1540j2668J94580K56318
38430E554406K561k34839j77485k4357m9340j82820k50008k54054k02906k8738
38420D152420J34752J0968l00698l39799l8879P3609k67417n63342l35229J25396
$$ y = [13571300, 12789113, 12153871, 12006713, 12089648, 12010695, 11723387, 11492955, 11510249, 11660427, 11705414, 11614674, 11592238, 11784296, 12111730, 12429983, 12678552, 12789852, 12651991, 12313575, 12037815, 11952978, 11810933, 11322933, 10594832, 9974133, 9585065, 9290789, 9012158, 8778560, 8534362, 8209551, 7928854, 7824429, 7692357, 7212051, 6507013, 6088669, 6176916, 6452041, 6568026, 6530839, 6446105, 6279873, 6050243, 5906970, 5828366, 5574265, 5137444, 4889173, 5034281, 5265244, 5240861, 5081349, 5064289, 5137716, 5116176, 5103508, 5298088, 5554406, 5556967, 5322128, 5144643, 5120286, 5070946, 4888126, 4638118, 4384064, 4181158, 4152420, 4287172, 4298140, 3997442, 3657643, 3618764, 3692373, 3424956, 2861614, 2526385, 2651781]
38410B651781L11601L16770M64328N34197J14292n13280o25634j53992J87911
38401C287974n4258n20670o67725m33911r5004J32863J78319J23045K08807N27327
38391B686767P12549L51103l00457n24083j61169J47509k9160k58454k0100L79068
38381B983573K84072k17910l87701L3786M41991K81119k00477m20749k98587k01851
38371B297266k71883k59234k7568J82383J39960j6428k5466Q8104J01557l1802
38361B176889j68812k70516m10589m93887k99258J03568L02999R5061j94363j80158
38351F60934K5537L3981k10936l93951l22873j14322J11273L82289O41987O52156
38341A466075K93616k01744m56502l09073P4853L66648L53461J56208J23427L70597
$$ y = [2651781, 2963382, 3280152, 3744480, 4278677, 4392969, 3879689, 3254055, 3100063, 3287974, 3233716, 2713046, 2045321, 1611410, 1516406, 1649269, 1827588, 1950633, 2159440, 2686767, 3399316, 3750419, 3449962, 2925879, 2764710, 2912219, 2883059, 2624605, 2604505, 2983573, 3267645, 3049735, 2662034, 2695820, 3137811, 3418930, 3218453, 2797704, 2499117, 2297266, 2025383, 1766149, 1738581, 1920964, 2060924, 2044496, 2019030, 2107134, 2208691, 2176889, 2008077, 1737561, 1326972, 833085, 533827, 637395, 940394, 1035455, 841092, 660934, 686471, 720452, 509516, 115565, -207308, -321630, -210357, 171932, 813919, 1466075, 1759691, 1557947, 1101445, 792372, 867225, 1233873, 1587334, 1743542, 1866969, 2237566]
38331B237566N31266K20717l35682n18961j97883N3109j78917m97293l07896K40410
38321A246436M56586J18175k82214l42681k48977k56461j90290J35115L79235
38312A014924J05360m28307m93772P4637O28104O39073L67957K99905L80622K59923
38302B848426l9583k28065l18361n24129o90043m41619N9343J47935l53282p66037
38292c05415n14704N5366K58423N8259m9952J25699L19707L64218L72061L85047
38282A068709K95295J42525Q7731N6989j90451n67809o32575k04791L14841M31229
38272H01693J15326k75307m11911j87432K78540O47757N58720J0469n58371p19538
38262B59946m83377j65089M1078J84329L31683M10366L16198Q8114j00777j48001
$$ y = [2237566, 2768832, 2989549, 2653867, 2134906, 1937023, 1990132, 1811215, 1313922, 1006026, 1246436, 1703022, 1821197, 1538983, 1196302, 947325, 690864, 500574, 635689, 1014924, 1120284, 691977, 198205, 272842, 900946, 1540019, 1907976, 2207881, 2588503, 2848426, 2808843, 2580778, 2262417, 1738288, 1048245, 606626, 665969, 813904, 460622, -305415, -820119, -764753, -506330, -448071, -498023, -372324, -52617, 311601, 683662, 1068709, 1364004, 1506529, 1594260, 1651249, 1460798, 892989, 260414, 55623, 370464, 801693, 917019, 641712, 229801, 42369, 320909, 968666, 1527386, 1537855, 979484, 259946, -223431, -388520, -347442, -163113, 168570, 578936, 895134, 983248, 882471, 734470]
38252G34470j72853l50824n77566m91412J7135N11838N13414J81233J17223M86008
38242I68666P48579M33171j96938n30038m03028j66511q8443o8400K8235P5909
38232H01202r4975l57885l87124q3528K74106L89126L30423L82869N65606N42371
38222B362191R2885n35121q87715p62359k88480K39175M55395J32921m36289n52135
38212a79532K4023N82060L59564k90508l19177M65778J058034O95892r3249l55567
38202A947318l8162J60325q3493l86869l54118p3792J23596P2227j17247j83177
38192A066608J2302K53390J89576j32616k60063j7294J86486J9662k14524j08303
38182I95224J35497O8144k03407k06062P4763K19674J57600K41508N01395N09895
$$ y = [734470, 561617, 210793, -366773, -858185, -841050, -329212, 184202, 365435, 482658, 968666, 1717245, 2150416, 1953478, 1423440, 1020412, 853901, 765458, 697058, 725293, 801202, 706227, 348342, -38782, -122310, 151796, 540922, 871345, 1254214, 1819820, 2362191, 2455076, 1919955, 1032240, 269881, -18599, 220576, 675971, 808892, 372603, -179532, -155509, 426551, 786115, 495607, 176430, 642208, 1700242, 2396134, 2302885, 1947318, 1909156, 2069481, 1985988, 1599119, 1245001, 1171209, 1294805, 1367032, 1249785, 1066608, 1078910, 1332300, 1521876, 1389260, 1129197, 1111903, 1298389, 1318051, 1103527, 995224, 1130721, 1198865, 995458, 789396, 864159, 1083833, 1241433, 1482941, 1984336, 2494231]
38172B494231J61580o0287J30162L44758J78779j58014k74869k34461k89686l30375
38162A961818j17626J42179L671m80743p06006k91662M11591P30806M12656j45780
38152A920904l47095m3844K96736J90989j56376o3837O10675J076171N84774m89088
38142C580009j036543n82774K22008N21598K09889k04824l28099j93377l8401
38133B149486k4658j27991j71803j2295K50278L39349J46004j01830j02768J61707
38123B505479M09274L41731q4843n98074p95810m98355M3325L75597K91317l9939
38113A949702l39179m20819j63456M00614Q69213P00400q8148p43794o43645r8491
38103A422397J25519r9056j96354J14605L80394J73588k46620l85206k16469l3410
$$ y = [2494231, 2655811, 2595524, 2725686, 3070444, 3249223, 3091209, 2816340, 2581879, 2292193, 1961818, 1844192, 1986371, 1990042, 1509299, 803293, 511631, 923222, 1654028, 2066684, 1920904, 1573809, 1529965, 1826701, 2017690, 1861314, 1797477, 2408152, 3484323, 4069097, 3580009, 2543466, 1960692, 2182700, 2704298, 2914187, 2709363, 2381264, 2187887, 2149486, 2124828, 1996837, 1825034, 1812739, 2063017, 2402366, 2548370, 2446540, 2343772, 2505479, 2914753, 3256484, 3171641, 2573567, 1777757, 1279402, 1322727, 1698324, 1989641, 1949702, 1610523, 1189704, 1026248, 1426862, 2296075, 2996475, 2908327, 2164533, 1520888, 1422397, 1547916, 1448860, 1252506, 1367111, 1747505, 1921093, 1674473, 1289267, 1072798, 1039388]
38093A039388R3551K55762L25367J19690j63364j40088J61587L28300J84286l0874
38083B173605j30306j83394j74503P2288M46166M67604n8167o40397o71318j62107
38073A139471L61713M97532K52635j10203k75700r8338J84399J67604j30421k03303
38063A785389J82454N39726L52479j34873l18117j45086l7029q4770L913K03912
38053B347998J28474k08802k66563J56298N42620M66984K14818J82893J85942
38044C750662r7007l88640j69848M41205P99131O56407L97885L26249K80105J19166
38034F115315P8970L45119O45365O28599M26123M62684Q03682J048646R13404
38025A1467907O30158O29172R96265J410539J535421J314319R07092M88700J48012
$$ y = [1039388, 1132939, 1388701, 1714068, 1833758, 1670394, 1530306, 1691893, 2020193, 2204479, 2173605, 2043299, 1859905, 1685402, 1757690, 2203856, 2671460, 2613293, 1972896, 1301578, 1139471, 1501184, 1998716, 2251351, 2141148, 1865448, 1767110, 1951509, 2119113, 1988692, 1785389, 1967843, 2507569, 2860048, 2725175, 2407058, 2261972, 2224943, 2140173, 2144086, 2347998, 2476472, 2267670, 2001107, 2157405, 2700025, 3167009, 3381827, 3564720, 3750662, 3653655, 3265015, 3095167, 3536372, 4335503, 4991910, 5389795, 5716044, 5996149, 6115315, 6194285, 6539404, 7184769, 7813368, 8239491, 8702175, 9505857, 10554503, 11467907, 12098065, 12727237, 13723502, 15134041, 16669462, 17983781, 18890873, 19379573, 19527585]
38016A9527585j26624m20167p77783j090231j186869j073817r51648r42815r65795
38007A1991836r70160j074781j277406j254231p80924k15701j50954n94926r15313
37998D757440o79580j56597J61886J50279n4365l67128o57218o48697k87372L1350
37988B249998j3893j30407J53824O62826P18746J24886n27274o83090m83880l44606
37978A727130k84197o8975K35706L17526J55486Q6015K50505L22075j2958n25653
37968B202660o76398l12361J34470K09622j9414j42486M587J66361Q0820j54570
37958A493291k39927o7939J71501K37605R5739o7199n4003R9613J24081j50376
37948A642386m90854m69773j8898M23193M33530Q8990k40483l99851m83029m66974
$$ y = [19527585, 19400961, 18980794, 18203011, 17112780, 15925911, 14852094, 13900446, 12957631, 11991836, 11021676, 9946895, 8669489, 7415258, 6634334, 6418633, 6267679, 5672753, 4757440, 4077860, 3921263, 4083149, 4233428, 4179063, 3811935, 3154717, 2506020, 2218648, 2249998, 2236105, 2105698, 2259522, 2922348, 3641094, 3765980, 3238706, 2555616, 2071736, 1727130, 1442933, 1373958, 1609664, 1927190, 2082676, 2168691, 2419196, 2741271, 2728313, 2202660, 1526262, 1213901, 1348371, 1557993, 1538579, 1396093, 1400680, 1567041, 1647861, 1493291, 1253364, 1185425, 1356926, 1594531, 1690270, 1623071, 1569068, 1668681, 1792762, 1642386, 1151532, 681759, 662861, 1086054, 1519584, 1608574, 1368091, 968240, 485211, 18237]
37938A8237j65300L79980P49742N86149L7242m24487n56278n21030n06349l96066
37928g98160Q99N09659O64873L12642j05602q1704L05053N29574L19443j01814
37918A554863m28388n66124m82783j65018J58704J64083j6972J62277P83076J103627
37908B267345N48309l60346o82083l81974k25575m71569n23941m7558L86183K01742
37898G10533k53913k63724J73531M22674J89584j66141k87663k79818l58848m14291
37888e28076j88357K64195N47478L81018n0169l01256j90633J6971J3246j20651
37878a56234p7052J65416K70991L7961k94696l71629j70069M6705J17739J50411
37868b80457L04414N14024M94061P9763m44960n28708l016O09873O76619K09446
$$ y = [18237, -147063, 232917, 982659, 1568808, 1606050, 1181563, 625285, 104255, -402094, -798160, -797261, -287602, 377271, 689913, 584311, 502607, 807660, 1337234, 1656677, 1554863, 1126475, 560351, 77568, -87450, 71254, 235337, 218365, 380642, 1163718, 2267345, 2815654, 2455308, 1773225, 1391251, 1165676, 694107, 170166, 122608, 508791, 710533, 456620, 192896, 366427, 789101, 978685, 812544, 524881, 245063, -113785, -528076, -716433, -452238, 95240, 476258, 426089, 124833, -65800, -48829, -35583, -156234, -233286, -67870, 203121, 241082, -53614, -425243, -595312, -548607, -430868, -280457, 23957, 537981, 1032042, 1111805, 666845, 138137, 135121, 744994, 1421613, 1631059]
37858A631059k57972m26889m47678m22555k13848J27881K42565Q669k13309j58989
37848a31066o9264j90578k70085J6863M55166N85630L82211J60679M897k14084
37838G30369l86536k69518J340K3758k21190l13443o1086K30801K79953K00367
37828B14815J88619J92493Q8852p8434k06301k65306k22336m8352J30367J24151
37818A18568k9626j16008r4124r9343r2896J08923M03969M37714J93056Q9197
37808I19430K89219L81928O1137l25100l20846r1817j16913m03124n26904l27634
37798d60624p3034K0564M729n3258j54981j98437p5953M9084q3398l59689l66294
37787a751291n66L59712M18549L42360L85660M38527K23361k25232n41197m46895
$$ y = [1631059, 1373087, 946198, 498520, 75965, -137883, -10002, 232563, 241232, 27923, -131066, -200330, -390908, -660993, -644130, -188964, 396666, 778877, 939556, 944453, 730369, 343833, 74315, 75655, 99413, -121777, -435220, -496306, -265505, 14448, 214815, 403434, 595927, 684779, 606345, 400044, 134738, -87598, -135950, -5583, 118568, 88942, -27066, -121190, -220533, -313429, -204506, 199463, 637177, 830233, 919430, 1208649, 1590577, 1651714, 1326614, 1005768, 913951, 797038, 393914, -132990, -460624, -533658, -513094, -508365, -561623, -716604, -915041, -990994, -941910, -1025308, -1384997, -1751291, -1751857, -1392145, -973596, -631236, -245576, 192951, 416312, 191080, -350117, -797012]
37777g97012l7170L36765L91880J54174j01050j88078k23864l72591m76390k18375
37767a531711L39836P11413O06410L07330K15300K77099J58207j79745m16358
37758D87781l47178j21004K7898L9482l4341j29119j21660J05127M16648M28328
37748G51962m2836o26814p29544k09261M73134Q10137P42393M99763J89297j90072
37738A668159m45239k79623K20031N02621J86128m22461o96177m50185n6534J25544
37728C52264J08024M4000l0845j00940q2870m571n0932k37242k46161J45687O22933
37717E19347O33060J06326m20927m59149r7507K17854K29720L6523j47715k06110
37707D11422j26687M1410J99317K49143J78399O4212k2844r1885j91458l17046
$$ y = [-797012, -834182, -497417, -105537, 48637, -52413, -240491, -464355, -836946, -1313336, -1531711, -1191875, -480462, 125948, 433278, 648578, 925677, 1083884, 904139, 487781, 140603, 19599, 47497, 86979, 52638, -76481, -198141, -93014, 323634, 751962, 709126, 82312, -647232, -856493, -383359, 426778, 1169171, 1668934, 1858231, 1668159, 1222920, 943297, 1163328, 1665949, 1852077, 1429616, 733439, 283254, 226720, 352264, 460288, 504288, 473443, 372503, 289633, 285062, 234130, -3112, -249273, -103586, 519347, 1152407, 1258733, 837806, 378657, 281150, 499004, 728724, 765247, 617532, 411422, 284735, 326145, 525462, 774605, 953004, 1017216, 994372, 902487, 711029, 393983]
37697C93983l89070l31338j56462M2062J75048K17873J98336J63114J62315K19696
37687F95557K80631K19089m2761m00490n90094m10268L6336L62180K55465j45695
37677B59950l49047p7030L57359M14737K0492l42833k77779N0334K37999K23146
37667E17328K55896L87790L35640n0501m44936l93683Q5142M65471L24789j56752
37657A326184m40373l05090p2314q4589j93478k8459L55495M95703K33011k3349
37647A262741M2538J37520j06205m14787k52926K35802L23355j99838o55480m81676
37637a08956n5357p0094m83207o26256j88386M31577P44044P08860N70097M73109
37627A395431L86762K28353k4313k56463k79794q9682L7754j04462l16762k71451
$$ y = [393983, 4913, -326425, -482887, -440825, -265777, -47904, 150432, 313546, 475861, 695557, 976188, 1195277, 1152516, 752026, 161932, -248336, -212000, 150180, 405645, 259950, -89097, -166127, 191232, 605969, 626461, 283628, 5849, 56183, 294182, 517328, 773224, 1161014, 1496654, 1446153, 1001217, 607534, 692676, 1158147, 1482936, 1326184, 885811, 580721, 508407, 423818, 230340, 201881, 557376, 1053079, 1286090, 1262741, 1305279, 1442799, 1336594, 921807, 668881, 904683, 1228038, 1028200, 372720, -108956, -164313, -234407, -717614, -1343870, -1532256, -1100679, -356635, 352225, 922322, 1395431, 1782193, 2010546, 1986233, 1729770, 1449976, 1360294, 1398048, 1293586, 976824, 705373]
37617G05373m3362j5785k60368l98084j86852J16327J77081N8191J4079N2861
37607B19461O735j12639j36695n1477j6119q2170j14826p139J94082L77393M45745
37596G22351L38726J24121K2001J60432L39676K44336j10388l68312l18274j68604
37586I86065k21362m53206n80742m32206r7324K25847L84746L07393L7435k34213
37576g7567k80823n5794K34563L26490J72674j0377L520J70398K20476L233l04871
37565D01922m19837k96264j21870k1344N1568J24932J20565L0095j1564M8230
37555i3567M9433j22859k95772k31238J1305J70252J79174K02101K72963J95095
37545C36887r3747l07557j53238K58064N20573L86370p608k93869j81082K73997
$$ y = [705373, 662011, 646226, 385858, -12226, -199078, -82751, 94330, 152521, 166600, 219461, 226196, 113557, -23138, -74615, -90734, -172904, -287730, -294869, -100787, 276606, 722351, 1061077, 1185198, 1207199, 1367631, 1707307, 1951643, 1841255, 1472943, 1154669, 986065, 764703, 311497, -269245, -701451, -798775, -572928, -188182, 119211, 156646, -77567, -358390, -414184, -179621, 146869, 319543, 309166, 312686, 483084, 703560, 706793, 401922, -17915, -314179, -436049, -457393, -405825, -280893, -160328, -130233, -141797, -93567, -44134, -166993, -462765, -694003, -682698, -512446, -333272, -131171, 141792, 336887, 243140, -64417, -217655, 40409, 560982, 947352, 939744, 645875, 464793, 738790]
37535G38790O12998L57245m10808j011497r11541l48174M1231N6121L3904J84977
37525f56754K84815J39219o2184r4189o8460j60248k15880J6605M11730N65431
37515A60085L11959j33725m83549n58496k55560L28641P69539O69685J88335j11730
37505H85184l239J69016P9932j45714k82793l82408m85637l11317L25833R92544
37495H41401J027630M17070j61199k17068K5709J10757r543o8522Q317K561k28068
37484A749045n05767n33202k49810R7317K48990K28124K35625K85589J54606k12106
37474A498411m79539l41635N338J10391j08870l28156l52663l01981k31080J488
37464e28296L39153M16138R9792k01215r2566K17177K44542o2568l38858l86447
$$ y = [738790, 1351788, 1709033, 1298225, 286728, -624813, -972987, -931756, -875635, -841731, -656754, -371939, -232720, -294904, -389093, -457553, -617801, -833681, -817076, -405346, 160085, 472044, 338319, -145230, -703726, -959286, -630645, 138894, 808579, 996914, 885184, 881945, 1050961, 1130893, 985179, 702386, 319978, -165659, -476976, -151143, 841401, 1869031, 2286101, 2124902, 1907834, 1933543, 2044300, 2034757, 1966235, 1974552, 1977113, 1749045, 1243278, 710076, 460266, 557583, 806573, 1034697, 1270322, 1555911, 1710517, 1498411, 1018872, 677237, 682575, 792966, 684096, 355940, 3277, -298704, -529784, -528296, -189143, 226995, 326787, 125572, 33006, 250183, 494725, 432157, 93299, -293148]
37454b93148l38188k84518j25511J62940M15369M80684L31538J4196k76026j91818
37444a04482L36382P61015M70832l15835p27784m08786M8249N2585j81197j69632
37434b38653K7008P1792K7521J34564J96641j13653m98071l41293K35247M16883
37424h2014n1421m39466j92069K26336J76824r2889N3524N03767N68949J17287
37414G88828k50878j75066L1602N8973O3077J98008K38039M907k67398l45821
37404C44271l88110n38670n00372J0789O43863P76398L71355l5636j40479j41194
37394D02215j89624j23554R3589J63900m0835j72127O4341L96149L80160O1326
37384A035540j78137k48657l69952n36328m63530j39549K9822j77312m14690k50866
$$ y = [-293148, -631336, -915854, -1041365, -878425, -463056, 17628, 349166, 363362, 87336, -104482, 231900, 992915, 1463747, 1147912, 420128, 11342, 59591, 112176, -69021, -238653, -211645, -139853, -112332, 22232, 218873, 105220, -392851, -734144, -498897, -82014, -133435, -572901, -764970, -538634, -361810, -454699, -401175, 102592, 671541, 788828, 537950, 362884, 394486, 453459, 516536, 714544, 952583, 957490, 690092, 344271, -43839, -582509, -1082881, -1072092, -428229, 348169, 719524, 683888, 543409, 402215, 212591, 89037, 182626, 346526, 305691, 133564, 197905, 594054, 974214, 1035540, 857403, 608746, 238794, -297534, -761064, -900613, -870791, -1048103, -1462793, -1713659]
37374a713659K21818N45610M92122K23411k5016j51487j36069k6034M0704r043
37364e37643l3069J35718L91887M63069K86569N6590q7084j67215j63527J1538
37354C56833K70654L72577K81348K18194K48016J54730r2574j34867K01470M78494
37344B354875K42406k14096k30185K03975L99388j4703n84436p24451m46322j32405
37334H54046L9500J31446J68406J33381Q8147Q0121N7981J6250M6406J29586J03117
37323A848387m8610j33415r8190j05070j18171J48460O11515O50620O306o16932
37313B144900m60109J33745K17509l14237o22489k67222K04077K29435K3987K3277
37303A312873J68934K04982J86037K18735J13762k19798l94113p7158L79514L95901
$$ y = [-1713659, -1491841, -946231, -454109, -230698, -255714, -407201, -543270, -569304, -528600, -537643, -570712, -434994, -43107, 419962, 706531, 763121, 676037, 508822, 345295, 356833, 627487, 1000064, 1281412, 1499606, 1747622, 1902352, 1809778, 1674911, 1876381, 2354875, 2597281, 2383185, 2153000, 2356975, 2756363, 2741660, 2157224, 1432773, 986451, 854046, 893546, 1024992, 1193398, 1326779, 1414926, 1495047, 1553028, 1569278, 1615684, 1745270, 1848387, 1799777, 1666362, 1568172, 1463102, 1344931, 1493391, 2104906, 2755526, 2761832, 2144900, 1684791, 1818536, 2036045, 1721808, 1099319, 832097, 1036174, 1265609, 1289596, 1312873, 1481807, 1686789, 1872826, 2091561, 2205323, 1985525, 1591412, 1514254, 1893768, 2289669]
37293B289669L9169j28614L9450J20131j03651k91878j54949N5107m8995l95173
37283A420266n77838m31985k02839j58269k39648j96952J2805J25785m9581k92738
37273e90994k31283J10616L28325K45424J43560K25246K43305k1453k65822r3396
37263I3528L02009L85435Q0277j97085k44186k78915m09841m36178k99660k34816
37253a239432k83732j37979K88575N84215M61448K42017L07853M10413N1678o21407
37243F3649q61237l07539M96351P43908K74712l26414m25723j647M00997L36184
37233C93241k7168j80869J5898J92570P1200j41023j56785o9353r4632j32145
37223a29066J0720J56921K95k91704k41914J46778L06428k8467l76836k33821
$$ y = [2289669, 2328838, 2200224, 2239674, 2359805, 2256154, 1964276, 1809327, 1864434, 1815439, 1420266, 842428, 410443, 207604, 49335, -190313, -387265, -374460, -248675, -298256, -590994, -822277, -711661, -383336, -137912, 5648, 230894, 474199, 452746, 186924, 93528, 395537, 780972, 861249, 664164, 419978, 141063, -268778, -704956, -1004616, -1239432, -1523164, -1661143, -1372568, -788353, -326905, -84888, 222965, 633378, 685056, 63649, -797588, -1105127, -608776, 135132, 409844, 83430, -342293, -343940, 57057, 393241, 366073, 185204, 201102, 393672, 464872, 323849, 167064, 97711, 3079, -129066, -118346, 38575, 38870, -252834, -494748, -347970, -41542, -70009, -446845, -680666]
37213f80666J85903L32372J40757m268M9936P5992m0398j41143j93095l73452
37203f48062n83727l46218M62357J141692R35341Q3013m48172k52748R4393N6926
37193D94795o5434K08862O06190M87580p7349l79491k01040j13313m32036o10812
37183h2048j47024M92071N05345l6534l41929j03327J76288R8466q2290m5772
37173D33246M2792q3125k89572l12687k25203k56409l68372l59509k13376k4604
37163a656819K41322N69813O54008K47007l32216m80686j01681K90011K99677
37154b69564R4442R037Q2917J62243J62195N4792j48836k70934j03774J99154
37144b8328K07827j32467l18995k5318L78205M00935J52847L0423K6677p9440
$$ y = [-680666, -494763, -162391, -21634, -25902, 24034, 100026, 59628, -81515, -274610, -648062, -1231789, -1578007, -1115650, 26042, 961383, 1044396, 596224, 343476, 437869, 494795, 429361, 638223, 1244413, 1731993, 1654644, 1275153, 1074113, 960800, 528764, -82048, -229072, 262999, 768344, 731810, 389881, 286554, 462842, 561308, 479018, 433246, 476038, 392913, 103341, -209346, -434549, -690958, -1059330, -1418839, -1632215, -1656819, -1415497, -845684, -191676, 55331, -276885, -757571, -859252, -569241, -269564, -175122, -166085, -83168, 79075, 241270, 296062, 147226, -123708, -227482, -28328, 179499, 47032, -271963, -297281, 80924, 481859, 634706, 665129, 691806, 612366]
37134F12366j33365J13472L28105n430n76832n32305J18821L50114k70161p85606
37124g80821l15660N41761O68212J39018r6266J41702J31962l01006m11121J29584
37114a52635N68294K70470k46628j49284M21718O23979J63474m02023n14494k41959
37104C40912j7594r2494l16375l26023J7100L63811K63334j61168k94457P4001
37094a48953L95721K08609j31190m4675L25487L89215R3466p2916k463j59445
37084H52856o81188r55696m73815L63084P39084M56770L8745o7661L7816N4941
37074C64936n1771j09147o8202n6358j17550r1239J42247M02516L70212M465l64802
37063D25307m12225j50799J55603K68232J17671j47653j96007J81067O93601P44243
$$ y = [612366, 479001, 592473, 920578, 915148, 338316, -193989, -75168, 274946, 4785, -780821, -1096481, -554720, 113492, 252510, 156244, 297946, 429908, 128902, -282219, -152635, 415659, 686129, 439501, 290217, 711935, 1335914, 1499388, 1097365, 582871, 340912, 323318, 230824, -85551, -411574, -394474, -30663, 232671, 71503, -222954, -148953, 246768, 455377, 324187, 279512, 604999, 994214, 1087680, 1014764, 1012301, 852856, 171668, -784028, -1257843, -894759, -155675, 301095, 339840, 272179, 309995, 364936, 313165, 204018, 135816, 79458, -38092, -129331, 12916, 415432, 785644, 790109, 425307, 13082, -137717, 17886, 286118, 403789, 256136, 60129, 241196, 934797, 1679040]
37053A679040J66434m85801o05162k27161K04379M70676N89801M50309m5192n65001
37043A632322o04630j94214J10084J7521j55222o3983J63792K29708J28030M8033
37033A311441M1061K7785r11K0373J08676K09578K47382J88923J21419J81945
37023B457672K93435J52049k85777n27877j58091M46910N42755R5408j81106O5119
37013B900497L39652J73017j50980j48597P9391J06592j15024k79122k27030m1647
37003B636749J55538J85741j54395p14997r32994n25153L2626J26768j63289l18846
36993C27748k15343j47609j74033l4386K82840M33488K64282K1619q3017j21584
36983E54005j59150q6517J08620K07766O6585j56151k01004M671L11898M72834
$$ y = [1679040, 1845474, 1359673, 754511, 527350, 731729, 1202405, 1792206, 2242515, 2197323, 1632322, 1027692, 833478, 943562, 961083, 805861, 741878, 905670, 1135378, 1263408, 1311441, 1352502, 1380287, 1379376, 1399749, 1508425, 1718003, 1965385, 2154308, 2275727, 2457672, 2751107, 2903156, 2617379, 2089502, 1931411, 2378321, 2921076, 3016484, 2835378, 2900497, 3240149, 3413166, 3262186, 3113589, 3192980, 3299572, 3184548, 2905426, 2678396, 2636749, 2792287, 2978028, 2823633, 2108636, 1175642, 650489, 683115, 809883, 646594, 327748, 112405, -35204, -209237, -243623, 39217, 472705, 736987, 758606, 675589, 554005, 394855, 308338, 416958, 624724, 691309, 535158, 334154, 338825, 650723, 1123557]
36973A123557L15360n6269k91463j86528N0592J11174L797q4105j47953k46790
36963E91372k05481J21957M13250K22227k55775l14148K63129Q45625Q03651K68932
36953B754739k01508l48113l04652k46313k30698k37789j84623j8256J44836J51683
36943A279306Q1130J08509J24236j25057m80404m37746O9568M51935L05899R945
36933A387321Q9905L85084L42207j07459m77859m39166j61439M0220N9344k3485
36923A094673o5557L9684K18381K35964K0385j64897p4902J35621J38347q3017
36913A494682k55508k40988j42989l1328J42778L34686L67020J71907j00873k63560
36903A475827k51704j07622O2975J24169K8516r8019q8951O3535K17753K38072
$$ y = [1123557, 1438917, 1382648, 1091185, 904657, 955249, 1066423, 1070220, 986115, 838162, 591372, 385891, 507848, 921098, 1143325, 887550, 573402, 836531, 1682156, 2485807, 2754739, 2553231, 2205118, 1900466, 1654153, 1423455, 1185666, 1001043, 982787, 1127623, 1279306, 1360436, 1468945, 1593181, 1468124, 987720, 549974, 619542, 1071477, 1377376, 1387321, 1477226, 1862310, 2204517, 2097058, 1619199, 1180033, 1018594, 1058814, 1118158, 1094673, 1029116, 1068800, 1287181, 1523145, 1543530, 1378633, 1303731, 1439352, 1577699, 1494682, 1239174, 998186, 855197, 823869, 966647, 1301333, 1668353, 1840260, 1739387, 1475827, 1224123, 1116501, 1179476, 1303645, 1332161, 1234142, 1145191, 1208726, 1426479, 1664551]
36893A664551P2995k25868m68881m28462j03895K10519K46571N3462j42123k32275
36883F46594k41800j84160p7376M268M8049J50396L02258K94294K8211k46231
36873G24503k37256m974J92391K83678L27012K23000j44032n45206n68705j70348
36863H0063K50858L65159K18809J635j94020l10468k87661j84334j23169n7991
36853b41119J73191N01218N92404K89640j31044l03291k06324r5104j15731j72274
36843B91566j38424l9974K8831Q3762K22158L92336L47671q49l12230k04436J23575
36832G93986Q7538l66852n62593j05861M17189K76492k83437m42938p1263J94330
36822f3409P7369N0399M22194P70747O29058J69638j76894l38258m53754m79010
$$ y = [1664551, 1737546, 1511678, 1042797, 614335, 510440, 720959, 967530, 1020992, 878869, 646594, 404794, 220634, 143258, 147526, 195575, 345971, 648229, 942523, 970734, 724503, 487247, 482273, 674664, 958342, 1285354, 1508354, 1364322, 819116, 250411, 80063, 330921, 696080, 914889, 916524, 722504, 412036, 124375, -59959, -183128, -241119, -67928, 433290, 1025694, 1315334, 1184290, 880999, 674675, 579571, 463840, 291566, 153142, 113168, 141999, 225761, 447919, 840255, 1187926, 1187077, 874847, 670411, 793986, 881524, 514672, -47921, -153782, 263407, 539899, 256462, -186476, -257739, -63409, 13960, 64359, 486553, 1257300, 1886358, 2055996, 1879102, 1540844, 1087090, 608080]
36812F08080l25751j32492o6591o9105m2161m5422q5347K081K14215K38332o5312
36801B30527l39907k25813R9016K48907K59763M45751P59463P52646K10718m95700
36791A945371p89651m75411P3589K67087q4504n10286m27716P8438L75996K16678
36781F69591M3548J66654K08403j89514o01985l87041K81996O07258K62693k89320
36771G72283n29110l97673r0695J87934K45844P5970j0635K10202M50507L15801
36761A230428k7332j31446o8880k75435o46010n76389l1206K48459q5617l85937
36751g49365n1041N12113N86470K63584J46008L06481L14258J06237N8785K03636
36741A697166R7673l71447o80818m63875j08353j74447n54876o58129k71566J85514
$$ y = [608080, 282329, 149837, 83246, 14141, -28020, -73442, -158789, -156708, 57507, 295839, 230527, -109380, -335193, -236177, 12730, 272493, 718244, 1477707, 2230353, 2441071, 1945371, 1155720, 680309, 753898, 1020985, 936481, 426195, -1521, 76917, 452913, 669591, 713139, 879793, 1088196, 898682, 296697, -90344, 191652, 798910, 1061603, 772283, 243173, -154500, -245195, -57261, 188583, 264553, 253918, 464120, 914627, 1230428, 1203096, 1071650, 1002770, 727335, 81325, -495064, -526270, -277811, -363428, -749365, -800406, -288293, 298177, 561761, 707769, 1014250, 1328508, 1434745, 1493530, 1697166, 1794839, 1423392, 742574, 278699, 170346, -4101, -558977, -1217106, -1488672, -1303158]
36731a303158K74371M6795j73711k47632k47354j94848l6804J55276K13613J47829
36721a365623J57588K75970K39618j03608m60447m18568J2652M30028N14463K59718
36711d58209j53932m51217l54774R6399M33231L15054P1422K31406O22193N52533
36701I04106o4179m73865k19871J68251P0782k40897j50235K15514K03563k51690
36691A61479m98860j87840K44778K95547P2818k1990Q7617J73809J23407M0328
36681D91093J3370M122k6780j4342J23329L13254L23561K7968l54016m41854j50384
36670C09321K15667L66128K92776O4667l16245o71377o14863r0196L61615K66683
36660A84176j01292j59420R4052J90352N0829P3771L32654L65320k9275l84804
$$ y = [-1303158, -1028787, -981992, -1155703, -1403335, -1650689, -1845537, -1882341, -1727065, -1513452, -1365623, -1208035, -932065, -692447, -796055, -1256502, -1675070, -1662418, -1232390, -717927, -458209, -612141, -1063358, -1418132, -1321733, -888502, -573448, -502026, -270620, 351573, 904106, 839927, 366062, 146191, 314442, 385224, 144327, -5908, 209606, 413169, 161479, -337381, -525221, -280443, 15104, 87922, 65932, 153549, 327358, 450765, 491093, 504463, 508585, 481805, 467463, 590792, 904046, 1227607, 1255575, 901559, 459705, 309321, 524988, 891116, 1183892, 1248559, 932314, 260937, -353926, -444122, -82507, 184176, 82884, -76536, 17516, 207868, 258697, 332468, 665122, 1030442, 1001167, 616363]
36650F16363k84736O012J5519k15516l04458j27053J64276M95811Q23543Q78188
36640B067949L92570m33389j027017j027755n65054l684L58701L96206K09889
36631C68416P4029J32241J81544m5479m41884o11867l82216R856K59707L00005
36621a55648K17233Q3712l0051m1804K9184L5727j24878l73630n22294m25708
36611a308157p6068L50206N51505L51231p7806l63613l39984j69953m0920P2447
36601a051112K33500L17532J76338n1092m1877K48907M37649J77933l31769n16929
36591d00920j29268M13556N36385K31807L4286K64221N79881M65486l1730l48390
36581A615314j45024K94215M73306K54195j20477l85811m54964l82140l13808
$$ y = [616363, 331627, 337639, 353158, 137642, -166816, -293869, -129593, 366218, 1189761, 2067949, 2460519, 2027130, 1000113, -27642, -592696, -596380, -237679, 158527, 368416, 442445, 574686, 756230, 710751, 268867, -343000, -725216, -715360, -455653, -155648, 61585, 145297, 115246, 73442, 102626, 138353, 13475, -360155, -882449, -1308157, -1384225, -1034019, -482514, -131283, -209089, -572702, -912686, -1082639, -1123559, -1051112, -817612, -500080, -323742, -374834, -416711, -167804, 269845, 447778, 116009, -400920, -530188, -116632, 419753, 651560, 685846, 950067, 1529948, 1995434, 1963704, 1615314, 1470290, 1764505, 2237811, 2492006, 2371529, 1985718, 1530754, 1148614, 834806]
36572H34806m06939o19603o38050k12564M39940P68936M76046j85645p33804r01148
36562a178025o94203k30065K94355N97091N08013J71577r3803j38347o6412r785
36552h39604J8619J6868q9377l04227m24042j98515L30677P44772O27418O2098
36542e5313l72443k36841K31323M38844K44290Q7466K26889L00113l3239m16958
36532D14131l02676J26405K02542j26625j82639L15440P34024M91967p6494l18174
36522A277901k26734k35059m00915m20519k45256r9967p383J75321L39625K54532
36512D11546L7167J580J17852J28490J01092K74954M22018N2275o83182j013585
36502a49793o62055k41603k48189l36584k7962M53603N90570L81555K02434J80281
$$ y = [834806, 427867, -191736, -829786, -1042350, -602410, 166526, 642572, 456927, -276877, -1178025, -1872228, -2102293, -1807938, -1210847, -702834, -531257, -625060, -763407, -829819, -839604, -820985, -804117, -893494, -1197721, -1621763, -1820278, -1489601, -744829, -117411, -55313, -427756, -664597, -433274, 5570, 249860, 337326, 564215, 864328, 831089, 414131, 111455, 237860, 440402, 313777, 131138, 446578, 1180602, 1672569, 1596075, 1277901, 1051167, 816108, 415193, -5326, -250582, -350549, -357932, -182611, 157014, 411546, 448713, 450293, 568145, 696635, 797727, 1072681, 1494699, 1546974, 863792, -149793, -811848, -1053451, -1301640, -1638224, -1666186, -1212583, -622013, -240458, -38024, 142257]
36492A42257J97225K40449K84370R1616l90349o77988l12492L99564P17495M32775
36482A124922K0224j10298l4965K0387Q628l2016r6658j69179k41504l38359l72925
36471b21743j44311L05499N59185L49983p303o4200J16862J80990J09296J22843
36461A307101J38287j04809m54027m62028r7937J88052J27649j32977m32616o76039
36451e99344n55698J43750R09356Q92271J16931m23873j65121K67920J21349l48338
36441C59203m06238O10L06577K55207J08832N9177q029j56565k19940m5311K90643
36430E44166N10364L32084j96023n59834l24765J50849P6391n41309p16459O0235
36420f64301Q94739P12681j55209n00658j0109M72532L60721K5127o5668l0665
$$ y = [142257, 339482, 579931, 864301, 955917, 565568, -112420, -424912, -25348, 692147, 1124922, 1145146, 1034848, 999883, 1020270, 1028898, 996882, 900224, 731045, 489541, 151182, -221743, -366054, -60555, 498630, 848613, 841310, 777110, 893972, 1074962, 1184258, 1307101, 1445388, 1340579, 886552, 424524, 326587, 514639, 642288, 509311, 76695, -599344, -1155042, -1011292, -101936, 790335, 907266, 483393, 318272, 586192, 707541, 359203, -47035, -46425, 260152, 515359, 624191, 683368, 675339, 518774, 298834, 253523, 544166, 1054530, 1386614, 1190591, 630757, 305992, 456841, 533232, -8077, -724536, -664301, 230438, 943119, 787910, 287252, 277143, 749675, 1110396, 1135523, 1069855, 1039190]
36410A039190q2232n7873J43788K03889j07818m63273m17938l4579K74841L00519
36400G98514J42223l4567j05443k4416N8073r3665m16934n20125k20800J47256
36390b69884K06664P3971J18871L59912M46380J86727k06962m22025l66306j48112
36380b0764P9109J81727Q9693j18735k24791o0991K73632M52415K63729j05110
36370H09914k63069j20017j03j42033l24525k30494K5813R9372J8362J32360M42055
36359D47635M69023j4056n34590n13258l1907L34811K96318J02382N2755P5238
36349F84351o9725l38728l90147p1201K62930J63397k23722k62124K33094O05887
36339E94012L02084k15141j36093L83917M38735j38068m79858j55760O7824m50378
$$ y = [1039190, 956958, 899085, 1042873, 1246762, 1138944, 675671, 257733, 223154, 497995, 798514, 940737, 906170, 800727, 776311, 834384, 740719, 323785, -196340, -417140, -269884, -63220, 10751, 129622, 489534, 935914, 1122641, 915679, 493654, 127348, -20764, 58345, 240072, 329765, 211030, -13761, -74752, 198880, 651295, 915024, 809914, 546845, 426828, 426725, 284692, -39833, -270327, -244514, -145142, -126780, 5580, 447635, 916658, 902602, 368012, -145246, -177153, 157658, 453976, 556358, 609113, 684351, 614626, 275898, -114249, -185450, 77480, 240877, 17155, -244969, -11875, 594012, 896096, 680955, 544862, 928779, 1367514, 1229446, 749588, 593828, 661652, 211274]
36329B11274j012649o17538L72031O92119P8614m04214l1734N90422N79081K2156
36319D79562l80054l94788l57990m42768l97689k9023M36648O12346M17154J51023
36309I4421R8488J46438m6621m77458o58206k61246L35368N02173K04524l6271
36299i8390M4462J78304J41760R0155J43462J20718m9998q6154J54642L09911
36289I48872L7701l91270m62956j67586P1044O9229K4082M8935L0841k9132L5705
36278B15465J88153J60513p6615j88071M640K13505J31397j01934j71420r1368
36268B84265r4000j59846m3310K53368L88361J52463k31561m01586k56041L7791
36258g0096K52569K14581r8366m30491m03927J1158L46330J95073k05087k54998
$$ y = [211274, -801375, -1418913, -1046882, -354763, -276149, -680363, -712097, -121675, 457406, 479562, 99508, -295280, -653270, -1096038, -1493727, -1522750, -1086102, -473756, -56602, 94421, 192909, 339347, 292726, -184732, -842938, -1104184, -768816, -266643, -62119, -98390, -53928, 124376, 266136, 356291, 499753, 620471, 570473, 484319, 638961, 948872, 986573, 595303, 132347, -35239, 35805, 105034, 129116, 178051, 208892, 179760, 215465, 403618, 564131, 487516, 299445, 304085, 517590, 648987, 547053, 375633, 284265, 190265, 30419, -12891, 240477, 628838, 781301, 549740, 148154, -107887, -70096, 182473, 397054, 298688, -131803, -535730, -524572, -178242, 16831, -188256, -443254]
36248d43254J88694O18043N62119J59967j15912p5977N2807k2822l50463o89604
36238a16402o87166k25202L25020M02404l9813l71215r0893M20241L63827l34686
36228c53885q33594m67505L80894Q17205N82227K35930K40948L23351k590n71379
36218C51602o92121j47477M05774L16761j47668k55373N1193J39873j67786k19686
36208c64908L48047Q31308M46312m07613o83741k13264J80990L1420k21619j87428
36198b40496j62442m09185n27389j15560M51686N17325Q7745k80342l18158k31585
36188a228401j71944k8735K36781M29872L59585L5199l45854m78857j80186L03584
36178a068956M46895J17537j87263n5465K28012J88675m6497j5404K45296K64375
$$ y = [-443254, -254560, 363483, 925602, 1085569, 969657, 893680, 946487, 923665, 573202, -116402, -803568, -1028770, -703750, -301346, -341159, -712374, -803267, -383026, -19199, -353885, -1187479, -1654984, -1274090, -456885, 125342, 361272, 602220, 925571, 922981, 351602, -340519, -487996, -82222, 234539, 86871, -168502, -117309, 22564, -145222, -364908, -16861, 814447, 1260759, 853146, 169405, -43859, 137131, 168551, -53068, -240496, -402938, -812123, -1339512, -1455072, -1003386, -486061, -398316, -678658, -996816, -1228401, -1400345, -1429080, -1192299, -762427, -402842, -367643, -713497, -1192354, -1372540, -1068956, -622061, -504524, -691787, -747252, -519240, -330565, -377062, -392466, -147170, 117205]
36168A17205n2449l09845l31586l55184m29664k47826K27085N54041M98906L86558
36158E7241M61192M33561P2156k59665j86326k5501k73354o63506m77390K65075
36148e96517O70369K15905m98400o17076j91687L4168k21736m19594p3646M81624
36138a216590N34877j1487n02515m03751N0417K73220J16088p2737l9057R5549
36128a175986J45276J17223O4447m1896j64124j46859M7737K39136K85452K66893
36118c62701L03366L67655L86339L46426K13029n1854l09678l43986k34345l09673
36108D578n81327o09800j88168K50763K82565J51592K77895M45502J51653m16737
36098b31484n23339l8457K96865K313m10841k47148L41963O36761L49170j44166
$$ y = [117205, 64756, -245089, -576675, -931859, -1361523, -1609349, -1382264, -828223, -329317, 57241, 518433, 951994, 1024150, 764485, 578159, 552658, 279304, -384202, -861592, -596517, 73852, 289757, -208643, -825719, -1017406, -983238, -1204974, -1624568, -1698214, -1216590, -681713, -693200, -1195715, -1599466, -1549049, -1275829, -1159741, -1232478, -1271535, -1175986, -1030710, -913487, -849040, -890936, -1055060, -1201919, -1154182, -915046, -629594, -362701, -59335, 308320, 694659, 1041085, 1254114, 1202260, 892582, 548596, 314251, 4578, -576749, -1186549, -1374717, -1123954, -841389, -689797, -411902, 33600, 185253, -231484, -754823, -793280, -496415, -494102, -904943, -1152091, -810128, -173367, 175803, 31637]
36088C1637m11671l85719k19394m8920Q4408K51114N26660P64644O44054J10859
36078A347672m20995n40226l36372j71872j37197o1647O6108P5684k7889o1383
36068b68117k6602j00804k18538p5850L07219M43517O4271m00611l87690Q397
36058f54808K32457J05407k2454N1045N4023k25642m99786l89932J737K89524
36048a058429L86067M84754N56018L30197j47561l99928j83559R3625n1500m55789
36038d46105n66496k57848O0854J23790J37483L19131N05206M47401K22644R5298
36028F41358J35163J79554O7820k17518n17479n30495r0536M92615O57599L21442
36018A139523M0150J65311K37560k90391j037268j093159l63428K36576J04410
$$ y = [31637, -380034, -765753, -985147, -1034067, -949659, -698545, -171885, 592759, 1236813, 1347672, 926677, 386451, 50079, -121793, -258990, -320637, -254529, -178845, -206734, -268117, -294719, -395523, -614061, -689911, -382692, 60825, 125096, -275515, -663205, -654808, -422351, -316944, -339398, -288353, -234330, -459972, -959758, -1349690, -1347953, -1058429, -672362, -187608, 368410, 698607, 551046, 151118, -32441, 61184, 9684, -446105, -1012601, -1270449, -1209595, -1085805, -948322, -629191, -123985, 323416, 546060, 641358, 776521, 956075, 1023895, 806377, 288898, -241597, -332133, 160482, 818081, 1139523, 1179673, 1344984, 1582544, 1292153, 254885, -838274, -1201702, -965126, -860716]
36009h60716k37503n2822M66084N64007R0087l65559m08322k88374l00315k54891
35999a648324J47407P19166R25563N60206J4433k00408m7398P0043r1489k60388
35989A88811o5760L37231L97570l9100m52563l83135r8146j34948m12822l30518
35979i93380K63973P32651M83980k30739o52814m27023J08685M28932L56469J05873
35969A76607k1123P1109K17143J93294m2591l31559m71953l34899O2916M52784
35959b8272M19347j17360o15914m70328J62254N17530K75319m9944J7711J93212
35949C03555q03m00633n16059l69465l52836l96567q914P91910J263496R03324
35939A217008J07071m22824n01991l93526k78324j52103j7470J22432K98610M11841
$$ y = [-860716, -1098219, -1151041, -684957, -120950, -30863, -396422, -804744, -1093118, -1393433, -1648324, -1500917, -781751, 143812, 704018, 718451, 518043, 470645, 540688, 449199, 188811, 123051, 460282, 857852, 818752, 366189, -16946, -115092, -250040, -662862, -993380, -729407, 3244, 487224, 256485, -396329, -823352, -714667, -285735, 70734, 176607, 155484, 226593, 443736, 637030, 594439, 262880, -209073, -543972, -481056, -28272, 391075, 273715, -342199, -812527, -650273, -132743, 142576, 92632, 110343, 303555, 302752, -97881, -613940, -983405, -1336241, -1732808, -1741722, -949812, 313684, 1217008, 1324079, 901255, 399264, 5738, -272586, -424689, -442159, -319727, -21117, 390724]
35929C90724K58228r6864k54915l5737K00746Q2948k09010k77610j53010j54225
35919b48725k69814j71872J89147M63583M27314K40836J08643K4333m9278n7985
35909F56182l5074j38014l79813n41604m68450k70871j38143j06967q7388N429
35899a504713J69436K65700J22528j62114j79400K57026O94545N50515o0382m76953
35889c23812m34402l06994l43439k75126Q1501M07325M09078K68895J93478Q404
35879c15092l49948m30670N8244N74605M19750j84465m14950p8272K23145J10221
35869c87432j34417k29193k89900l76056k70595M0834K21875J63732J76571L45992
35859g38589K77003j60978m10712n4035M23603L14949k06298l52659P4043M42240
$$ y = [390724, 648952, 552088, 297173, 261436, 462182, 545130, 336120, 58510, -94500, -248725, -518539, -690411, -501264, -37681, 389633, 630469, 739112, 763445, 714167, 656182, 621108, 483094, 103281, -438323, -906773, -1177644, -1315787, -1422754, -1510142, -1504713, -1335277, -1069577, -947049, -1109163, -1288563, -1031537, -336992, 213523, 153141, -323812, -758214, -1065208, -1408647, -1683773, -1602272, -1194947, -785869, -516974, -323496, -315092, -665040, -1095710, -1037466, -462861, -43111, -227576, -642526, -720798, -497653, -387432, -521849, -751042, -1040942, -1416998, -1687593, -1646759, -1424884, -1261152, -1084581, -738589, -461586, -622564, -1033276, -1087311, -663708, -348759, -555057, -907716, -833673, -391433]
35849c91433K82241r5056j60423J09389L36455K92570Q6808p6491j42315k10396
35839C1349l47137m27975k67691O6512K60807J90284J24101K84168M30225K13973
35829E58616k19795l96816k21110q9967k52967m63549m17865k00649q0622j02968
35819a887692j03790K3962K53516M93525N98934M28184K1605l57209m55513k50350
35809a234828R2861L70271M24627K30829m0253j67578j32761r9028j28638j10823
35799g95321j0515L9029j1852j2683J06544J53252l0059k56685k17775Q8820L69080
35788e78165M05395K24644m1293k51327k43632M1904L85744M23141O1285l42262
35778H5434l30454J38561N93801N10518j24136p51284q11250l37045J37965K42912
$$ y = [-391433, -109192, -204248, -364671, -255282, 81173, 373743, 460551, 384060, 241745, 31349, -315788, -743763, -1011454, -944942, -684135, -493851, -369750, -85582, 344643, 558616, 338821, -57995, -279105, -369072, -622039, -1085588, -1503453, -1704102, -1784724, -1887692, -1991482, -1967520, -1714004, -1220479, -621545, -193361, -171756, -528965, -984478, -1234828, -1141967, -771696, -347069, -116240, -156493, -324071, -456832, -555860, -684498, -795321, -805836, -766807, -778659, -791342, -684798, -531546, -561605, -818290, -1036065, -947245, -578165, -172770, 51874, 10581, -240746, -484378, -442474, -56730, 366411, 427696, 85434, -245020, -106459, 487342, 997860, 873724, 122440, -688810, -1025855, -887890, -644978]
35768f44978J46647K01814M19818N00714K91757m518j05526J2628J25886O1988
35758A006230q3655q4038P8842J40103p2137l24694k76445m893R1941p6543j65027
35747B29684j9016O982l46380o99062n24633N5284M41615L87751J81401N5004
35737b31370q3200k65668k82749o6106J03920p366k44965l15277j81196j6156
35727a590133R4224K27411M50897O62549O11261J54436m35115o08357k07031K11599
35717d28259P6704l44217l06110K74550O79166M96057J97219K93092N20723L55572
35707A814497j32265m77210n38887m87786l39302m5816J57314M3344j40691m3964
35697a90766J36879m395k53942m4249M67249M37084l33696r27031n90087K08232
$$ y = [-644978, -498331, -296517, 123301, 624015, 915772, 911254, 805728, 818356, 944242, 1006230, 922575, 838537, 917379, 1057482, 985345, 660651, 384206, 379313, 471254, 394711, 229684, 210668, 217650, -128730, -827792, -1352425, -1297141, -855526, -467775, -286374, -231370, -314570, -580238, -862987, -929093, -825173, -832539, -1077504, -1392781, -1573977, -1590133, -1495909, -1268498, -817601, -155052, 456209, 610645, 175530, -432827, -639858, -428259, -351555, -695772, -1001882, -727332, -48166, 447891, 645110, 938202, 1458925, 1814497, 1682232, 1205022, 666135, 178349, -160953, -206769, -49455, -6111, -146802, -190766, -53887, -58282, -312224, -356473, 110776, 547860, 214164, -712867, -1302954, -1094722]
35687a094722N64210M10210L11089L96220K87361o2471k29562q5916m7601l48973
35677I9845o01726l90707P6479K83513J41630M3459K55966N70102O04688K66561
35667A349810j79294m09951l46210j83123j58717k99167l98073k54797P6387K99306
35657e03829J68197k19140m59792k42392K98203O98353O51494K87725n6469k11651
35647D10699k19249j34362J8573J30910O5770j12359j36166J25149M45719M98329
$$ y = [-1094722, -530512, -120302, 190787, 587007, 874368, 811897, 582335, 496419, 448818, 99845, -501881, -892588, -816109, -532596, -390966, -347507, -91541, 478561, 1083249, 1349810, 1170516, 760565, 414355, 231232, 72515, -226652, -624725, -879522, -803135, -503829, -335632, -554772, -1014564, -1256956, -958753, -260400, 391094, 678819, 622350, 410699, 191450, 57088, 75661, 206571, 272341, 159982, 23816, 148965, 594684, 1093013]
$$ [...]
##END NTUPLES=NMR SPECTRUM
##END=
