##TITLE=31Pdec_LR-794-O-C3-1
 CDCl3, 24 sc
 24.12.2024
##JCAMPDX= 6.0         $$ Bruker NMR JCAMP-DX V2.0
##DATA TYPE= NMR SPECTRUM
##DATA CLASS= NTUPLES
##ORIGIN= UXNMR, Bruker Analytische Messtechnik GmbH
##OWNER= root
$$ XWIN-NMR		Version 3.5
$$ Tue Dec 24 14:13:01 2024 Russian Standard Time (UT+4h)  she@DPX200
##.OBSERVE FREQUENCY= 81.013821
##.OBSERVE NUCLEUS= ^31P
##.ACQUISITION MODE= SIMULTANEOUS
##.ACQUISITION SCHEME= undefined
##.AVERAGES= 24
##.DIGITISER RES= 17
##SPECTROMETER/DATA SYSTEM= spect
##.PULSE SEQUENCE= zgpg30
##.SOLVENT NAME= CDCl3
##.SHIFT REFERENCE= (INTERNAL, CDCl3, 0, 198.062)
##AUDIT TRAIL= $$ (NUMBER, WHEN, WHO, WHERE, WHAT)
$$ ##TITLE= Audit trail, XWIN-NMR		Version 3.5
$$ ##JCAMPDX= 5.01
$$ ##ORIGIN= Bruker BioSpin GmbH
$$ ##OWNER= she
$$ F:/spectra/data/she/nmr/P31/2/pdata/1/auditp.txt
$$ ##AUDIT TRAIL=  $$ (NUMBER, WHEN, WHO, WHERE, WHAT)
(   1,<2024-12-24 14:11:55.46 +0400>,<she>,<DPX200>,
      <created by zg, POWCHK disabled, PULCHK disabled
       configuration hash MD5:
       00 E9 B6 7A A2 85 ED C7 34 08 36 98 17 FE 4E 26
       data hash MD5: 32K
       9F DD 02 C5 23 87 56 61 34 5C B3 DF 4B 88 C7 C8>)
(   2,<2024-12-24 14:11:57.76 +0400>,<she>,<DPX200>,
      <Start of raw data processing
       efp BC_mod = 2 LB = 1.5 FT_mod = 6 PKNL = 1 PHC0 = 2169.098 PHC1 = -39.91409 SI = 64K 
       data hash MD5: 64K
       BD 26 1F 27 E9 25 B2 02 8C F6 BD 03 DB E5 62 C8>)
(   3,<2024-12-24 14:12:18.62 +0400>,<she>,<DPX200>,
      <pk PHC0 = -66.41395 PHC1 = 177.4001 
       data hash MD5: 64K
       71 21 F0 FD 6C 76 35 D9 54 77 8E 45 AC 17 39 E2>)
(   4,<2024-12-24 14:12:23.12 +0400>,<she>,<DPX200>,
      <abs ABSG = 5 
       data hash MD5: 64K
       53 56 E8 75 AA A9 A3 CB 6F 62 43 10 4F 76 E7 61>)
$$ ##END=
$$ 
$$ hash MD5
$$ FD 73 8E 65 A6 6A 01 C1 55 5D 00 18 C8 76 2C A2
##$RELAX= 
##$RELAX= 
##$RELAX= 
##$RELAX= 
##$RELAX= 
##$RELAX= 
##$RELAX= 
##$RELAX= 
$$ Bruker specific parameters
$$ --------------------------
##$DU= <F:/spectra>
##$EXPNO= 2
##$NAME= <P31>
##$PROCNO= 1
##$TYPE= <nmr>
##$USER= <she>
##$AMP= (0..31)
100 100 100 100 100 100 100 100 100 100 100 100 100 100 100 100 100 100 
100 100 100 100 100 100 100 100 100 100 100 100 100 100 
##$AQSEQ= 0
##$AQ_mod= 1
##$AUNM= <au_zg>
##$AUTOPOS= <>
##$BF1= 81.014009
##$BF2= 200.13
##$BF3= 200.13
##$BF4= 200.13
##$BF5= 200.13
##$BF6= 200.13
##$BF7= 200.13
##$BF8= 200.13
##$BYTORDA= 1
##$CFDGTYP= 0
##$CFRGTYP= 5
##$CHEMSTR= <none>
##$CNST= (0..31)
1 1 145 1 1 1 1 1 1 1 1 1 1 1 1 1 1 1 1 1 1 1 1 1 1 1 1 1 1 1 1 1 
##$CPDPRG= <waltz16>
##$CPDPRG1= <>
##$CPDPRG2= <waltz16>
##$CPDPRG3= <>
##$CPDPRG4= <mlev>
##$CPDPRG5= <mlev>
##$CPDPRG6= <mlev>
##$CPDPRG7= <mlev>
##$CPDPRG8= <mlev>
##$CPDPRGB= <>
##$CPDPRGT= <>
##$D= (0..31)
0 1 0 0 0 0 0 0 0 0.06 0 0.03 2e-05 3e-06 0 0 0.0002 0 0 0 0 0 0 0 0 0 
0 0 0 0 0 0 
##$DATE= 1735035114
##$DBL= (0..7)
120 120 120 11 120 120 24 19 
##$DBP= (0..7)
150 150 150 150 150 150 150 150 
##$DBP07= 0
##$DBPNAM0= <>
$$ [...]
##$SUBNAM3= <"">
##$SUBNAM4= <"">
##$SUBNAM5= <"">
##$SUBNAM6= <"">
##$SUBNAM7= <"">
##$SUBNAM8= <"">
##$SUBNAM9= <"">
##$SW= 400.765351723535
##$SWIBOX= (0..15)
0 1 3 0 0 0 0 0 0 0 0 0 0 0 0 0 
##$SW_h= 32467.5324675325
##$TD= 32768
##$TD0= 1
##$TE= 0
##$TE2= 300
##$TE3= 300
##$TEG= 300
##$TL= (0..7)
0 120 53 12 22 120 120 120 
##$TP= (0..7)
150 150 150 150 150 150 150 150 
##$TP07= 0
##$TPNAME0= <>
##$TPNAME1= <>
##$TPNAME2= <>
##$TPNAME3= <>
##$TPNAME4= <>
##$TPNAME5= <>
##$TPNAME6= <>
##$TPNAME7= <>
##$TPOAL= (0..7)
0.5 0.5 0.5 0.5 0.5 0.5 0.5 0.5 
##$TPOFFS= (0..7)
0 0 0 0 0 0 0 0 
##$TUNHIN= 0
##$TUNHOUT= 0
##$TUNXOUT= 0
##$USERA1= <user>
##$USERA2= <user>
##$USERA3= <user>
##$USERA4= <user>
##$USERA5= <user>
##$V9= 5
##$VALIST= <valist>
##$VCLIST= <CCCCCCCCCCCCCCC>
##$VD= 0
##$VDLIST= <DDDDDDDDDDDDDDD>
##$VPLIST= <PPPPPPPPPPPPPPP>
##$VTLIST= <TTTTTTTTTTTTTTT>
##$WBST= 1024
##$WBSW= 4
##$XGAIN= (0..3)
0 0 0 0 
##$XL= 0
##$YL= 0
##$YMAX_a= 18188
##$YMIN_a= -19125
##$ZGOPTNS= <>
##$ZL1= 120
##$ZL2= 120
##$ZL3= 120
##$ZL4= 120
##$ABSF1= 198.0616
##$ABSF2= -202.7028
##$ABSG= 5
##$ABSL= 3
##$ALPHA= 0
##$AQORDER= 0
##$ASSFAC= 0
##$ASSFACI= 0
##$ASSFACX= 0
##$ASSWID= 0
##$AUNMP= <proc_1d>
##$AZFE= 0.1
##$AZFW= 0.5
##$BCFW= 0
##$BC_mod= 2
##$BYTORDP= 0
##$COROFFS= 0
##$CY= -3
##$DATMOD= 1
##$DC= 0
##$DFILT= <>
##$DTYPP= 0
##$F1P= 0
##$F2P= 0
##$FCOR= 1
##$FTSIZE= 65536
##$FT_mod= 6
##$GAMMA= 0
##$GB= 0
##$INTBC= 1
##$INTSCL= 9.790993e-09
##$ISEN= 30
##$LB= 1.5
##$LEV0= 0
##$LPBIN= 0
##$MAXI= 10000
##$MC2= 0
##$MEAN= 0
##$ME_mod= 0
##$MI= 50
##$NCOEF= 0
##$NC_proc= -5
##$NLEV= 6
##$NOISF1= 182.463
##$NOISF2= 159.3651
##$NSP= 0
##$NTH_PI= 0
##$NZP= 0
##$OFFSET= 198.0616
##$PC= 4
##$PHC0= 2102.684
##$PHC1= 137.486
##$PH_mod= 1
##$PKNL= yes
##$PPARMOD= 0
##$PSCAL= 0
##$PSIGN= 0
##$REVERSE= no
##$SF= 81.0140089999434
##$SI= 65536
##$SIGF1= 159.3651
##$SIGF2= -187.1042
##$SINO= 113.3802
##$SIOLD= 16384
##$SREGLST= <1H.CDCl3>
##$SSB= 0
##$STSI= 65536
##$STSR= 0
##$SW_p= 32467.5324675325
##$SYMM= 0
##$S_DEV= 0
##$TDeff= 32768
##$TDoff= 0
##$TI= <>
##$TILT= no
##$TM1= 0
##$TM2= 0
##$TOPLEV= 0
##$USERP1= <user>
##$USERP2= <user>
##$USERP3= <user>
##$USERP4= <user>
##$USERP5= <user>
##$WDW= 1
##$XDIM= 65536
##$YMAX_p= 412950622
##$YMIN_p= -5069068
$$ End of Bruker specific parameters
$$ ---------------------------------
##NTUPLES= NMR SPECTRUM
##VAR_NAME=  FREQUENCY,     SPECTRUM/REAL,   SPECTRUM/IMAG
##SYMBOL=    X,             R,               I
##VAR_TYPE=  INDEPENDENT,   DEPENDENT,       DEPENDENT
##VAR_FORM=  AFFN,          ASDF,            ASDF
##VAR_DIM=   65536,         65536,           65536
##UNITS=     HZ,            ARBITRARY UNITS, ARBITRARY UNITS
##FACTOR=    0.49542278885378, 1,            1
##FIRST=     16045.7642231865, 0,            0
##LAST=      -16421.768244346, 0,            0
##MIN=       -16421.768244346, -5069068,     0
##MAX=       16045.7642231865, 412950622,    0
$$ Real data points
##PAGE= N=1
##DATA TABLE= (X++(R..R)), XYDATA
$$ [...]
44073 -507587 -565765 -446100 -149072 111428 164296 84333 48226 82684 75053 -11965 -75760
44062 -75760 -49423 -24000 -115127 -287171 -422623 -515708 -639921 -721956 -547750 -95228 312996
44051 312996 366900 170318 88828 269338 528889 681463 724078 677614 502091 262257
44041 262257 155926 251372 371849 356555 262176 185683 82092 -73420 -119472 83232
44031 83232 401415 594423 631235 642393 650544 568478 401464 237994 88225 -65432 -119071
44020 -119071 18253 183762 111889 -177684 -398643 -422446 -415077 -492428 -517673 -370440 -183088
44009 -183088 -137537 -192185 -174227 -23212 193216 396059 501305 415228 158264 -81810
43999 -81810 -140363 -62764 -4157 -2360 46094 208908 390866 387203 66849 -455370 -858178
43988 -858178 -913389 -720973 -543833 -469865 -407242 -354322 -413666 -522551 -457513 -194591 10715
43977 10715 25523 40927 207001 355570 317615 248816 346629 469533 379323 194758 232872
43966 232872 495866 683663 674589 642494 699959 757653 762579 763746 702499 442188 65994
43955 65994 -143771 -93303 27900 93098 175788 263501 167605 -137246 -394006 -460473 -530686
43944 -530686 -751438 -908282 -764721 -472690 -339084 -371306 -380186 -396366 -632638 -1082197
43934 -1082197 -1469679 -1601577 -1505243 -1233447 -808069 -384915 -200801 -266092 -321986 -198585
43924 -198585 -34754 -40827 -198939 -313909 -246405 6693 364662 691090 844218 801952
43914 801952 697562 656335 631640 470314 117147 -307641 -631030 -780178 -797409 -730938
43904 -730938 -563432 -292341 -47062 -14050 -195790 -345634 -243653 30219 212698 187215
43894 187215 53573 -92646 -262632 -429636 -466780 -324162 -138726 -64355 -90773 -130562
43884 -130562 -189146 -318587 -465200 -506935 -427273 -327113 -258610 -164779 -15217 103500
43874 103500 95533 -14932 -128141 -197723 -249476 -299153 -321853 -302257 -257655 -201185 -131328
43863 -131328 -70162 -54732 -58315 20285 221389 411506 394227 142893 -157875 -338401 -438828
43852 -438828 -607803 -849499 -971165 -809710 -448119 -149763 -88916 -192450 -263727 -223664
43842 -223664 -175693 -234088 -357500 -406551 -330862 -227675 -214800 -304339 -414405 -458322 -410464
43831 -410464 -327836 -314599 -416314 -540394 -539270 -394151 -261366 -303582 -512294 -718360
43821 -718360 -744909 -548816 -263331 -101690 -155386 -290363 -318303 -251340 -263371 -399165
43811 -399165 -495042 -447120 -371426 -376840 -359465 -210724 -84138 -202998 -471144 -546213 -311625
43800 -311625 -26741 52859 -24745 -91022 -129346 -197739 -230164 -123420 34077 11883 -261858
43789 -261858 -577633 -669994 -493207 -229047 -63627 -6447 67975 234514 418898 497774
43779 497774 448690 348855 258421 179666 117095 88758 68601 5670 -78148 -101844 -71545
43768 -71545 -110818 -275784 -429543 -401359 -216061 -57485 -30395 -66540 -65187 -17772 38607
43757 38607 94497 131461 85475 -62221 -193969 -159522 23379 171309 171083 112694 121593
43746 121593 166716 159307 155239 272126 435288 431867 261898 198299 373500 527341 368468
43735 368468 16671 -167834 -87735 37621 70498 105992 198648 227115 135579 79457 197471
43724 197471 409810 559415 599304 535477 353805 138010 102136 336033 629511 711960
43714 711960 579877 434149 374718 327918 233470 140821 113766 142310 150244 42664 -199082
43703 -199082 -421220 -396073 -97087 236572 406879 487745 608297 666040 487819 178506
43693 178506 39935 164403 361655 498278 644549 819081 848725 628727 329555 170997
43683 170997 118083 -23579 -285048 -475749 -433996 -207553 36920 203845 330069 483483
43673 483483 636483 679248 575038 438074 379301 328462 140112 -139717 -279428 -181553
43663 -181553 -37003 -60403 -202773 -265632 -208353 -169511 -204695 -171518 65511 414282 620759
43652 620759 535335 272283 98675 172958 403239 574255 589525 533090 498785 460018 374033
43641 374033 329721 459027 708856 835953 694585 439778 343408 450581 542764 459155
43631 459155 325210 366957 582675 744025 708691 579455 508455 485828 422736 337510 322411
43620 322411 376804 406080 370558 321902 296395 275049 249265 228428 181847 70015 -67989
43609 -67989 -161594 -236895 -366755 -475129 -346532 84869 565701 747831 532554 128004
43599 128004 -179096 -245999 -120028 62682 220631 369914 503405 492501 237006 -108870
43589 -108870 -246750 -127597 -47762 -231060 -487014 -477210 -207049 -15061 -98339 -276926
43579 -276926 -283252 -107676 40049 -2682 -227857 -535612 -834786 -1065598 -1176556 -1111393
43569 -1111393 -845701 -455343 -109973 65112 115400 186751 323864 394723 234059 -174059
43559 -174059 -662633 -995058 -1018214 -760897 -407573 -149700 -47749 -41530 -60630 -73645
43549 -73645 -49956 45183 190258 299456 316417 283995 283117 323240 333398 257286 120042
43538 120042 -12262 -109365 -181461 -224750 -219034 -197240 -254525 -428150 -609330 -654800 -565138
43527 -565138 -461546 -396290 -298819 -123247 77711 265319 461084 607337 535087 206883
43517 206883 -130453 -209330 -77817 11610 -9009 37584 252325 503134 641940 673583
43507 673583 619608 407183 39624 -265270 -285423 -77458 95778 77062 -73301 -236260
43497 -236260 -358215 -411168 -359683 -221157 -86428 -27633 -13656 50262 196784 313732
43487 313732 214636 -153459 -580973 -768428 -657301 -478341 -413865 -361136 -169517 27384
43477 27384 -46059 -381369 -662920 -704297 -654957 -677462 -667541 -471824 -182936 14082 149471
43466 149471 362671 574901 556746 311976 110471 89307 88517 -21666 -111949 -51790 26488
43455 26488 -70244 -290873 -450768 -518254 -567889 -557592 -402939 -206336 -154055 -216322 -203927
43444 -203927 -100846 -55450 -30680 206087 646764 919338 783252 480008 369530 445713
43434 445713 466186 366526 244835 71756 -253495 -615948 -771270 -716789 -684192 -738909
43424 -738909 -683594 -434610 -202923 -155772 -148206 4981 170366 49327 -387723 -830656
43414 -830656 -984278 -843016 -603375 -425173 -321859 -220659 -80437 52952 103884 57085
43404 57085 -39869 -134775 -171217 -67240 195479 460950 504941 293672 29801 -100654
43394 -100654 -112346 -103225 -91760 -65131 -67873 -118421 -125396 -10507 158953 281368 386385
43383 386385 545545 682779 647263 453134 277534 215185 197592 176697 213276 316838
43373 316838 359682 262575 146376 165694 267279 255065 70557 -114324 -96780 145301
43363 145301 450044 617863 565665 404205 361487 552874 815620 853620 577446 221213
43353 221213 75115 183865 382754 546594 670446 736709 662870 434201 180917 51883
43343 51883 71304 160393 226973 191672 18498 -209744 -333004 -316807 -328680 -507504 -743387
43332 -743387 -826757 -745988 -662561 -628356 -531560 -342571 -210751 -237803 -315455 -286714 -147069
43321 -147069 5311 114591 179204 213728 265969 369503 427841 287946 3044 -153904
43311 -153904 -66416 19386 -142330 -390786 -379305 -102586 108263 108594 136143 387608 675267
43300 675267 686241 401759 63683 -159932 -279898 -320031 -246405 -79281 70946 127488
43290 127488 111083 39757 -140807 -446958 -733040 -787563 -571428 -281674 -133102 -138161
43280 -138161 -167431 -161960 -162789 -155968 -58567 87973 79744 -163933 -400232 -322873 40401 367963
43268 367963 453308 386273 313259 215152 14243 -237981 -396970 -382441 -225026 -14133
43258 -14133 145312 187330 154667 164702 260936 348714 316942 173381 26869 -18707 54943
43247 54943 134252 10996 -413161 -920551 -1109244 -818198 -316419 22102 118954 146347
43237 146347 199221 207229 138693 94680 154124 257519 296512 227688 68755 -123766 -244794
43226 -244794 -210386 -81189 -20988 -80591 -120508 -17506 152225 238605 242417 276751 348821
43215 348821 340750 220056 116422 126675 166522 106328 -38835 -158151 -211300 -228776 -201435
43204 -201435 -110140 -43334 -130080 -333819 -458668 -412405 -325159 -326252 -331536 -173502 141363
43193 141363 427430 521689 399516 159474 -4687 99303 453422 777029 830227 711865
43183 711865 685566 767576 719605 453895 186543 101685 96807 8694 -98341 -62198 85170
43172 85170 157805 83748 -46844 -167846 -303532 -449923 -536328 -534091 -498918 -481148 -480074
43161 -480074 -504894 -594197 -735572 -825792 -761016 -552107 -324082 -190263 -124435 13823
43151 13823 285638 536481 541681 282576 -35313 -253276 -403544 -535886 -582506 -518580
43141 -518580 -486104 -568222 -574062 -291870 116729 250708 5272 -287392 -319029 -172114
43131 -172114 -112873 -217422 -359494 -431515 -417273 -331696 -228365 -207252 -301366 -411566 -448001
43120 -448001 -459558 -513152 -531278 -402626 -201353 -123067 -209162 -300737 -288135 -236922 -201927
43109 -201927 -83016 199921 499334 581412 444813 332930 399091 507473 455787 286801
43099 286801 235654 399899 609728 660069 545332 383153 207260 -29757 -287379 -421083
43089 -421083 -369059 -248425 -216893 -319996 -511759 -717018 -796916 -574271 -52199 448407
43079 448407 559863 299367 60094 111848 288294 295719 160764 140426 269840 289314
43069 289314 70631 -150017 -117157 63273 96930 -66945 -207764 -185459 -89852 -33492
43059 -33492 -10553 -10006 -72700 -152213 -92183 144246 363702 389786 309877 336587 499061
43048 499061 608267 495322 187189 -125235 -235322 -94955 109990 139521 -8950 -117364
43038 -117364 -99152 -130419 -307290 -411122 -254587 -62609 -174376 -477145 -520577 -189933
43028 -189933 117665 76051 -162761 -304398 -350507 -473945 -673690 -795855 -765393 -598963
43018 -598963 -304772 42058 226244 90797 -240184 -482663 -486428 -302504 -51570 143262
43008 143262 182014 89886 26465 78307 135936 92870 35072 74656 135784 111845 104387 244413
42996 244413 369080 187560 -245799 -532204 -448225 -183643 14318 152301 313233 419270
42986 419270 365810 223900 126520 74392 9491 -31489 10846 90821 143284 201281 288024
42975 288024 296339 144903 -29511 -23590 140782 263741 271031 265293 270754 144134 -183104
42964 -183104 -540541 -703109 -635186 -466359 -314015 -214254 -157777 -109527 -32588 56373 107246
42953 107246 150652 310280 628277 947558 1062298 947928 761538 654520 672264 796439
42943 796439 966835 1065644 998200 819201 688159 671758 678547 618664 524456 453135 369190
42932 369190 220673 67913 26074 102960 188270 200055 163521 137689 127866 91317 2493
42921 2493 -89369 -70899 112206 326655 348917 165488 64053 284561 660899 795060
42911 795060 551027 167520 -119677 -322089 -492922 -531140 -369619 -181866 -183305 -323039
42901 -323039 -378720 -298698 -238458 -264718 -230345 -10510 279712 399993 254664 -19531
42891 -19531 -214194 -258722 -257678 -321391 -404360 -382883 -262667 -177116 -167962 -138606 -83850 -159315
42879 -159315 -392556 -540927 -447232 -343640 -520260 -843675 -950472 -824980 -780279 -874987
42869 -874987 -794564 -418953 -72478 5605 47539 310573 572850 465520 92133 -104652
42859 -104652 5666 120705 12475 -208002 -365635 -432198 -388461 -173998 108305 193785
42849 193785 11374 -163384 -63069 225226 414823 382100 226641 86734 49199 156833
42839 156833 356909 496220 484182 401046 342591 248522 22822 -261319 -452929 -562887
42829 -562887 -709145 -842172 -761425 -459660 -217402 -221875 -286745 -143996 128835 221669
42819 221669 70346 -52382 38954 185999 178394 86385 102295 194967 175525 59073 93381
42808 93381 368535 625858 596592 378564 295303 449496 599998 493429 167510 -143456
42798 -143456 -305528 -380817 -455018 -485393 -382293 -180652 -21952 45922 139653 340557
42788 340557 520104 494826 306492 190223 259548 380731 400871 344969 307360 288152 244671
42777 244671 185324 91689 -138605 -522232 -857710 -936150 -818749 -715119 -630361 -364968
42767 -364968 104800 474109 449884 91017 -311707 -578745 -731394 -818927 -813037 -678086
42757 -678086 -444388 -184372 31731 142398 102811 -74927 -287467 -374222 -234804 62660
42747 62660 328466 444295 467531 494640 489104 352139 119927 -57775 -136766 -212142 -287476
42736 -287476 -188026 173791 583298 744752 647986 539660 553728 554481 387466 123136 -56051
42725 -56051 -114854 -182844 -335301 -465102 -410598 -163636 91393 147613 -21013 -228420
42715 -228420 -258325 -78338 149080 270257 298164 319783 306723 139519 -169048 -409987
42705 -409987 -421338 -296618 -236625 -272031 -282530 -240181 -240668 -282797 -218425 5926 229819
42694 229819 294679 223641 91334 -105446 -307384 -311524 -42959 230314 192486 -103225
42684 -103225 -346286 -405594 -388074 -334781 -174730 29674 113824 119770 254725 489806 549219
42673 549219 396670 350750 540091 635633 400222 137377 210511 408059 255694 -211738
42663 -211738 -483083 -318054 5960 211928 338782 445823 421390 262429 199074 332428
42653 332428 431703 302893 102956 57300 97936 47603 -30598 31499 158310 138788 16144
42642 16144 40474 221368 245809 -52390 -397627 -417990 -125470 128201 92995 -141288
42632 -141288 -316610 -278776 -64934 175478 298861 261886 149827 97842 158831 260589
42622 260589 310475 316584 358037 435370 412897 162465 -252964 -589417 -630752 -376671 -32073
42611 -32073 174654 179267 110916 121949 184067 106960 -202867 -570043 -728919 -642145 -528323
42600 -528323 -561385 -654298 -601084 -360043 -113210 -55509 -173819 -251825 -92825 269789
42590 269789 609519 752564 723585 619527 440389 147042 -187449 -424004 -519870 -510946
42580 -510946 -378829 -113998 115300 89790 -124331 -203567 -23286 156988 111971 7027
42570 7027 99436 286162 269588 67572 2910 181913 328726 244254 129966 253044 489621
42559 489621 451609 4355 -542465 -772247 -568913 -172562 83624 60630 -115868 -231835
42549 -231835 -210431 -146628 -150491 -227565 -319122 -378523 -371403 -271673 -111029 18895 62486
42538 62486 51270 18993 -64742 -203640 -281749 -175169 60518 231083 253827 261076 399731
42527 399731 619080 749113 731201 653725 573069 430975 196395 -18644 -72714 37899
42517 37899 207573 360171 467721 489869 421092 363410 408002 461791 359104 147868 59612
42506 59612 149343 205134 133115 177096 533954 958739 1051952 816293 606604 593111 623084
42495 623084 613175 698940 890750 932315 687869 380124 223857 84269 -228180 -543597
42485 -543597 -553125 -318158 -202741 -326880 -423069 -286684 -73351 -31963 -166580 -303361
42475 -303361 -332835 -250219 -72013 159173 359464 488740 592102 693695 728148 648662
42465 648662 522744 435157 363464 243229 104350 41934 78959 150187 209917 268043 314958
42454 314958 294138 183042 45816 -42127 -102415 -241838 -512750 -801004 -894131 -693617
42444 -693617 -342013 -94460 -65880 -153714 -209830 -209153 -201877 -169026 -24016 243761 505906
42433 505906 612741 539642 383625 232212 74886 -139985 -384252 -532958 -496026 -339851
42423 -339851 -222400 -199222 -152469 39961 298026 377539 142647 -241268 -440499 -286184
42413 -286184 59572 291782 284492 173493 128773 131908 43601 -155871 -295449 -207820 67424
42402 67424 318821 374674 249769 102953 82446 206478 367877 447917 435280 431455 523677
42391 523677 653335 648882 435349 193015 213181 539417 837154 744287 315866 -37731
42381 -37731 -67307 50557 50059 -21088 75426 370048 643624 738885 692300 565947 375503
42370 375503 216233 230602 367193 375478 150174 -103222 -172875 -129183 -144869 -189754 -120194
42359 -120194 29331 73257 -39488 -160185 -154804 -27653 157422 331211 406606 359565
42349 359565 316178 414292 584649 620659 462630 246077 57810 -161717 -412619 -521557
42339 -521557 -358592 -48560 156081 142511 -9708 -170354 -261151 -265185 -216711 -169549 -147917
42328 -147917 -157653 -233184 -386200 -501656 -404444 -80518 269879 455703 474773 419580 328894
42317 328894 226312 190850 253235 289362 153161 -114617 -326141 -377710 -336693 -302555 -278617
42306 -278617 -201941 -35379 191179 395362 493737 464959 361215 252877 186019 190793 276693
42295 276693 402322 497625 522233 451513 237726 -100559 -366179 -332789 -56613 131192
42285 131192 27409 -219646 -397147 -537873 -756816 -952002 -929348 -737009 -612713 -631872
42275 -631872 -654822 -615200 -607010 -646393 -585212 -347199 -59995 137681 259648 359689 406151
42264 406151 362008 269662 182489 125226 168111 390781 700627 840490 678560 365733
42254 365733 120116 -367 -10229 146131 472024 764575 780947 525739 229071 67920
42244 67920 31504 24813 -30409 -187695 -443309 -690352 -789244 -706331 -539314 -412170 -380880
42233 -380880 -418410 -454057 -447247 -432244 -443952 -412824 -239983 10130 138703 93428 59089
42222 59089 159875 235745 85830 -195819 -340662 -284228 -198407 -175144 -108624 76180 276194
42211 276194 358383 306588 161208 -54350 -282553 -421929 -436940 -392203 -334777 -237689 -103287
42200 -103287 -18212 -40736 -115655 -158991 -148817 -78468 87094 321958 477569 420335 211364
42189 211364 59255 85212 199072 230872 140636 54918 102752 261848 402700 456262 468127
42178 468127 482410 462722 379961 297835 285635 300868 255146 160601 108034 118839 126668 109049
42166 109049 130190 216173 264632 137045 -172458 -481407 -554035 -338551 -64690 -15462
42156 -15462 -183452 -286682 -184846 -98591 -261563 -522474 -540805 -290498 -94147 -169834
42146 -169834 -403305 -592006 -660047 -577435 -325371 -48087 -6616 -235833 -429870 -312643
42136 -312643 30592 315825 390244 263228 -16633 -326987 -447734 -284409 -46525 -18253
42126 -18253 -195794 -318069 -228050 -44120 34923 -26038 -75979 60615 398309 740621
42116 740621 856433 726794 549370 488834 531300 602079 671544 686582 566945 362331
42106 362331 244462 234158 122048 -193006 -477856 -473747 -267367 -132031 -139515 -171090 -189551
42095 -189551 -225910 -185241 34801 267526 215070 -121081 -407107 -403514 -187636 72818
42085 72818 312516 470905 442062 232350 -63 -141158 -210100 -216475 -106463 94277
42075 94277 252786 298919 272188 178038 -17484 -223512 -267322 -153166 -64066 -49576 47306
42064 47306 267831 408852 361119 324564 489380 714778 751342 613450 492197 433380
42054 433380 354096 284095 325963 409207 330059 58794 -186085 -212346 -59828 99352 144218
42043 144218 54857 -120658 -305093 -449672 -567440 -678168 -743454 -702832 -551295 -342767
42033 -342767 -146283 -23382 1173 -26573 -41093 -56524 -136825 -262007 -340096 -370491 -443387
42022 -443387 -526703 -434622 -117461 185829 238387 114380 46489 72482 26702 -171352 -397427
42011 -397427 -482700 -377246 -173246 -36654 -55839 -108304 885 205097 175527 -202464
42001 -202464 -565318 -521786 -201817 -63746 -258042 -497798 -519769 -360877 -167030 -22455
41991 -22455 -16090 -209861 -471603 -567797 -470534 -342497 -197546 123647 562750 764576
41981 764576 572820 319680 373091 610472 623086 301476 -74113 -260582 -289520 -268509
41971 -268509 -187932 -15252 167599 231038 154765 60169 93588 285019 517227 645378
41961 645378 637951 561038 441559 227500 -102592 -472458 -777917 -954841 -966010 -808826
41951 -808826 -559508 -324721 -133809 31390 111033 17158 -167482 -207517 -1091 304591
41941 304591 569210 877477 1382519 2055314 2711738 3182851 3350335 3139956 2624791 2040893
41931 2040893 1567533 1183194 854336 723279 920851 1302315 1591963 1730726 1866338
41922 1866338 2051486 2202166 2353576 2687964 3219266 3655692 3691950 3301407 2664090 1961040
41912 1961040 1336367 905781 654437 421842 120866 -108761 -101171 51842 83754 -96099
41902 -96099 -294028 -303525 -148700 5593 72679 76534 42299 -23162 -63231 -720 143995
41891 143995 255044 274094 270540 319679 397900 459572 528593 623111 668692 602704 501940
41880 501940 473595 475308 403674 316617 363683 500900 513945 382833 373984 633821 909410
41869 909410 870087 548342 242601 91419 -20471 -180435 -300612 -276520 -134188 14072
41859 14072 62161 -36921 -221646 -348434 -347084 -304090 -318942 -365189 -391234 -436816 -497759
41848 -497759 -399565 -19847 444510 667300 605052 483326 409161 271072 38722 -120836
41838 -120836 -101879 4226 106767 214805 263093 100852 -223075 -418230 -354982 -268833
41828 -268833 -374362 -514866 -446171 -265952 -251373 -393530 -417633 -224106 -11269 52342
41818 52342 16621 -25564 -65827 -72564 27397 172400 161342 -61418 -269701 -231183 -6403
41807 -6403 155863 140649 53790 31223 89524 173950 258405 347094 409461 363059 150308
41796 150308 -167254 -423845 -487157 -366353 -168396 10560 114236 105940 1344 -102794
41786 -102794 -111946 -34545 63761 168051 280550 317556 182817 -47101 -161232 -90691 -11673
41775 -11673 -90801 -242448 -241985 1512 374697 675826 714169 412571 -43189 -255068 -7698
41764 -7698 429534 594798 409969 236638 331012 510731 493506 327404 262592 349848 418679
41753 418679 378298 294828 197171 47270 -81544 -34247 153052 223504 45121 -192053
41743 -192053 -238386 -83642 132698 352520 572872 707054 662014 500089 370568 324369
41733 324369 321717 353850 410405 391871 221747 1972 -108478 -126929 -179317 -238090 -143760
41722 -143760 105032 303608 337489 328898 405029 490072 430523 201739 -95096 -333942 -403060
41711 -403060 -264255 -35302 98249 94898 56454 2278 -165982 -419323 -543330 -445510
41701 -445510 -313482 -307474 -293537 -95246 154027 174329 -37233 -214487 -226881 -223479 -338578
41690 -338578 -465016 -405313 -119981 242183 483405 499653 354317 221522 206379 240797
41680 240797 200253 62444 -117011 -302858 -453887 -482857 -369607 -242539 -211753 -194268
41670 -194268 -61277 110596 123603 -43198 -212867 -273880 -276123 -265401 -217431 -164164 -206348
41659 -206348 -356210 -515036 -627368 -707090 -713367 -587024 -418868 -369552 -393095 -277449
41649 -277449 -21593 90918 -81245 -288371 -246306 -23864 140904 222762 344850 460150
41639 460150 389349 142022 -55837 -71697 2948 57896 108008 174843 187782 95744 -19983
41628 -19983 -24929 120821 325391 436882 359516 161035 51382 172070 409424 508155
41618 508155 380340 201918 163428 214498 131815 -196315 -621478 -878915 -854019 -688674
41608 -688674 -611092 -670703 -691591 -511528 -198784 43245 139378 198291 305697 382629 308291
41597 308291 102575 -91515 -165723 -120841 -18994 62610 50841 -59757 -150729 -75980 144251
41586 144251 304811 256839 97444 22997 49650 19561 -122647 -220204 -128172 88159 269771
41575 269771 370724 441024 488894 478515 407429 288585 127321 13614 125538 482605
41565 482605 790474 734886 378549 58117 -64296 -96522 -88648 71738 357731 504780
41555 504780 383739 225345 267568 382182 290053 -2973 -242210 -303231 -278447 -222104
41545 -222104 -56101 235290 503182 589948 477889 253096 10752 -187812 -333259 -447371
41535 -447371 -510353 -463040 -336026 -287336 -408958 -571562 -582223 -431983 -256741 -115991
41525 -115991 31333 166233 195101 105229 -6053 -79127 -152404 -253192 -326874 -298047 -137257
41514 -137257 118720 342663 359347 124806 -160632 -234658 -60553 168389 289411 315065
41504 315065 323770 333047 316144 265091 209276 198841 234902 187598 -113802 -619723 -1004628
41493 -1004628 -1019122 -804900 -685513 -724895 -707260 -512297 -272425 -139114 -105721 -110388
41483 -110388 -135660 -152217 -113215 -44605 -9235 28626 158002 343212 448392 426020 312361
41472 312361 84831 -237942 -389741 -73862 550998 925452 771474 437222 384369 593193
41462 593193 705731 546939 235599 -87653 -376965 -580907 -639710 -582475 -510619 -510381 -630264
41451 -630264 -843378 -982405 -871308 -602932 -493925 -643086 -745912 -521862 -120612 121599
41441 121599 154406 180272 278295 338853 305763 234647 149307 46034 -13860 -6491 -57147
41430 -57147 -245953 -407672 -368005 -274166 -398206 -684803 -821590 -730782 -641725 -650462 -572607
41419 -572607 -335058 -167980 -230088 -328643 -232103 -45774 -39754 -245591 -451347 -523431 -539286
41408 -539286 -617115 -748104 -814011 -722102 -528587 -413091 -468543 -558587 -508517 -394566 -445145
41397 -445145 -650714 -718817 -505189 -253528 -251124 -438629 -554735 -523841 -482718 -504910 -515365
41386 -515365 -466122 -424688 -459542 -542395 -586669 -531018 -396480 -290520 -305401 -383673 -364684
41375 -364684 -206721 -60316 -55100 -124545 -132338 -66360 -5171 -2879 -126287 -477714 -1002799
41364 -1002799 -1372504 -1282090 -847312 -497506 -462804 -562998 -539611 -385957 -243291 -144646
41354 -144646 -21539 136004 284787 434236 587112 602216 301177 -236444 -643099 -641749
41344 -641749 -354678 -110105 -27500 30358 139247 187783 133267 153671 381099 643081
41334 643081 666732 437401 158595 -49143 -179767 -154507 98033 375511 333662 -24901
41324 -24901 -277351 -134164 190444 335580 276728 215904 190282 90202 -38333 -16407
41314 -16407 153857 260278 210985 186254 377695 710982 911143 780473 377515 -37094
41304 -37094 -232810 -220404 -204604 -312012 -451920 -486069 -408631 -275308 -103731 22789
41294 22789 -85457 -452128 -740794 -588677 -81889 351318 492107 504882 547850 515327
41284 515327 293382 31051 -35639 95247 209568 159664 22859 6234 236892 607132
41274 607132 830475 728977 451612 303726 381700 513838 543295 487376 401224 288340
41264 288340 208460 275170 447774 502775 326017 73673 -68839 -115439 -130618 -38339 215193
41253 215193 441194 388919 92712 -166113 -216574 -133688 -36287 57209 141958 163062 111493
41242 111493 80760 160854 329656 487786 566662 580951 584364 571500 449101 174138 -95128
41231 -95128 -124074 77534 220653 124437 -30863 -3617 120023 85759 -87501 -142078 -49008
41220 -49008 -102980 -435153 -722352 -598157 -170144 114370 29432 -231167 -395498 -437280
41210 -437280 -487880 -570993 -554450 -338843 -1867 278064 400870 398442 328265 199299 41086
41199 41086 -45152 -4553 57990 7705 -104733 -106687 9803 33179 -167912 -435961 -524180
41188 -524180 -402134 -249310 -220325 -326120 -482531 -557621 -418052 -58388 322627 477521
41178 477521 350513 104077 -64442 -64019 76609 224628 203075 -40338 -328356 -430753
41168 -430753 -339677 -246660 -252352 -256313 -167154 -52435 5220 53467 154721 244709 242296 207036
41156 207036 235476 267222 162840 -51993 -189149 -157839 -72098 -62182 -110839 -134391 -118464
41145 -118464 -104684 -120422 -179407 -287590 -405001 -466533 -472537 -481550 -484219 -387473 -178081
41134 -178081 10244 82719 138739 323410 589044 731483 638235 399315 190950 129787
41124 129787 207796 288775 211339 -18415 -190262 -140502 33969 136404 155623 204647 238542
41113 238542 84788 -225060 -407256 -304031 -101991 -54895 -170294 -304350 -397188 -453317
41103 -453317 -433747 -344829 -314263 -396628 -414458 -195273 127766 280046 243805 238903 327676
41092 327676 312046 74727 -222975 -380895 -394809 -343895 -231583 -79742 -29986 -183991
41082 -183991 -428730 -555077 -482972 -267454 22948 304489 442404 377206 244184 218270
41072 218270 267845 216580 41627 -62369 35225 207808 258107 195611 203469 371128 584792
41061 584792 700228 720229 730907 722864 585644 291241 -17815 -184207 -203450 -155121 -47443
41050 -47443 133101 269527 204700 2624 -82011 32449 129932 66313 45329 290848 605489
41039 605489 578211 191175 -110164 -17652 260646 357885 238229 125780 110435 60660
41029 60660 -130596 -403180 -622249 -685838 -562168 -332817 -178210 -218494 -382480 -505646
41019 -505646 -511224 -416253 -239550 -32531 63849 -43624 -232610 -296977 -234416 -225278 -312999
41008 -312999 -309284 -96432 153044 188580 4584 -164018 -95749 248765 723331 1071295
40998 1071295 1087275 804990 472271 279467 195644 124385 75945 65571 -14123 -233085
40988 -233085 -431725 -396715 -174933 1713 73844 196591 406452 503342 363740 152977
40978 152977 76159 81889 -13554 -219377 -371287 -386533 -347585 -327270 -263043 -56307 260544
40967 260544 504252 507254 319173 199665 329516 555994 557603 270848 -14925 -49595
40957 -49595 71492 114476 53102 28673 82837 132245 139769 120175 33552 -129599 -210598
40946 -210598 -56793 191171 235633 58055 -49088 54489 151342 61921 -31515 111420
40936 111420 367589 417642 221639 37914 8493 9391 -57334 -86544 9955 107897 42331
40925 42331 -144910 -263283 -206438 -22276 183569 307537 265077 70815 -109358 -94010
40915 -94010 107772 301706 333030 232101 115667 25929 -75453 -210785 -361397 -521149
40905 -521149 -704714 -893399 -1022758 -1040147 -938675 -725560 -405760 -27174 299907 480021
40895 480021 514328 460809 328448 80978 -233313 -433290 -375756 -162959 -81592 -281698
40885 -281698 -581664 -678313 -516967 -339851 -361008 -529174 -677931 -770705 -854755 -871821
40875 -871821 -717125 -465281 -328599 -354564 -368339 -295957 -331979 -621596 -936644 -888667
40865 -888667 -402138 210347 611872 718965 647463 551223 517826 484998 264649 -217680
40855 -217680 -728073 -925862 -757097 -489375 -360326 -373040 -446804 -546457 -591873 -454360
40845 -454360 -166881 34219 10243 -87454 -63721 29807 21962 -76523 -96313 21776 156946
40834 156946 186214 93864 -75519 -250619 -338300 -301324 -211755 -146231 -81203 16371 75903
40823 75903 33413 -21377 21038 61237 -95409 -392759 -512654 -293847 9607 16595 -332851
40812 -332851 -734006 -865083 -677676 -370677 -172085 -164620 -267328 -338839 -295676 -164581
40802 -164581 -58392 -90541 -262114 -434332 -476595 -436152 -457833 -526474 -452307 -198207 -50693
40791 -50693 -289503 -792206 -1161369 -1180973 -950922 -623827 -253875 72480 195670 76409
40781 76409 -121948 -228866 -226586 -166525 -68294 26243 27978 -84334 -219881 -304222 -348131
40770 -348131 -345908 -240510 -58982 55031 35648 -6902 15267 3808 -152525 -349469 -382641
40759 -382641 -238065 -107071 -125558 -236594 -323476 -360493 -386886 -405775 -371999 -275086 -201664
40748 -201664 -270744 -476829 -645000 -620378 -467947 -369449 -339638 -204488 104113 400417
40738 400417 479799 366535 227379 154856 137697 138220 98833 -22757 -136884 -73602 147025
40727 147025 261807 131339 -13240 98599 348853 403195 217955 76250 142143 274367
40717 274367 317937 305400 289994 226461 128671 131899 269899 374315 332223 274337 347940
40706 347940 447172 361195 107333 -70396 -9576 211616 419996 530788 564287 563141 534224
40695 534224 454822 326436 202985 126400 55109 -69136 -197811 -224935 -159912 -113539 -83183
40684 -83183 80612 409868 687059 713761 575626 474915 418492 287838 150878 243533
40674 243533 600778 924943 930277 676788 443956 365154 312533 113348 -220955 -499919
40664 -499919 -544982 -358174 -110833 20767 -14499 -170915 -392057 -610581 -723026 -669460
40654 -669460 -522013 -391969 -253177 24025 438430 779492 847278 661073 390138 171508
40644 171508 69235 108943 232210 285021 184720 61419 103958 292063 425349 411864
40634 411864 364838 380644 390863 318109 226658 193107 147051 -6671 -188718 -233469 -130822
40623 -130822 -17314 43803 95508 108460 -22586 -253952 -371046 -298744 -248676 -396406
40613 -396406 -559820 -410212 72439 569653 824478 859727 778155 565833 200897 -200004
40603 -200004 -488518 -658815 -795715 -905775 -921862 -849348 -782333 -754359 -676565 -481366
40593 -481366 -261114 -184633 -292592 -446827 -499267 -455018 -429838 -488731 -586247 -645768 -628486
40582 -628486 -526405 -362876 -213832 -147771 -118112 -7597 172281 233452 58062 -192396
40572 -192396 -240668 -19675 286044 486005 537795 482327 382873 344467 445671 607159
40562 607159 653903 550269 444077 431329 435454 413241 514614 858948 1246646 1307578 944526
40551 944526 460248 194072 166069 162760 69398 -18461 9598 110228 175819 204646 271965
40540 271965 361580 360967 257938 206817 303863 411738 355980 221193 262267 531856 787116
40529 787116 808062 638314 441590 278961 132700 24430 -11396 10226 81840 237489
40519 237489 443105 552051 479820 338701 283291 301611 288897 257030 309568 431752 462766
40508 462766 312550 108763 85390 355957 785611 1065357 972413 610190 325601 327201
40498 327201 464666 460136 252364 -7068 -197109 -297762 -277929 -105481 124258 227602
40488 227602 136197 -37771 -143317 -107169 64376 285303 409551 362271 230493 124921
40478 124921 12466 -180634 -376503 -442339 -422403 -456279 -504535 -410954 -230299 -196746 -314786
40467 -314786 -302009 -63372 100060 -36449 -233818 -164578 53145 54926 -164010 -224520
40457 -224520 62526 438817 588025 507858 381392 294583 220950 139550 39682 -93112
40447 -93112 -200834 -156306 65373 296476 346302 206094 18646 -95706 -118058 -98950
40437 -98950 -120381 -236606 -381873 -392128 -200792 39656 135273 113720 181577 416444 641350
40426 641350 664295 524503 398277 340850 255820 96220 -40945 -51705 45209 159559
40416 159559 227923 218131 127056 43012 123420 405018 689897 738161 554015 365588 316151
40405 316151 290912 100668 -236332 -466973 -359926 24375 346254 326481 74356 -30010
40395 -30010 176192 420747 387784 159848 42436 66848 -16886 -270148 -434026 -355164
40385 -355164 -225221 -238923 -297879 -258538 -213625 -269344 -271280 -67959 125877 -7922 -359828
40374 -359828 -501700 -307249 -90283 -76497 -104181 19248 186987 214234 138552 85444
40364 85444 32146 -72337 -110790 40420 261317 335677 280780 298495 429949 494527 392249
40353 392249 245232 168770 98585 -33155 -106704 22218 238491 237607 -89252 -478200 -584536
40342 -584536 -378096 -150475 -156292 -353717 -524528 -551854 -498086 -458741 -436890 -363824 -177779
40331 -177779 118216 416433 533152 367569 56799 -109899 19314 310635 522630 561267
40321 561267 494354 384408 231586 88428 114037 422918 901556 1252460 1260877 1000571
40311 1000571 749620 716813 882535 1086438 1194034 1150400 950448 638940 315052 70863
40301 70863 -67685 -107440 -43711 93135 205142 232555 249537 350365 482015 521769 490254
40290 490254 514346 566085 436107 49635 -361012 -520981 -417177 -208533 39289 350263
40280 350263 642401 734585 560511 240982 -70263 -305377 -447027 -493905 -497749 -555135
40270 -555135 -725940 -990146 -1262341 -1399719 -1258856 -860000 -466871 -369017 -573949 -828335
40260 -828335 -941613 -942568 -893491 -733793 -417127 -67773 143184 200465 196054 149535 29625
40249 29625 -83292 -36932 152592 249373 77545 -234860 -389445 -254935 13286 177251
40239 177251 160704 69748 30808 64322 107990 106320 37977 -116886 -367802 -652047 -840809
40228 -840809 -860343 -775187 -698248 -650491 -578195 -477110 -395458 -316459 -165715 21852 76044
40217 76044 -69135 -218991 -145290 90423 201316 49318 -204244 -344793 -346388 -304622
40207 -304622 -264974 -223969 -215989 -289449 -431102 -579820 -674032 -643185 -434364 -130895 25746
40196 25746 -148777 -554198 -874733 -876161 -588886 -221184 52766 223324 385421 537852
40186 537852 492967 106938 -413375 -631171 -386857 11742 234685 346280 560208 786409
40176 786409 753942 481410 263327 206381 137082 6883 20723 250108 461049 491423
40166 491423 488134 576345 599276 432996 275335 316881 364802 144814 -210088 -360893 -324576
40155 -324576 -412604 -655361 -729130 -516010 -325891 -410772 -603119 -642598 -584207 -630736 -747414
40144 -747414 -705354 -424571 -66946 178358 257094 224772 168782 140920 111718 33333 -29058
40133 -29058 71236 344351 589327 622767 480366 296759 99516 -132593 -287552 -185942
40123 -185942 157636 482582 550624 389591 219235 181342 201046 118895 -78572 -214793
40113 -214793 -134010 98041 278477 319396 306368 306918 263083 140810 65370 191351 492856
40102 492856 778709 884368 784148 567934 387705 371559 484412 506264 267325 -95785
40092 -95785 -235593 17952 456455 733573 732198 615091 556799 535449 421055 191250
40082 191250 -23417 -99368 -55923 -10723 -50262 -171291 -298069 -317030 -151393 129383
40072 129383 312554 235945 -31977 -265690 -310464 -174655 52657 268002 370006 343696
40062 343696 330475 482972 734272 847121 722184 513129 388866 342193 318998 372520
40052 372520 543984 709062 714136 601924 540751 562639 530971 377944 235563 276056 501245
40041 501245 745014 853695 828626 787106 794527 778142 650987 468282 349507 269349 90657
40030 90657 -161639 -249462 -51206 224262 303985 192759 71057 -24212 -184239 -355408
40020 -355408 -338322 -91365 164557 205738 27758 -229845 -439192 -516198 -426917 -228781
40010 -228781 -23962 154199 321275 415455 328672 90978 -120136 -212585 -289421 -449683
40000 -449683 -604221 -598310 -430602 -236571 -107931 -34012 8859 13920 -2895 17447 110645
39989 110645 232526 297820 274363 216862 185723 155373 65900 -36309 -14934 148908 283429
39978 283429 266002 227421 358548 590975 667622 502049 263630 107849 40618 74435
39968 74435 266557 507365 515476 209112 -109851 -132071 55359 148738 80489 46385 151275
39957 151275 284054 344032 361833 356225 274859 147831 122139 244583 355424 313334 206134
39946 206134 199272 264031 228506 71710 -15574 84355 220170 175622 -19426 -129793 -46101
39935 -46101 75060 43368 -118749 -239947 -211718 -43004 206211 425133 465099 312600
39925 312600 209116 417747 862737 1173620 1123278 859828 655100 592617 585165 541506
39915 541506 406627 169646 -58236 -98024 55064 171960 90557 -61196 -80995 19460
39905 19460 122478 254517 486951 685762 638659 402287 249494 253736 192142 -75016
39895 -75016 -378010 -495358 -422183 -258030 -26665 234574 373021 298762 160301 169245
39885 169245 324361 462111 503612 485633 414335 283705 211788 349197 623779 769978
39875 769978 681791 561905 612352 734199 700367 525627 460180 631379 883911 1021443
39865 1021443 1037741 1009235 896664 613897 237103 -16184 -29418 103844 225739 263484
39855 263484 217078 120015 67165 173904 422950 630001 655770 598642 678638 957365 1265122
39844 1265122 1401277 1328250 1151890 969133 778431 543583 325624 290046 518992 859373
39834 859373 1077104 1157876 1298467 1553341 1674385 1435481 972973 625285 523609 525810
39824 525810 496251 449911 424179 384094 283606 103424 -161181 -433302 -527014 -356310
39814 -356310 -133628 -151562 -365260 -414726 -104113 362271 693008 834101 866014 788088
39804 788088 579681 336293 180035 126083 147576 244092 323722 178225 -234583 -604613
39794 -604613 -587205 -244496 41810 62061 -34055 -40749 40610 110360 152551 184214 141955
39783 141955 -39678 -275565 -367833 -213347 81266 314809 394477 390484 391808 366120 222839
39772 222839 -15419 -196796 -205493 -59800 161601 380488 480014 347173 39339 -210248
39762 -210248 -257555 -213375 -231968 -249214 -89632 245465 568179 733720 719172 530522
39752 530522 231017 37328 153722 460607 576205 321853 -47706 -192753 -110448 -49850
39742 -49850 -113410 -140508 22472 299666 487817 483394 337813 139247 -70047 -244046
39732 -244046 -278552 -94817 222415 454662 464564 330803 231139 256434 393846 606440
39722 606440 818563 878365 677694 312869 12539 -106819 -114786 -96018 -31641 105836
39712 105836 247754 295333 238446 161646 167124 302139 504395 608661 479067 160955
39702 160955 -155171 -331078 -375983 -344773 -244138 -84309 63346 133750 148816 169655
39692 169655 189696 126002 -72456 -322998 -448289 -368548 -246497 -332226 -611915 -746862
39682 -746862 -493348 -61835 144152 70602 39340 240108 478453 512728 387727 288394
39672 288394 264895 269942 305655 359111 326150 171999 49508 86934 176950 166465 145141
39661 145141 322125 689892 1042573 1283948 1478833 1617436 1584520 1393730 1205533 1043637
39651 1043637 734205 240844 -168855 -268807 -210323 -297225 -541927 -690192 -647697 -625164
39641 -625164 -795789 -1016474 -1027825 -806265 -557945 -421942 -345436 -252064 -166982 -112666
39631 -112666 -28981 84643 63023 -220210 -602421 -778632 -693971 -598292 -678979 -841127
39621 -841127 -929059 -960332 -1002172 -992449 -862445 -703056 -619617 -535190 -340078 -131182 -67814
39610 -67814 -72457 51218 243231 239284 25625 -75581 117158 371747 410591 295555 224930
39599 224930 156812 -78849 -402166 -507910 -259147 169971 554972 814681 903746 724578
39589 724578 280705 -197849 -430203 -368904 -222962 -194928 -255343 -205989 60230 408145
39579 408145 589541 495394 238527 7642 -88524 -31631 147325 358794 481617 483829
39569 483829 470383 530971 590204 518906 368726 352076 543042 720735 616413 258008
39559 258008 -51307 -95997 24538 78496 9583 -46273 2106 100078 202711 370028 606639
39548 606639 737297 609358 354171 256126 366744 445616 337239 214247 319636 602641
39538 602641 770221 636457 285542 -67424 -243268 -153044 159755 487802 578033 357899
39528 357899 13059 -193108 -153309 39955 237229 372457 470059 563271 650692 727571
39518 727571 801310 841360 766785 547823 280677 82596 -50765 -184241 -279746 -238317
39508 -238317 -92889 20207 109493 334538 667730 773238 422503 -120511 -366595 -178937
39498 -178937 143149 314313 349272 376034 403656 386210 359168 385971 453307 510090 547914
39487 547914 574343 563709 501959 442609 457217 539708 595826 539807 408330 364996 531995
39476 531995 795229 866968 618397 264747 105945 161175 220304 204852 261676 468314
39466 468314 657028 644298 491834 407766 471426 572302 573306 437507 219049 6911
39456 6911 -124162 -150273 -93100 16321 143373 238994 276180 282477 276761 203375 16109
39445 16109 -199426 -300925 -277704 -243034 -243367 -214897 -138128 -75592 -24045 96646 245560
39434 245560 235493 14551 -188295 -138650 105372 307695 356537 306684 215334 100443
39424 100443 13335 9609 67998 132494 193088 248631 262804 243680 279550 396952 480056
39413 480056 441463 363840 342438 312195 203066 147550 306777 557111 593570 340151 43596
39402 43596 -59260 19342 133220 183756 153856 99850 118861 200311 151495 -161478 -552570
39391 -552570 -717117 -662205 -669215 -814726 -832156 -543507 -144132 93531 157584 165711 117889
39380 117889 -8834 -89178 481 167214 225387 145427 23187 -86407 -137887 -18776
39370 -18776 292612 579553 600952 394148 181237 46094 -87985 -216794 -228046 -109863
39360 -109863 28880 156467 327510 473964 415619 156298 -33179 51966 284342 395425
39350 395425 315720 192642 150972 176984 216985 270544 352207 418728 386615 238576 94045
39339 94045 117073 323509 538790 607680 586720 636931 772407 837412 725619 510005 345900
39328 345900 339116 507843 767203 937841 872238 600251 280831 25611 -134115 -143256
39318 -143256 51274 347209 514820 444304 260651 154831 209403 407292 663742 804680
39308 804680 673815 340115 60955 -29291 -38974 -59212 6416 206017 333978 193201
39298 193201 -55180 -47865 319540 790953 1077731 1097491 909087 611661 335132 176018
39288 176018 112002 77986 84519 127024 57290 -238470 -571144 -612618 -343108 -71094 41162
39277 41162 173089 444022 623194 472187 139417 -68319 -134984 -245382 -367870 -285580
39267 -285580 -20124 137503 89994 97381 333753 574325 549244 388252 433856 736996
39257 736996 1025344 1125551 1135114 1150051 1087868 884995 659421 529694 424747 235938
39247 235938 43484 7170 99642 146139 112807 154525 334611 481577 422964 222806 62329
39236 62329 -17810 -116120 -266139 -378994 -388330 -336132 -288108 -242022 -145488 43952 316345
39225 316345 574787 661055 495158 192810 -31036 -83174 -44905 -10765 15792 37365 -3257
39214 -3257 -118634 -192572 -107138 92614 263502 366005 488585 662946 767939 680922
39204 680922 461645 307833 341715 502195 656959 761387 857804 951282 971464 884441
39194 884441 768782 713105 687909 612725 527392 576107 790025 990828 978144 747106 460791
39183 460791 269254 221291 293831 417820 501203 505019 488881 529571 617622 684244 694281
39172 694281 650947 547503 390340 239384 145221 73156 -27617 -114617 -116642 -77462 -98852
39161 -98852 -140471 -35470 239113 454246 400841 177685 84575 263890 548678 662842
39151 662842 503053 212335 9515 -41258 -78605 -238675 -442033 -478865 -301166 -96849
39141 -96849 -20623 11717 149950 342500 403976 300216 198415 224910 315805 348529 306254
39130 306254 249764 206947 158361 90222 14524 -36122 -11544 117697 298094 408332 373299
39119 373299 244932 147419 157563 252248 352522 395166 360373 244703 39008 -230771
39109 -230771 -459428 -537993 -499255 -497661 -578977 -568123 -310966 46014 202398 127095 131071
39098 131071 431834 814330 879554 541465 115996 -57295 57859 252805 332679 263855
39088 263855 145160 106563 213774 422142 616637 708670 689924 594588 444970 271498
39078 271498 165073 228315 424080 535804 387542 91685 -56577 32572 119207 775
39068 775 -162140 -88624 168053 287648 187121 150302 362990 602002 570342 325506 148609
39057 148609 142169 204638 304897 519383 820784 1054842 1133394 1070126 847268 459721
39047 459721 94488 25520 255872 465303 413348 227183 180071 330251 505291 533791
39037 533791 372494 93300 -141776 -167891 8304 175326 154302 24675 29092 291445
39027 291445 695829 1001922 1026764 773387 445893 286734 345229 458387 484618 456173
39017 456173 457732 493543 570283 769992 1091436 1328536 1284474 1041412 850143 811399 841586
39006 841586 889588 965524 978604 796715 506625 375487 468969 532336 376903 176489
38996 176489 202549 431173 627550 707559 777108 861691 842005 688844 557631 571847 663118
38985 663118 715520 749456 855113 1018467 1120451 1079711 922155 730953 583210 508849
38975 508849 459751 351270 190083 119615 256004 505579 651664 630842 612072 758155
38965 758155 1010683 1184129 1184894 1040053 788159 484276 281639 344411 640692 944493
38955 944493 1090937 1124254 1152640 1187683 1206946 1245884 1302976 1254729 1016083 718061 564600
38944 564600 556680 533960 467098 498082 650822 716612 547265 300297 232640 348738 419143
38933 419143 303326 99989 -18559 12799 161884 376210 586715 694223 621489 387010
38923 387010 117360 -22968 50066 257813 413961 396191 250758 108794 42217 47055
38913 47055 119723 264982 441485 583326 683898 783820 862272 823164 630070 387725
38903 387725 233811 195285 204792 217314 243249 287234 323834 336767 328023 279065 150084
38892 150084 -62758 -295424 -448609 -436740 -231663 87926 348776 430589 414424 489644
38882 489644 679388 779152 658509 501515 574575 819162 902679 707453 539396 711677
38872 711677 1089316 1254116 1051824 762426 708323 870515 978032 869380 654658 546206
38862 546206 612612 730926 754500 676209 590866 537287 470829 395365 395834 476437 494476 375070
38850 375070 284444 420501 694262 815402 683107 492610 419979 396511 284841 121528
38840 121528 59209 154404 312306 394226 331347 186882 115450 177853 218774 76218 -103731
38829 -103731 8390 425788 731699 621021 318141 228808 378542 493379 497306 567120
38819 567120 720256 713246 440873 140852 56149 118786 130074 74891 74882 151256 214321 223596
38807 223596 212084 196934 186318 228760 339193 420932 387182 326654 403632 594790 682198
38796 682198 559996 406217 443782 631538 739062 684302 622876 668000 695627 558523
38786 558523 380323 438886 764436 1043221 996615 717269 516877 534137 629582 632201 555566
38775 555566 537758 642512 772088 777858 648804 555101 651126 860317 953821 845531 684924
38764 684924 625356 644185 660085 676776 707820 709044 713707 876587 1216795 1475307 1443293
38753 1443293 1286623 1278944 1340985 1188914 883341 826989 1145094 1448266 1387405 1135721
38743 1135721 1083327 1278744 1439972 1394119 1262001 1246350 1404377 1614764 1680720 1513740
38733 1513740 1270623 1223442 1447907 1753947 1959749 2068455 2111304 2026931 1831839 1720833
38723 1720833 1823102 2011348 2126337 2231904 2437405 2607492 2504723 2153239 1826590
38714 1826590 1703242 1727642 1776565 1775949 1687363 1561302 1569001 1801029 2080633 2179515 2176259
38703 2176259 2356926 2753196 3037098 2958832 2682676 2567958 2756729 3093674 3362886 3498329
38693 3498329 3589533 3732619 3886171 3914357 3797353 3701384 3748913 3823179 3743026 3543144
38683 3543144 3407062 3391660 3407028 3403747 3366177 3186049 2810361 2487766 2561086 2976888
38673 2976888 3308645 3349256 3360663 3585873 3831232 3786312 3524616 3389379 3518128 3763469
38663 3763469 4006964 4272056 4530689 4643791 4560389 4419136 4390394 4522181 4779208 5131333
38653 5131333 5538863 5907700 6130739 6182104 6145036 6126385 6158030 6236408 6459773 6996450
38643 6996450 7805616 8502502 8709523 8519575 8399979 8622177 9017191 9354134 9696939
38634 9696939 10223569 10901354 11563463 12186566 12880334 13665730 14450175 15199227 15994053
38625 15994053 16939435 18116080 19576527 21281731 23086885 24892523 26775606 28900088
38617 28900088 31361455 34193850 37447100 41164216 45363881 50141920 55711205 62249920
38609 62249920 69798585 78395622 88207076 99426257 112182273 126686589 143344372
38602 143344372 162562504 184562102 209543626 237887265 269873000 305008685 341389105
38595 341389105 375258560 401089600 412950622 407200719 384725121 350588985 311286454
38588 311286454 272014323 235798214 204014214 176975811 154229207 134941055 118379504
38581 118379504 104116336 91902583 81504860 72658003 65092957 58591584 53005333
38574 53005333 48184160 43927288 40088929 36680954 33738309 31124917 28640982 26295945
38566 26295945 24276088 22639885 21251539 20018040 18943801 17918162 16741274 15467811
38558 15467811 14440043 13811868 13290133 12543434 11637874 10845755 10238243 9728866 9331445
38549 9331445 9067461 8749391 8182260 7513318 7073115 6904022 6743701 6456976 6171985
38540 6171985 5973485 5791440 5663228 5766036 6036420 6068217 5624091 5017005 4714047 4723064
38530 4723064 4663515 4354760 4025161 3930871 4043460 4197031 4324435 4421181 4439455 4375216
38520 4375216 4361689 4516966 4745272 4836175 4746684 4643630 4650827 4698185 4686356 4676910 4802052
38509 4802052 5050605 5272557 5390540 5500028 5724815 6040509 6300747 6437127 6595868
38500 6595868 7010157 7682300 8253853 8341049 8012510 7742194 7791104 7845184 7470030 6745944
38490 6745944 6143113 5858123 5647865 5342574 5120398 5105753 5043218 4646182 4033887 3527885
38480 3527885 3182564 2829067 2479213 2351351 2498681 2696660 2750580 2695067 2632960 2564786
38470 2564786 2445867 2268089 2033925 1768781 1577157 1553640 1625224 1622747 1515185 1412944
38460 1412944 1333820 1172783 960234 925972 1168262 1431355 1389740 1054838 739644 686712
38450 686712 877868 1159198 1391576 1477494 1381417 1176594 999427 920150 898651 877794
38440 877794 870061 925992 1049075 1177642 1252093 1277558 1297642 1311433 1256003 1093996 884146
38429 884146 730696 692623 770985 930519 1080091 1098764 971216 843517 840875 890492 864323
38418 864323 838070 1003917 1326104 1513201 1404048 1167979 1009620 885906 692821 554709
38408 554709 681197 1016883 1267578 1259829 1087261 910254 792495 745891 761368 756330 639511
38397 639511 468286 406721 491715 580935 576140 548122 575497 616483 641854 748215 993459
38386 993459 1223779 1227452 1008069 764034 639981 639145 743122 946146 1153115 1198485 1029199
38375 1029199 772222 578286 482783 443287 408602 310300 94608 -174642 -338958 -339920 -305742
38364 -305742 -370115 -485149 -494473 -320512 -4200 360169 647915 757024 740321 782977
38354 782977 925917 935001 627842 219585 89512 251787 347931 191294 19297 96745
38344 96745 342253 524692 609265 692154 753625 710850 619965 609350 667078 677279 618331
38333 618331 555785 488246 373135 269331 286699 419956 586286 786517 1053642 1273348
38323 1273348 1258838 1021416 786619 704682 699107 639379 521269 430971 445619 595768 820225
38312 820225 954046 875192 654000 439234 238591 -21152 -254761 -264012 -46442 157226
38302 157226 181392 105555 45808 -16983 -104444 -123202 -5169 167814 275398 279875 186808
38291 186808 33607 -41167 97675 347538 438175 308734 194372 246739 318776 262668
38281 262668 182726 203985 230956 162032 127745 265766 448291 493294 468445 506695 493176
38270 493176 255686 -68883 -197271 -132472 -98061 -125612 -68086 33072 -13194 -145354
38260 -145354 -86691 164032 276748 130439 22571 171215 365443 342607 213768 238523
38250 238523 398947 483092 445634 417539 440033 418619 306770 168278 84193 108229 257330
38239 257330 451169 537071 466440 362569 336348 350413 359645 446315 671523 903590 959694
38228 959694 851504 742980 716716 718587 690554 623956 504078 322363 142780 69140 142947
38217 142947 316415 497874 592970 559145 456942 378707 296820 82834 -272373 -568279
38207 -568279 -596806 -340379 82521 538455 873778 948334 806037 691226 766897 931493
38197 931493 1032308 1103173 1216181 1253228 1072805 813611 759051 914474 974848 758279
38187 758279 461993 411202 704936 1176149 1580702 1770438 1776324 1758750 1804525 1788271 1543212
38176 1543212 1142944 853495 787332 776880 664099 561543 687668 1014980 1232850 1097606
38166 1097606 746995 581958 807891 1163976 1219074 914041 635648 692683 918097 949423
38156 949423 735705 532097 493730 543020 605087 697737 755694 626593 336517 151520
38146 151520 255673 516597 672188 628339 489720 407075 464481 621764 725432 670612
38136 670612 552775 530077 563742 495211 372618 429698 674762 793964 609390 358354
38126 358354 314849 389376 369211 334184 496157 761624 819832 628650 475357 531554 651334
38115 651334 673734 649719 668147 690890 677958 676229 667301 522434 250263 106189 268776
38104 268776 540269 574738 328729 86488 70813 219883 360551 427025 446932 442911 437003
38093 437003 475249 561627 602186 483485 205702 -88146 -205801 -31085 386142 823511
38083 823511 1017142 877049 579262 398323 445418 611465 751803 838391 893974 867583
38073 867583 682533 389953 172883 161794 301593 436996 491901 526629 637396 835788
38063 835788 1035063 1145615 1171883 1198760 1285255 1409341 1533516 1670037 1831676 1966446
38053 1966446 2017060 2017882 2054778 2153312 2294959 2517545 2883214 3353665 3831986 4346009
38043 4346009 5041133 5940819 6871514 7724670 8662384 9937110 11596209 13460623 15263343
38034 15263343 16652243 17180689 16555285 14932764 12830942 10734832 8895218 7440259
38026 7440259 6439177 5784820 5203986 4518611 3812348 3268265 2943874 2779068 2707231
38017 2707231 2643977 2460458 2112945 1752215 1559343 1484183 1289695 880763 450432 227383
38007 227383 194026 174702 130036 199435 445584 722554 883613 994904 1206758 1485881
37997 1485881 1636333 1565502 1366690 1127445 833368 519286 334189 334623 355169 231748
37987 231748 46220 -8170 84046 178875 213442 240130 259052 214494 151632 178526 252128
37976 252128 200899 10150 -110826 -31932 106433 124783 79372 156861 386143 597578
37966 597578 629533 477479 269231 156208 188600 256379 211588 74862 31096 185040
37956 185040 430542 610914 682122 649256 489808 255084 113407 142599 178172 19261
37946 19261 -295872 -568046 -707945 -764853 -759370 -676209 -581302 -555663 -532751 -389747 -194299
37935 -194299 -164507 -361209 -605922 -741542 -792920 -818925 -793704 -718392 -677035 -672771 -563097
37924 -563097 -290697 -50189 -63970 -261895 -335571 -101473 280905 448600 161383 -458907
37914 -458907 -986133 -1067814 -783949 -535383 -546595 -630380 -524726 -278469 -122814 -88393
37904 -88393 14969 269732 512590 549368 352777 25390 -291600 -445946 -351893 -99446
37894 -99446 105628 146144 64134 -61475 -186067 -240854 -152692 20037 96185 -7357 -156092
37883 -156092 -161237 23935 315548 594877 731454 638780 408631 282712 375097 516439
37873 516439 498131 376584 376364 556984 754752 829878 795119 698000 551726 418146 399547
37862 399547 490490 569508 583280 596621 610215 503838 260911 76102 83807 124242 -19190
37851 -19190 -250671 -268959 -11862 247757 281213 156431 37976 -50488 -126056 -80849 190540
37840 190540 580272 854680 908164 786400 514829 96233 -320581 -477946 -310704 -76734
37830 -76734 -75721 -317368 -562362 -621743 -508592 -339771 -210492 -172344 -238755 -371252 -498679
37819 -498679 -565761 -547756 -446148 -313887 -249874 -297127 -366296 -339405 -233331 -162144 -143088
37808 -143088 -70234 83216 178060 115243 8497 17883 93530 44162 -175939 -411428 -535952
37797 -535952 -576319 -577099 -504691 -361978 -257493 -250886 -235168 -93819 105042 200011 162171
37786 162171 93026 38056 -45087 -142281 -172532 -163319 -285830 -621629 -990030 -1111907 -907015
37775 -907015 -564839 -355426 -407142 -609946 -688835 -446990 -10754 238817 81497 -251084
37765 -251084 -328944 -36074 329964 480521 464729 473878 488104 325307 -15355 -283112
37755 -283112 -299105 -174955 -106128 -86736 11055 152153 136033 -95209 -318771 -297582 -75979
37744 -75979 104457 115722 43912 11583 40976 119374 274919 507789 719004 801184 776802
37733 776802 767216 820913 839991 710187 463321 258459 201175 227247 200042 95141 20695
37722 20695 40900 61468 -33679 -183855 -210950 -88698 -27103 -208355 -523607 -692918 -624067
37711 -624067 -527876 -636354 -896257 -1023908 -833439 -433915 -93767 24694 -44068 -192572
37701 -192572 -363585 -522111 -575420 -415133 -59253 303482 461912 372470 178271 42303
37691 42303 -11303 -75646 -204597 -327009 -341834 -257798 -172560 -121213 -34389 116154 221805
37680 221805 176960 57862 45752 185991 339028 383403 352094 327015 309224 269809 245884
37669 245884 290024 368361 394621 341775 249915 146780 34676 -53940 -64242 169 54747
37658 54747 15631 -119475 -278391 -378385 -374294 -261868 -58805 194795 416801 510277 458123
37647 458123 363076 332341 347724 331271 310712 389582 542115 591825 458286 280970 202507
37636 202507 171731 99287 76061 237028 475960 513112 254565 -89835 -272451 -246904
37626 -246904 -121863 -22611 -34758 -151743 -235065 -148778 30533 72633 -87500 -233849
37616 -233849 -156215 75881 235434 231345 153876 96099 63215 37340 22439 18959 29262
37605 29262 97321 283762 574005 830716 865850 598330 166693 -155660 -218611 -140162
37595 -140162 -126051 -199553 -235857 -225829 -315336 -544162 -732898 -724464 -583303 -440783 -284652
37584 -284652 -43814 233156 441196 574981 670717 670612 510027 280410 133556 61631
37574 61631 -56502 -217091 -282302 -207475 -94876 1066 140638 323311 423548 385803
37564 385803 329725 355039 372552 259686 89437 58466 227673 458190 591830 591224 498768
37553 498768 353373 187600 53272 954 37283 117285 179273 184019 119655 -18222 -218104
37542 -218104 -412023 -490518 -410287 -261586 -165628 -118287 -11566 183537 342227 339217 214594
37531 214594 119190 116514 104157 -46144 -302680 -476176 -433926 -279963 -249669 -411000 -558613
37520 -558613 -470803 -195636 27543 86052 90542 145724 177609 76387 -88062 -121592 37109
37509 37109 219613 236083 128325 129629 349525 586644 567375 335228 226047 397863
37499 397863 576132 428032 42266 -200040 -156579 -50533 -61777 -78989 41279 214616
37489 214616 285459 258336 201609 70776 -184681 -445953 -539555 -450571 -263707 10821
37479 10821 362064 616584 591268 384132 279648 353313 404313 323520 272333 374920 463831
37468 463831 332643 90019 32710 235079 479179 572642 533349 440646 309682 197149
37458 197149 250422 496966 693999 569388 181025 -128381 -146554 -10404 33036 -68149
37448 -68149 -204386 -320209 -443748 -554566 -573068 -476549 -302516 -42173 328066 685827
37438 685827 791294 564988 223813 33685 8030 -33873 -172648 -295503 -287106 -176773
37428 -176773 -49005 94458 303110 551997 733528 787646 777997 788867 780661 633524 351580
37417 351580 124996 107474 201843 183094 -4740 -213024 -334866 -414949 -474294 -412286 -203243
37406 -203243 -47121 -154270 -449191 -651555 -629167 -524859 -524250 -627903 -701453 -661358 -541965
37395 -541965 -414663 -304582 -205774 -146146 -172402 -241067 -202663 4844 199832 149777 -84391
37384 -84391 -183029 1290 240441 261653 96040 -52929 -118097 -145823 -95844 101717 356902
37373 356902 505817 547810 601501 667759 644251 546432 497157 504916 467282 397909 431713
37362 431713 586757 738287 853027 1022697 1231343 1333479 1320444 1353092 1447507 1400047
37352 1400047 1149749 938054 926637 915230 677143 362573 295141 517972 808988 1023928
37342 1023928 1150047 1120376 879321 595562 519655 625612 661821 578613 624855 939570
37332 939570 1301932 1421188 1283047 1070432 902155 802459 801215 890849 951530 874639 733371
37321 733371 704601 832136 977125 1007489 936777 849949 779319 710147 653752 641419 660032
37310 660032 662874 655615 701644 800881 834269 719438 584230 661683 990539 1326579 1398711
37299 1398711 1167425 789872 440548 244485 272969 463420 593056 470579 150784 -142951
37289 -142951 -299176 -411870 -582555 -737853 -704509 -421036 -31707 222913 208016 3478
37279 3478 -189067 -239872 -162479 -18927 149937 280384 290360 197690 132010 145842 121943
37268 121943 -22482 -156774 -122660 -9828 -47678 -261809 -444282 -466612 -416489 -384315
37258 -384315 -317490 -179563 -86134 -152033 -309247 -398132 -371568 -307133 -269545 -257057 -255053
37247 -255053 -260540 -259556 -236584 -210504 -230519 -327544 -471355 -579896 -596866 -568253 -588352 -640910
37235 -640910 -580489 -351408 -131741 -115407 -207907 -125698 195220 478737 462464 217957
37225 217957 19664 5645 79113 86267 -5313 -94681 -71164 49761 134937 109706 62251
37214 62251 86767 107613 20643 -57012 81917 347837 375125 34326 -328185 -337086 -71659
37203 -71659 113869 102432 94258 244509 463000 584708 561923 455678 353081 307338 281417
37192 281417 175659 -16754 -147536 -107644 -3953 -1001 -53570 27195 271253 501387
37182 501387 598049 631415 684153 710347 651708 554607 462410 290706 -61492 -512321 -814454
37171 -814454 -782872 -458739 -56065 207720 235163 71566 -138885 -232871 -135929 56525
37161 56525 140502 13778 -190972 -260329 -170819 -92553 -113295 -106971 53293 290681 446743
37150 446743 493352 485374 402007 214744 63304 166781 535973 922971 1096383 1054652
37140 1054652 940013 857524 828961 830652 808786 708370 541240 405441 407587 561250 749944
37129 749944 795783 616954 334973 161168 156832 200861 223506 316540 509673 604032 420442
37118 420442 110235 281 173241 405736 496933 454405 366740 305995 368540 596945
37108 596945 824178 801235 527954 257894 131994 36670 -100713 -130553 58049 308505
37098 308505 405484 345436 232508 73873 -125222 -213915 -79675 114429 111375 -72906
37088 -72906 -187394 -125804 -45497 -87373 -180350 -190973 -117412 -59486 -95751 -239698 -430327
37077 -430327 -532727 -440849 -219637 -57895 -34824 -19636 132406 358841 460772 366101
37067 366101 221189 196687 287042 374946 439620 570700 753609 793050 576444 313932
37057 313932 328544 629100 885997 860481 658779 480924 322194 85573 -159197 -241449
37047 -241449 -160196 -106095 -213965 -423822 -592463 -642091 -591847 -511837 -442412 -329365 -99446
37036 -99446 159322 205993 -58976 -404440 -509861 -323807 -42019 192723 384142 516622
37026 516622 505378 347939 171810 87858 101064 163683 192985 56722 -291848 -652791
37016 -652791 -727852 -471835 -138576 57603 142639 187953 133898 -50782 -208660 -179539
37006 -179539 -36568 44184 66550 172501 362476 463310 392671 275292 236023 222561
36996 222561 123410 -41651 -153020 -154217 -85941 11693 135985 262634 337998 359218 394209
36985 394209 475390 524076 441140 240534 23988 -155382 -316186 -434166 -414832 -240295
36975 -240295 -63122 -64054 -246563 -443806 -513937 -473809 -454679 -571161 -813942 -1030549 -1039841
36964 -1039841 -810114 -496122 -264211 -131124 -26809 51367 41614 -61883 -188093 -274094
36954 -274094 -292658 -222060 -80861 26483 4015 -90215 -87306 84665 312442 438344 427903
36943 427903 373931 367978 378529 263576 -41295 -344884 -335839 29717 411223 483673 322785
36932 322785 211124 191097 76974 -154264 -302257 -303438 -342980 -501496 -566146 -358017
36922 -358017 -28390 153971 136188 23207 -148611 -369933 -512485 -448150 -250950 -86915
36912 -86915 48437 290095 619614 811091 705309 415872 211938 255212 468306 626277
36902 626277 585771 436461 382852 478187 572204 541869 439832 356999 286570 219059 223435
36891 223435 306686 331620 225393 141127 237063 407670 431781 299911 182077 129001 25059
36880 25059 -179776 -388659 -509668 -527080 -436684 -264799 -123513 -93740 -99583 -56900 -62483
36869 -62483 -226382 -406003 -382794 -251353 -308867 -549547 -618129 -347849 -4056 148894
36859 148894 200032 313602 393253 286153 99289 32199 56390 33089 15835 146151 330855
36848 330855 316285 67659 -179107 -258196 -249688 -288494 -390042 -509190 -615092 -665651 -635206
36837 -635206 -590504 -618385 -668604 -594803 -362334 -93942 89192 136887 -6338 -361174
36827 -361174 -753446 -879599 -640941 -291341 -150533 -265013 -441194 -513690 -464350 -345548
36817 -345548 -216459 -139493 -140274 -164103 -134104 -52676 2081 -20840 -80768 -83048 27967 190867
36805 190867 243772 80055 -189772 -313323 -196705 -50115 -121013 -329318 -328513 33097
36795 33097 457641 517261 153701 -273157 -419941 -310239 -207831 -253245 -335045 -285432
36785 -285432 -93678 102428 174012 112911 17930 -3545 66113 150310 188496 227982 348530
36774 348530 506184 548588 427666 301641 327272 404440 257452 -213305 -764684 -1047880
36764 -1047880 -949560 -646936 -381195 -255066 -231109 -229346 -178975 -32940 188279 370108
36754 370108 390567 260325 122276 77463 75465 40366 30996 147894 311311 301812 67608
36743 67608 -166435 -189618 -62367 48698 152234 341808 510877 430301 136924 -14187
36733 -14187 196543 545842 665666 489319 220514 -9096 -216957 -369630 -370387 -281100
36723 -281100 -327259 -584929 -837856 -861736 -703602 -543084 -407259 -203628 45079 205115
36713 205115 255511 313488 404752 386964 178399 -84789 -224877 -245935 -268133 -326379 -360988
36702 -360988 -349987 -315588 -223442 -5558 306579 574441 695142 671500 537069 305748
36692 305748 21342 -219979 -329755 -268956 -48412 235200 394628 318446 157008 188613
36682 188613 434098 555337 263514 -278250 -614343 -506786 -139459 164144 275124 286361
36672 286361 336436 477168 648558 725568 620717 371452 103914 -93311 -220271 -293358
36662 -293358 -290340 -206469 -121102 -149074 -318541 -520861 -596242 -474042 -230108 -5531 117813
36651 117813 142055 81088 -62606 -226073 -272285 -127139 106175 247696 238676 167684 117728
36640 117728 80003 30144 -3291 8948 41660 61894 84294 134458 198118 255640 330535
36629 330535 442070 529999 500064 357489 231567 224859 275892 230681 43391 -159003 -238637
36618 -238637 -213683 -198512 -211452 -142817 59522 261626 275962 86949 -122072 -153731 39830
36607 39830 352501 610145 658837 448008 82154 -234648 -357903 -326539 -314360 -436809
36597 -436809 -605589 -607684 -351325 9753 258118 383295 562151 859137 1078858 997931
36587 997931 645875 248340 -42149 -241356 -405900 -544527 -653090 -724239 -709394 -564558
36577 -564558 -345438 -171395 -87797 -51573 -56454 -164539 -378719 -576709 -627453 -521896
36567 -521896 -361347 -263967 -285743 -369275 -372330 -222961 -37776 8990 -75522 -117379 -32789
36556 -32789 82224 156296 261810 430202 501881 313367 -54081 -358053 -477122 -489540
36546 -489540 -511700 -567557 -591159 -478997 -188338 143066 258130 70063 -187233 -228083
36536 -228083 -62678 72372 62443 10249 21547 96865 229735 401472 458513 227961 -169305
36525 -169305 -344426 -104199 300768 531320 573909 613804 668096 607462 461150 427861
36515 427861 573220 732125 746600 629168 468895 346086 360202 554279 768103 759061
36505 759061 534887 371609 421036 521728 522313 541357 691990 780193 590843 320296 348743
36494 348743 635381 739477 493246 260632 373429 661576 781895 726067 703505 733816
36484 733816 698048 669472 837539 1134223 1258325 1094898 827633 596504 334049 31749
36474 31749 -115027 29 165688 114181 -123405 -298355 -279996 -146346 -15811 51193
36464 51193 23449 -88892 -205370 -251532 -239722 -208470 -144020 -44215 19949 21231 79916
36453 79916 302099 560792 611960 430324 255724 256415 306931 201539 -34612 -193180 -184780
36442 -184780 -133058 -144960 -127310 70012 404473 665584 740907 724663 718351 659732 462816
36431 462816 225572 133932 200236 266368 258291 256195 285748 235453 64460 -81516 -79794
36420 -79794 -13904 -20990 -87135 -138283 -213653 -373508 -520536 -499507 -327687 -154857 -33199
36409 -33199 93402 189606 115450 -142302 -375083 -358279 -76016 277455 450575 309158
36399 309158 -42088 -324678 -364467 -273211 -255063 -303320 -253260 -89475 10569 -46797 -156540
36388 -156540 -223296 -283616 -341384 -280268 -72507 83162 -4329 -240627 -349334 -196871
36378 -196871 100563 340438 395168 254359 17386 -161928 -190540 -90695 75482 268485
36368 268485 420724 419345 229697 -25737 -200505 -285290 -347832 -366723 -245777 14383
36358 14383 268560 377861 335961 218611 73080 -88043 -211348 -191175 23123 325820
36348 325820 518618 503981 377234 300167 338218 465261 644923 807557 818293 618406
36338 618406 374216 325209 472628 572745 463925 239272 53377 -65172 -132502 -120934
36328 -120934 -73614 -154002 -429878 -720819 -811287 -726918 -656100 -679505 -728425 -745996 -733694
36317 -733694 -675738 -556205 -427030 -351271 -324092 -347128 -490555 -735719 -848159 -614055
36307 -614055 -171860 100302 41971 -131029 -154150 -17874 114165 127348 12574 -172889
36297 -172889 -318876 -335811 -279455 -307177 -457232 -581669 -566767 -506072 -555869 -708175 -820345
36286 -820345 -813089 -728917 -625241 -512327 -393185 -282907 -176878 -56171 63564 128728
36276 128728 106556 27697 -32993 -11995 89024 189168 188722 65932 -103986 -248507 -389050
36265 -389050 -584161 -788398 -840138 -645594 -340719 -183640 -262903 -387028 -318891 -55184
36255 -55184 211469 352618 398270 391459 308313 166377 67584 53064 34955 -40216 -83488
36244 -83488 -31025 1424 -116712 -303089 -369138 -289299 -183528 -80992 85815 252250
36234 252250 215410 -65245 -341341 -365089 -188742 -68001 -148502 -344456 -471967 -415957
36224 -415957 -196492 56751 195105 153180 -19418 -204662 -284716 -221375 -120867 -160444
36214 -160444 -366523 -524047 -423058 -149820 16092 -22892 -82493 -1550 124825 104988
36204 104988 -76916 -251267 -263329 -111520 75930 162792 128308 65000 24148 -70820 -268033
36193 -268033 -429895 -394284 -235544 -157163 -149358 -7109 278022 424266 269852 19760
36183 19760 -79454 -77944 -131125 -182695 -106144 -13423 -119844 -368330 -485238 -409344 -384139
36172 -384139 -557177 -730504 -638671 -306741 17434 188963 277045 387107 505326 554441
36162 554441 522591 461796 376404 198004 -86449 -348292 -437680 -350800 -195911 -47141
36152 -47141 52550 9038 -214053 -423525 -360779 -77669 85830 -19405 -143537 -45941
36142 -45941 136657 139070 -20452 -128640 -129042 -124925 -134488 -97362 -53395 -78448 -105393 -35775
36130 -35775 40459 -23994 -152725 -157419 -75985 -113945 -274883 -349549 -281197 -237382 -277832
36119 -277832 -258288 -145321 -129900 -304423 -486001 -495528 -382335 -246605 -74186 108334
36109 108334 143372 -23396 -214195 -279747 -287816 -294578 -160653 181350 476259 435454 151160
36098 151160 -34170 17434 155370 237145 262442 240549 147986 23946 -63920 -137255 -234260
36087 -234260 -253542 -50972 316838 620413 741171 776209 847074 947337 1004071 967831
36077 967831 818553 586048 375820 279017 255106 189538 47698 -121524 -295027 -466952
36067 -466952 -566591 -529487 -435807 -425577 -473771 -411782 -202282 -27934 -35004 -126830 -111461
36056 -111461 43620 212963 311249 378124 464674 515668 416890 152504 -134741 -292018
36046 -292018 -341865 -428452 -570050 -592537 -377346 -52969 167112 228912 198203 97479
36036 97479 -45364 -86646 79564 313533 397741 375144 471728 685499 732459 469937 110361
36025 110361 -107472 -229195 -408662 -609481 -666953 -526273 -265271 18317 216807 228142
36015 228142 101439 60891 239420 475422 507386 286971 -19269 -234715 -252029 -37276
36005 -37276 274737 403724 240507 48006 134037 410717 534688 431627 373979 502991
35995 502991 582391 365461 -28089 -282277 -277348 -139053 -1014 115862 240334 399532
35985 399532 601286 777634 793776 606446 366939 262026 276681 216861 -32447 -362773
35975 -362773 -577751 -601555 -503653 -351163 -110529 256641 629900 768361 586105 318209
35965 318209 282343 486048 611284 425177 71013 -126796 -36562 201699 384881 418104
35955 418104 328572 219663 189707 216718 160515 -42066 -243409 -263374 -160452 -177017 -408838
35944 -408838 -677838 -782301 -737170 -670396 -583200 -357765 13844 338132 413765 255167
35934 255167 58258 -32339 -46920 -69336 -83193 -25171 60175 51503 -51245 -94482 5549
35923 5549 134104 166142 163651 252479 402191 493149 523136 545572 452262 71164 -488269
35912 -488269 -838456 -767807 -489207 -314048 -274293 -229032 -159881 -128734 -60115 171542 469471
35901 469471 570175 399718 180230 131696 228338 306252 268058 114565 -96304 -240079
35891 -240079 -181600 70831 342670 494323 568536 667805 770475 769517 639714 460744 298692
35880 298692 160056 55163 13385 14388 -21471 -131420 -240436 -237627 -107290 53860 151708
35869 151708 190987 231165 272116 240364 102734 -63193 -159119 -188455 -226063 -285248 -289772
35858 -289772 -188555 -32903 90753 160792 219301 298510 383266 443710 484298 540679 613152
35847 613152 623458 494021 279111 138040 126430 91321 -133566 -476624 -680617 -592193
35837 -592193 -308009 -44567 49945 -28113 -150492 -153690 -15572 81824 -36953 -302980
35827 -302980 -498860 -544216 -513361 -402837 -117612 273539 514567 497361 402412 375999
35817 375999 286561 -15187 -389433 -595535 -647423 -728331 -841102 -804987 -567287 -278515
35807 -278515 -60721 81545 116077 -22950 -248245 -329758 -170695 82242 267808 393859
35797 393859 511439 547767 382102 17041 -404015 -703486 -764346 -589843 -301204 -22514
35787 -22514 225596 447132 535814 369230 34931 -207901 -236181 -179146 -178685 -205776 -204385
35776 -204385 -247640 -404689 -569419 -579038 -434068 -262030 -116838 46748 229657 358251
35766 358251 405668 432327 474441 470502 344785 130174 -33395 -39633 44696 16699 -238399
35755 -238399 -584549 -774667 -745828 -672508 -705038 -772761 -711569 -487227 -202328 47022
35745 47022 225830 319650 333737 312122 285674 218566 68686 -111448 -193765 -108193 62105
35734 62105 128262 -36351 -343292 -537996 -466067 -254440 -132735 -121066 -54610 93351
35724 93351 130470 -37345 -217087 -204772 -85741 -73814 -166671 -168415 -2287 186306 225428
35713 225428 72402 -201709 -449208 -498176 -309840 -69084 2794 -107588 -269060 -439381
35703 -439381 -646654 -781563 -653042 -298743 -24734 -40511 -224503 -352349 -393686 -445614
35693 -445614 -506964 -496802 -434993 -437710 -535128 -611404 -540644 -307966 1166 262130 371046
35682 371046 325562 258373 317596 487511 592842 522046 385772 380948 530585 654980 611368
35671 611368 459582 333008 238310 89221 -118276 -296220 -411369 -506702 -574485 -554798
35661 -554798 -485809 -493471 -572393 -545773 -341020 -140487 -123785 -214238 -252400 -284420 -462608
35650 -462608 -747600 -935128 -933488 -806432 -587656 -285849 -51511 -76648 -288792 -385502
35640 -385502 -245315 -85736 -122787 -283271 -377580 -376823 -373645 -405983 -456323 -513952 -521419 -374584
35628 -374584 -96385 102223 68834 -78082 -121769 -52757 -51974 -210315 -403068 -442803 -268023
35617 -268023 18259 243551 311042 269382 205295 96909 -111171 -300939 -243597 59412
35607 59412 295700 240950 69916 92477 322186 520559 566150 539137 493099 395032 298228
35596 298228 337171 489155 533501 331618 500 -267000 -418333 -494740 -496597 -411762 -304338
35585 -304338 -268320 -323131 -419736 -512650 -568209 -543027 -428412 -306232 -297511 -433734 -601915
35574 -601915 -634455 -456434 -148764 126712 256016 229122 103922 -36766 -101871 -36668
35564 -36668 116627 246911 286414 250521 157534 -10514 -227756 -389594 -426052 -386873 -349643
35553 -349643 -313145 -259742 -251030 -353441 -509259 -584139 -521579 -370363 -196318 -58132 -34001
35542 -34001 -162448 -362080 -498088 -526657 -508480 -500652 -500799 -466430 -326915 -31350 335977
35531 335977 559049 521121 371307 331333 390981 349682 127717 -134203 -286593 -322558
35521 -322558 -300786 -267331 -283127 -392430 -530048 -578545 -532459 -479275 -417138 -250291 14567
35510 14567 239486 364632 474529 603002 658915 627147 649383 780546 842889 686533
35500 686533 455004 405894 558328 696309 665184 505561 334295 241031 276655 408014
35490 408014 495778 434184 302059 268666 358979 412718 276183 -44798 -412443 -666480
35480 -666480 -731082 -686399 -700357 -811864 -833869 -585453 -184745 35091 -78222 -312354
35470 -312354 -358825 -170843 24542 18277 -166778 -362366 -488008 -623117 -829991 -983910
35460 -983910 -887014 -544541 -202561 -56499 -29177 73224 272821 409738 377557 245844
35450 245844 145366 124220 139545 134150 96577 59525 36857 -20277 -148636 -265751 -239953
35439 -239953 -85332 43012 95446 209358 446520 622203 562813 387373 319566 332665
35429 332665 232670 23809 -90148 -52675 -12685 -8856 99637 299049 325483 73067 -168189
35418 -168189 -109156 114105 172784 42061 -29891 41159 84175 15579 -21109 65544 136892
35407 136892 50956 -104836 -145617 -40732 89984 149502 120442 10467 -149753 -289509
35397 -289509 -369853 -442347 -554268 -634362 -580422 -446672 -420414 -576074 -752810 -740631 -517853
35386 -517853 -230512 9984 210609 387612 469976 361320 68707 -260183 -430271 -348455
35376 -348455 -113005 55311 11850 -177831 -324079 -311546 -173658 -9417 92352 66194
35366 66194 -83387 -234928 -262077 -226190 -332173 -624927 -857397 -774776 -433817 -111354
35356 -111354 26019 20883 -31485 -60249 26939 274367 543990 619780 482008 323031 256480
35345 256480 188448 47711 -42238 46866 226429 311308 265957 187950 130305 92738 120670
35334 120670 239889 327522 229066 10892 -74716 82083 304432 372779 277281 146314
35324 146314 52528 11617 77740 281933 508274 584787 512647 469742 544491 602388 511126
35313 511126 382426 430902 636936 732062 558298 285593 178977 267973 374175 387667
35303 387667 360853 351008 326737 268232 241313 304541 407360 432521 308825 72928 -137394
35292 -137394 -168443 -9286 140844 65130 -198106 -386810 -350777 -233762 -255820 -424153
35282 -424153 -550280 -472950 -179138 218347 531123 593318 413169 182935 59709 -1721
35272 -1721 -115985 -254284 -292107 -212465 -120651 -80931 -68362 -71997 -125520 -236486 -382682
35261 -382682 -553034 -688036 -641786 -371281 -122579 -201945 -534399 -694554 -479086 -210805
35251 -210805 -282430 -583303 -649334 -308258 104953 209058 15300 -200936 -291340 -337836
35241 -337836 -452588 -640297 -853411 -1054624 -1187582 -1179560 -1037509 -885560 -833564 -835485
35231 -835485 -757593 -583790 -460003 -491352 -573767 -513559 -281007 -47776 38920 31351 78855
35220 78855 209456 301169 274316 227489 310428 496365 589377 489753 334522 268845 179971
35209 179971 -144996 -618357 -851447 -645948 -275292 -120468 -200708 -271318 -245559 -250389
35199 -250389 -321887 -324559 -197364 -49422 28753 43425 -43442 -307806 -656300 -848905 -812487
35188 -812487 -721983 -693722 -641175 -536554 -526295 -606760 -479178 -1744 459684 474429 167341
35177 167341 21931 170721 285595 153692 -42590 -89878 -29496 40276 139534 246092
35167 246092 235888 132604 152709 332749 375064 84172 -274635 -313334 -37840 247701
35157 247701 403988 510805 545554 355052 -18185 -269512 -194721 71538 266586 295029
35147 295029 233668 176824 173681 234219 315308 343021 284992 163502 2046 -176686 -313617
35136 -313617 -361261 -364154 -398299 -432303 -353243 -142541 78853 204661 246641 261808 275237
35125 275237 303183 352987 362574 234854 -23494 -278198 -411941 -407904 -280038 -51183 154602
35114 154602 145295 -112730 -409549 -537914 -532980 -560173 -656874 -716988 -662756 -491750 -208334
35103 -208334 132453 342235 245955 -52639 -215947 -69955 160957 128810 -200174 -512848
35093 -512848 -543137 -370781 -265484 -321281 -370737 -258534 -60150 58512 92597 156858
35083 156858 244194 222445 95435 55603 169607 199629 -80055 -510945 -707093 -532812
35073 -532812 -224683 -48494 -22300 -4650 109192 331195 590422 751321 731249 629498
35063 629498 623654 712820 700127 478816 198614 71457 126434 238419 299668 281707 215618
35052 215618 186406 265629 394000 435034 399513 469745 700876 859875 729537 444860
35042 444860 315348 392411 452041 382633 330722 402147 451712 305045 30191 -167284 -223570
35031 -223570 -240930 -286061 -309819 -266007 -194789 -160183 -181441 -254122 -375027 -507168 -570043
35020 -570043 -521930 -432506 -416285 -488925 -542653 -491215 -396278 -403726 -573231 -806207 -918235
35009 -918235 -752705 -288424 271120 560174 351773 -171876 -571770 -616624 -471284 -378261
34999 -378261 -331418 -202361 -33723 17339 -33342 4274 189875 336503 253070 -43331
34989 -43331 -409789 -731724 -924506 -912965 -719800 -502770 -413385 -460134 -560354 -657205
34979 -657205 -718072 -683999 -515614 -272119 -81227 -32639 -119847 -249132 -280932 -119863
34969 -119863 180742 436292 500547 397814 261818 187882 187708 244877 346769 469964 583278
34958 583278 667840 706255 659747 490461 217546 -63648 -237392 -260671 -201703 -158611 -131849
34947 -131849 -25656 193695 406133 473441 412847 341289 288565 186666 30555 -82848
34937 -82848 -94384 -44921 20850 92270 111762 -5788 -220950 -363077 -335175 -210344 -82216
34926 -82216 31626 76506 -63312 -350128 -521349 -401528 -158722 -73600 -168415 -264536
34916 -264536 -307411 -390628 -500989 -495950 -361340 -270609 -324284 -407205 -373614 -225227 -39417
34905 -39417 142616 283188 322870 265739 201030 184022 177847 145885 99552 20755 -141327
34894 -141327 -341020 -428242 -352215 -267576 -341792 -539373 -692589 -717378 -660160 -581808 -497937
34883 -497937 -415341 -344687 -272032 -162692 597 186713 303792 245347 21832 -171205
34873 -171205 -133241 73801 173505 46962 -90624 2067 237327 320353 157149 -44605
34863 -44605 -74472 53014 207432 325838 397797 373319 208468 -30071 -208678 -279005
34853 -279005 -303895 -311724 -219484 20770 266404 309031 154235 31063 70052 127394 48643
34842 48643 -42579 71466 311348 352345 85315 -217176 -278717 -155322 -70784 -85054 -79072
34831 -79072 39268 248048 453402 529140 411281 229059 212872 383457 489601 370924
34821 370924 196950 172672 197063 64267 -143209 -169154 -17435 50244 -53716 -124085
34811 -124085 -29400 89400 86297 23311 -17321 -120529 -373445 -659992 -771280 -629709
34801 -629709 -311970 46530 302463 387670 409072 525748 669854 579879 212940 -89914
34791 -89914 -28825 237128 315635 104030 -146095 -214787 -127639 -1545 106019 162468 146126
34780 146126 115760 169393 292700 346407 240594 53047 -46889 43432 256916 383184
34770 383184 265711 16136 -81379 39664 90791 -157978 -485126 -494486 -190360 38451
34760 38451 3747 -43870 148259 462589 644078 665321 653201 627943 534848 419837 369329
34749 369329 354766 313724 304775 396566 472534 352662 82321 -97676 -72864 27811 47146
34738 47146 -37974 -191547 -383300 -527623 -512110 -354835 -204191 -123036 -6226 220428
34728 220428 462544 613160 711670 828412 912335 897386 857415 885097 893324 735606 491859
34717 491859 417439 576332 728386 669197 514208 515895 715112 919552 964869 860608
34707 860608 704919 578745 528978 557407 602274 593846 542872 529669 609616 773204 977372
34696 977372 1152801 1201813 1075652 855567 672539 538464 353669 108141 -39247 36854
34686 36854 224975 280301 104351 -163311 -320474 -291208 -138049 32367 132454 109492
34676 109492 -33027 -208066 -269166 -113538 212609 537596 723433 774508 754269 653363
34666 653363 433650 164103 -24732 -125759 -239739 -339243 -238210 93662 372591 346306
34656 346306 161735 150961 333689 414133 272416 161978 308287 547412 535771 175513
34646 175513 -324515 -701004 -795891 -554714 -52270 477673 766279 710207 424953 119594
34636 119594 -59679 -112376 -150033 -248524 -339799 -320467 -235936 -212085 -209903 -59726 196272
34625 196272 240518 -81977 -479724 -591109 -461631 -371090 -334102 -126218 239283 433859
34615 433859 282098 -5103 -181931 -282262 -428611 -552422 -501872 -290997 -70816 63059
34605 63059 117003 137539 189557 305318 395766 330930 159615 91468 186762 247524 132133
34594 132133 -7387 39549 227539 348398 305825 134357 -108003 -279357 -142788 341652
34584 341652 822187 902864 614084 307561 174341 135957 137369 223837 330074 309796 218548
34573 218548 270099 448010 463443 206617 -50633 -52016 106583 211658 256751 316514 304800
34562 304800 116753 -117605 -168120 -26098 104488 84602 -49267 -191664 -244540 -155000
34552 -155000 -2594 37833 -57726 -73561 136160 382846 389587 189115 41997 40662 57492
34541 57492 47882 120242 271326 311613 145833 -65724 -119406 1724 172639 269417 228730
34530 228730 101689 69971 247886 446935 332291 -129343 -576850 -693187 -539535 -346908
34520 -346908 -188418 -27963 87644 106413 127222 257119 378806 272946 -53417 -354921
34510 -354921 -466827 -462555 -472657 -510611 -531458 -527059 -483392 -335390 -52887 265037 444887
34499 444887 393012 187665 17936 4087 61922 -3522 -232176 -412371 -334758 -76561
34489 -76561 94929 71625 8723 68325 213253 318773 355639 359197 316619 220978 191475
34478 191475 389862 784948 1102268 1076214 718363 296837 73496 88061 169767 117665
34468 117665 -112840 -347548 -320963 59741 547689 731753 456776 18071 -161497 -12724
34458 -12724 152714 88458 -93511 -155822 -92094 -82213 -185747 -277043 -271102 -239271 -271597
34447 -271597 -364609 -479833 -580241 -568876 -338842 40433 326508 398022 415103 547003
34437 547003 664128 514493 154323 -51555 79999 278650 185423 -154249 -352257 -178420
34427 -178420 189185 438231 488420 496283 589157 708729 702380 491908 145222 -169470 -295492
34416 -295492 -200048 3990 167142 234951 249545 239560 171139 24648 -145447 -278538 -391772
34405 -391772 -530811 -665654 -720867 -708008 -722819 -759788 -630277 -190863 373957 641958
34395 641958 389334 -149186 -532936 -565470 -402454 -270134 -228572 -232129 -266267 -319626 -319634
34384 -319634 -230004 -165218 -264616 -451704 -460543 -160139 247865 436544 304293 45734
34374 45734 -95196 -69687 -18186 -71567 -198308 -267964 -252587 -292201 -494071 -725095 -736763
34363 -736763 -503566 -289457 -305139 -423909 -360312 -60938 212249 169849 -225440 -746785
34353 -746785 -1090466 -1099466 -880912 -687647 -634549 -592247 -431985 -267341 -287143 -408522
34343 -408522 -318544 102802 595298 836097 784501 608714 420033 231325 82746 38136
34333 38136 80142 133412 177764 237469 282055 251166 176268 169635 270861 389407 423559
34322 423559 364695 263322 163816 101477 96552 109965 56013 -100892 -302258 -478464 -626109
34311 -626109 -761078 -847127 -839165 -767770 -703752 -647836 -539527 -389455 -307588 -338912 -349330
34300 -349330 -182948 93284 221949 59855 -247868 -450886 -468067 -408444 -390549 -436213
34290 -436213 -499297 -502917 -383394 -197768 -141891 -321217 -531380 -454906 -103866 145931
34280 145931 63270 -105384 2066 329272 487165 302019 -2495 -188574 -296555 -446001
34270 -446001 -569299 -523254 -336370 -169326 -99220 -85354 -82057 -35698 169949 578507 978564
34259 978564 1048663 739137 350659 154518 85759 -62205 -267789 -304439 -105298 92471
34249 92471 43725 -181748 -279213 -76164 262117 404579 196043 -187476 -419155 -350249
34239 -350249 -141860 -57391 -160581 -277067 -242599 -103441 -31988 -111435 -270516 -389929
34229 -389929 -392082 -238688 65786 426853 676205 702279 559546 409545 354855 364897
34219 364897 363321 330947 282613 191527 24727 -148763 -193783 -109079 -90584 -278980 -507218
34208 -507218 -460799 -93213 282742 377914 254755 173284 234893 324625 334996 288641 252994
34197 252994 262026 327222 421384 445870 310603 62036 -143113 -196841 -114379 20816 104848
34186 104848 45467 -141501 -294614 -290525 -238528 -335337 -535752 -567227 -324926 -55397 -36568
34175 -36568 -234017 -405764 -411448 -265034 1681 332971 559203 508916 236049 4312
34165 4312 6404 175959 294379 222309 15830 -145223 -146111 -67354 -81942 -208422 -259835
34154 -259835 -98451 159977 298220 271610 208860 205019 252101 331782 424695 437793 269796
34143 269796 -27060 -262669 -307852 -192031 -13618 138354 181456 88167 -42024 -71136
34133 -71136 -1578 44569 33787 68526 189580 282902 267926 249959 365077 555896 630696
34122 630696 515378 340978 277957 352610 441459 414214 273250 152102 161843 257215 304865
34111 304865 274147 281242 421062 630464 764736 755309 642986 497749 361260 251918
34101 251918 183126 165618 188947 194785 101445 -96190 -272070 -286457 -164195 -86005 -176647
34090 -176647 -355918 -433486 -319296 -110924 21494 29817 47684 208410 416231 414709 133341
34079 133341 -172685 -246459 -160586 -147333 -214228 -181620 -50894 -35464 -181840 -247335 -73792
34068 -73792 156961 193810 48566 -100736 -169265 -160906 -51875 142637 295040 315499 278396
34057 278396 274147 263306 209084 195688 249735 215765 16307 -136640 -44393 125740 100267
34046 100267 -23627 58906 290320 284368 -25050 -215523 -25913 217953 89472 -332606
34036 -332606 -655130 -747863 -792097 -881345 -914003 -851665 -785279 -714850 -514586 -188005 43676
34025 43676 7627 -203399 -368270 -387280 -316981 -247104 -234694 -308688 -455107 -603905 -665604
34014 -665604 -573290 -299927 101768 462972 586105 422619 104391 -242401 -614014 -965667
34004 -965667 -1052510 -656649 26136 468664 402003 136888 123540 353960 463178 333059
33994 333059 248642 393722 525791 356605 18398 -121966 11893 144727 75071 -94249
33984 -94249 -181118 -165726 -130240 -111197 -102363 -108819 -127649 -133532 -116227 -81378 -21788 34439
33972 34439 -28146 -291156 -619233 -732745 -512790 -125990 202043 421713 592299 689143
33962 689143 614142 380509 174040 169916 311078 333836 73237 -282168 -355764 -46959
33952 -46959 300087 302945 1791 -246818 -244694 -107321 13109 112056 201583 216095 136255
33941 136255 44466 -11468 -57890 -54086 101114 351846 475422 394241 299648 332150 336733
33930 336733 116999 -235905 -481787 -573733 -638291 -701772 -672155 -558204 -481707 -456496 -346348
33919 -346348 -92426 163577 253019 188285 134412 208941 348139 382237 245901 62939
33909 62939 -48194 -182444 -493712 -860961 -951459 -672230 -298398 -41697 218825 585674
33899 585674 825857 707781 413444 254010 167027 -86109 -361959 -268295 165784 452844
33889 452844 363212 208081 254786 316750 174707 151 21457 79184 -103585 -412330
33879 -412330 -484164 -250102 7030 83037 40024 -15257 -67350 -86205 -8436 138114 252871
33868 252871 310198 340353 288859 73902 -216128 -361078 -278578 -112950 -22462 918 66331
33857 66331 229707 421673 474507 265298 -93436 -297868 -216378 -105713 -276024 -629501
33847 -629501 -780916 -593041 -303625 -109686 51931 220265 234999 29167 -180708 -229404
33837 -229404 -289996 -554551 -840478 -856139 -708841 -744749 -935486 -866433 -417293 -35594
33827 -35594 -124215 -490911 -685729 -633281 -597284 -674134 -686477 -544450 -383366 -296161 -198394
33816 -198394 -38355 85888 114594 130493 167601 106723 -103744 -299032 -339533 -352046 -524616
33805 -524616 -766594 -807600 -594855 -363292 -298329 -339151 -367505 -395412 -462443 -498730 -426556
33794 -426556 -309723 -271582 -308744 -300557 -190949 -63621 -19944 -52625 -78824 -64304 -69922
33783 -69922 -168144 -337538 -462036 -427759 -203224 151794 505900 702090 674717 542216
33773 542216 489537 522516 457124 220591 16228 48673 211670 246511 127056 52848 95498
33762 95498 117152 72114 118980 322732 476089 377039 113587 -92039 -187078 -270281 -378579
33751 -378579 -459177 -482663 -442124 -307873 -112589 -5883 -86894 -249832 -326915 -304977 -252283
33740 -252283 -121002 175401 527320 685192 576205 398448 363654 480333 614799 633883
33730 633883 462089 134534 -160182 -207571 5325 271716 400845 384616 315655 248343
33720 248343 178137 69193 -124186 -376482 -523769 -395831 -46393 267224 376304 350815
33710 350815 310392 239143 100796 9884 115138 351393 460964 281929 -83032 -403756
33700 -403756 -542587 -503894 -342580 -107641 128588 259515 222231 73186 -70646 -171129
33690 -171129 -280163 -386574 -351916 -95421 222377 337408 202377 53026 127097 405019
33680 405019 659211 690461 491922 237788 124030 177988 245654 215322 177753 245011 289339
33669 289339 72375 -368302 -698006 -726298 -649614 -719280 -862905 -833135 -602763 -389906
33659 -389906 -344007 -403265 -449579 -434838 -342019 -163474 50866 221310 326410 384968 370926
33648 370926 247770 73402 -38854 -60393 -45500 -5988 82678 151761 75596 -112173 -189504
33637 -189504 -32688 178096 162329 -114413 -416662 -532080 -473390 -382143 -336128 -307360
33627 -307360 -256387 -196647 -156571 -116969 -23626 132957 280444 335722 298660 238994 197654
33616 197654 152492 95058 81035 149770 221463 142597 -149117 -542881 -855338 -984335 -947497
33605 -947497 -810145 -625697 -436052 -275466 -153159 -59234 2650 14933 -23200 -105156
33595 -105156 -248677 -444380 -562164 -420894 -27738 341070 408909 195159 -60025 -202018
33585 -202018 -253743 -255269 -200026 -136922 -147471 -174045 -48613 233000 434655 378935 172404
33574 172404 20643 -33626 -53979 -34782 48373 119809 110305 101588 198367 333526 368976
33563 368976 309094 230891 94108 -145735 -297455 -86601 436040 891710 1028164 950028
33553 950028 849918 762381 679733 665513 700321 610856 315766 -16521 -206654 -305756 -439178
33542 -439178 -566033 -587290 -563922 -612341 -673955 -608538 -456959 -388157 -408269 -338326 -94960
33531 -94960 195906 392590 474328 455090 334993 194053 170997 260753 266452 58365 -221205
33520 -221205 -328886 -233074 -135746 -196080 -334048 -342493 -140691 135081 288367 259732 131262
33509 131262 -20648 -183853 -323751 -361872 -297762 -238807 -227426 -160905 -2010 64020 -127583
33498 -127583 -413827 -472790 -264932 -61668 -25957 -22434 93008 251444 357930 466948
33488 466948 601077 584462 265529 -208218 -519490 -507882 -241214 119623 382693 390300
33478 390300 208659 133425 305959 445945 208470 -294183 -614783 -562028 -361796 -235130
33468 -235130 -144825 -25991 49835 69348 162498 344499 421935 316746 234660 316122 364236
33457 364236 166742 -129814 -262322 -285983 -421487 -589732 -494224 -148383 71061 -25793
33447 -25793 -185777 -146207 -24798 -77329 -291035 -444456 -432201 -331203 -242058 -236082 -374745
33436 -374745 -612212 -739467 -589441 -267100 -35024 5853 -14037 28106 78293 15856
33426 15856 -155927 -285678 -227496 -19203 97033 -105498 -562659 -932117 -931233 -588076
33416 -588076 -107934 380325 814030 1045242 920734 523976 157279 16860 4603 -75062
33406 -75062 -233475 -297283 -134903 191741 490572 615758 575597 467215 322229 80913
33396 80913 -253048 -529703 -627189 -640671 -753497 -945929 -995369 -791455 -498375 -343973
33386 -343973 -377946 -513841 -684364 -839867 -878558 -715508 -408839 -130701 -7435 -20668
33376 -20668 -40599 62241 282702 432098 304856 -51797 -319195 -241143 88847 360721
33366 360721 401118 284098 145979 38862 -26990 -28503 32437 116140 203550 300275 363912
33355 363912 313883 158214 34680 61380 199265 329742 421314 525110 617598 563057
33345 563057 296692 -22022 -138694 12989 241059 337726 311753 309919 372599 385852 268442
33334 268442 84587 -65296 -159218 -199490 -144901 8280 149706 172346 129708 166300 306181
33323 306181 414260 370859 195395 -6663 -132085 -114236 26625 143139 70213 -182723
33313 -182723 -428661 -524272 -504301 -461130 -407958 -335891 -291152 -279787 -188738 52742 296627
33302 296627 330941 188335 121194 254034 446124 554099 633237 756068 810879 677768
33292 677768 493191 508899 725247 891355 880810 838703 889370 921253 797431 598772
33282 598772 476391 389770 197404 -61957 -185914 -87278 125833 343789 547129 688817
33272 688817 676129 534955 435883 481677 598203 691492 761905 792603 698290 497933 370969
33261 370969 394100 382219 179353 -38584 4442 249898 384259 314645 259345 331028 345860
33250 345860 173733 -5128 -1210 43278 -122422 -419020 -500758 -228377 163929 397623
33240 397623 437279 390390 306301 190391 101254 106225 184564 258316 287240 270797 190599
33229 190599 22275 -198238 -366101 -375360 -191530 120682 436009 673122 871179 1108511
33219 1108511 1328802 1338648 1054661 681210 516932 599839 676428 555697 365255 359651
33209 359651 552529 672732 495819 125030 -112706 -21126 260516 417171 298173 52430
33199 52430 -95322 -137327 -252202 -499517 -695068 -668075 -517254 -466246 -529576 -494311 -236399
33188 -236399 105027 320185 365087 328382 265119 167598 48391 -46874 -103463 -157177 -250666
33177 -250666 -393097 -546743 -645276 -658973 -643668 -671670 -709344 -636196 -408439 -130833 61346
33166 61346 116625 43856 -119139 -262560 -241247 -39208 186862 305402 357981 424985 458801
33155 458801 384136 273606 262221 336190 358444 269778 120612 -59757 -265714 -411759
33145 -411759 -398167 -278223 -191604 -129122 47788 326247 486384 404132 225861 138060
33135 138060 129187 105954 93801 158757 238470 226034 160126 167806 251612 291433 255826 263173
33123 263173 395192 569200 666398 711815 831822 1038789 1142613 947425 519236 161387
33113 161387 74458 134469 113617 32227 103919 352587 513771 391172 107211 -127902
33103 -127902 -314667 -550964 -758324 -750848 -527724 -287740 -150853 -44806 97086 175451
$$ [...]
##END NTUPLES=NMR SPECTRUM
##END=
