##TITLE=31Pdec_LR-793-RM1
 , 64 sc
 6.12.2024
##JCAMPDX= 6.0         $$ Bruker NMR JCAMP-DX V2.0
##DATA TYPE= NMR SPECTRUM
##DATA CLASS= NTUPLES
##ORIGIN= UXNMR, Bruker Analytische Messtechnik GmbH
##OWNER= root
$$ XWIN-NMR		Version 3.5
$$ Fri Dec  6 16:11:05 2024 Russian Standard Time (UT+4h)  she@DPX200
##.OBSERVE FREQUENCY= 81.013821
##.OBSERVE NUCLEUS= ^31P
##.ACQUISITION MODE= SIMULTANEOUS
##.ACQUISITION SCHEME= undefined
##.AVERAGES= 64
##.DIGITISER RES= 17
##SPECTROMETER/DATA SYSTEM= spect
##.PULSE SEQUENCE= zgpg30
##.SOLVENT NAME= DMSO
##.SHIFT REFERENCE= (INTERNAL, DMSO, 0, 198.062)
##AUDIT TRAIL= $$ (NUMBER, WHEN, WHO, WHERE, WHAT)
$$ ##TITLE= Audit trail, XWIN-NMR		Version 3.5
$$ ##JCAMPDX= 5.01
$$ ##ORIGIN= Bruker BioSpin GmbH
$$ ##OWNER= she
$$ F:/spectra/data/she/nmr/P31/2/pdata/1/auditp.txt
$$ ##AUDIT TRAIL=  $$ (NUMBER, WHEN, WHO, WHERE, WHAT)
(   1,<2024-12-06 16:09:33.89 +0400>,<she>,<DPX200>,
      <continue with go, POWCHK disabled, PULCHK disabled
       configuration hash MD5:
       00 E9 B6 7A A2 85 ED C7 34 08 36 98 17 FE 4E 26
       data hash MD5: 32K
       CC 99 94 43 20 05 31 A0 9E 4F 4C 67 F0 67 2D 4F>)
(   2,<2024-12-06 16:09:36.70 +0400>,<she>,<DPX200>,
      <Start of raw data processing
       efp BC_mod = 2 LB = 1.5 FT_mod = 6 PKNL = 1 PHC0 = 1636.581 PHC1 = 1568.886 SI = 64K 
       data hash MD5: 64K
       B0 D3 08 1A 1F 6C 09 85 3E DB F3 EA AD 71 4B 02>)
(   3,<2024-12-06 16:09:41.42 +0400>,<she>,<DPX200>,
      <abs ABSG = 5 
       data hash MD5: 64K
       EB 3A E3 69 09 00 5E 6E 2A 9D 69 6B 3A 82 23 1A>)
(   4,<2024-12-06 16:10:23.20 +0400>,<she>,<DPX200>,
      <pk PHC0 = 526.0152 PHC1 = -1211 
       data hash MD5: 64K
       7C 65 A6 E8 18 15 43 D9 BD 99 90 A6 11 BB 76 E2>)
(   5,<2024-12-06 16:10:37.23 +0400>,<she>,<DPX200>,
      <abs ABSG = 5 
       data hash MD5: 64K
       E3 4B A3 D8 1A E5 59 F2 A6 CF 5C F2 17 74 94 9F>)
$$ ##END=
$$ 
$$ hash MD5
$$ FC 0A F9 75 9B D9 AD 5E 66 71 A0 96 4E E2 45 24
##$RELAX= 
##$RELAX= 
##$RELAX= 
##$RELAX= 
##$RELAX= 
##$RELAX= 
##$RELAX= 
##$RELAX= 
$$ Bruker specific parameters
$$ --------------------------
##$DU= <F:/spectra>
##$EXPNO= 2
##$NAME= <P31>
##$PROCNO= 1
##$TYPE= <nmr>
##$USER= <she>
##$AMP= (0..31)
100 100 100 100 100 100 100 100 100 100 100 100 100 100 100 100 100 100 
100 100 100 100 100 100 100 100 100 100 100 100 100 100 
##$AQSEQ= 0
##$AQ_mod= 1
##$AUNM= <au_zg>
##$AUTOPOS= <>
##$BF1= 81.014009
##$BF2= 200.13
##$BF3= 200.13
##$BF4= 200.13
##$BF5= 200.13
##$BF6= 200.13
##$BF7= 200.13
##$BF8= 200.13
##$BYTORDA= 1
##$CFDGTYP= 0
##$CFRGTYP= 5
##$CHEMSTR= <none>
##$CNST= (0..31)
1 1 145 1 1 1 1 1 1 1 1 1 1 1 1 1 1 1 1 1 1 1 1 1 1 1 1 1 1 1 1 1 
##$CPDPRG= <waltz16>
##$CPDPRG1= <>
##$CPDPRG2= <waltz16>
##$CPDPRG3= <>
##$CPDPRG4= <mlev>
##$CPDPRG5= <mlev>
##$CPDPRG6= <mlev>
##$CPDPRG7= <mlev>
##$CPDPRG8= <mlev>
##$CPDPRGB= <>
##$CPDPRGT= <>
##$D= (0..31)
0 1 0 0 0 0 0 0 0 0.06 0 0.03 2e-05 3e-06 0 0 0.0002 0 0 0 0 0 0 0 0 0 
0 0 0 0 0 0 
$$ [...]
##$SUBNAM3= <"">
##$SUBNAM4= <"">
##$SUBNAM5= <"">
##$SUBNAM6= <"">
##$SUBNAM7= <"">
##$SUBNAM8= <"">
##$SUBNAM9= <"">
##$SW= 400.765351723535
##$SWIBOX= (0..15)
0 1 3 0 0 0 0 0 0 0 0 0 0 0 0 0 
##$SW_h= 32467.5324675325
##$TD= 32768
##$TD0= 1
##$TE= 0
##$TE2= 300
##$TE3= 300
##$TEG= 300
##$TL= (0..7)
0 120 53 12 22 120 120 120 
##$TP= (0..7)
150 150 150 150 150 150 150 150 
##$TP07= 0
##$TPNAME0= <>
##$TPNAME1= <>
##$TPNAME2= <>
##$TPNAME3= <>
##$TPNAME4= <>
##$TPNAME5= <>
##$TPNAME6= <>
##$TPNAME7= <>
##$TPOAL= (0..7)
0.5 0.5 0.5 0.5 0.5 0.5 0.5 0.5 
##$TPOFFS= (0..7)
0 0 0 0 0 0 0 0 
##$TUNHIN= 0
##$TUNHOUT= 0
##$TUNXOUT= 0
##$USERA1= <user>
##$USERA2= <user>
##$USERA3= <user>
##$USERA4= <user>
##$USERA5= <user>
##$V9= 5
##$VALIST= <valist>
##$VCLIST= <CCCCCCCCCCCCCCC>
##$VD= 0
##$VDLIST= <DDDDDDDDDDDDDDD>
##$VPLIST= <PPPPPPPPPPPPPPP>
##$VTLIST= <TTTTTTTTTTTTTTT>
##$WBST= 1024
##$WBSW= 4
##$XGAIN= (0..3)
0 0 0 0 
##$XL= 0
##$YL= 0
##$YMAX_a= 36902
##$YMIN_a= -31152
##$ZGOPTNS= <>
##$ZL1= 120
##$ZL2= 120
##$ZL3= 120
##$ZL4= 120
##$ABSF1= 198.0616
##$ABSF2= -202.7028
##$ABSG= 5
##$ABSL= 3
##$ALPHA= 0
##$AQORDER= 0
##$ASSFAC= 0
##$ASSFACI= 0
##$ASSFACX= 0
##$ASSWID= 0
##$AUNMP= <proc_1d>
##$AZFE= 0.1
##$AZFW= 0.5
##$BCFW= 0
##$BC_mod= 2
##$BYTORDP= 0
##$COROFFS= 0
##$CY= -3
##$DATMOD= 1
##$DC= 0
##$DFILT= <>
##$DTYPP= 0
##$F1P= 0
##$F2P= 0
##$FCOR= 1
##$FTSIZE= 65536
##$FT_mod= 6
##$GAMMA= 0
##$GB= 0
##$INTBC= 1
##$INTSCL= 9.790993e-09
##$ISEN= 30
##$LB= 1.5
##$LEV0= 0
##$LPBIN= 0
##$MAXI= 10000
##$MC2= 0
##$MEAN= 0
##$ME_mod= 0
##$MI= 50
##$NCOEF= 0
##$NC_proc= -8
##$NLEV= 6
##$NOISF1= 182.463
##$NOISF2= 159.3651
##$NSP= 0
##$NTH_PI= 0
##$NZP= 0
##$OFFSET= 198.0616
##$PC= 4
##$PHC0= 2162.596
##$PHC1= 357.886
##$PH_mod= 1
##$PKNL= yes
##$PPARMOD= 0
##$PSCAL= 0
##$PSIGN= 0
##$REVERSE= no
##$SF= 81.0140089999434
##$SI= 65536
##$SIGF1= 159.3651
##$SIGF2= -187.1042
##$SINO= 113.3802
##$SIOLD= 16384
##$SREGLST= <1H.CDCl3>
##$SSB= 0
##$STSI= 65536
##$STSR= 0
##$SW_p= 32467.5324675325
##$SYMM= 0
##$S_DEV= 0
##$TDeff= 32768
##$TDoff= 0
##$TI= <>
##$TILT= no
##$TM1= 0
##$TM2= 0
##$TOPLEV= 0
##$USERP1= <user>
##$USERP2= <user>
##$USERP3= <user>
##$USERP4= <user>
##$USERP5= <user>
##$WDW= 1
##$XDIM= 65536
##$YMAX_p= 437692436
##$YMIN_p= -126243082
$$ End of Bruker specific parameters
$$ ---------------------------------
##NTUPLES= NMR SPECTRUM
##VAR_NAME=  FREQUENCY,     SPECTRUM/REAL,   SPECTRUM/IMAG
##SYMBOL=    X,             R,               I
##VAR_TYPE=  INDEPENDENT,   DEPENDENT,       DEPENDENT
##VAR_FORM=  AFFN,          ASDF,            ASDF
##VAR_DIM=   65536,         65536,           65536
##UNITS=     HZ,            ARBITRARY UNITS, ARBITRARY UNITS
##FACTOR=    0.49542278885378, 1,            1
##FIRST=     16045.7642231865, 0,            0
##LAST=      -16421.768244346, 0,            0
##MIN=       -16421.768244346, -126243082,   0
##MAX=       16045.7642231865, 437692436,    0
$$ Real data points
##PAGE= N=1
##DATA TABLE= (X++(R..R)), XYDATA
$$ [...]
$$ plain form
39996 216443 1591037 3176961 3417324 2230199 1663689 3469275 6508702 8508269 9927139
39987 9927139 13366109 18846443 22701646 22471854 20276802 19365549 19321495 17074249 11639244
39978 11639244 5769445 3223029 5566302 11064522 15822101 16892337 15137786 14076623
39970 14076623 15317362 16656565 15576550 12761219 10680693 10384837 11385970 13051752
39962 13051752 14130979 12526768 7993241 3791769 2973710 3921250 2460437 -2094356
39954 -2094356 -6048994 -6575148 -4944581 -3858700 -4030381 -4437425 -4097586 -2638629 -507377
39945 -507377 855680 451299 -469712 229165 2190984 2688664 717059 -1313096 -1025579
39936 -1025579 962065 2934465 4783087 6841347 7839076 6556757 4402560 3627031
$$ packed form
39996B16443J374594J585924K40363j187125n66510J805586L039427J999567J418870
39987I927139L438970N480334L855203k29792k195052r11253m4054k247246n435005
39978A1639244n869799k546416K343273N498220M757579J070236j754551j061163
39970A4076623J240739J339203j080015k815331k080526k95856J001133J665782
39962A3051752J079227j604211m533527m201472q18059R47540j460813m554793
39954b094356l954638n26154J630567J085881j71681m07044L39839J458957K131252
39945e07377J363057m04381r21011O98877J961819M97680j971605k030155K87517
39936a025579J987644J972400J848622K058260R97729j282319k154197p75529
$$ plain form
39928 3627031 3462542 887547 -4445915 -8726395 -8596305 -5270827 -2562073 -2248912 -3118730
39919 -3118730 -3579566 -3144650 -1565676 1434620 4955976 6936999 6260806 3908775 1410554
39910 1410554 -721720 -2197603 -1944085 553643 3728034 5443121 5578615 5491519 5470177
39901 5470177 4796405 3995544 4389073 5093824 3362568 -957909 -4092850 -3278834 -560904
39892 -560904 702427 982407 3248199 7889883 12082346 13458281 11575097 6554093
39884 6554093 -423844 -5658655 -5737799 -2365748 -897165 -3065772 -4713146 -2398119
39876 -2398119 1360604 2348172 1365862 2839467 7967099 13026401 14562171 13170801
39868 13170801 11407719 10390205 9647208 8565622 6628752 3416559 -194206 -1534439
$$ packed form
39928C627031j64489k574995n333462m280480J30090L325478K708754L13161q69818
39919c118730m60836M34916J578974L000296L521356J981023o76193k352031k498221
39910A410554k132274j475883K53518K497728L174391J715087J35494q7096k1342
39901E470177o73772q00861L93529P04751j731256m320477l134941Q14016K717930
39892e60904J263331K79980K265792M641684M192463J375935j883184n021004
39884F554093o977937n234811p9144L372051J468583k168607j647374K315027
39876b398119L758723R87568r82310J473605N127632N059302J535770j391370
39868A3170801j763082j017514p42997j081586j936870l212193l610765j340233
$$ plain form
39860 -1534439 1569562 7895526 13339458 14764284 12613884 9354090 6355085 3426566
39852 3426566 766054 -452012 185939 1552436 2798639 4692348 8059007 12017452
39844 12017452 15049385 16753122 17028207 14673705 8939295 1817107 -3524918 -6360662
39836 -6360662 -8286002 -9871380 -10143157 -9400440 -9382697 -9857150 -8165780 -3506567 1359641
39827 1359641 4431565 7347627 11358843 13384638 9847006 2648228 -2719604 -4280189
39819 -4280189 -4951733 -7031567 -9232880 -9902147 -9545039 -8677805 -6250711 -2231820 651736
39810 651736 89370 -2550316 -4356663 -4910373 -5729929 -6649551 -5734899 -3069604 -1927790
39801 -1927790 -4734173 -9373595 -11146526 -7863135 -1791781 3194053 5276915 5393814
$$ packed form
39860a534439L104001O325964N443932J424826k150400l259794k999005k928519
39852C426566k660512j218066O37951J366497J246203J893709L366659L958445
39844A2017452L031933J703737K75085k354502n734410p122188n342025k835744
39836f360662j925340j585378k71777P42717J7743m74453J691370M659213M866208
39827A359641L071924K916062M011216K025795l537632p198778n367832j560585
39819d280189o71544k079834k201313o69267L57108Q67234K427094M018891K883556
39810F51736n62366k639686j806347n53710q19556r19622R14652K665295J141814
39801a927790k806383m639422j772931L283391O071354M985834K082862J16899
$$ plain form
39793 5393814 5259639 5323204 4481833 1628270 -2405672 -4791486 -3457329 11094 1416201
39784 1416201 -1303835 -5334877 -6205852 -3051024 902564 2697125 2452697 1543052 263625
39775 263625 -1307804 -1896158 -631258 676430 -882867 -5208127 -8469149 -7407676
39767 -7407676 -3261821 -249673 -534206 -1840612 -428715 4308888 9042685 10161535
39759 10161535 7329958 3116283 93096 -805042 140645 2020699 3564943 4086172
39751 4086172 4275915 5087111 5993711 5589318 3735710 1634023 -99183 -1632125 -2262045
39742 -2262045 -875695 1489430 2082275 471209 -317032 1910073 5526380 8162810
39734 8162810 10222470 12843705 14580048 13245810 9658644 6487386 4449518 2661236
$$ packed form
39793E393814j34175O3565q41371k853563m033942k385814J334157L468423J405107
39784A416201k720036m031042q70975L154828L953588J794561k44428r09645j279427
39775B63625j571429n88354J264900J307688j559297m325260l261022J061473
39767g407676M145855L012148k84533j306406J411897M737603M733797J118850
39759A0161535k831577m213675l023187q98138R45687J880054J544244N21229
39751D086172J89743Q11196R06600m04393j853608k101687j733206j532942o29920
39742b262045J386350K365125N92845j611066p88241K227105L616307K636430
39734H162810K059660K621235J736343j334238l587166l171258k037868j788282
$$ plain form
39726 2661236 1728254 3056660 5574854 6624975 6150245 6711209 9072401 11029946 11218484
39717 11218484 10929109 11219443 11147433 10019599 8717767 7558423 5333812 1817816 -1014792
39708 -1014792 -1523724 -129498 2334269 5570882 8254682 8429907 6889082 7237907 10810757
39699 10810757 14421061 15279891 15146471 16835187 19365115 19957556 18665988 17360345
39691 17360345 15756121 12287695 7898337 5233031 4645841 4430251 4382466 5543419 6951574
39682 6951574 6684754 6023364 8148648 12092460 12728586 8534803 4791399 6039665 9130256
39673 9130256 7781064 1562197 -4033421 -5247279 -3463966 -1147678 1402079 4091769
39665 4091769 5359072 4672107 4408320 6709268 9776054 9953623 7090615 5157930 6923357
$$ packed form
39726B661236r32982J328406K518194J050121m74730N60964K361192J957545J88538
39717A1218484k89375K90334p2010j127834j301832j159344k224611l515996k832608
39708a014792n08932J394226K463767L236613K683800J75225j540825L48825L572850
39699A0810757L610304Q58830j33420J688716K529928N92441j291568j305643
39691A7360345j604224l468426m389358k665306n87190k15590m7785J160953J408155
39682F951574k66820o61390K125284L943812O36126m193783l743404J248266L090591
39673I130256j349192o218867n595618j213858J783313K316288K549757K689690
39665D091769J267303o86965k63787K300948L066786J77569k863008j932685J765427
$$ plain form
39656 6923357 10238200 10973328 8098629 4220882 2184424 2980069 6226087 10483012
39648 10483012 13242252 12809106 10489239 9007353 8739632 7919106 6673092 7465617 10323515
39639 10323515 11264952 7948161 3704771 2693782 3741102 2922074 93880 -1738987
39631 -1738987 -2143015 -3279246 -4787380 -3956065 -1298145 -560901 -2064911 -1507369 2536241
39622 2536241 5349493 3551348 943059 2566944 6798635 8317219 6300424 4652225
39614 4652225 5707516 8366298 11407190 14316270 15584581 14260446 12551604 12987878
39606 12987878 13871133 11850314 8176880 7291492 9305677 9516524 6354840 4076123
39598 4076123 5422126 7098148 5884540 4488796 6990579 12004875 14993979 14854579
$$ packed form
39656F923357L314843P35128k874699l877747k036458P95645L246018M256925
39648A0483012K759240m33146k319867j481886k67721q20526j246014P92525K857898
39639A0323515R41437l316791m243390j010989J047320q19028k828194j832867
39631a738987m04028j136231j508134Q31315K657920P37244j504010N57542M043610
39622B536241K813252j798145k608289J623885M231691J518584k016795j648199
39614D652225J055291K658782L040892K909080J268311j324135j708842M36274
39606A2987878Q83255k020819l673434q85388K014185K10847l161684k278717
39598D076123J346003J676022j213608j395744K501783N014296K989104j39400
$$ plain form
39590 14854579 13636338 11675104 7944207 4339185 4667742 8939417 12681485 12894722
39582 12894722 11504950 11824985 14206277 16383793 16227315 13329751 9474157 7937783
39574 7937783 10657169 15783911 19632042 20927427 21145478 20961099 19279914 16351494
39566 16351494 14811595 16071237 17933423 17498603 14719018 11583034 9428924 8625028
39558 8625028 9400412 11316414 13086438 14346682 16386254 19777213 22706370 23256333
39550 23256333 21999748 20661722 19651599 18867985 19420296 21941392 24200488 23318221
39542 23318221 20094101 18465256 20584630 24811548 28633881 31027303 31528504 29610829
39534 29610829 26056749 22957934 21309773 20168867 18775728 17625067 16791865 15434258
$$ packed form
39590A4854579j218241j961234l730897l605022L28557M271675L742068K13237
39582A2894722j389772L20035K381292K177516j56478k897564l855594j536374
39574G937783K719386N126742L848131J295385K18051j84379j681185k928420
39566A6351494j539899J259642J862186m34820k779585l135984k154110q03896
39558H625028P75384J916002J770024J260244K039572L390959K929157N49963
39550B3256333j256585j338026j010123p83614N52311K521096K259096q82267
39542B3318221l224120j628845K119374M226918L822333K393422N01201j917675
39534B9610829l554080l098815j648161j140906j393139j150661q33202j357607
$$ plain form
39526 15434258 14066848 15049072 19103003 23220921 24048495 21995254 20060238 19754467
39518 19754467 20193501 20304108 19894347 19181688 19103886 21330715 25901916 29588237 29144278
39509 29144278 25964592 24745960 27121214 29457427 28240532 25132048 24459965 27143617
39501 27143617 29623365 28588668 24736724 21354368 20552749 21761650 23241889 24046843
39493 24046843 24297015 24079678 22761519 19708192 15498558 12046009 11311230 13776738
39485 13776738 17998969 21680813 23541420 24260943 25250155 26503031 26411753 24030241 20629165
39476 20629165 18233082 17335797 17107149 17341737 18847356 21853003 25149726 27133770
39468 27133770 27029578 25032136 22025923 19328356 18028548 18289452 19504647 20843120
$$ packed form
39526A5434258j367410R82224M053931M117918Q27574k053241j935016l05771
39518A9754467M39034J10607m09761p12659p7802K226829M571201L686321m43959
39509B9144278l179686j218632K375254K336213j216895l108484o72083K683652
39501B7143617K479748j034697l851944l382356q01619J208901J480239Q04954
39493B4046843K50172k17337j318159l053327m209634l452549p34779K465508
39485A3776738M222231L681844J860607P19523R89212J252876r1278k381512l401076
39476B0629165k396083q97285k28648K34588J505619L005647L296723J984044
39468B7133770j04192j997442l006213k697567j299808K60904J215195J338473
$$ plain form
39460 20843120 21246487 19628636 16126154 12668075 11088203 11051989 11171612 11599130 13509617
39451 13509617 16154239 16949178 15283605 13927370 15265480 18078886 19778442 20088460
39443 20088460 20270415 19971602 17654099 13940784 11920908 13467226 17110251 20337802
39435 20337802 22435316 24012261 24925844 24112665 21200462 17264944 13814844 11488192
39427 11488192 9931812 8753078 8214908 8625332 9181595 8274272 5506853 2749376 2219144
39418 2219144 3799038 5308336 5410037 5098672 5881074 7440984 7956225 6404405 3870877
39409 3870877 2505120 3462992 5974057 8397535 10037291 11522377 13300827 14539758
39401 14539758 14323043 13352739 13073568 13139238 11493073 7854933 5598678 8333981 15125241
$$ packed form
39460B0843120M03367j617851l502482l458079j579872l6214J19623M27518J910487
39451A3509617K644622P94939j665573j356235J338110K813406J699556L10018
39443B0088460J81955k98813k317503l713315k019876J546318L643025L227551
39435B0337802K097514J576945R13583q13179k912203l935518l450100k326652
39427A1488192j556380j178734n38170M10424N56263r07323k767419k757477n30232
39418B219144J579894J509298J01701l11365P82402J559910N15241j551820k533528
39409C870877j365757R57872K511065K423478J639756J485086J778450J238931
39401A4539758k16715r70304k79171O5670j646165l638140k256255K735303O791260
$$ plain form
39392 15125241 20928125 21894493 18611952 13817768 9102800 5345340 4433910 7565738
39384 7565738 12106041 13172018 9434466 4986751 3799492 4433775 2843450 -951028
39376 -951028 -2423923 1100857 6855145 10577868 11421819 11046163 9973771 7649554 5246551
39367 5246551 5447163 8797995 12224886 12272630 8864607 4984041 3243353 3680202 4806548
39358 4806548 5882322 7401152 9528062 11150004 11242403 10447035 10069610 9969113 9131534
39349 9131534 8272862 9648167 13442582 16497233 16186894 13839995 12418452 12286852 11584682
39340 11584682 9699744 7734162 6066400 4160638 2699081 3157600 4885659 5260496
39332 5260496 3552267 2205676 3209725 5479393 7148841 8185935 8951543 8316968
$$ packed form
39392A5125241N802884R66368l282541m794184m714968l757460r11430L131828
39384G565738M540303J065977l737552m447715j187259O34283j590325l794478
39376i51028j472895L524780N754288L722723Q43951l75656j072392k324217k403003
39367E246551K00612L350832L426891M7744l408023l880566j740688M36849J126346
39358D806548J075774J518830K126910J621942R2399p95368l77425j00497q37579
39349I131534q58672J375305L794415L054651l10339k346899j421543j31600p02170
39340A1584682j884938j965582j667762j905762j461557M58519J728059L74837
39332E260496j708229j346591J004049K269668J669448J037094P65608o34575
$$ plain form
39324 8316968 5772464 4013427 6407255 12020451 15698369 13720517 7724408 2481845
39316 2481845 1238934 3937669 8593312 12932700 15140874 14641909 12941593 12914415 16018505
39307 16018505 20149410 21449938 18835928 15540958 15067964 16794685 17447581 16090247
39299 16090247 14988738 15410213 15450846 13253850 10009035 8015628 7607860 7912746 9069790
39290 9069790 11416550 13528930 13522207 11972184 11491711 13467987 16855050 19987202 21909581
39281 21909581 22015771 20082196 16963340 14117233 12408692 12160715 13626537 16037308
39273 16037308 17103728 15514459 13367278 13765881 16267084 17396084 15856313 14223886
39265 14223886 14540416 15231540 14236860 12714842 13171904 15531475 17544054 17995659 17041704
$$ packed form
39324H316968k544504j759037K393828N613196L677918j977852n996109n242563
39316B481845j242911K698735M655643M339388K208174m98965j700316k7178L104090
39307A6018505M130905J300528k614010l294970m72994J726721O52896j357334
39299A6090247j101509M21475M0633k196996l244815j993407m07768L04886J157044
39290I069790K346760K112380o723j550023m80473J976276L387063L132152J922379
39281B1909581J06190j933575l118856k846107j708541k47977J465822K410771
39273A6037308J066420j589269k147181L98603K501203J129000j539771j632427
39265A4223886L16530O91124r94680j522018M57062K359571K012579M51605r53955
$$ plain form
39256 17041704 14194828 8907641 3329753 1728793 5802527 12050371 15137115 13244404
39248 13244404 9324527 7670460 10003243 14488418 17713851 17575948 14827061 12183157
39240 12183157 11884626 13961820 16662173 18252689 18195259 16829052 14663103 12501904
39232 12501904 11701200 13079730 15344344 15831877 13683020 11328991 11615030 14149162
39224 14149162 16033836 15848830 15077635 15371499 16213346 16127909 14856063 13271491 11966083
39215 11966083 10820415 9489353 7783232 6030501 5219552 6031321 7672128 8654515
39207 8654515 8708932 8599131 8141044 6410466 4304706 4420707 7098492 8905241 7035300
39198 7035300 3378092 1956540 3839644 7052166 10136422 12767449 13615876 11032971
$$ packed form
39256A7041704k846876n287187n577888j600960M073734O247844L086744j892711
39248A3244404l919877j654067K332783M485175L225433j37903k748887k643904
39240A2183157k98531K077194K700353J590516n7430j366207k165949k161199
39232A2501904q00704J378530K264614M87533k148857k354029K86039K534132
39224A4149162J884674j85006p71195K93864Q41847q5437j271846j584572j305408
39215A1966083j145668j331062j706121j752731q10949Q11769J640807R82387
39207H654515N4417j09801m58087j730578k105760J16001K677785J806749j869941
39198G035300l657208j421552J883104L212522L084256K631027Q48427k582905
$$ plain form
39190 11032971 6206646 2802111 2724496 4458146 6134670 7881766 10166747 11828581
39182 11828581 11029233 7069331 930385 -4564848 -5387838 297989 8784221 13600004
39174 13600004 12862394 11237239 13056350 16432908 16823871 13888896 11114488 9983562
39166 9983562 8634060 6354912 5544103 7810005 10977752 11981580 10978478 10497800
39158 10497800 11429478 11992553 10785273 9134460 9370023 11471085 12769070 11365509
39150 11365509 8816422 8262495 10280160 12109838 11331007 8800051 7001021 6687256
39142 6687256 6537357 5537970 4405855 4786969 7796278 12930293 17738148 19279725 16905889
39133 16905889 13092995 10725652 10285579 10503065 10518078 9963386 8150702 5250125 3524026
$$ packed form
39190A1032971m826325l404535p7615J733650J676524J747096K284981J661834
39182A1828581p99348l959902o138946n495233q22990N685827Q486232M815783
39174A3600004p37610j625155J819111L376558L90963k934975k774408j130926
39166I983562j349502k279148q10809K265902L167747J003828j003102m80678
39158A0497800R31678N63075j207280j650813K35563K101062J297985j403561
39150A1365509k549087n53927K017665J829678p78831k530956j799030l13765
39142F687256j49899r99387j132115L81114L009309N134015M807855J541577k373836
39133A6905889l812894k367343m40073K17486J5013n54692j812684k900577j726099
$$ plain form
39124 3524026 5119937 8946615 11870978 12696821 12665960 12440457 11617022 11430864 14433215
39115 14433215 20149069 24190751 23722884 21259565 20766583 22298684 23208265 22746006 22232226
39106 22232226 21812309 20383405 18370810 17547674 18133802 18901337 20183839 23615455 28233637
39097 28233637 30107770 27452315 23424951 21757992 21790379 20361405 17037293 14443801
39089 14443801 13964233 14007420 12853708 10753418 8406767 5532835 2297400 443120
39081 443120 1149006 2827243 3189762 3140222 6216317 13447680 20764808 23069054 19775223
39072 19775223 14754584 11587887 10737438 11059335 11865012 12839694 13654640 14605863 16305671
39063 16305671 17911468 17219762 13804456 10574503 10367463 12036402 12030929 9221632 5791598
$$ packed form
39124C524026J595911L826678K924363Q25843l0861k25503q23435j86158L002351
39115A4433215N715854M041682m67867k463319m92982J532101R09581m62259n13780
39106B2232226m19917j428904k012595q23136N86128P67535J282502L431616M618182
39097B8233637J874133k655455m027364j666959L2387j428974l324112k593492
39089A4443801m79568M3187j153712k100290k346651k873932l235435j854280
39081D43120P05886J678237L62519m9540L076095P231363P317128K304246l293831
39072A9775223n020639l166697q50449L21897Q05677R74682Q14946R51223J699808
39063A6305671J605797o91706l415306l229953k07040J668939n473k809297l430034
$$ plain form
39054 5791598 3481575 1552658 -811377 -2393627 -1658588 973621 4060162 7259766
39046 7259766 10989464 14594749 16428612 15833473 14037603 12754067 12309700 11460979 9190614
39037 9190614 6584111 6086607 8123612 9424089 6554000 850086 -2497175 -786160
39029 -786160 3229918 5875048 7387993 9933815 12964373 13960208 13017730 13288612 16429083
39020 16429083 20215510 21355974 18617949 12759889 5670184 352821 -572305 2214690
39012 2214690 4952139 5121786 4007317 3940147 4997223 6011156 6889847 7727385 7213857
39003 7213857 4627396 2368659 3494342 7050848 8915424 7585367 6079755 7005365
38995 7005365 8522584 7164992 2740896 -1793404 -4237261 -4820222 -4518409 -3641589 -2217621
$$ packed form
39054E791598k310023j928917k364035j582250P35039K632209L086541L199604
39046G259766L729698L605285J833863n95139j795870j283536m44367q48721k270365
39037I190614k606503m97504K037005J300477k870089n703914l347261J711015
39029g86160M016078K645130J512945K545822L030558R95835r42478K70882L140471
39020A6429083L786427J140464k738025n858060p089705n317363r25126K786995
39012B214690K737449J69647j114469o7170J057076J013933Q78691Q37538n13528
39003G213857k586461k258737J125683L556506J864576j330057j505612R25610
38995G005365J517219j357592m424096m534300k443857n82961L01813Q76820J423968
$$ plain form
38986 -2217621 -512419 1029587 1731139 919713 -1068520 -2772937 -3489160 -4478819 -6856125
38977 -6856125 -8960959 -7922848 -3840152 -144475 955675 1284297 3459210 6527468
38969 6527468 7124102 4407838 1455778 1164367 2553560 2422586 -291590 -3382461 -4508211
38960 -4508211 -3951108 -3461999 -3394950 -2454790 -71128 2631684 4733154 6720224 8570866
38951 8570866 8187026 3947986 -1888552 -4931568 -3954483 -1944848 -1320101 -976878 377574
38942 377574 896856 -1406907 -4205919 -3224114 1204737 3592708 380199 -5206812 -7108274
38933 -7108274 -3496407 1851089 4215500 2380445 -1167968 -3230594 -2937903 -2181200
38925 -2181200 -2974761 -4755517 -5253899 -3846983 -2381126 -2104099 -1561477 1043462 4697839
$$ packed form
38986b217621J705202J542006P01552q11426j988233j704417p16223r89659k377306
38977f856125k104834J038111M082696L695677J100150L28622K174913L068258
38969F527468N96634k716264k952060k91411J389193j30974k714176l090871j125750
38960d508211N57103M89109O7049R40160K383662K702812K101470J987070J850642
38951H570866l83840m239040n836538l043016R77085K009635O24747L43223J354452
38942C77574N19282k303763k799012R81805M428851K387971l212509n587011j901462
38933g108274L611867N347496K364411j835055l548413k062626K92691P56703
38925b181200p93561j780756m98382J406916J465857K77027N42622K604939L654377
$$ plain form
38916 4697839 6734647 6658166 6824649 8941328 11438656 11266627 7527462 2420422 -1061099
38907 -1061099 -1497966 749838 4459320 7879326 9119674 7845489 6391351 7171201
38899 7171201 8543774 5902004 -1368725 -6749195 -3905434 4422966 9250413 6745994
38891 6745994 1948723 210199 326745 -935609 -2404531 -1431203 -30392 -2373241
38883 -2373241 -7370654 -9193698 -5399444 43476 2588598 1942424 23314 -2133493
38875 -2133493 -3808262 -3988824 -3003448 -2361338 -1920587 -13758 2541781 1992168 -2845917
38866 -2845917 -7891318 -9252683 -8521993 -9441432 -11637052 -11447676 -7677964 -2874597 520382
38857 520382 2018339 1496391 -927422 -3301274 -3226627 -1515652 -1923678 -6446835 -12966666
$$ packed form
38916D697839K036808p6481J66483K116679K497328j72029l739165n107040l481521
38907a061099m36867K247804L709482L420006J240348j274185j454138P79850
38899G171201J372573k641770p270729n380470K843761Q328400M827447k504419
38891F745994m797271j738524J16546j262354j468922R73328J400811k342849
38883b373241m997413j823044L794254N442920K545122o46174j919110k156807
38875b133493j674769j80562R85376O42110M40751J906829K555539n49613m838085
38866b845917n045401j361365P30690r19439k195620J89376L769712M803367L394979
38857E20382J497957n21948k423813k373852P4647J710975m08026m523157o519831
$$ plain form
38848 -12966666 -18110659 -20303516 -19425731 -15918985 -11507392 -8809040 -8638208 -8956099
38840 -8956099 -7676811 -5283185 -3634927 -3585127 -4977565 -7480432 -9717079 -8882017 -3623336
38831 -3623336 2969847 5476875 1811949 -4592214 -8693826 -8706932 -6633926 -5384566
38823 -5384566 -6477513 -9624704 -13005102 -14058248 -11449043 -6776390 -3358939 -2663450
38815 -2663450 -2764571 -1220277 1323844 1845661 -915918 -4526521 -5427048 -2342663 3040341
38806 3040341 7384375 7369779 2059613 -5110429 -8415144 -5808099 -1594990 -1055803 -3535709
38797 -3535709 -3750277 456914 5149457 6059341 4150638 3256279 4362686 5075652 3781737
38788 3781737 1455666 -791897 -3443032 -6783284 -9128111 -8514736 -5566503 -3160702
$$ packed form
38848a2966666n143993k192857Q77785L506746M411593K698352J70832l17891
38840h956099J279288K393626J648258M9800j392438k502867k236647Q35062N258681
38831c623336O593183K507028l664926o404163m101612j3106K073006J249360
38823e384566j092947l147191l380398j053146K609205M672653L417451O95489
38815b663450j01121J544294K544121N21817k761579l610603r00527L084385N383004
38806C040341M344034j4596n310166p170042l304715K607045M213109N39187k479906
38797c535709k14568M207191M692543R09884j908703q94359J106407P12966j293915
38788C781737k326071k247563k651135l340252k344827O13375K948233K405801
$$ plain form
38780 -3160702 -3133290 -4533503 -5675790 -6715461 -8750457 -10855546 -10059795 -5116913 1223343
38771 1223343 5104480 5706886 4904961 3651714 1004168 -3161896 -6743835 -7745665
38763 -7745665 -6571852 -4990304 -3902457 -3066036 -2113423 -965270 65415 63076 -1544388
38754 -1544388 -3261083 -2323262 1384508 3549267 -259506 -8777253 -15487373 -15234434
38746 -15234434 -9032752 -1999145 2013557 2907456 2702016 2919337 3537295 3502074 1857253
38737 1857253 -1168172 -3814768 -3890075 -829379 3321252 5511726 4402731 1025285
38729 1025285 -3068019 -7071470 -10003133 -10344316 -8251568 -6830382 -8797496 -12356777
38721 -12356777 -13033802 -9770970 -6414444 -6293144 -8084239 -8651098 -7483678 -6006663
$$ packed form
38780c160702K7412j400213j142287j039671k034996k105089P95751M942882O340256
38771A223343L881137O02406q01925j253247k647546m166064l581939j001830
38763g745665J173813J581548J087847Q36421R52613J148153J030685k339j607464
38754a544388j716695R37821L707770K164759l808773q517747o710120K52939
38746a5234434O201682P033607M012702Q93899k05440K17321O17958l5221j644821
38737A857253l025425k646596p5307L060696M150631K190474j108995l377446
38729A025285m093304m003451k931663l41183K092748J421186j967114l559281
38721a2356777o77025L262832L356526J21300j791095n66859J167420J477015
$$ plain form
38713 -6006663 -4371976 -1758757 1034480 1875768 -65241 -3813095 -8181411 -12030960
38705 -12030960 -13691572 -12486719 -10598780 -11076871 -13822200 -15655535 -14656056 -12383954
38697 -12383954 -11285315 -11796287 -12756765 -13087788 -12306084 -10761928 -10035258 -11778083 -15468192
38688 -15468192 -18448744 -18775859 -17007376 -14868128 -13404090 -12827797 -12842692 -12613531 -11597401
38679 -11597401 -10644383 -10833988 -11078824 -8886130 -4160686 -155062 533961 -986178 -2301531
38670 -2301531 -3325912 -5560204 -8935521 -11510002 -11860565 -10242377 -7813476 -5970659
38662 -5970659 -5863135 -7243306 -8235127 -7340789 -5173227 -3326894 -2429271 -2384221 -3388435
38653 -3388435 -5122635 -5877273 -4365798 -1890319 -936263 -2013034 -3608439 -4839204
$$ packed form
38713f006663J634687K613219K793237Q41288j941009l747854m368316l849549
38705a2030960j660612J204853J887939m78091k745329j833335R99479K272102
38697a2383954J098639n10972r60478l31023P81704J544156P26670j742825l690109
38688a5468192k980552l27115J768483K139248J464038N76293j4895K29161J016130
38679a1597401R53018j89605k44836K192694M725444M005624O89023j520139j315353
38670b301531j024381k234292l375317k574481l50563J618188K428901J842817
38662e970659J07524j380171r91821Q94338K167562J846333Q97623M5050j004214
38653c388435j734200p54638J511475K475479R54056j076771j595405j230765
$$ plain form
38645 -4839204 -6157736 -7546273 -8065565 -7524993 -6854795 -6376260 -5214273 -2905449 -337026
38636 -337026 1213711 824319 -2195029 -7499688 -12565058 -14180554 -11843635 -8300310
38628 -8300310 -6153436 -5372304 -4708356 -3830190 -2954730 -1820437 -455333 -77240 -1926563
38619 -1926563 -5616209 -9405962 -11660440 -11722756 -10268707 -9173275 -9838696 -11165016 -10618631
38610 -10618631 -7988039 -6290781 -7747768 -10725551 -12525246 -13525699 -15956238 -19519896
38602 -19519896 -21240773 -19765759 -17193278 -15933394 -15891492 -15751379 -15282334 -15032550 -14810838
38593 -14810838 -13767946 -11655300 -9397853 -8648582 -10656301 -14729894 -17949348 -17719331
38585 -17719331 -14849131 -12730257 -13094522 -14172989 -13702081 -11872521 -9925064 -7508928
$$ packed form
38645d839204j318532j388537n19292N40572O70198M78535J161987K308824K568423
38636c37026J550737l89392l019348n304659n065370j615496K336919L543325
38628h300310K146874P81132O63948Q78166Q75460J134293J365104L78093j849323
38619a926563l689646l789753k254478o2316J454049J095432o65421j326320N46385
38610a0618631K630592J697258j456987k977783j799695j000453k430539l563658
38602a9519896j720877J475014K572481J259884M1902J40113M69045K49784K21712
38593a4810838J042892K112646K257447P49271k007719m073593l219454K30017
38585a7719331K870200K118874l64265j078467M70908J829560J947457K416136
$$ plain form
38577 -7508928 -3557363 1086449 4129413 4742379 4167191 3401075 2012345 -511924 -3832540
38568 -3832540 -7455040 -10746763 -11972511 -9439327 -4739437 -2870148 -7005851 -14086479
38560 -14086479 -17744068 -15355846 -10210982 -6581348 -4894604 -3017973 -651322 -140098
38552 -140098 -2843268 -6515811 -7565791 -5314556 -2609676 -1905250 -2049855 -247599 3427944
38543 3427944 5390943 2982408 -1956350 -5119597 -4419271 -1418733 1138502 1730403
38535 1730403 387136 -1724720 -2898690 -2390778 -1536186 -2181520 -3870708 -3969540 -1009454
38526 -1009454 3376542 6429722 7054099 6072741 4813504 4097093 3704874 2397988 -520879
38517 -520879 -3464758 -3903367 -1867756 -252015 -898693 -2638048 -4444798 -7737580 -12944911
$$ packed form
38577g508928L951565M643812L042964O12966n75188p66116j388730k524269l320616
38568c832540l622500l291723j225748K533184M699890J869289m135703p080628
38560a4086479l657589K388222N144864L629634J686744J876631K366651N11224
38552a40098k703170l672543j049980K251235K704880P04426j44605J802256L675543
38543C427944J962999k408535m938758l163247P00326L000538K557235N91901
38535A730403j343267k111856j173970N07912Q54592o45334j689188r8832K960086
38526a009454M385996L053180O24377r81358j259237p16411l92219j306886k918867
38517e20879k943879m38609K035611J615741o46678j739355j806750l292782n207331
$$ plain form
38508 -12944911 -16112168 -12728683 -4099440 3750526 7497263 9431532 12469993 15643233
38500 15643233 16067060 13012144 8392723 4739447 3714480 5144486 6721098 6097468
38492 6097468 3742713 2059704 1559207 360205 -1968514 -3025963 -1459089 465172
38484 465172 88792 -2036369 -3628548 -3586890 -1583757 2732139 7737296 9579571 6995318
38475 6995318 4244626 5828082 10159459 12312275 11357769 10357014 10027113 7735786
38467 7735786 3277212 607864 2202410 5776393 8397892 10060847 11108412 9776926
38459 9776926 5088442 -620066 -4713818 -7337871 -9031431 -8045515 -3245533 2512831
38451 2512831 5382502 5289735 4360843 2258227 -2790763 -9045466 -11694895 -8848696 -3690017
$$ packed form
38508a2944911l167257L383485Q629243P849966L746737J934269L038461L173240
38500A5643233M23827l054916m619421l653276j024967J430006J576612o23630
38492F097468k354755j683009n00497j199002k328719j057449J566874J924261
38484D65172l76380k125161j592179M1658K003133M315896N005157J842275k584253
38475F995318k750692J583456M331377K152816r54506j000755l29901k291327
38467G735786m458574k669348J594546L573983K621499J662955J047565j331486
38459I776926m688484n708508m093752k624053j693560R85916M799982N758364
38451B512831K869671r2767r28892k102616n048990o254703k649429K846199N158679
$$ plain form
38442 -3690017 54679 1710008 1920215 518410 -2240878 -4657323 -5446170 -5002377 -3838953
38433 -3838953 -1791728 138543 -397498 -3566642 -5816171 -4396122 -1844251 -2964867
38425 -2964867 -8038127 -12149630 -11538643 -7828339 -5000244 -4591377 -5562948 -7113651 -9201466
38416 -9201466 -10818321 -10106043 -6843122 -3321301 -1802049 -2070001 -2587463 -3321689 -5768088
38407 -5768088 -9999568 -13296526 -12816509 -8819166 -4068584 -539207 1877998 3527975
38399 3527975 3658720 1837296 -531055 -1408637 -263423 2154204 5515041 9606907
38391 9606907 12330196 10238581 2554650 -6567791 -11546967 -10704632 -6624601 -1781978
38383 -1781978 3815925 10126371 14757918 15263264 12620062 10288476 10065066 10653045 10367057
$$ packed form
38442c690017L744696J655329K10207j401805k759288k416445p88847M43793J163424
38433c838953K047225J930271n36041l169144k249529J420049K551871j120616
38425b964867n073260m111503O10987L710304K828095M08867r71571j550703k087815
38416i201466j616855P12278L262921L521821J519252k67952n17462p34226k446399
38407e768088m231480l296958M80017L997343M750582L529377K417205J649977
38399C527975J30745j821424k368351q77582J145214K417627L360837M091866
38391I606907K723289k091615p683931r122441m979176Q42335M080031M842623
38383a781978N597903O310446M631547N05346k643202k331586k23410N87979k85988
$$ plain form
38374 10367057 9540269 9754070 11917643 15566010 19099231 20599707 19646901 18460010
38366 18460010 19721360 22956821 24929336 24323940 23826278 25961769 28897808 28885943 25647401
38357 25647401 22393730 20815629 19128613 15870545 12966591 13247983 16473357 19665327
38349 19665327 20648536 19622684 17592649 14989054 12339532 11009283 12051360 14546221
38341 14546221 16120248 15488126 13773270 12704133 12203808 10954851 9024659 8157701
38333 8157701 8819680 8569421 4871994 -1235008 -5814727 -6272021 -3886257 -2142822 -3259081
38324 -3259081 -6211846 -7642464 -5021152 609607 5500362 7091485 6117150 4453539
38316 4453539 2560603 374014 -921422 -247776 1117562 988251 -396400 -673455 1149732
$$ packed form
38374A0367057q26788K13801K163573L648367L533221J500476r52806j186891
38366A8460010J261350L235461J972515o05396m97662K135491K936039j1865l238542
38357B5647401l253671j578101j687016l258068k903954K81392L225374L191970
38349A9665327R83209j025852k030035k603595k649522j330249J042077K494861
38341A4546221J574027o32122j714856j069137n00325j248957j930192q66958
38333H157701O61979k50259l697427o107002m579719m57294K385764J743435j116259
38324c259081k952765j430618K621312N630759M890755J591123r74335j663611
38316D453539j892936k186589j295436O73646J365338j29311j384651k77055J823187
$$ plain form
38307 1149732 3597300 5089993 5389926 4738954 3672188 3655268 5578688 7486886 6295955
38298 6295955 2100939 -1831264 -3765683 -5144598 -6633854 -5999552 -2077929 1905155
38290 1905155 1804767 -2152303 -5805053 -5703837 -1741099 3453301 6236084 4673833
38282 4673833 1119509 381272 3810370 7298125 6922311 4006356 1985425 887408
38274 887408 -1376319 -4111864 -4548084 -2676183 -1264836 -1170302 -538917 1026659 1418715
38265 1418715 159307 67423 3079925 6961791 7875725 4518109 -1283715 -6298455 -7486449
38256 -7486449 -3936165 1741932 5562833 6335589 5986976 5530269 3293069 -1803646 -7598231
38247 -7598231 -10920501 -10871277 -8726743 -6204664 -4849972 -5384890 -6507079 -5931132 -3581722
$$ packed form
38307A149732K447568J492693K99933o50972j066766j6920J923420J908198j190931
38298F295955m195016l932203j934419j378915j489256O34302L921623L983084
38290A905155j00388l957070l652750J01216L962738N194400K782783j562251
38282D673833l554324p38237L429098L487755l75814k915955k020931j098017
38274H87408k263727k735545m36220J871901J411347R4534O31385J565576L92056
38265A418715j259408r1884L012502L881866R13934l357616n801824n014740j187994
38256g486449L550284N678097L820901P72756l48613m56707k237200n096715n794585
38247g598231l322270M9224K144534K522079J354692n34918j122189N75947K349410
$$ plain form
38238 -3581722 -1950599 -2340887 -2951898 -2087833 -1016981 -1662992 -3268058 -3525179 -1707356
38229 -1707356 1286421 4740469 8004848 9711163 9135083 7507898 6259015 4964791
38221 4964791 2797836 832971 749672 2040300 2647690 1896777 985005 1156172 3070036
38212 3070036 7075837 12094482 15078925 13913400 10411208 8367137 9210658 11607711
38204 11607711 14251260 16175154 15242116 10200393 4440794 3707276 8797206 14089428
38196 14089428 15160598 14523311 17134595 22967904 27566532 28486030 27620603 27490235 28328394
38187 28328394 29232282 29718830 29419789 28169173 27182305 28479664 32191102 35872201 37691160
38178 37691160 39151194 43144750 49916804 56593652 60789626 63324135 66860948 72792034
$$ packed form
38238c581722J631123l90288o11011Q64065J070852o46011j605066k57121J817823
38229a707356K993777L454048L264379J706315n76080j627185j248883j294224
38221D964791k166955j964865q3299J290628O07390p50913r11772J71167J913864
38212C070036M005801N018645K984443j165525l502192k044071Q43521K397053
38204A1607711K643549J923894r33038n041723n759599p33518N089930N292222
38196A4089428J071170o37287K611284N833309M598628R19498q65427j30368Q38159
38187B8328394R03888M86548k99041j250616r86868J297359L711438L681099J818959
38178C7691160J460034L993556O772054O676848M195974K534509L536813N931086
$$ plain form
38170 72792034 80059410 86352967 89843998 90357714 89644247 90123268 92531618 94909198
38162 94909198 94461730 90222158 83532740 76637088 71527728 69107553 67903451 64289049
38154 64289049 56046684 45642539 37924425 34392316 31876901 27206930 20722621 14468486
38146 14468486 9658100 7181191 7681959 9156821 7384750 1532596 -3194169 -1819465
38138 -1819465 3653421 7528521 8392180 8995769 9522352 7006240 2024252 -113712 2702289
38129 2702289 5370533 3034445 -1521546 -2260834 1249184 4310153 4948277 6159689
38121 6159689 9987677 13734328 13755706 10099512 5391796 1070928 -3054767 -6446371
38113 -6446371 -7401062 -5570791 -3560308 -4695392 -9232512 -13792284 -15080788 -13392710
$$ packed form
38170G2792034P267376O293557L491031N13716p13467M79021K408350K377580
38162I4909198m47468m239572o689418o895652n109360k420175j204102l614402
38154F4289049q242365j0404145p718114l532109k515415m669971o484309o254135
38146A4468486m810386k476909N00768J474862j772071n852154m726765J374704
38138a819465N472886L875100Q63659O03589N26583k516112m981988k137964K816001
38129B702289K668244k336088m555991p39288L510018L060969O38124J211412
38121F159689L827988L746651K1378l656194m707716m320868m125695l391604
38113f446371r54691J830271K010483j135084m537120m559772j288504J688078
$$ plain form
38105 -13392710 -11558427 -11160806 -11275182 -10693451 -9589998 -8566813 -7646907 -6947275 -7018868
38096 -7018868 -7760269 -8248120 -8383897 -9305575 -11187073 -12082876 -10383235 -7347275 -5669065
38087 -5669065 -6209406 -7498885 -7909157 -7020902 -5249924 -3308459 -1894750 -1261534 -1511831
38078 -1511831 -3516218 -8069096 -13201596 -14225181 -8726891 -620093 3301599 847321
38070 847321 -3643135 -5042329 -2910224 -442995 -24769 -1549062 -4023953 -6676923
38062 -6676923 -8267311 -7046919 -2668148 2520202 5516788 6135274 7068432 9904675
38054 9904675 12631537 12510386 10026006 7686037 5753365 2210850 -2878976 -6198160
38046 -6198160 -5552614 -2738199 -520228 776399 1899436 2370459 1880327 1926190 3527633
$$ packed form
38105a3392710J834283L97621j14376N81731J103453J023185R19906O99632p1593
38096g018868p41401m87851j35777r21678j881498q95803J699641L035960J678210
38087e669065n40341j289479m10272Q88255J770978J941465J413709O33216k50297
38078a511831k004387m552878n132500j023585N498290Q106798L921692k454278
38070H47321m490456j399194K132105K467229M18226j524293k474891k652970
38062f676923j590388J220392M378771N188350K996586O18486R33158K836243
38054I904675K726862j21151k484380k339969j932672l542515n089826l319184
38046f198160O45546K814415K217971J296627J123037M71023m90132M5863J601443
$$ plain form
38037 3527633 5072249 5033897 5048809 7212171 9817028 9389954 6223411 4274841 5661154
38028 5661154 8500536 10307918 10432365 8902906 5933094 3062361 1956995 1638691
38020 1638691 -254332 -3102994 -3450757 -332797 2758147 2463082 -822929 -5094896
38012 -5094896 -9313758 -12283186 -12281309 -10051881 -9170350 -10846729 -11192648 -6759879 -266032
38003 -266032 2954357 2349223 1768494 2660182 2267404 -893577 -3921465 -3662074 -1037127
37994 -1037127 834219 835511 -25987 -1420750 -4115507 -7576397 -9183440 -6948991 -2225138
37985 -2225138 1415426 1902992 368039 -951084 -1257102 -915159 117584 2023422 3948208
37976 3948208 4864299 5343625 6720304 8758683 10227668 11582150 14331919 17337800
$$ packed form
38037C527633J544616l8352J4912K163362K604857m27074l166543j948570J386313
38028E661154K839382J807382J24447j529459k969812k870733j105366l18304
38020A638691j893023k848662l47763L117960L090944k95065l286011m271967
38012e094896m218862k969428J877K229428Q81531j676379l45919M432769O493847
38003b66032L220389o05134n80729Q91688l92778l160981l027888K59391K624947
37994a037127J871346J292q61498j394763k694757l460890j607043K234449M723853
37985b225138L640564M87566j534953j319123l06018L41943J032743J905838J924786
37976C948208R16091M79326J376679K038379J468985J354482K749769L005881
$$ plain form
37968 17337800 16910312 12040671 6670544 4697305 5206050 5115677 4261162 4603904 5809102
37959 5809102 5184359 1921445 -1330358 -1405463 2638107 9394029 15868922 18841915 17568055
37950 17568055 15044508 14929014 17559880 20587007 22656701 24248205 25442955 25340799
37942 25340799 23612943 20564239 15996000 10208221 5582946 4442106 5549448 5662989
37934 5662989 4550570 5165474 8340533 10912680 10639942 9897811 12353756 18096532 23928517
37925 23928517 26754800 25242787 20085508 14262294 11264068 11441689 11683639 9878561
37917 9878561 7509285 6362631 5409012 3420827 2265290 4374782 8591168 11846958
37909 11846958 13762322 16108506 18593087 19067070 17850399 17956810 20254265 21933070
$$ packed form
37968A7337800m27488m869641n370127j973239N08745r0373q54515L42742J205198
37959E809102o24743l262914l251803p5105M043570O755922O474893K972993j273860
37950A7568055k523547j15494K630866L027127K069694J591504J194750j02156
37942B5340799j727856l048704m568239n787779m625275j140840J107342J13541
37934E662989j112419O14904L175059K572147k72738p42131K455945N742776N831985
37925B3928517K826283j512013n157279n823214k998226J77621K41950j805078
37917I878561k369276j146654r53619j988185j155537K109492M216386L255790
37909A1846958J915364K346184K484581M73983j216671J06411K297455J678805
$$ plain form
37901 21933070 21092524 19641519 19747288 20095938 18099640 13980354 10232510 8247988
37893 8247988 7793212 9025747 12569028 17466266 20923153 20777709 17525311 13828549
37885 13828549 12520044 14625037 18450344 20871253 20314570 18224613 16992192 17134430
37877 17134430 17548468 17792468 18444989 19392487 19571341 18784557 18119029 17834972 16422294
37868 16422294 13013108 9555040 8936296 11434916 14570764 16370381 17257492 18355915
37860 18355915 19325741 18905970 16909686 14511565 12524692 10368519 7466604 5272047
37852 5272047 6647555 12405614 19199902 22345875 20802778 17835013 16384453 15862610
37844 15862610 14814025 14412966 16397661 18814214 17596129 12645517 8812399 9633656
$$ packed form
37901B1933070q40546j451005J05769L48650j996298m119286l747844j984522
37893H247988m54776J232535L543281M897238L456887j45444l252398l696762
37885A3828549j308505K104993L825307K420909n56683k089957j232421J42238
37877A7134430M14038K44000O52521R47498J78854p86784o65528k84057j412678
37868A6422294l409186l458068o18744K498620L135848J799617Q87111J098423
37860A8355915R69826m19771j996284k398121j986873k156173k901915k194557
37852E272047J375508N758059O794288L145973j543097k967765j450560n21843
37844A5862610j048585m01059J984695K416553j218085m950612l833118Q21257
$$ plain form
37836 9633656 13178036 15666436 16110414 15159558 12536889 9001208 8302431 12831423 18715981
37827 18715981 19902730 16697082 15433434 19173282 23738925 24713824 23599824 23946641
37819 23946641 25280536 24919581 23169758 22365187 22244190 20517471 17395585 15603184
37811 15603184 15962795 16631900 16944951 18270926 20299669 20308657 17752707 16060380 17403675
37802 17403675 18614753 15540143 9589291 6511945 9429241 16010965 22068403 25036074
37794 25036074 24071747 19900563 15366563 13526165 14050229 13634525 11016165 9252192
37786 9252192 11401808 16077220 19515734 20495154 20597187 20524548 18987824 15293202 10786685
37777 10786685 7409348 6445107 8456358 12326817 14415360 11297416 4200097 -1428018
$$ packed form
37836I633656L544380K488400M43978r50856k622669l535681o98777M528992N884558
37827A8715981J186749l205648j263648L739848M565643R74899j114000L46817
37819B3946641J333895l60955j749823q04571j20997j726719l121886j792401
37811A5603184L59611O69105L13051J325975K028743Q988k555950j692327J343295
37802A7403675J211078l074610n950852l077346K917296O581724O057438K967671
37794B5036074r64327m171184m534000j840398N24064m15704k618360j763973
37786I252192K149616M675412L438514R79420J02033p2639j536724l694622m506517
37777A0786685l377337r64241K011251L870459K088543l117944p097319n628115
$$ plain form
37769 -1428018 -1745440 1902479 5867178 8276658 9055861 8418567 7357281 7705845 9608933
37760 9608933 10571457 9048035 7176520 7617164 9574551 10813172 11746263 13835080 15282070
37751 15282070 12748791 7077965 2859751 1850275 1224336 -611180 -1126821 1272229
37743 1272229 3626062 3127930 2101346 4417507 9194424 12056661 11445898 9905591
37735 9905591 9485730 9248107 7716964 5272038 3452028 3405389 5142728 7137029 7172493
37726 7172493 5022217 3555611 5429640 9346605 11553247 10481611 7757149 5099302
37718 5099302 2785876 1180506 1001435 1314484 -245636 -3931403 -6568440 -5475278
37710 -5475278 -2258741 -741469 -1832544 -2522229 -176340 3900113 6223198 5490437
$$ packed form
37769a428018l17422L647919L964699K409480P79203o37294j061286L48564J903088
37760I608933R62524j523422j871515M40644J957387J238621R33091K088817J446990
37751A5282070k533279n670826m218214j009476o25939j835516n15641K399050
37743A272229K353833m98132j026584K316161M776917K862237o10763j540307
37735I905591m19861k37623j531143k444926j820010m6639J737339J994301L5464
37726G172493k150276j466606J874029L916965K206642j071636k724462k657847
37718E099302k313426j605370j79071L13049j560120l685767k637037J093162
37710e475278L216537J517272j091075o89685K345889M076453K323085p32761
$$ plain form
37702 5490437 3684520 2884889 2640125 1472444 -368502 -1446738 -1695172 -2180145 -2382661
37693 -2382661 -174605 4865483 10360381 14157133 16144822 16255261 13652974 9586193
37685 9586193 7858692 9738475 11148959 8254091 3402662 1500129 2432573 1931757
37677 1931757 -972298 -2566155 -782073 1990876 3541760 4833996 6641065 7168159
37669 7168159 5373087 3529357 4020807 5870624 6461200 4733105 1238558 -2728070
37661 -2728070 -4757792 -2775915 1501234 3320345 1016054 -1427898 -153002 3217412
37653 3217412 4903179 4875735 5691800 7340001 7386598 5509447 4159640 4742124 6155156
37644 6155156 7177326 7646351 7186815 5252313 2708021 1323256 1585547 2807277 5016105
$$ packed form
37702E490437j805917p99631k44764j167681j840946j078236k48434m84973k02516
37693b382661K208056N040088N494898L796752J987689J10439k602287m066781
37685I586193j727501J879783J410484k894868m851429j902533R32444n00816
37677A931757k904055j593857J784082K772949J550884J292236J807069N27094
37669G168159j795072j843730M91450J849817N90576j728095l494547l966628
37661b728070k029722J981877M277149J819111k304291k443952J274896L370414
37653C217412J685767k7444Q16065J648201M6597j877151j349807N82484J413032
37644F155156J022170M69025m59536j934502k544292j384765K62291J221730K208828
$$ plain form
37635 5016105 8467516 11510145 11656663 9340185 8243230 10876873 15520608 18420904
37627 18420904 17646461 14102389 10141822 8050630 8788889 11171393 12664507 11498046
37619 11498046 7902048 3568985 508633 5186 1627628 3278003 3080991 1289615
37611 1289615 -186801 170012 2466438 5836971 9097733 11407566 12878721 13916285
37603 13916285 13708228 10881713 6436632 3974880 5258695 7393937 6767677 4113568
37595 4113568 2683908 2729993 1633235 -743296 -868199 3310950 9304344 13548661 15247709
37586 15247709 15285971 13836183 11074692 8582545 7983093 8890728 9414815 8170075 5409726
37577 5409726 3140542 4136843 9268518 15651277 19270487 19590159 19367255 19771492 18773913
$$ packed form
37635E016105L451411L042629J46518k316478j096955K633643M643735K900296
37627A8420904p74443l544072l960567k091192P38259K382504J493114j166461
37619A1498046l595998m333063l060352n03447J622442J650375j97012j791376
37611A289615j476416L56813K296426L370533L260762K309833J471155J037564
37603A3916285k08057k826515m445081k461752J283815K135242o26260k654109
37595D113568j429660M6085j096758k376531j24903M179149N993394M244317J699048
37586A5247709L8262j449788k761491k492147n99452R07635N24087j244740k760349
37577E409726k269184R96301N131675O382759L619210L19672k22904M04237r97579
$$ plain form
37568 18773913 15440506 12564277 12864307 15119449 16467505 16274067 15052760 11770078
37560 11770078 5823119 489918 489482 5874499 11376203 12470121 9828082 7233104 7190547
37551 7190547 9361672 11598781 11600604 8729367 4965320 3341983 5085598 8808277 12229458
37542 12229458 13781430 13026466 10981607 9934654 11458028 14504612 16724254 17392360
37534 17392360 17294863 15992231 11888946 5895263 2359812 4307504 9480902 13416860
37526 13416860 15191035 17342719 20737501 22999816 23002072 23704019 27998870 33652047 35646500
37517 35646500 33171918 31042024 33259424 37923095 40403405 39527162 37973484 37604393
37509 37604393 37532786 37163882 38397125 43271995 50918672 58383808 63832488 67861199
$$ packed form
37568A8773913l333407k876229L00030K255142J348056j93438j221307l282682
37560A1770078n946959n333201m36N385017N501704J093918k642039k594978m2557
37551G190547K171125K237109J823k871237l764047j623337J743615L722679L421181
37542A2229458J551972p54964k044859j046953J523374L046584K219642O68106
37534A7392360r7497j302632m103285n993683l535451J947692N173398L935958
37526A3416860J774175K151684L394782K262315K256P01947M294851N653177J994453
37517C5646500k474582k129894K217400M663671K480310q76243j553678l69091
37509C7604393p1607l68904J233243M874870P646677P465136N448680M028711
$$ plain form
37501 67861199 72098559 77439039 83567028 89728854 95926864 103191457 112284543 122571157
37493 122571157 133172335 144997887 160332752 180425886 204908744 233474104 265977079
37486 265977079 300335199 332797572 361747482 388948683 414705812 433514162 437692436
37479 437692436 425205719 401568960 374059681 346344631 319017301 292655237 268488283
37472 268488283 247219907 228875389 213585221 201433976 191580004 182591557 174297003
37465 174297003 168761837 168321585 172408932 177556416 181553689 186455583 195590119 208259768
37457 208259768 220007568 228227453 234407255 239634462 241057098 235319567 223268921 208379215
37449 208379215 192151265 174200587 155769098 139656050 126766892 115599935 105131310
$$ packed form
37501F7861199M237360N340480O127989O161826O198010P264593R093086J0286614
37493A22571157J0601178J1825552J5334865K0093134K4482858K8565360L2502975
37486B65977079L4358120L2462373K8949910K7201201K5757129J8808350M178274
37479D37692436j2486717k3636759k7509279k7715050k7327330k6362064k4166954
37472B68488283k1268376j8344518j5290168j2151245r853972q988447q294554
37465A74297003n535166m40252M087347N147484L997273M901894R134536J2669649
37457B08259768J1747800Q219885O179802N227207J422636n737531j2050646j4889706
37449B08379215j6227950j7950678j8431489j6113048j2889158j1166957j0468625
$$ plain form
37442 105131310 95543606 86255415 76276337 66832720 60599280 57616810 54902357 51045231
37434 51045231 48128865 47604025 47290346 44840212 41818465 41425610 43489748 44578824
37426 44578824 42686557 39426513 37380130 37021495 36829656 35512989 33622161 33070839
37418 33070839 34876491 37412072 37644348 34357101 29364325 25302098 23148515 22128090
37410 22128090 20860034 18186961 14134084 10592635 9783574 11483620 13123589 13130464 12446389
37401 12446389 12010017 10941540 8829528 7865542 10402982 15555979 20478395 24199889
37393 24199889 27820910 31248513 32209975 29129755 23501428 18883515 18334214 22578380
37385 22578380 29434888 35075434 37110856 36742834 37201716 40241494 44878007 48985302
$$ packed form
37442A05131310r587704r288191r979078r443617o233440k982470k714453l857126
37434E1045231k916366n24840l13679k450134l021747l92855K064138J089076
37426D4578824j892267l260044k046383l58635j91839j316667j890828n51322
37418C3070839J805652K535581K32276l287247m992776m062227k153583j020425
37410B2128090j268056k673073m052877l541449q09061J700046J639969O875o84075
37401A2446389m36372j068477k112012r63986K537440N152997M922416L721494
37393B4199889L621021L427603R61462l080220n628327m617913n49301M244166
37385B2578380O856508N640546K035422l68022M58882L039778M636513M107295
$$ plain form
37377 48985302 50916819 49958845 46668305 42793913 39626782 36442992 31905744 27088653
37369 27088653 25449676 28883244 34832572 38594021 38392314 37210776 39025669 43708290
37361 43708290 46933620 45735316 42664621 42402230 45039670 45915088 42713936 39068599
37353 39068599 38778022 39689955 37244921 32161210 29774730 31910857 34127348 32326594
37345 32326594 28036982 24794415 22561040 19093937 15051326 14084056 17865457 23709268
37337 23709268 27880346 29523201 30222311 30704238 29578552 25757235 21047291 18864417
37329 18864417 20200906 22320622 22330952 20720019 19978812 21012767 22958715 25551084
37321 25551084 28927452 31332592 30015387 25071877 19848776 16669970 14572056 12231823
$$ packed form
37377D8985302J931517r57974l290540l874392l167131l183790m537248m817091
37369B7088653j638977L433568N949328L761449k01707j181538J814893M682621
37361D3708290L225330j198304l070695k62391K637440Q75418l201152l645337
37353C9068599k90577R11933k445034n083711k386480K136127K216491j800754
37345C2326594m289612l242567k233375l467103m042611r67270L781401N843811
37337B3709268M171078J642855O99110M81927j125686l821317m709944k182874
37329A8864417J336489K119716J0330j610933p41207J033955J945948K592369
37321B5551084L376368K405140j317205m943510n223101l178806k097914k340233
$$ plain form
37313 12231823 10484038 10308463 10585484 9771384 8060560 6265475 4467537 3480369 5398156
37304 5398156 10342163 14681321 15212599 13332825 12081222 10901936 7244004 2143489
37296 2143489 -453643 52881 44592 -1864141 -2084123 1913607 6696890 7346581 4181249
37287 4181249 1396596 698627 156223 -1193890 -1461366 553146 2860525 2928950 1113242
37278 1113242 -117184 568170 2277407 3716926 4915928 6825448 9695554 12315766
37270 12315766 13119110 12078384 11133854 12241205 15030985 16912175 15712529 11921430
37262 11921430 8132895 6561051 7388792 9248244 10593531 10319555 7758603 3175314
37254 3175314 -1560310 -3819361 -2618613 136583 1502420 408218 -1780252 -3150031
$$ packed form
37313A2231823j747785j75575K77021q14100j710824j795085j797938r87168J917787
37304E398156M944007M339158N31278j879774j251603j179286l657932n100515
37296B143489k597132N06524q289j908733k19982L997730M783283O49691l165332
37287D181249k784653o97969n42404j350113k67476K014512K307379O8425j815708
37278A113242j230426O85354J709237J439519J199002J909520K870106K620212
37270A2315766Q03344j040726r44530J107351K789780J881190j199646l791099
37262A1921430l788535j571844Q27741J859452J345287k73976k560952m583289
37254C175314m735624k259051J200748K755196J365837j094202k188470j369779
$$ plain form
37246 -3150031 -2875850 -1403127 -175058 -968462 -4006452 -6507251 -4776966 1372322
37238 1372322 7632776 9781062 8175316 6378051 6337457 6840124 6371412 5367048 4973794
37229 4973794 5047513 4411058 2501696 144059 -1043284 -20434 2237301 2824630 -352612
37220 -352612 -5573887 -8317347 -6135103 -1598201 564284 -1529791 -5834971 -9472478
37212 -9472478 -11227044 -11095168 -9227329 -6284406 -3788795 -2834750 -2599119 -1100859 2228204
37203 2228204 5330088 5596009 3151688 1202538 2295950 4729150 4109195 -1185135
37195 -1185135 -7583807 -10382498 -8949096 -6337124 -4757043 -3714737 -2392809 -1301489
37187 -1301489 -840891 -403028 12400 -702311 -2267684 -2091650 1070733 4266264 3950602
$$ packed form
37246c150031K74181J472723J228069p93404l037990k500799J730285O149288
37238A372322O260454K148286j605746j797265m0594N02667m68712j004364l93254
37229D973794P3719o36455j909362k357637j187343J022850K257735N87329l177242
37220c52612n221275k743460K182244M536902K162485k094075m305180l637507
37212i472478j754566J31876J867839K942923K495611R54045K35631J498260L329063
37203B228204L101884K65921k444321j949150J093412K433200o19955n294330
37195a185135o398672k798691J433402K611972J580081J042306J321928J091320
37187a301489M60598M37863M15428p14711j565373J76034L162383L195531l15662
$$ plain form
37178 3950602 1468504 1737762 6438907 11568175 12598429 9466433 5206026 2009805
37170 2009805 467055 856809 2857059 4761912 4926231 3645263 2195673 601414
37162 601414 -1993852 -5069659 -6687577 -6000760 -4357866 -3390627 -3163700 -2939009 -2911750
37153 -2911750 -4146576 -6870932 -9568358 -10250614 -8602740 -6445375 -5735851 -6481855 -7247467
37144 -7247467 -7262352 -6807159 -5689213 -3174364 -14721 1455851 649355 364207 2998518
37135 2998518 6450212 6527933 2978740 187573 1372463 4625634 5841911 3621884
37127 3621884 -78572 -2707337 -3111163 -1786609 -453260 -806528 -2783767 -4571018
37119 -4571018 -4870419 -4374487 -4434855 -5223978 -5919924 -5740712 -4008070 -247198 4711452
$$ packed form
37178C950602k482098K69258M701145N129268J030254l131996m260407l196221
37170B009805j542750L89754K000250J904853J64319j280968j449590j594259
37162F01414k595266l075807j617918O86817J642894R67239K26927K24691K7259
37153b911750j234826k724356k697426o82256J647874K157365P09524p46004p65612
37144g247467j4885M55193J117946K514849L159643J470572q06496k85148K634311
37135B998518L451694P7721l549193k791167J184890L253171J216277k220027
37127C621884l700456k628765m03826J324554J333349l53268j977239j787251
37119d571018k99401M95932o0368p89123o95946J79212J732642L760872M958650
$$ plain form
37110 4711452 8617373 9973287 9690942 9526281 9536480 8236004 4698858 -644707 -6729277
37101 -6729277 -12148038 -15335831 -15978090 -15960636 -17411672 -19836553 -20552273 -17926159 -12818768
37092 -12818768 -6963950 -1726246 1291270 606665 -2849450 -5350874 -4104788 -739765
37084 -739765 546503 -1837640 -5004186 -5140196 -1748769 2249616 3833829 2566422
37076 2566422 496065 265913 3145262 7973449 11740906 11936938 8877473 5346763
37068 5346763 3626211 3497219 3632791 3938994 5227781 7142151 8072105 7182685 5064823
37059 5064823 2312879 -819980 -3046842 -2436919 742467 3371910 3104127 1230466
37051 1230466 547097 1819030 3894790 5695179 6038806 3037121 -3604795 -10503185
$$ packed form
37110D711452L905921J355914k82345j64661J0199j300476l537146n343565o084570
37101f729277n418761l187793o42259J7454j451036k424881p15720K626114N107391
37092a2818768N854818N237704L017516o84605l456115k501424J246086L365023
37084g39765J286268k384143l166546j36010L391427L998385J584213j267407
37076B566422k070357k30152K879349M828187L767457J96032l059465l530710
37068E346763j720552j28992J35572L06203J288787J914370R29954q89420k117862
37059E064823k751944l132859k226862O09923L179386K629443k67783j873661
37051A230466o83369J271933K075760J800389L43627l001685o641916o898390
$$ plain form
37043 -10503185 -13492953 -12170428 -9165634 -5767458 -1491149 2392311 2828536 -569490
37035 -569490 -4350042 -5827389 -5954127 -6231694 -5825402 -3809209 -1629078 -838605 -386267
37026 -386267 1358189 3463590 3732773 1932155 -352034 -1896937 -2049327 -273748 2396502
37017 2396502 3005591 185526 -3320708 -4064524 -2342280 -526974 1361658 4762841
37009 4762841 8261661 8376511 4836276 1320780 266880 251880 -687500 -2394560 -4300792
37000 -4300792 -6672606 -8804583 -8819662 -6741606 -5119140 -5164415 -5051709 -3689791 -3153017
36991 -3153017 -5010138 -6962972 -6052327 -3137245 -1235565 -1171247 -1917691 -3607676 -6580381
36982 -6580381 -8418476 -5915085 -162971 3789095 3139333 348781 -976330 -625151
$$ packed form
37043a0503185k989768J322525L004794L398176M276309L883460M36225l398026
37035e69490l780552j477347j26738k77567M06292K016193K180131P90473M52338
37026c86267J744456K105401K69183j800618k284189j544903j52390J775579K670250
37017B396502O09089k820065l506234p43816J722244J815306J888632L401183
37009D762841L498820J14850l540235l515496j053900j5000r39380j707060j906232
37000d300792k371814k131977j5079K078056J622466m5275J12706J361918N36774
36991c153017j857121j952834R10645K915082J901680O4318p46444j689985k972705
36982f580381j838095K503391N752114L952066o49762k790552j325111L51179
$$ plain form
36974 -625151 -834541 -2823852 -5907982 -8860889 -10759330 -11061913 -9778789 -7431863 -4849694
36965 -4849694 -3405520 -4611418 -7874531 -9164929 -4388416 5269567 13512548 15544158
36957 15544158 12702353 9354870 7374010 5917841 5021778 6061841 8569539 9567899
36949 9567899 7452366 4655904 4681349 7398436 9038544 6717431 1564711 -2835292
36941 -2835292 -3941050 -1827933 1500553 3465315 2454346 -721881 -3183542 -2812787
36933 -2812787 -550365 1003453 741262 -589604 -2636512 -5762607 -8795040 -9119854
36925 -9119854 -6587280 -5107998 -7903126 -12502426 -13295097 -8657416 -2826691 -425044
36917 -425044 -1661093 -3862049 -5497612 -6948378 -8534569 -9623205 -9481018 -7853651
$$ packed form
36974f25151k09390j989311l084130k952907j898441l02583J283124K346926K582169
36965d849694J444174j205898l263113j290398M776513R657983Q242981K031610
36957A5544158k841805l347483j980860j456169q96063J040063K507698R98360
36949I567899k115533k796462K5445K717087J640108k321113n152720m400003
36941b835292j105758K113117L328486J964762j010969l176227k461661L70755
36933b812787K262422J553818k62191j330866k046908l126095l032433l24814
36925i119854K532574J479282k795128m599300p92671M637681N830725K401647
36917d25044j236049k200956j635563j450766j586191j088636J42187J627367
$$ plain form
36909 -7853651 -4703536 -232271 4558947 7836141 8138906 6037569 4278314 5300988
36901 5300988 8275563 9672218 7574289 4280392 3212292 4216687 4083497 1500682
36893 1500682 -943797 -470207 2212589 4376644 5127654 6021547 8159053 10208147 9924380
36884 9924380 6983128 3412661 962852 -1162376 -4787672 -9225416 -11141974 -8852503
36876 -8852503 -5020169 -3475285 -4693129 -6297282 -6757805 -6190204 -4477097 -1509885
36868 -1509885 1003473 791217 -1906143 -5041179 -8149796 -11909392 -14657779 -13449281
36860 -13449281 -9201833 -6477089 -6734784 -6255942 -2966985 -613263 -2495496 -5167696
36852 -5167696 -3317940 1796642 4195946 2135129 -76586 840278 2959032 3014599 795740
$$ packed form
36909g853651L150115M471265M791218L277194L02765k101337j759255J022674
36901E300988K974575J396655k097929l293897j068100J004395j33190k582815
36893A500682k444479M73590K682796K164055P51010Q93893K137506K049094k83767
36884I924380k941252l570467k449809k125228l625296m437744j916558K289471
36876h852503L832334J544884j217844j604153m60523N67601J713107K967212
36868a509885K513358k12256k697360l135036l108617l759596k748387J208498
36860a3449281M247448K724744k57695M78842L288957K353722j882233k672200
36852e167696J849756N114582K399304k060817k211715R16864K118754N5567k218859
$$ plain form
36843 795740 -1613943 -2404880 -897609 2141506 4437953 4080209 1560361 -1376216 -4050653
36834 -4050653 -6069955 -5571553 -1324756 4126320 6759807 6186716 5021576 3491219
36826 3491219 -953373 -7808889 -11778319 -9202605 -3051596 1017250 1254192 132891
36818 132891 -39673 628168 832317 -225467 -1934920 -2424443 -503793 2359858 3441889
36809 3441889 2205051 534465 -396115 -1103411 -1560206 -913892 28283 -789690 -2851202
36800 -2851202 -3046464 -839178 146612 -2266363 -5139374 -4998696 -2820911 -1313840 -248766
36791 -248766 1706468 2927686 910639 -2993331 -4990680 -4214940 -3014404 -2511505 -1585403
36782 -1585403 -128815 244802 -797259 -1523522 -953633 -146757 -261337 -1217502 -2359939
$$ packed form
36843G95740k409683p90937J507271L039115K296447l57744k519848k936577k674437
36834d050653k019302M98402M246797N451076K633487n73091j165140j530357
36826C491219m444592o855516l969430K575714O151009M068846K36942j121301
36818A32891j72564O67841K04149j057784j709453m89523J920650K863651J082031
36809C441889j236838j670586r30580p07296m56795O46314R42175q17973k061512
36800b851202j95262K207286R85790k412975k873011J40678K177785J507071J065074
36791b48766J955234J221218k017047l903970j997349P75740J200536N02899R26102
36782a585403J456588L73617j042061p26263N69889Q06876j14580r56165j142437
$$ plain form
36773 -2359939 -2768357 -1306636 1792772 4025715 3337432 1016296 -261310 -265091 -572193
36764 -572193 -1227131 -1170314 -1239948 -3341835 -6963633 -9828972 -11644156 -13620076 -14686636
36755 -14686636 -12497274 -8413983 -6756084 -8000189 -7542276 -3225789 572239 -565781
36747 -565781 -4475469 -6067097 -4650513 -3536563 -4287864 -5444899 -6060220 -6892806 -8258001
36738 -8258001 -9496323 -10555518 -11866201 -12787025 -12216783 -10692250 -10053054 -10926747 -11988918
36729 -11988918 -11802388 -10316062 -8605779 -7931848 -8813614 -10503187 -11866309 -12983429
36721 -12983429 -14746814 -16561692 -16200505 -12856161 -8550494 -5265580 -2557301 320749
36713 320749 1857550 269201 -3169524 -5237498 -4609905 -2631217 -994813 -591720 -1830338
$$ packed form
36773b359939m08418J461721L099408K232943o88283k321136j277606l781l07102
36764e72193o54938N6817o9634k101887l621798k865339j815184j975920j066560
36755a4686636K189362M083291J657899j244105M57913M316487L798028j138020
36747e65781l909688j591628J416584J113950p51301j157035o15321q32586j365195
36738h258001j238322j059195j310683r20824N70242J524533O39196q73693j062171
36729a1988918J86530J486326J710283O73931q81766j689573j363122j117120
36721a2983429j763385j814878L61187L344344M305667L284914K708279K878050
36713C20749J536801j588349l438725k067974O27593J978688J636404M03093j238618
$$ plain form
36704 -1830338 -3948616 -4700570 -2960844 -1015075 -1813711 -4383597 -4707300 -1227774 3285257
36695 3285257 5919891 6989619 7999339 8501392 6921911 3474126 557522 369451
36687 369451 2895275 6134570 7896326 7424456 5407884 2686627 -319955 -2794506
36679 -2794506 -3427165 -2051765 -309800 409844 561097 666810 -591187 -4328638 -8428234
36670 -8428234 -9133563 -5567470 -509569 3225556 5045707 5381181 4756963 4444952 5659346
36661 5659346 7380612 7041440 4096430 958343 -286845 -66577 493442 1339348 2368702
36652 2368702 2707842 2477962 3265012 5267729 5972447 3652326 464365 -296347 1254562
36643 1254562 2408610 2472577 3624747 6880185 9781026 9350966 5823433 2085764 197141
$$ packed form
36704a830338k118278p51954J739726J945769p98636k569886l23703L479526M513031
36695C285257K634634J069728J009720N02053j579481l447785k916604j88071
36687C69451K525824L239295J761756m71870k016572k721257l006582k474551
36679b794506o32659J375400J741965P19644J51253J05713j257997l737451m099596
36670h428234p05329L566093N057901L735125J820151L35474o24218l12011J214394
36661E659346J721266l39172k945010l138087j245188K20268N60019Q45906J029354
36652B368702L39140k29880P87050K002717P04718k320121l187961p60712J550909
36643A254562J154048O3967J152170L255438K900841m30060l527533l737669j888623
$$ plain form
36634 197141 -282416 -722619 -1435767 -1863313 -2008928 -2469202 -2919015 -1908748 856092
36625 856092 3016134 1799518 -2665797 -7627580 -10835871 -11893952 -11151535 -9452341
36617 -9452341 -8714685 -10092494 -11254208 -8426257 -2094584 2350029 1265111 -2878513
36609 -2878513 -5926618 -7760681 -10298870 -12337546 -10935484 -7021742 -5032209 -6518239
36601 -6518239 -8104964 -6931870 -4515570 -3347002 -2759890 -903357 1213791 756770
36593 756770 -2520431 -5512745 -5642661 -3734050 -2626986 -4193917 -8110924 -12478917
36585 -12478917 -15029712 -14527279 -11884048 -9646106 -9571849 -10636656 -10116985 -6891532 -2864112
36576 -2864112 -476672 284295 1000834 1472742 -521055 -5418542 -9934167 -10656666 -8283268
$$ packed form
36634A97141m79557m40203p13148m27546j45615m60274m49813J010267K764840
36625H56092K160042j216616m465315m961783l208291j058081P42417J699194
36617i452341P37656j377809j161714K827951O331673M444613j084918m143624
36609b878513l048105j834063k538189k038676J402062L913742J989533j486030
36601f518239j586725J173094K416300J168568N87112J856533K117148m57021
36593G56770l277201k992314j29916J908611J107064j566931l917007m367993
36585a2478917k550795N02433K643231K237942P4257j064807N19671L225453M027420
36576b864112K387440P60967P16539M71908j993797m897487m515625p22499K373398
$$ plain form
36567 -8283268 -6251619 -5933671 -5497229 -3503767 -1366761 -1455191 -4324482 -8651343 -12675047
36558 -12675047 -14926063 -14710196 -12893754 -11416408 -11131080 -10797820 -8997368 -6220056
36550 -6220056 -3986359 -2602291 -1237251 41607 -540 -1574271 -2898736 -2425359 -917525
36541 -917525 59163 881319 3063540 5734577 5353541 247107 -6406936 -10069101 -10075998
36532 -10075998 -9189367 -8948628 -8437183 -7459697 -7559890 -9013995 -10002628 -10250687 -12242020
36523 -12242020 -16415659 -18236709 -13728964 -5976314 -1966182 -3776377 -6967069 -7596621
36515 -7596621 -6625344 -6501274 -7379930 -8664901 -11099583 -14756936 -17094429 -15667468 -11650411
36506 -11650411 -8501598 -7806056 -8138196 -7499399 -5355522 -2472426 97216 1712338
$$ packed form
36567h283268K031649L17948M36442J993462K137006q8430k869291m326861m023704
36558a2675047k251016K15867J816442J477346K85328L33260J800452K777312
36550f220056K233697J384068J365040J278858m2147j573731j324465M73377J507834
36541i17525R76688Q22156K182221K671037l81036n106434o654043l662165o897
36532a0075998Q86631K40739N11445R77486j00193j454105r88633k48059j991333
36523a2242020m173639j821050M507745P752650M010132j810195l190692o29552
36515g596621R71277J24070q78656j284971k434682l657353k337493J426961M017057
36506a1650411L148813O95542l32140O38797K143877K883096K569642J615122
$$ plain form
36498 1712338 2206270 1292517 -1477668 -5174020 -6734832 -4013442 447432 1446047 -2214903
36489 -2214903 -5858714 -5213184 -1775228 366370 503820 890514 2060651 2307349 1363438
36480 1363438 1187521 2725679 4578305 5349082 5026108 3715096 1422596 -336435 775574
36471 775574 4485544 7274040 6604915 4120040 3085023 4033744 4724323 3548331 1123822
36462 1123822 -1236867 -2926501 -3589726 -2678287 -432287 1328327 604978 -2311823 -4677785
36453 -4677785 -4400631 -2738372 -2694555 -4977559 -7217874 -7508651 -6797937 -6807384 -7573343
36444 -7573343 -8677841 -10946046 -14405805 -16007451 -12579802 -5631310 -154820 1415511
36436 1415511 1196417 1684413 2808710 3886822 5263463 6502359 5703112 2359041 -1433571
$$ packed form
36498A712338M93932r13753k770185l696352j560812K721390M460874R98615l660950
36489b214903l643811O45530L437956K141598J37450L86694J170137K46698r43911
36480A363438j75917J538158J852626P70777l22974j311012k292500j759031J112009
36471G75574L709970K788496o69125k484875j035017R48721O90579j175992k424509
36462A123822k360689j689634o63225R11439K246000J760614p23349k916801k365962
36453d677785K77154J662259M3817k283004k240315k90777P10714r447p65959
36444g573343j104498k268205l459759j601646L427649O948492N476490J570331
36436A415511k19094M87996J124297J078112J376641J238896p99247l344071l792612
$$ plain form
36427 -1433571 -4155963 -6708609 -9330677 -9613315 -6306574 -2711983 -3065364 -7141736
36419 -7141736 -11383440 -13708332 -13981743 -11478377 -6061557 -1092942 -768578 -4302024
36411 -4302024 -6584981 -5044604 -2078628 -142456 1369288 2951676 2839976 411087
36403 411087 -1554325 -578311 2215678 4747460 6949245 8445719 6523780 289438
36395 289438 -5565248 -5640765 -1168682 1894989 1277902 228815 1033734 1733401 684980
36386 684980 -58460 1621296 4238701 5356963 5287387 5305908 4354309 895100 -3080658
36377 -3080658 -3345378 1155114 6845893 10069422 11028374 12273576 14813196 17165166
36369 17165166 17902591 18046044 20330857 26021519 32872330 37079099 37613275 38018937 43338241
$$ packed form
36427a433571k722392k552646k622068k82638L306741L594591l53381m076372
36419g141736m241704k324892k73411K503366N416820M968615L24364l533446
36411d302024k282957J540377K965976J936172J511744J582388j11700k428889
36403D11087j965412R76014K793989K531782K201785J496474j921939o234342
36395B89438n854686p5517M472083L063671o17087j049087Q04919O99667j048421
36386F84980p43440J679756K617405J118262o9576J8521r51599l459209l975758
36377c080658k64720M500492N690779L223529R58952J245202K539620K351970
36369A7165166P37425J43453K284813N690662O850811M206769N34176M05662N319304
$$ plain form
36360 43338241 55492371 71844401 87551091 98679359 103665018 102988971 98024253 90098809
36352 90098809 80399842 70284301 61129939 53901749 49105961 46673412 45280073 42534962
36344 42534962 37119754 30380075 24572027 20195340 16738671 15033744 15891322 16703680
36336 16703680 13314941 6410355 2257882 4953616 11266261 15720594 17337370 17893725
36328 17893725 16917263 13334213 9897695 10448689 13618592 14523492 12380571 11016459
36320 11016459 11638104 11050857 8355730 7347167 9617031 10888405 7948562 4357156
36312 4357156 4699072 7230078 7515305 6231789 7343521 10257422 10047624 5433191 968213
36303 968213 271813 1741885 2558806 2935091 4188373 5613451 5728151 4742122 3713677
$$ packed form
36360D3338241J2154130J6352030J5706690J1128268M985659o76047m964718p925444
36352I0098809r698967j0115541r154362p228190m795788k432549j393339k745111
36344D2534962n415208o739679n808048m376687l456669j704927Q57578Q12358
36336A6703680l388739o904586m152473K695734O312645M454333J616776N56355
36328A7893725r76462l583050l436518N50994L169903R04900k142921j364112
36320A1016459O21645n87247k695127j008563K269864J271374k939843l591406
36312D357156L41916K531006K85227j283516J111732K913901k09798m614433m464978
36303I68213o96400J470072Q16921L76285J253282J425078J14700r86029j028445
$$ plain form
36294 3713677 2527589 462782 -1994030 -3297760 -2588740 -638936 755510 228136
36286 228136 -1931771 -4096316 -5076087 -4968352 -3955957 -1657305 1346632 2985575 2389987
36277 2389987 1604260 2587618 4114292 4237577 4162701 6199213 9117007 9788039 8945055
36268 8945055 10479657 14436688 15685843 11344414 5044156 1385194 269600 -217073
36260 -217073 813769 4677291 8889468 9787520 7858673 6443255 6187823 4723626 1394724
36251 1394724 -1444649 -2071022 -1298663 -535064 -597859 -2471182 -6379456 -9814082 -9342780
36242 -9342780 -5121438 -1124812 -122068 -834439 -1012570 -860330 -1853986 -4043370 -6196773
36233 -6196773 -7317864 -6663487 -3607803 933030 4017770 3409059 339318 -1864104
$$ packed form
36294C713677j186088k064807k456812j303730P09020J949804J394446n27374
36286B28136k159907k164545r79771J07735J012395K298652L003937J638943n95588
36277B389987p85727R83358J526674J23285p4876K036512K917794O71032q42984
36268H945055J534602L957031J249155m341429o300258l658962j115594m86673
36260b17073J030842L863522M212177Q98052j928847j415418k55432j464197l328902
36251A394724k839373o26373P72359P63599o2795j873323l908274l434626M71302
36242i342780M221342L996626J002744p12371j78131J52240r93656k189384k153403
36233f196773j121091O54377L055684M540833L084740o08711l069741k203422
$$ plain form
36225 -1864104 -1567369 10851 954270 310438 -2340038 -6948712 -11650481 -12997834 -9472159
36216 -9472159 -4162747 -1834140 -3154004 -4080243 -1908051 623540 -385732 -3620285
36208 -3620285 -4181472 -1061184 1187491 -779165 -4526162 -6050997 -5163037 -3892057
36200 -3892057 -2472720 -439066 519219 -1170531 -3264988 -2451932 102926 385352 -1679664
36191 -1679664 -2028343 312164 1004151 -2494447 -6298800 -5909830 -3034539 -2534912 -4921149
36182 -4921149 -6199905 -4188338 -999641 822858 1433460 2305073 4025179 6139819
36174 6139819 7601360 7085670 4324035 1215130 111157 914936 1435498 738459 341891
36165 341891 1545551 3356290 4203266 4387149 5296617 6808650 7070900 5107993 2507050
$$ packed form
36225a864104K96735J578220R43419o43832k650476m608674m701769j347353L525675
36216i472159N309412K328607j319864r26239K172192K531591j009272l234553
36208c620285n61187L120288K248675j966656l746997j524835Q87960J270980
36200c892057J419337K033654R58285j689750k094457Q13056K554858K82426k065016
36191a679664l48679K340507O91987l498598l804353L88970K875291M99627k386237
36182d921149j278756K011567L188697J822499O10602Q71613J720106K114640
36174F139819J461541n15690k761635l108905j103973Q03779N20562o97039l96568
36165C41891J203660J810739Q46976J83883R09468J512033K62250j962907k600943
$$ plain form
36156 2507050 1711062 2978435 3836452 1873441 -2318068 -5528615 -5281956 -2372255 102254
36147 102254 -120470 -2565789 -5002781 -5852648 -5364021 -4497912 -3239069 -790990 2642755
36138 2642755 5494170 6905904 7992561 9772427 10841540 9043178 5110779 2496114
36130 2496114 3196041 5575188 6861144 6039784 3648796 657390 -1330433 -552229 2697673
36121 2697673 5620701 6097909 5151670 4908672 5471506 5513030 4789035 4030086 3070887
36112 3070887 1105943 -1545802 -3694541 -5046376 -6199310 -7269334 -8031178 -8858386
36104 -8858386 -9757338 -9027828 -5064043 614383 4277749 4120656 1529562 -1837907 -5815705
36095 -5815705 -9882997 -11989367 -10817566 -7727000 -4957516 -2927992 -611472 2247923
$$ packed form
36156B507050p95988J267373Q58017j963011m191509l210547K46659K909701K474509
36147A02254k22724k445319k436992q49867M88627Q66109J258843K448079L433745
36138B642755K851415J411734J086657J779866J069113j798362l932399k614665
36130B496114O99927K379147J285956q21360k390988k991406j987823P78204L249902
36121B697673K923028M77208r46239k42998N62834M1524p23995p58949r59199
36112C070887j964944k651745k148739j351835j152934j070024p61844q27208
36104h858386q98952P29510L963785N678426L663366j57093k591094l367469l977798
36095e815705m067292k106370J171801L090566K769484K029524K316520K859395
$$ plain form
36087 2247923 4639803 5678224 5525370 4988607 4630257 4182646 2909281 927201 -280187
36078 -280187 398021 1954261 2720450 3155043 5027115 7715502 8027797 4869626 1553878
36069 1553878 1397779 2928809 2020721 -2357748 -7161291 -9407156 -8591114 -5068237 1022493
36060 1022493 8071345 12343488 10825134 4223893 -3532822 -8204034 -7664700 -3025685
36052 -3025685 1838474 3248337 1456459 472079 2941569 6343900 6213348 2428625
36044 2428625 -436531 430756 2017721 -176494 -5555807 -8950345 -7273068 -3001544
36036 -3001544 -538116 -1381536 -4016610 -6722636 -8792110 -9971741 -10272003 -9958268 -8912795
36027 -8912795 -6796535 -4513486 -4030593 -5439185 -5868730 -3414492 -701563 -1726737
$$ packed form
36087B247923K391880J038421j52854n36763l58350m47611j273365j982080j207388
36078b80187O78208J556240P66189M34593J872072K688387L12295l158171l315748
36069A553878j56099J531030r08088m378469m803543k245865Q16042L522877O090730
36060A022493P048852M272143j518354o601241p756715m671212N39334M639015
36052c025685M864159J409863j791878r84380K469490L402331j30552l784723
36044B428625k865156Q67287J586965k194215n379313l394538J677277M271524
36036c001544K463428q43420k635074k706026k069474j179631l00262L13735J045473
36027h912795K116260K283049M82893j408592m29545K454238K712929j025174
$$ plain form
36019 -1726737 -6020262 -9205353 -9135522 -7900623 -7257727 -5991061 -3465264 -2139399 -3734187
36010 -3734187 -5611891 -4292064 -838757 623410 -1209770 -3673103 -4505453 -4340093
36002 -4340093 -4603642 -5515420 -6726213 -7882302 -8036294 -6295418 -3524179 -1785869 -1742745
35993 -1742745 -2199672 -2440944 -3167816 -4678989 -6097075 -7212234 -9171966 -12099876 -13703999
35984 -13703999 -11976460 -8306464 -6192781 -7179981 -9413722 -10234212 -9198699 -8199224
35976 -8199224 -9001993 -11074170 -12203880 -11348808 -10012234 -9872682 -9904741 -7734642 -3711335
35967 -3711335 -1263521 -2299874 -4366847 -4045959 -1628820 -293055 -1452479 -3218716
35959 -3218716 -3552391 -2998659 -3524131 -5757893 -8200746 -8739409 -6553221 -2839049 81989
$$ packed form
36019a726737m293525l185091O9831J234899O42896J266666K525797J325865j594788
36010c734187j877704J319827L453307J462167j833180k463333q32350J65360
36002d340093k63549r11778j210793j156089j53992J740876K771239J738310M3124
35993a742745m56927k41272p26872j511173j418086j115159j959732k927910j604123
35984a3703999J727539L669996K113683r87200k233741q20490J035513R99475
35976h199224q02769k072177j129710Q55072J336574J39552l2059K170099M023307
35967c711335K447814j036353k066973L20888K417139J335765j159424j766237
35959c218716l33675N53732n25472k233762k442853n38663K186188L714172K921038
$$ plain form
35950 81989 489257 -1763977 -5675750 -9831530 -12613414 -12711213 -10349575 -7538624 -6190687
35941 -6190687 -6185408 -6028885 -5117945 -4364724 -4542238 -4950644 -4219502 -2076080 109016
35932 109016 719773 -102864 -265147 1732701 4270371 4028507 422587 -2968745 -2679357
35923 -2679357 275055 2164196 1771540 1454141 3033891 5063863 5068988 2784009 93475
35914 93475 -1113873 -227501 1914326 3453515 3084103 1698336 1366518 2358811 2800768
35905 2800768 1904878 1416402 2365408 2466356 -757997 -5560765 -7639087 -5915337 -3795343
35896 -3795343 -4174687 -5726789 -5360241 -2563880 178543 440401 -1670921 -3606407 -2654883
35887 -2654883 1135034 4399814 4068768 1407564 624146 3223535 6139635 6526827 5935885
$$ packed form
35950H1989M07268k253234l911773m155780k781884r7799K361638K810951J347937
35941f190687N279J56523R10940P53221j77514m08406P31142K143422K185096
35932A09016O10757q22637j62283J997848K537670k41864l605920l391332K89388
35923b679357K954412J889141l92656l17399J579750K029972N125k284979k690534
35914I3475j207348Q86372K141827J539189l69412j385767l31818R92293M41957
35905B800768q95890m88476R49006J00948l224353m802768k078322J723750K119994
35896c795343l79344j552102L66548K796361K742423K61858k111322j935486R51524
35887b654883L789917L264780l31046k661204p83418K599389K916100L87192n90942
$$ plain form
35878 5935885 7698011 12040166 16330136 18997333 20557619 21343314 20832142 19156486
35870 19156486 16986021 13909037 9184800 4157152 1441939 1287924 1208963 -107024
35862 -107024 -1112758 -616734 128081 261466 1510581 4954822 7782627 6621765 2917953
35853 2917953 1406928 3400891 5070473 3184739 -490288 -2116432 -855204 974333
35845 974333 1439628 709105 -130906 -217180 997929 3341931 5378288 5381089 3327484
35836 3327484 1146523 407133 376144 -705939 -2647558 -2917963 89146 4481131 6966133
35827 6966133 7012620 7039469 8290499 8740957 6344190 2457762 -25651 -784745 -1907526
35818 -1907526 -4094487 -5511459 -4715539 -2582426 -684021 416682 497556 -870328 -2984689
$$ packed form
35878E935885J762126M342155M289970K667197J560286P85695n11172j675656
35870A9156486k170465l076984m724237n027648k715213j54015p8961j315987
35862a07024j005734M96024P44815J33385J249115L444241K827805j160862l703812
35853B917953j511025J993963J669582j885734l675027j626144J261228J829537
35845I74333M65295p30523q40011q6274J215109K344002K036357K801k053605
35836C327484k180961p39390l0989j082083j941619k70405L007109M391985K485002
35827F966133M6487K6849J251030M50458k396767l886428k483413p59094j122781
35818a907526k186961j416972P95920K133113J898405J100703Q0874j367884k114361
$$ plain form
35809 -2984689 -3557145 -1148960 2604912 4432498 2787438 -939388 -4118426 -5161516
35801 -5161516 -4544231 -4082168 -4841146 -5601518 -4116439 -149940 3641112 4361179 1738669
35792 1738669 -1924556 -3819328 -2503806 1011335 3503713 2063589 -2872232 -7899564
35784 -7899564 -10397261 -10592900 -9572972 -7297404 -3866241 -949660 -84881 -642753 -1080965
35775 -1080965 -1130068 -1187990 -860278 -38944 -174402 -2071909 -3318992 -643990 5429935
35766 5429935 10891728 13267699 13843941 14529187 14984167 13805305 10698969 6529221 2518411
35757 2518411 -99899 -918155 -1054242 -1677714 -2013302 -549774 2102303 3893112 4726310
35748 4726310 6342639 8619022 9332820 8455165 8948747 11503176 12227510 8456782 3590793
$$ packed form
35809b984689n72456K408185L753872J827586j645060l726826l179038j043090
35801e161516O17285M62063p58978p60372J485079L966499L791052P20067k622510
35792A738669l663225j894772J315522L515141K492378j440124m935821n027332
35784g899564k497697j95639J019928K275568L431163K916581Q64779n57872m38212
35775a080965m9103n7922L27712Q21334j35458j897507j247083K675002O073925
35766E429935N461793K375971N76242O85246M54980j178862l106336m169748m010810
35757B518411k618310q18256j36087o23472l35588J463528K652077J790809Q33198
35748D726310J616329K276383P13798q77655M93582K554429P24334l770728m865989
$$ plain form
35739 3590793 2396900 3936797 3451543 -244468 -3782165 -5000232 -5101594 -4774992 -2634478
35730 -2634478 1120270 3281424 1885762 -936029 -2253493 -1957381 -1159393 503981
35722 503981 3444253 5973563 6446466 6258015 7804925 10275706 10586786 8432634 7249032
35713 7249032 9236627 12046472 11975305 8554299 4180987 666013 -1690646 -2505225 -1446290
35704 -1446290 -144890 -1471330 -5731056 -9412203 -9283222 -6318570 -3673504 -2048836
35696 -2048836 168936 2652931 2570066 -561691 -2580913 258620 5874384 8851823
35688 8851823 7416199 5164783 6082860 10255015 14637650 15970385 12749609 6383678
35680 6383678 721584 -1458070 -1658448 -3322079 -6368237 -7065464 -4088202 -1240802
$$ packed form
35739C590793j193893J539897m85254l696011l537697j218067j01362L26602K140514
35730b634478L754748K161154j395662k821791j317464K96112P97988J663374
35722E03981K940272K529310M72903j88451J546910K470781L11080k154152j183602
35713G249032J987595K809845p1167l421006m373312l514974k356659q14579J058935
35704a446290J301400j326440m259726l681147J28981K964652K645066J624668
35696b048836K217772K483995q2865l131757k019222K839533N615764K977439
35688H851823j435624k251416R18077M172155M382635J332735l220776o365931
35680F383678n662094k179654k00378j663631l046158o97227K977262K847400
$$ plain form
35672 -1240802 -2038623 -4484578 -4250762 -1043972 1653073 2138904 2266051 3737037 5764765
35663 5764765 7017304 7374616 6979535 5707470 4499001 5331779 8755739 12880339 15702012
35654 15702012 17004733 17041427 15011477 10545232 5762436 3939894 5979010 9285366
35646 9285366 10460173 8566545 5524946 3628861 3205990 3193352 3646266 6074743 10284963
35637 10284963 12513158 9192202 2172716 -2567466 -1955846 1023945 2220402 1588546
35629 1588546 1580910 2633056 3220063 3209079 4099252 6136149 7761986 8137655 8090822 8313719
35619 8313719 8582871 9061074 10398611 12031507 12281555 10895461 9740452 10022397 10316956
35610 10316956 8444493 4145603 -999072 -5211043 -7331147 -7231684 -6228824 -5885359
$$ packed form
35672a240802p97821k445955K33816L206790K697045M85831J27147J470986K027728
35663E764765J252539L57312l95081j272065j208469Q32778L423960M124600K821673
35654A5702012J302721L6694k029950m466245m782796j822542K039116L306356
35646I285366J174807j893628l041599j896085m22871j2638M52914K428477M210220
35637A0284963K228195l320956p019486m740182O11620K979791J196457o31856
35629A588546p636J052146N87007j0984Q90173K036897J625837L75669m6833K22897
35619H313719K69152M78203J337537J632896K50048j386094j155009K81945K94559
35610A0316956j872463m298890n144675m211971k120104R9463J002860L43465
$$ plain form
35602 -5885359 -5780361 -4095908 -1200035 -309469 -2690996 -4328018 -345761 8270912
35594 8270912 15438384 17099012 14582346 10879341 7159471 4339250 4775285 9322296
35586 9322296 14095107 13295605 5745012 -3083609 -6290689 -2202836 4429639 7395544
35578 7395544 4843339 200861 -2276921 -1861597 -565864 843699 3895627 9239201
35570 9239201 14538363 16834298 15810962 13543255 11959641 11605860 11904056 11462363 9177921
35561 9177921 6399079 6812824 12179668 18875021 20993751 16928403 10824351 7321939
35553 7321939 7057866 8067948 9360391 11324035 13771084 15388926 15034944 12744798
35545 12744798 9698374 7567947 7260771 7914869 8011395 7908026 9947177 15021708 20309816
$$ packed form
35602e885359J04998J684453K895873Q90566k381527j637022L982257Q616673
35594H270912P167472J660628k516666l703005l719870k820221M36035M547011
35586I322296M772811p99502p550593q828621l207080M087853O632475K965905
35578G395544k552205m642478k477782M15324J295733J409563L051928N343574
35570I239201N299162K295935j023336k267707j583614l53781K98196m41693k284442
35561I177921k778842M13745N366844O695353K118730m065348o104052l502412
35553G321939k64073J010082J292443J963644K447049J617842l53982k290146
35545A2744798l046424k130427l07176O54098R6526j03369K039151N074531N288108
$$ plain form
35536 20309816 22095616 20130003 17384893 15873294 14867395 13549576 13077910 14480586
35528 14480586 15972038 14528430 9997699 5895756 5502973 8245013 10736673 10702523
35520 10702523 8853234 7175843 6587724 6673128 6763279 6405840 5278798 3671208 2957852
35511 2957852 4564293 8118271 11349271 12259420 10928952 8887528 7277210 6122227
35503 6122227 5006082 3871885 3115171 3000868 2953422 1794098 -672582 -2595502 -1766470
35494 -1766470 1441190 4118760 4382877 3553568 3786964 4853868 4884865 3482392 2145766
35485 2145766 1743620 1397627 314620 -650727 57546 2929552 6872562 9836916 10004072
35476 10004072 7257203 3589621 1295108 757894 680499 31584 -1334630 -3438734 -5906454
$$ packed form
35536B0309816J785800j965613k745110j511599j005899j317819m71666J402676
35528A4480586J491452j443608m530731m101943l92783K742040K491660l4150
35520A0702523j849289j677391n88119Q5404R0151l57439j127042j607590p13356
35511B957852J606441L553978L231000R10149j330468k041424j610318j154983
35503F122227j116145j134197p56714j14303m7446j159324k466680j922920Q29032
35494a766470L207660K677570K64117q29309K33396J066904L0997j402473j336626
35485B145766m02146l45993j083007r65347P08273K872006L943010K964354J67156
35476A0004072k746869l667582k294513n37214p7395o48915j366214k104104k467720
$$ plain form
35467 -5906454 -7219478 -6212012 -4382602 -4508080 -6492328 -6976921 -4040973 135478
35459 135478 2759765 4164533 5923995 7316688 6453949 3671850 1063604 -482591
35451 -482591 -1138207 17131 3802956 8018201 9278489 8150411 8869058 12789709 15627312
35442 15627312 13363237 8012217 4619361 4450126 4369889 2086669 -1136195 -3113020
35434 -3113020 -3518845 -3309397 -3139820 -3232956 -3649249 -3888803 -3013494 -909615 1016648
35425 1016648 1127089 -389547 -1143129 1259617 6360648 10665529 11146153 8735173 7098701
35416 7098701 7733540 7895719 4456128 -1463509 -5322656 -4157852 588425 4998909
35408 4998909 6284599 4557304 2060038 909408 1292751 2001158 2437327 2787688 2037957
$$ packed form
35467e906454j313024J007466J829410j25478j984248m84593K935948M176451
35459A35478K624287J404768J759462J392693q62739k782099k608246j546195
35451d82591o55616J155338L785825M215245J260288j128078P18647L920651K837603
35442A5627312k264075n351020l392856j69235q0237k283220l222864j976825
35434c113020m05825K09448J69577r3136m16293k39554Q75309K103879J926263
35425A016648J10441j516636p53582K402746N101031M304881M80624k410980j636472
35416G098701O34839J62179l439591n919637l859147J164804M746277M410484
35408D998909J285690j727295k497266j150630L83343P08407M36169L50361p49731
$$ plain form
35399 2037957 -1895071 -8484140 -13148381 -12186315 -7908409 -5800617 -7270851 -8682540
35391 -8682540 -7563789 -5811843 -5509198 -5308852 -3411039 -1313994 -1596048 -3682263 -4695612
35382 -4695612 -3492694 -1319584 725313 2369694 2828428 1289073 -1279014 -2879323
35374 -2879323 -3099574 -3165915 -3514989 -3268215 -2199805 -1343977 -1460362 -2628227 -5336434
35365 -5336434 -9875174 -14417005 -16051687 -14528100 -12906194 -13552043 -15406104 -16155358
35357 -16155358 -14979438 -11869737 -6525372 60162 4771167 5518580 3951050 2774942
35349 2774942 1713526 -1102772 -4773947 -6182096 -4972307 -4480375 -6561900 -8485486
35341 -8485486 -6860973 -2451469 1151474 2184987 1738134 950800 -429257 -2612742
$$ packed form
35399B037957l933028o589069m664241R62066M277906K107792j470234j411689
35391h682540J118751J751946L02645K00346J897813K097045k82054k086215j013349
35382d695612J202918K173110K044897J644381M58734j539355k568087j600309
35374b879323k20251o6341l49074K46774J068410Q55828j16385j167865k708207
35365e336434m538740m541831j634682J523587J621906o45849j854061p49254
35357a6155358J175920L109701N344365O585534M711005P47413j567530j176108
35349B774942j061416k816298l671175j408149J209789M91932k081525j923586
35341h485486J624513M409504L602943J033513m46853p87334j380057k183485
$$ plain form
35333 -2612742 -4745319 -5901692 -6014842 -5347222 -3818490 -1337349 1621693 4148235
35325 4148235 5559944 5952742 6088288 6477125 6658700 6031477 5366732 6280410 8644747
35316 8644747 9918463 8292710 5305996 3575925 2886377 934749 -2330124 -3960470
35308 -3960470 -2325171 443314 1753375 2015910 2765109 3224253 1503209 -1790929 -4086379
35299 -4086379 -4764824 -5643693 -7116464 -6725005 -3000258 1543852 3212399 1471715 -1433492
35290 -1433492 -4018852 -6335922 -7590058 -5557083 612742 8407726 13931508 15448232
35282 15448232 14448458 13642387 14379685 15790923 16059127 14476077 12214014 11011912 11406884
35273 11406884 12609785 13735082 14376960 14042713 12010824 8356447 4695863 3238819
$$ packed form
35333b612742k132577j156373j13150O67620J528732K481141K959042K526542
35325D148235J411709L92798J35546L88837J81575o27223o64745R13678K364337
35316H644747J273716j625753k986714j730071o89548j951628l264873j630346
35308c960470J635299K768485J310061K62535P49199M59144j721044l294138k295450
35299d086379o78445q78869j472771L91459L724747M544110J668547j740684k905207
35290a433492k585360k317070j254136K032975O169825P794984N523782J516724
35282A5448232r99774q06071P37298J411238K68204j583050k262063j202102L94972
35273A1406884J202901J125297O41878l34247k031889l654377l660584j457044
$$ plain form
35265 3238819 4830819 7863048 9210337 6820366 1984729 -1253552 157388 5020341
35257 5020341 9132698 9875690 8544417 7727944 7684770 6561676 3429219 -539524 -3819001
35248 -3819001 -5840761 -6193770 -4241094 -723441 1604979 919134 -508059 1703313
35240 1703313 8216787 13999843 13625947 7473973 1025770 -1344226 -34159 2037951
35232 2037951 3024497 2643105 972938 -1583501 -3910774 -5075608 -5257738 -5024077 -4422323
35223 -4422323 -3729285 -4115890 -6050814 -7690966 -6721713 -3741015 -2043346 -3673649 -7134287
35214 -7134287 -9377075 -8655970 -4992126 536556 5976445 9266013 10091150 10272398 11351400
35205 11351400 12457704 11494995 7901888 3394078 384335 242405 2447576 4718892
$$ packed form
35265C238819J592000L032229J347289k389971m835637l238281J410940M862953
35257E020341M112357P42992j331273q16473m3174j123094l132457l968743l279477
35248c819001k021760l53009J952676L517653K328420o85845j427193K211372
35240A703313O513474N783056l73896o151974o448203k369996J310067K072110
35232B037951R86546l81392j670167k556439k327273j164834j82130K33661O01754
35223d422323O93038l86605j934924j640152R69253K980698J697669j630303l460638
35214g134287k242788P21105L663844N528682N439889L289568Q25137J81248J079002
35205A1351400J106304r62709l593107m507810l009743j41930K205171K271316
$$ plain form
35197 4718892 4589475 1633919 -2287319 -5372717 -7515607 -8981679 -8823757 -6113874
35189 -6113874 -2006606 1017124 1746946 949864 -74039 -413563 473895 2213748 3165214
35180 3165214 2040400 -252025 -1695394 -1831450 -1842311 -2262332 -2470052 -2449391 -2938446
35171 -2938446 -3373852 -1880148 1641641 4313429 3636243 684746 -1525032 -1793458 -1385896
35162 -1385896 -1749470 -3079342 -4658091 -5286321 -3745849 -110852 3582916 5129796
35154 5129796 4636785 4356450 6037136 9092983 11302515 10750256 7297080 2782254 -301875
35145 -301875 -794428 489515 2059626 3036491 2976635 1535716 -822214 -2526016 -2299327
35136 -2299327 -514565 1384112 2120306 783763 -2901277 -7310309 -9103473 -6460612
$$ packed form
35197D718892j29417k955556l921238l085398k142890j466072J57922K709883
35189f113874M107268L023730P29822p97082j023903l39524Q87458J739853R51466
35180C165214j124814k292425j443369j36056j0861m20021k07720K0661m89055
35171b938446m35406J493704L521789K671788o77186k951497k209778k68426M07562
35162a385896l63574j329872j578749o28230J540472L634997L693768J546880
35154E129796m93011k80335J680686L055847K209532n52259l453176m514826l084129
35145c01875m92553J283943J570111R76865n9856j440919k357930j703802K26689
35136b299327J784762J898677P36194j336543l685040m409032j793164K642861
$$ plain form
35128 -6460612 -1585503 1665993 2250185 2388153 3953556 6348483 8032400 8325499 7320986
35119 7320986 5516422 3836089 2670424 921777 -2287076 -5027255 -4062370 425276
35111 425276 4059425 3608132 1035841 445667 2668807 5041849 5435049 4206003 2631280
35102 2631280 1530869 1518437 2897599 4892530 6031807 5537263 3753138 1535229 -58902
35093 -58902 -144785 785115 654294 -1779264 -4778946 -5590634 -4296283 -3694243 -5060960
35084 -5060960 -6241316 -5165113 -3503947 -4751699 -9122181 -12276544 -9827112 -2216100
35076 -2216100 5721288 9785251 10129807 9697392 9974699 9703473 7641769 4732762 2548474
35067 2548474 1081935 -295710 -729105 1157708 4478132 6337038 5160013 2087293
$$ packed form
35128f460612M875109L251496N84192J37968J565403K394927J683917K93099j004513
35119G320986j804564j680333j165665j748647l208853k740179R64885M487646
35111D25276L634149m51293k572291n90174K223140K373042L93200j229046j574723
35102B631280j100411j2432J379162J994931J139277m94544j784125k217909j594131
35093e8902q5883R29900j30821k433558k999682q11688J294351O02040j366717
35084e060960j180356J076203J661166j247752m370482l154363K449432P611012
35076b216100P937388M063963L44556m32415K77307k71226k061704k909007k184288
35067B548474j466539j377645m33395J886813L320424J858906j177025l072720
$$ plain form
35059 2087293 -1209604 -4221631 -6459819 -6555579 -3949233 -378341 1686151 1562986 484227
35050 484227 -114496 431808 2115626 4352504 6193810 7013240 6834434 5920707 4580027
35041 4580027 3316231 2349246 1163786 -291930 -318573 2667939 6933401 8604088 6783753
35032 6783753 4772031 4884590 5144586 3405223 1629474 2503333 4262306 3416237 1109114
35023 1109114 1542360 4403920 4576100 640225 -1857075 1495196 7120628 8533388
35015 8533388 4959893 707913 -1656950 -2895752 -3100898 -792513 3778014 8111043
35007 8111043 10847862 12700206 13525243 11544922 6563747 1391178 -1338269 -1889420
34999 -1889420 -1890828 -1905526 -1701697 -1302597 -515697 1247587 3626068 5111669 5137809 4846999
$$ packed form
35059B087293l296897l012027k238188r5760K606346L570892K064492j23165j078759
35050D84227n98723N46304J683818K236878J841306Q19430j78806r13727j340680
35041D580027j263796r66985j185460j455716k6643K986512M265462J670687j820335
35032F783753k011722J12559K59996j739363j775749Q73859J758973q46069k307123
35023A109114M33246K861560J72180l935875k497300L352271N625432J412760
35015H533388l573495m251980k364863j238802k05146K308385M570527M333029
35007H111043K736819J852344Q25037j980321m981175n172569k729447n51151
34999a889420j408j4698K03829L99100P86900J763284K378481J485601K6140k90810
$$ plain form
34989 4846999 4717434 3204274 -666737 -4971240 -7146256 -7276061 -6914805 -5842214 -2871939
34980 -2871939 640080 1435222 -892717 -2846827 -2146315 -1189026 -3165290 -6820518 -8170770
34971 -8170770 -6468238 -4987102 -5456338 -5057884 -962804 4404006 5609020 1143653
34963 1143653 -4675746 -7293730 -7037671 -7218334 -8899829 -9924572 -8676063 -6426073
34955 -6426073 -5213826 -5054483 -4453455 -2732577 -589460 1184220 2371079 2857772 2551191
34946 2551191 1920230 1821572 2526932 3476563 4121658 4392946 4191827 3212947 1722167
34937 1722167 738015 582952 -271513 -3720321 -9251326 -13804313 -15099519 -14232828 -13797349
34928 -13797349 -13926152 -11949093 -6471173 -119652 3219825 2929282 1652260 1326888
$$ packed form
34989D846999j29565j513160l871011m304503k175016j29805L61256J072591K970275
34980b871939L512019P95142k327939j954110P00512R57289j976264l655228j350252
34971h170770J702532J481136m69236L98454M095080N366810J205014m465367
34963A143653n819399k617984K56059j80663j681495j024743J248509K249990
34955f426073J212247J59343O01028J720878K143117J773680J186859M86693l06581
34946B551191o30961r8658P05360R49631O45095K71288k01119r78880j490780
34937A722167r84152j55063q54465l448808n531005m552987j295206Q66691M35479
34928a3797349j28803J977059N477920O351521L339477k90543j277022l25372
$$ [...]
##END NTUPLES=NMR SPECTRUM
##END=
