##TITLE=31Pdec_LR-793-O-C3-MK
 CDCl3+DMSO-d6, 64 sc
 26.12.2024
##JCAMPDX= 6.0         $$ Bruker NMR JCAMP-DX V2.0
##DATA TYPE= NMR SPECTRUM
##DATA CLASS= NTUPLES
##ORIGIN= UXNMR, Bruker Analytische Messtechnik GmbH
##OWNER= root
$$ XWIN-NMR		Version 3.5
$$ Thu Dec 26 14:14:21 2024 Russian Standard Time (UT+4h)  she@DPX200
##.OBSERVE FREQUENCY= 81.013821
##.OBSERVE NUCLEUS= ^31P
##.ACQUISITION MODE= SIMULTANEOUS
##.ACQUISITION SCHEME= undefined
##.AVERAGES= 64
##.DIGITISER RES= 17
##SPECTROMETER/DATA SYSTEM= spect
##.PULSE SEQUENCE= zgpg30
##.SOLVENT NAME= CDCl3
##.SHIFT REFERENCE= (INTERNAL, CDCl3, 0, 198.062)
##AUDIT TRAIL= $$ (NUMBER, WHEN, WHO, WHERE, WHAT)
$$ ##TITLE= Audit trail, XWIN-NMR		Version 3.5
$$ ##JCAMPDX= 5.01
$$ ##ORIGIN= Bruker BioSpin GmbH
$$ ##OWNER= she
$$ F:/spectra/data/she/nmr/P31/2/pdata/1/auditp.txt
$$ ##AUDIT TRAIL=  $$ (NUMBER, WHEN, WHO, WHERE, WHAT)
(   1,<2024-12-26 14:13:21.28 +0400>,<she>,<DPX200>,
      <continue with go, POWCHK disabled, PULCHK disabled
       configuration hash MD5:
       00 E9 B6 7A A2 85 ED C7 34 08 36 98 17 FE 4E 26
       data hash MD5: 32K
       20 26 06 C3 64 0D F2 81 26 B9 7A EA CE B8 3F 03>)
(   2,<2024-12-26 14:13:25.03 +0400>,<she>,<DPX200>,
      <Start of raw data processing
       efp BC_mod = 2 LB = 1.5 FT_mod = 6 PKNL = 1 PHC0 = 2056.429 PHC1 = 181.0863 SI = 64K 
       data hash MD5: 64K
       19 13 5C CE 91 A1 D0 86 4E 8E A2 8C 0D 79 35 B8>)
(   3,<2024-12-26 14:13:42.40 +0400>,<she>,<DPX200>,
      <pk PHC0 = 12.71797 PHC1 = 0 
       data hash MD5: 64K
       EF 00 65 1D CE C4 E1 8A 00 1C 86 97 8C 62 E9 E2>)
(   4,<2024-12-26 14:13:51.79 +0400>,<she>,<DPX200>,
      <abs ABSG = 5 
       data hash MD5: 64K
       7E 11 00 B7 A8 2C 0A 67 FD AF 69 38 1E E8 10 38>)
$$ ##END=
$$ 
$$ hash MD5
$$ E7 18 DE 3C 99 00 51 49 60 F0 2D 95 2C 53 22 55
##$RELAX= 
##$RELAX= 
##$RELAX= 
##$RELAX= 
##$RELAX= 
##$RELAX= 
##$RELAX= 
##$RELAX= 
$$ Bruker specific parameters
$$ --------------------------
##$DU= <F:/spectra>
##$EXPNO= 2
##$NAME= <P31>
##$PROCNO= 1
##$TYPE= <nmr>
##$USER= <she>
##$AMP= (0..31)
100 100 100 100 100 100 100 100 100 100 100 100 100 100 100 100 100 100 
100 100 100 100 100 100 100 100 100 100 100 100 100 100 
##$AQSEQ= 0
##$AQ_mod= 1
##$AUNM= <au_zg>
##$AUTOPOS= <>
##$BF1= 81.014009
##$BF2= 200.13
##$BF3= 200.13
##$BF4= 200.13
##$BF5= 200.13
##$BF6= 200.13
##$BF7= 200.13
##$BF8= 200.13
##$BYTORDA= 1
##$CFDGTYP= 0
##$CFRGTYP= 5
##$CHEMSTR= <none>
##$CNST= (0..31)
1 1 145 1 1 1 1 1 1 1 1 1 1 1 1 1 1 1 1 1 1 1 1 1 1 1 1 1 1 1 1 1 
##$CPDPRG= <waltz16>
##$CPDPRG1= <>
##$CPDPRG2= <waltz16>
##$CPDPRG3= <>
##$CPDPRG4= <mlev>
##$CPDPRG5= <mlev>
##$CPDPRG6= <mlev>
##$CPDPRG7= <mlev>
##$CPDPRG8= <mlev>
##$CPDPRGB= <>
##$CPDPRGT= <>
##$D= (0..31)
0 1 0 0 0 0 0 0 0 0.06 0 0.03 2e-05 3e-06 0 0 0.0002 0 0 0 0 0 0 0 0 0 
0 0 0 0 0 0 
##$DATE= 1735207919
##$DBL= (0..7)
120 120 120 11 120 120 24 19 
##$DBP= (0..7)
150 150 150 150 150 150 150 150 
##$DBP07= 0
##$DBPNAM0= <>
$$ [...]
##$SUBNAM3= <"">
##$SUBNAM4= <"">
##$SUBNAM5= <"">
##$SUBNAM6= <"">
##$SUBNAM7= <"">
##$SUBNAM8= <"">
##$SUBNAM9= <"">
##$SW= 400.765351723535
##$SWIBOX= (0..15)
0 1 3 0 0 0 0 0 0 0 0 0 0 0 0 0 
##$SW_h= 32467.5324675325
##$TD= 32768
##$TD0= 1
##$TE= 0
##$TE2= 300
##$TE3= 300
##$TEG= 300
##$TL= (0..7)
0 120 53 12 22 120 120 120 
##$TP= (0..7)
150 150 150 150 150 150 150 150 
##$TP07= 0
##$TPNAME0= <>
##$TPNAME1= <>
##$TPNAME2= <>
##$TPNAME3= <>
##$TPNAME4= <>
##$TPNAME5= <>
##$TPNAME6= <>
##$TPNAME7= <>
##$TPOAL= (0..7)
0.5 0.5 0.5 0.5 0.5 0.5 0.5 0.5 
##$TPOFFS= (0..7)
0 0 0 0 0 0 0 0 
##$TUNHIN= 0
##$TUNHOUT= 0
##$TUNXOUT= 0
##$USERA1= <user>
##$USERA2= <user>
##$USERA3= <user>
##$USERA4= <user>
##$USERA5= <user>
##$V9= 5
##$VALIST= <valist>
##$VCLIST= <CCCCCCCCCCCCCCC>
##$VD= 0
##$VDLIST= <DDDDDDDDDDDDDDD>
##$VPLIST= <PPPPPPPPPPPPPPP>
##$VTLIST= <TTTTTTTTTTTTTTT>
##$WBST= 1024
##$WBSW= 4
##$XGAIN= (0..3)
0 0 0 0 
##$XL= 0
##$YL= 0
##$YMAX_a= 7037
##$YMIN_a= -10962
##$ZGOPTNS= <>
##$ZL1= 120
##$ZL2= 120
##$ZL3= 120
##$ZL4= 120
##$ABSF1= 198.0616
##$ABSF2= -202.7028
##$ABSG= 5
##$ABSL= 3
##$ALPHA= 0
##$AQORDER= 0
##$ASSFAC= 0
##$ASSFACI= 0
##$ASSFACX= 0
##$ASSWID= 0
##$AUNMP= <proc_1d>
##$AZFE= 0.1
##$AZFW= 0.5
##$BCFW= 0
##$BC_mod= 2
##$BYTORDP= 0
##$COROFFS= 0
##$CY= -3
##$DATMOD= 1
##$DC= 0
##$DFILT= <>
##$DTYPP= 0
##$F1P= 0
##$F2P= 0
##$FCOR= 1
##$FTSIZE= 65536
##$FT_mod= 6
##$GAMMA= 0
##$GB= 0
##$INTBC= 1
##$INTSCL= 9.790993e-09
##$ISEN= 30
##$LB= 1.5
##$LEV0= 0
##$LPBIN= 0
##$MAXI= 10000
##$MC2= 0
##$MEAN= 0
##$ME_mod= 0
##$MI= 50
##$NCOEF= 0
##$NC_proc= -9
##$NLEV= 6
##$NOISF1= 182.463
##$NOISF2= 159.3651
##$NSP= 0
##$NTH_PI= 0
##$NZP= 0
##$OFFSET= 198.0616
##$PC= 4
##$PHC0= 2069.147
##$PHC1= 181.0863
##$PH_mod= 1
##$PKNL= yes
##$PPARMOD= 0
##$PSCAL= 0
##$PSIGN= 0
##$REVERSE= no
##$SF= 81.0140089999434
##$SI= 65536
##$SIGF1= 159.3651
##$SIGF2= -187.1042
##$SINO= 113.3802
##$SIOLD= 16384
##$SREGLST= <1H.CDCl3>
##$SSB= 0
##$STSI= 65536
##$STSR= 0
##$SW_p= 32467.5324675325
##$SYMM= 0
##$S_DEV= 0
##$TDeff= 32768
##$TDoff= 0
##$TI= <>
##$TILT= no
##$TM1= 0
##$TM2= 0
##$TOPLEV= 0
##$USERP1= <user>
##$USERP2= <user>
##$USERP3= <user>
##$USERP4= <user>
##$USERP5= <user>
##$WDW= 1
##$XDIM= 65536
##$YMAX_p= 248939847
##$YMIN_p= -122864015
$$ End of Bruker specific parameters
$$ ---------------------------------
##NTUPLES= NMR SPECTRUM
##VAR_NAME=  FREQUENCY,     SPECTRUM/REAL,   SPECTRUM/IMAG
##SYMBOL=    X,             R,               I
##VAR_TYPE=  INDEPENDENT,   DEPENDENT,       DEPENDENT
##VAR_FORM=  AFFN,          ASDF,            ASDF
##VAR_DIM=   65536,         65536,           65536
##UNITS=     HZ,            ARBITRARY UNITS, ARBITRARY UNITS
##FACTOR=    0.49542278885378, 1,            1
##FIRST=     16045.7642231865, 0,            0
##LAST=      -16421.768244346, 0,            0
##MIN=       -16421.768244346, -122864015,   0
##MAX=       16045.7642231865, 248939847,    0
$$ Real data points
##PAGE= N=1
##DATA TABLE= (X++(R..R)), XYDATA
$$ [...]
##PAGE= N=2
##DATA TABLE= (X++(I..I)), XYDATA
$$ plain form
7356 -10764377 -14395143 -18843888 -16018748 -3123370 12022355 20757052 23114942 23213173
7348 23213173 21081372 15024357 7447734 2021969 -1618772 -4912938 -5692062 -2030625
7340 -2030625 2842019 5377461 7825613 13014108 16527738 11705197 93535 -10687793
7332 -10687793 -17515032 -22134681 -22820527 -15533587 -4160854 34749 -7595523 -19117481
7324 -19117481 -25285261 -25981408 -25718534 -25173711 -22356269 -17862219 -13970768 -10967517 -7866764
7315 -7866764 -4692075 -1649685 1558188 3723472 2288577 -2628375 -7375820 -9807883
7307 -9807883 -11993588 -15787837 -18905947 -18047404 -13529313 -8603268 -6167710 -7427111
7299 -7427111 -11130137 -13000694 -9248003 -2054283 2128863 1381055 1024657 4990655 9124643
$$ packed form
7356a0764377l630766m448745K825140J2895378J5145725Q734697K357890R8231
7348B3213173k131801o057015p576623n425765l640741l294166p79124L661437
7340b030625M872644K535442K448152N188495L513630m822541j1611662j0781328
7332a0687793o827239m619649o85846P286940J1372733M195603p630272j1521958
7324a9117481o167780o96147K62874N44823K817442M494050L891451L003251L100753
7315g866764L174689L042390L207873K165284j434895m916952m747445k432063
7307i807883k185705l794249l118110Q58543M518091M926045K435558j259401
7299g427111l703026j870557L752691P193720M183146p47808l56398L965998M133988
$$ plain form
7290 9124643 7196008 7160 -6184920 -7994398 -7087805 -5502266 -3118954 523780
7282 523780 5039274 9586101 12425406 11201534 5872634 213013 -1736612 267928
7274 267928 3591784 5961036 6261180 4387985 2307126 3010706 6417659 8857854 8672281
7265 8672281 9024964 12280336 15224261 14012578 10743931 10022803 11168167 9464361 4180714
7256 4180714 -258092 -1257798 -1134452 -2260601 -3541699 -3421306 -3108622 -4852415 -8774655
7247 -8774655 -12483514 -12769996 -7903926 212970 6627260 7645578 3990510 -1312053
7239 -1312053 -6180608 -8770770 -6307886 1849509 11705920 18591130 21937352 22812096
7231 22812096 19399210 10063764 -808397 -6079091 -4914058 -3240809 -4893679 -7477410
$$ packed form
7290I124643j928635p188848o192080j809478R06593J585539K383312L642734
7282E23780M515494M546827K839305j223872n328900n659621j949625K004540
7274B67928L323856K369252L00144j873195k080859P03580L406953K440195j85573
7265H672281L52683L255372K943925j211683l268647p21128J145364j703806n283647
7256D180714m438806r99706J23346j126149j281098J20393L12684j743793l922240
7247h774655l708859k86482M866070Q116896O414290J018318l655068n302563
7239a312053m868555k590162K462884Q157395R856411O885210L346222Q74744
7231B2812096l412886r335446j0872161n270694J165033J673249j652870k583731
$$ plain form
7223 -7477410 -7634758 -5235248 -1166307 4199562 8865782 9860774 7298600 3764106 -852683
7214 -852683 -8857135 -18200625 -22374713 -19139341 -13880740 -11492363 -10368315 -8060504
7206 -8060504 -7534482 -12562233 -20345931 -23939487 -20461394 -13479804 -8913973 -10868076
7198 -10868076 -18863609 -26775986 -27503948 -21085119 -14834221 -13366555 -13204900 -10288424
7190 -10288424 -7010488 -6668677 -6361457 -2383795 1454509 -958611 -6971204 -7900076 -2138596
7181 -2138596 2770667 1798730 -1704745 -3542679 -4618665 -6275536 -6069490 -2284331 2008704
7172 2008704 3265599 2155240 576849 -2481002 -8483439 -15544921 -20524593 -22734527
7164 -22734527 -22701942 -19753425 -14210368 -9954496 -11019004 -16422396 -21294082 -22485145
$$ packed form
7223g477410j57348K399510M068941N365869M666220R94992k562174l534494m616789
7214h52683q004452r343490m174088L235372N258601K388377J124048K307811
7206h060504N26022n027751p783698l593556L478093O981590M565831j954103
7198a0868076p995533p912377p27962O418829O250898J467666J61655K916476
7190a0288424L277936L41811L07220L977662L838304k413120o012593r28872N761480
7181b138596M909263r71937l503475j837934j075986j656871K06046L785159M293035
7172B008704J256895j110359j578391l057851o002437p061482m979672k209934
7164b2734527L2585K948517N543057M255872j064508n403392m871686j191063
$$ plain form
7156 -22485145 -20782150 -18625544 -18127520 -20338798 -23664461 -23498898 -16234441 -3873004
7148 -3873004 7322253 12726432 12188579 7649141 666364 -7322367 -14812904 -21411680
7140 -21411680 -27391550 -31115732 -28992034 -19966169 -8809410 -2453643 -3031343 -6514411
7132 -6514411 -8523367 -9128484 -10494116 -12052514 -11186810 -8066090 -6125233 -6690628 -6412242
7123 -6412242 -2195578 4058273 8523713 10796882 12234149 10869591 3524906 -6893972
7115 -6893972 -12016569 -8173116 -1240605 1692412 1237790 2154162 4459289 3728671 -1233878
7106 -1233878 -6669529 -9945536 -12400127 -15076007 -16106135 -14394325 -12348694 -12404675 -13367855
7097 -13367855 -12697885 -10427398 -8277096 -6375766 -3537151 -131319 1651961 493822
$$ packed form
7156b2485145J702995K156606M98024k211278l325663J65563P264457J2361437
7148c873004J1195257N404179n37853m539438o982777p988731p490537o598776
7140b1411680n979870l724182K123698R025865J1156759O355767n77700l483068
7132f514411k008956o05117j365632j558398Q65704L120720J940857n65395K78386
7123f412242M216664O253851M465440K273169J437267j364558p344685j0418878
7115f893972n122597L843453O932511K933017m54622R16372K305127p30618m962549
7106a233878n435651l276007k454591k675880j030128J711810K045631n5981r63180
7097a3367855O69970K270487K150302J901330K838615L405832J783280j158139
$$ plain form
7089 493822 -2387127 -4188998 -2748551 1144928 3243516 -371721 -7910621 -12793070
7081 -12793070 -11938072 -10257723 -13451499 -18951750 -19372826 -14049871 -10852452 -15024765
7073 -15024765 -21916318 -23938477 -20041282 -14096444 -7805858 -939384 3455603 757737
7065 757737 -7345358 -11965944 -6811015 4056606 10924655 9258538 3395603 131062
7057 131062 1024579 1982310 -749003 -6111316 -10494355 -12818154 -14897050 -17079312 -16801483
7048 -16801483 -12741667 -7409365 -3481867 -302299 3257787 5190334 3374399 131609
7040 131609 -643775 365859 -677044 -3725762 -4112416 654702 7528095 11975905 11923117
7031 11923117 8008271 4111239 6750677 18085301 29445419 28724133 15708522 2970597
$$ packed form
7089D93822k880949j801871J440447L893479K098588l615237p538900m882449
7081a2793070Q54998J680349l193776n500251m21076N322955L197419m172313
7073a5024765o891553k022159L897195N944838O290586O866474M394987k697866
7065G57737q103095m620586N154929J0867621O868049j666117n862935l264541
7057A31062Q93517R57731k731313n362313m383039k323799k078896k182262K77829
7048a6801483M059816N332302L927498L179568L560086J932547j815935l242790
7040A31609p75384J009634j042903l048718l86654M767118O873393M447810n2788
7031A1923117l914846l897032K639438J1334624J1360118p21286j3015611j2737925
$$ plain form
7023 2970597 -842343 -605643 -3391302 -6018141 -1567044 7682461 12896152 11264922
7015 11264922 7749159 6076776 5740624 6979512 11111094 15642360 15790474 11548569
7007 11548569 7168372 3162334 -4484679 -15497300 -22308281 -19467263 -11584243 -8016943
6999 -8016943 -11876740 -16994510 -14850156 -3568924 9387452 14519745 11469549 9886799
6991 9886799 15940818 22096899 16890180 2268306 -7511810 -4578158 3427141 5006884
6983 5006884 -2037786 -12110130 -19396273 -20160681 -13877582 -6351771 -5994709 -12727270
6975 -12727270 -16328379 -10435114 -2015994 -901207 -5581316 -6960685 -2027825 4506473
6967 4506473 9595661 14198006 16860811 13321833 4214810 -3212331 -3609687 441045
$$ packed form
7023B970597l812940K36700k785659k626839M451097R249505N213691j631230
7015A1264922l515763j672383l36152J238888M131582M531266J48114m241905
7007A1548569m380197m006038p647013j1012621o810981K841018P883020L567300
6999h016943l859797n117770K144354J1281232J2956376N132293l050196j582750
6991I886799O054019O156081n206719j4621874r780116K933652Q005299J579743
6983E006884p044670j0072344p286143p64408O283099P525811L57062o732561
6975a2727270l601109N893265Q419120J114787m680109j379369M932860O534298
6967D506473N089188M602345K662805l538978r107023p427141l97356M050732
$$ plain form
6959 441045 2647933 -181335 -6859592 -14314092 -20006854 -23754119 -27420137 -31283680
6951 -31283680 -32013943 -27108632 -19971308 -16533598 -17237885 -16677624 -11763092 -6189719 -5274155
6942 -5274155 -9376296 -14087900 -14883191 -10524428 -3788207 237676 -1790255 -8269928
6934 -8269928 -14481590 -17487823 -17816611 -16818695 -14666125 -11315136 -7521683 -4126827 -1331843
6925 -1331843 1050058 3180264 4638979 3940182 -39157 -5337141 -7577347 -4962231
6917 -4962231 -697956 1458787 1964214 3390212 5758004 7139816 7256787 7052629 5819177
6908 5819177 2051168 -3632356 -9198798 -13637136 -16100941 -14737869 -9808402 -5650779
6900 -5650779 -5277256 -5357430 -1799581 1963952 -825033 -8604637 -11823435 -6191345 1680455
$$ packed form
6959D41045K206888k829268o678257p454500n692762l747265l666018l863543
6951c1283680p30263M905311P137324L437710p04287N60261M914532N573373R15564
6942e274155m102141m711604p95291M358763O736221M025883k027931o479673
6934h269928o211662l006233l28788R97916K152570L350989L793453L394856K794984
6925a331843K381901K130206J458715o98797l979339n297984k240206K615116
6917d962231M264275K156743N05427J425998K367792J381812J16971k04158j233452
6908E819177l768009n683524n566442m438338k463805J363072M929467M157623
6900e650779L73523q0174L557849L763533k788985p779604l218798N632090P871800
$$ plain form
6891 1680455 4528870 3616332 3574974 3647180 -387671 -8552196 -16081561 -19575092 -20178722
6882 -20178722 -20689421 -21629241 -20890795 -17375581 -14633116 -18093584 -26495796 -29870123 -21461478
6873 -21461478 -8874374 -5535927 -11789236 -13671697 -2379744 14359189 24427153 25922026
6865 25922026 23463789 18049485 9429036 3111124 4925397 10559428 9338390 -1514839
6857 -1514839 -13167774 -15911147 -8036060 5565881 17706106 21557918 14946569 3707906
6849 3707906 -3210890 -3005774 -221933 828859 345979 -598666 -3088058 -7835984 -13063178
6840 -13063178 -16893404 -19708933 -22810746 -26261145 -28585631 -27461774 -21310944 -11895671
6832 -11895671 -4317928 -2332464 -4736693 -8196831 -11289980 -12926802 -10047632 -2002410
$$ packed form
6891A680455K848415r12538m1358P2206m034851q164525p529365l493531o03630
6882b0178722n10699r39820P38446L515214K742465l460468q402212l374327Q408645
6873b1461478J2587104L338447o253309j882461J1291953J6738933J0067964J494873
6865B5922026k458237n414304q620449o317912J814273N634031j221038j0853229
6857a514839j1652935k743373P875087J3601941J2140225L851812o611349j1238663
6849C707906o918796K05116K783841J050792m82880r44645k489392m747926n227194
6840a3063178l830226k815529l101813l450399k324486J123857O150830R415273
6832a1895671P577743J985464k404229l460138l093149j636822K879170Q045222
$$ plain form
6824 -2002410 4923982 3589185 -4032563 -9200821 -8819810 -8639952 -12467013 -15147464 -10246708
6815 -10246708 245964 8281217 8776761 2998160 -4218191 -7638886 -4849549 592941
6807 592941 1644283 -3661136 -8540344 -5581746 3507267 9823556 7751415 167704
6799 167704 -6440533 -9141004 -10172515 -12788310 -16269811 -15826221 -8664604 803993 4822366
6790 4822366 1379405 -4212285 -7378020 -9085146 -10591698 -9081760 -3313578 758465
6782 758465 -3382541 -12520580 -16739880 -12598827 -7008305 -6749979 -9935346 -10706388 -7863659
6773 -7863659 -4859747 -3893294 -4103435 -4756690 -6843097 -11028058 -15900963 -18807331 -17632712
6764 -17632712 -12030203 -4013110 2714765 5268061 4074944 2357619 2666907 4431552
$$ packed form
6824b002410O926392j334797p621748n168258L81011J79858l827061k680451M900756
6815a0246708J0492672Q035253M95544n778601p216351l420695K789337N442490
6807E92941J051342n305419m879208K958598R089013O316289k072141p583711
6799A67704o608237k700471j031511k615795l481501M43590P161617R468597M018373
6790D822366l442961n591690l165735j707126j506552J509938N768182M072043
6782G58465m141006r138039m219300M141053N590522K58326l185367p71042K842729
6773g863659L003912R66453k10141o53255k086407m184961m872905k906368J174619
6764a7632712N602509Q017093O727875K553296j193117j717325L09288J764645
$$ plain form
6756 4431552 5649546 6451340 9210751 14382957 18126658 16370092 10423326 5609521
6748 5609521 4132670 2692654 -1340632 -4845677 -3237292 2456251 6894798 7985961
6740 7985961 8910724 12065183 14908756 13696422 8479588 2089327 -3794032 -8936614
6732 -8936614 -12226898 -12085560 -9312160 -7123708 -7379771 -8172879 -6285209 -1382777 3184387
6723 3184387 3644608 -576471 -6264185 -9075868 -7204942 -3086401 -1313240 -4171166
6715 -4171166 -9375761 -13071725 -14717152 -17170061 -21425635 -23670437 -19758433 -11167101
6707 -11167101 -3733857 -1126347 -2481189 -6024753 -11029418 -15309741 -15160172 -10556729
6699 -10556729 -7124914 -9403419 -14503698 -16341550 -14450044 -14108939 -18240890 -23621579
$$ packed form
6756D431552J217994Q01794K759411N172206L743701j756566n946766m813805
6748E609521j476851j440016m033286l505045J608385N693543M438547J091163
6740G985961R24763L154459K843573j212334n216834o390261n883359n142582
6732h936614l290284J41338K773400K188452k56063p93108J887670M902432M567164
6723C184387M60221m221079n687714k811683J870926M118541J773161k857926
6715d171166n204595l695964j645427k452909m255574k244802L912004Q591332
6707a1167101P433244K607510j354842l543564n004665m280323J49569M603443
6699a0556729L431815k278505n100279j837852J891506L41105m131951n380689
$$ plain form
6691 -23621579 -25792821 -24091138 -20795193 -18267392 -17782982 -18462116 -16927243 -11133142
6683 -11133142 -4788248 -3866651 -7738569 -8577323 -1892909 7165419 11497268 11319250 10778086
6674 10778086 9440693 4036273 -3444729 -6984527 -5930092 -6026600 -9716426 -12374175
6666 -12374175 -11107464 -10736710 -16106197 -23335748 -24692788 -19364463 -13611512 -11727761
6658 -11727761 -12339411 -13102181 -13643083 -13149695 -9886762 -4974314 -3069325 -6992971 -13743560
6649 -13743560 -17369366 -14209803 -4667842 7849028 18436341 23108936 21470183 16432871
6641 16432871 11153705 7479469 6792245 9532230 13361824 14700734 13273846 12616923
6633 12616923 14914417 18042248 19070863 17616750 13849357 6719862 -2585102 -8359627
$$ packed form
6691b3621579k171242J701683L295945K527801M84410o79134J534873N794101
6683a1133142O344894R21597l871918q38754O684414R058328M331849j78018n41164
6674A0778086j337393n404420p481002l539798J054435r6508l689826k657749
6666a2374175J266711L70754n369487p229551j357040N328325N752951J883751
6658a1727761o11650p62770n40902M93388L262933M912448J904989l923646o750589
6649a3743560l625806L159563R541961J2516870J0587313M672595j638753n037312
6641A6432871n279166l674236o87224K739985L829594J338910j426888o56923
6633A2616923K297494L127831J028615j454113l767393p129495r304964n774525
$$ plain form
6625 -8359627 -5886606 2081734 8179579 8910790 6697720 4310852 1574569 -1803998
6617 -1803998 -3804481 -2067363 3643276 11573820 18927339 22864160 22700230 20946775
6609 20946775 20095622 19097875 15708497 11249228 9078341 8694112 6229639 1719644 638601
6600 638601 5562381 10785889 9118539 971267 -7311491 -11848550 -13635400 -13977903 -12218822
6591 -12218822 -8462313 -5097507 -4431695 -6605569 -10119953 -12792497 -12506954 -9225297
6583 -9225297 -6333918 -7694319 -12763049 -16655308 -15923293 -12437607 -10261640 -10300489 -10157652
6574 -10157652 -8655383 -7823325 -9214445 -10205840 -6701573 570909 5358880 3010982
6566 3010982 -3828826 -8759452 -8904343 -5815236 -1183670 3649050 4652340 -2255405
$$ packed form
6625h359627K473021P968340O097845P31211k213070k386868k736283l378567
6617a803998k000483J737118N710639P930544P353519L936821j63930j753455
6609B0946775q51153r97747l389378m459269k170887l84229k464473m509995j081043
6600F38601M923780N223508j667350q147272q282758m537059j786850l42503J759081
6591a2218822L756509L364806O65812k173874l514384k672544K85543L281657
6583i225297K891379j360401n068730l892259P32015L485686K175967l8849J42837
6574a0157652J502269Q32058j391120r91395L504267P272482M787971k347898
6566C010982o839808m930626j44891L089107M631566M832720J003290o907745
$$ plain form
6558 -2255405 -13544334 -18651063 -12187817 -1407453 3277882 1866080 2814690 9276887
6550 9276887 14406222 11699912 4041836 -1016884 -1270975 -1026828 -3730730 -7290502 -7516933
6541 -7516933 -3960365 -378358 434737 369729 2846387 6935068 7812898 3914692 200242
6532 200242 1808336 7329518 11856544 14172673 16050693 15964643 9851692 -910835 -8227521
6523 -8227521 -6813038 -465573 4425894 7386970 11304426 14608164 12170250 3687366
6515 3687366 -4078539 -4712952 1828411 11641316 21476849 28834348 30913889 27067599
6507 27067599 20711311 15544951 10908483 4270306 -2541178 -4279698 -339874 3108814
6499 3108814 1980472 865062 5983934 14801988 19171696 17626532 17098174 21119843
$$ packed form
6558b255405j1288929n106729O463246J0780364M685335j411802R48610O462197
6550I276887N129335k706310p658076n058720k54091K44147k703902l559772k26431
6541g516933L556568L582007Q13095o5008K476658M088681Q77830l898206l714450
6532B00242J608094N521182M527026K316129J878020q6050o112951j0762527p316686
6523h227521J414483O347465M891467K961076L917456L303738k437914q482884
6515C687366p765905o34413O541363R812905R835533P357499K079541l846290
6507B7067599o356288n166360m636468o638177o811484j738520L939824L448688
6499C108814j128342j115410N118872Q818054M369708j545164n28358M021669
$$ plain form
6491 21119843 23674120 18471697 8251426 -117675 -4658046 -6367594 -2783545 8362942
6483 8362942 20836670 23777752 15078042 4295479 656339 4110398 10114676 16825073
6475 16825073 23674095 27823773 27022677 23421340 20650198 18913082 15919921 10748800
6467 10748800 4079519 -3340498 -9653809 -11417159 -7442924 -1632677 1216180 1260904
6459 1260904 2062473 4165566 4076090 92610 -4158353 -3802332 1225290 5943200 6046273
6450 6046273 2829518 1502908 4674566 9183789 10745637 9799748 9603574 9751605 6358568
6441 6358568 -757489 -6299572 -7234662 -7555191 -11740481 -17553576 -19854667 -18307352 -16128300
6432 -16128300 -13706049 -9420386 -5491741 -6551270 -11881252 -14815350 -11432060 -5134218
$$ packed form
6491B1119843K554277n202423j0220271q369101m540371j709548L584049J1146487
6483H362942J2473728K941082q699710j0782563l639140L454059O004278O710397
6475A6825073O849022M149678q01096l601337k771142j737116k993161n171121
6467A0748800o669281p420017o313311j763350L974235N810247K848857M4724
6459A260904Q01569K103093q9476l983480m250963L56021N027622M717910J03073
6450F046273l216755j326610L171658M509223J561848r45889j96174J48031l393037
6441F358568p116057n542083r35090l20529m185290n813095k301091J547315K179052
6432a6128300K422251M285663L928645j059529n329982k934098L383290O297842
$$ plain form
6424 -5134218 -832229 1007118 2226513 2951133 2782108 2997075 4327413 4777147 2899323
6415 2899323 1496587 4342549 9782106 11322300 5638128 -2610820 -5777241 -1706122
6407 -1706122 4767376 8358228 8927007 9421233 10491005 10260028 8887672 9451698 12881830
6398 12881830 15553491 14744439 13750354 17768777 26199204 32909204 33408977 28147412 19545385
6389 19545385 10219854 4182284 4820908 9947586 12656158 9041505 1960011 -4316738
6381 -4316738 -9369545 -14151446 -16883385 -15085842 -9652906 -3682209 1314168 5399252
6373 5399252 8100627 9230748 10395459 12544810 13005804 8216694 -953560 -9576331
6365 -9576331 -14166440 -14976735 -13070490 -8771881 -4101711 -3310711 -8306106 -15214297 -18173647
$$ packed form
6424e134218M301989J839347J219395P24620j69025K14967J330338M49734j877824
6415B899323j402736K845962N439557J540194n684172q248948l166421M071119
6407a706122O473498L590852N68779M94226J069772k30977j372356N64026L430132
6398A2881830K671661q09052r94085M018423Q430427O710000M99773n261565q602027
6389A9545385r325531o037570O38624N126678K708572l614653p081494o276749
6381d316738n052807m781901k731939J797543N432936N970697M996377M085084
6373E399252K701375J130121J164711K149351M60994m789110r170254q622771
6365i576331m590109q10295J906245M298609M670170P91000m995395o908191k959350
$$ plain form
6356 -18173647 -16144330 -13784241 -15360082 -19828258 -23113177 -23651826 -23285636 -22910093 -20249022
6347 -20249022 -13616510 -5558118 107474 3476992 7245177 10790517 10042471 4365999
6339 4365999 -754650 -545031 2884157 4367959 3006944 1989028 3041038 4976308
6331 4976308 6567186 7058635 4841710 -194890 -3615754 -632652 6093130 7798823
6323 7798823 613621 -9193544 -13617192 -12587935 -11540159 -12529993 -12821646 -11139024 -10189420
6314 -10189420 -12039265 -14825230 -15822661 -15078655 -14061532 -12923712 -11634996 -12324370 -17133637
6305 -17133637 -23631087 -25585448 -19966875 -11018687 -5244328 -4071560 -4310554 -4434448
6297 -4434448 -5901369 -7786121 -5355442 2682376 9410618 7216238 -1784166 -8206594
$$ packed form
6356a8173647K029317K360089j575841m468176l284919n38649L66190L75543K661071
6347b0249022O632512Q058392N665592L369518L768185L545340p48046n676472
6339D365999n120649K09619L429188J483802j361015j017916J052010J935270
6331D976308J590878M91449k216925n036600l420864K983102O725782J705693
6323G798823p185202r807165m423648J029257J047776r89834k91653J682622R49604
6314a0189420j849845k785965r97431P44006J017123J137820J288716o89374m809267
6305a7133637o497450j954361N618573Q948188N774359J172768k38994j23894
6297d434448j466921j884752K430679Q037818O728242k194380r000404o422428
$$ plain form
6289 -8206594 -7860569 -6010435 -7910271 -10883326 -9550976 -4751469 -2064702 -3270508
6281 -3270508 -4439026 -2628187 43713 745166 1111069 5124280 12856428 19032041 18633187
6272 18633187 12507419 5942619 2232546 8183 -2036213 -600986 8319149 21889458
6264 21889458 31462918 32353916 28269040 23799269 17337875 6057811 -5848151 -10655904
6256 -10655904 -7850900 -4736027 -5475343 -5788611 -955958 6494923 10969846 11452146 10568360
6247 10568360 9288581 7541800 7861050 12695113 18523638 18072613 9579612 -297055
6239 -297055 -4330619 -2013917 2571656 6569204 9291611 10017339 8383173 6087093 5373253
6230 5373253 6022648 5990476 4827122 4200759 4556509 3225454 -2829996 -13091139 -23177350
$$ packed form
6289h206594L46025J850134j899836k973055J332350M799507K686767j205806
6281c270508j168518J810839K671900P01453L65903M013211P732148O175613l98854
6272A8633187o125768o564800l710073k224363k044396J435227Q920135J3570309
6264B1889458R573460Q90998m084876m469771o461394j1280064j1905962m807753
6256a0655904K805004L114873p39316l13268M832653P450881M474923M82300q83786
6247A0568360j279779j746781L19250M834063N828525m51025q493001r876667
6239b97055m033564K316702M585573L997548K722407P25728j634166k296080p13840
6230E373253O49395l2172j163354o26363L55750j331055o055450j0261143j0086211
$$ plain form
6221 -23177350 -28326224 -27069385 -22023102 -17428762 -15649302 -15833428 -15930968 -15372809 -14867732
6212 -14867732 -13992158 -10939527 -5724823 -1980835 -3180798 -7481246 -9218502 -6566101
6204 -6566101 -4892165 -9905434 -19327258 -25031364 -22983708 -17042238 -12148759 -8146561
6196 -8146561 -3005917 1501273 1726105 -1908669 -5174206 -5851946 -5545643 -5692495 -5486940
6187 -5486940 -4416653 -3433055 -2575456 -632579 1585440 896675 -3473307 -7611326 -7602298
6178 -7602298 -4162093 -526103 1948420 3746873 4898630 5232086 5194108 4233329 437168
6169 437168 -5831249 -10365580 -10269394 -8378218 -8905981 -10901547 -10594619 -8632829 -9485571
6160 -9485571 -13820782 -16915553 -15685020 -12478333 -10247462 -8259779 -4801007 -533731
$$ packed form
6221b3177350n148874J256839N046283M594340J779460j84126r7540N58159N05077
6212a4867732Q75574L052631N214704L743988j199963m300448j737256K652401
6204f566101J673936n013269r421824n704106K047656N941470M893479M002198
6196h146561N140644M507190K24832l634774l265537o77740L06303j46852K05555
6187e486940J070287R83598Q57599J942877K218019o88765m369982m138019R028
6178g602298L440205L635990K474523J798453J151757L33456l7978r60779l796161
6169D37168o268417m534331R6186J891176n27763j995566L06928J961790q52742
6160i485571m335211l094771J230533L206687K230871J987683L458772M267276
$$ plain form
6152 -533731 3226609 6689758 9825941 10814753 8107783 2033531 -6533275 -16289562 -23600714
6143 -23600714 -24477281 -20196350 -16909966 -17384812 -17416653 -13374911 -8517267 -7340784 -8003436
6134 -8003436 -6280745 -3894484 -6013995 -11977152 -15554568 -14473299 -13004138 -13902943
6126 -13902943 -13968579 -9924550 -3564730 1683315 5021892 6447623 4809243 915162
6118 915162 -1022057 1289450 4276333 3581043 639615 41563 2059340 2531032 -15558
6109 -15558 -1555190 1701706 7773917 11250189 9916470 7186832 7751235 11817315 14925214
6100 14925214 13852374 10946571 10310101 10771003 6590549 -4072091 -15583808 -21966731
6092 -21966731 -23654265 -23691856 -21056935 -13268781 -3534014 1161657 -784832 -4119558
$$ packed form
6152e33731L760340L463149L136183R88812k706970o074252q566806r756287p311152
6143b3600714q76567M280931L286384m74846l1841M041742M857644J176483o62652
6134h003436J722691K386261k119511n963157l577416J081269J469161q98805
6126a3902943o5636M044029O359820N248045L338577J425731j638380l894081
6118I15162j937219K311507K986883o95290k941428n98052K017777M71692k546590
6109a5558j539632L256896O072211L476272j333719k729638N64403M066080L107899
6100A4925214j072840k905803o36470M60902m180454j0662640j1511717o382923
6092b1966731j687534l7591K634921P788154R734767M695671j946489l334726
$$ plain form
6084 -4119558 -5381718 -7178509 -11482176 -14272935 -11152678 -4494324 -302699 -356655 -1902973
6075 -1902973 -3238468 -4746333 -5376074 -3187038 357986 1318301 -591547 -1306197 508951
6066 508951 307143 -5188832 -11401946 -11096437 -4473628 519783 -2141206 -10521281 -18977330
6057 -18977330 -24550648 -26928779 -25003178 -17477328 -6995461 -455232 -2730304 -10518229
6049 -10518229 -14654290 -9909830 -1418372 714555 -6908339 -17220248 -21611833 -19757924
6041 -19757924 -17755987 -18545338 -18781110 -15704646 -12681375 -14926909 -21840994 -26794422
6033 -26794422 -24409370 -16177754 -8659748 -7075499 -10616972 -13519913 -11063726 -4783323
6025 -4783323 -1054573 -4381644 -13330879 -23338923 -31364919 -36357671 -37303026 -33656875
$$ packed form
6084d119558j262160j796791m303667k790759L120257O658354M191625n3956j546318
6075a902973j335495j507865o29741K189036L545024R60315j909848p14650J815148
6066E08951k01808n495975o213114L05509O622809M993411k660989q380075q456049
6057a8977330n573318k378131J925601P525850J0481867O540229k275072p787925
6049a0518229m136061M744460Q491458K132927p622894j0311909m391585J853909
6041a9757924K001937p89351k35772L076464L023271k245534o914085m953428
6033b6794422K385052Q231616P518006J584249l541473k902941K456187O280403
6025d783323L728750l327071q949235j0008044q025996m992752r45355L646151
$$ plain form
6017 -33656875 -27080304 -20329673 -14590427 -9797056 -6897842 -7028952 -8375947 -6870541
6009 -6870541 -1096437 5882099 10766587 13656727 15747760 15961136 12926118 8948606
6001 8948606 8349979 11581052 14131886 12558941 9059246 7973649 9539125 10091031 8161380
5992 8161380 7263532 11142101 18127255 22260719 19456605 11092832 2099666 -2895224
5984 -2895224 -2119806 2299445 5512143 4236494 505894 -803683 1328417 2513736
5976 2513736 -629086 -5556760 -7852389 -7552145 -7851218 -9340089 -9801127 -8912696 -8598569
5967 -8598569 -8569340 -6101105 -1243153 2145343 2145321 1316749 1513179 766997 -1628746 -1683005
5957 -1683005 2964317 7226232 5216660 240030 1015490 8403457 13274953 9377850
$$ packed form
6017c3656875O576571O750631N739246M793371K899214j31110j346995J505406
6009f870541N774104O978536M884488K890140K091033K13376l035018l977512
6001H948606n98627L231073K550834j572945l499695j085597J565476N51906j929651
5992H161380q97848L878569O985154M133464k804114q363773q993166m994890
5984b895224P75418M419251L212698j275649l730600j309577K132100J185319
5976B513736l142822m927674k295629L00244k99073j488871m61038Q88431L14127
5967h598569K9229K468235M857952L388496k2q28572J96430p46182k395743n4259
5957a683005M647322M261915k009572m976630P75460P387967M871496l897103
$$ plain form
5949 9377850 1694649 -1640804 -538632 -1115056 -5796153 -10532654 -11119551 -8310336 -6322081
5940 -6322081 -8510368 -14443028 -19910679 -20825888 -18340586 -18002747 -21720048 -23343067 -16280542
5931 -16280542 -3714904 4045390 2379388 -2790748 -4194427 -1889879 84187 715640
5923 715640 832289 -1620149 -8741412 -15915767 -14266261 -1814825 12363249 18034364
5915 18034364 14792810 10049850 8447957 7546068 3749908 -1713785 -4971887 -5437138
5907 -5437138 -6522968 -10425561 -14644403 -15112351 -11353174 -6398536 -2100039 2681468
5899 2681468 8384644 12205494 11783617 9413879 9042666 9945266 7579813 1237177 -3566263
5890 -3566263 -2452792 1888569 4454759 5493887 8664525 13301219 14164707 9651347
$$ packed form
5949I377850p683201l335453J102172n76424m681097m736501n86897K809215J988255
5940f322081k188287n932660n467651r15209K485302L37839l717301j623019P062525
5931a6280542J2565638P760294j666002n170136j403679K304548J974066O31453
5923G15640J16649k452438p121263p174355J649506J2451436J4178074N671115
5915A8034364l241554m742960j601893r01889l796160n463693l258102m65251
5907e437138j085830l902593m218842m67948L759177M954638M298497M781507
5899B681468N703176L820850m21877k369738l71213R02600k365453o342636m803440
5890c566263J113471M341361K566190J039128L170638M636694Q63488m513360
$$ plain form
5882 9651347 5099846 5149075 6496139 2294010 -7887018 -16652486 -17623117 -12448441 -7692740
5873 -7692740 -7108956 -9156402 -10895144 -11473620 -11133438 -8928372 -3421030 4735055 12405271
5864 12405271 16488866 16177366 12909143 9100031 6894652 6900350 7640502 7088668 5013413
5855 5013413 2864597 1219469 -1205141 -5335021 -9835800 -12353433 -11812758 -9100056
5847 -9100056 -6756615 -8214812 -15044531 -23694669 -27195897 -22166277 -12615150 -5052699
5839 -5052699 -1809259 -1480561 -3540987 -8444967 -13969497 -15656993 -11707339 -4735442
5831 -4735442 1733991 6138704 8290790 8733338 9148854 11039179 13617497 14884659 14286256
5822 14286256 11987642 6839272 -1140527 -7154257 -5496279 2502872 9288717 10740804
$$ packed form
5882I651347m551501M9229J347064m202129j0181028q765468r70631N174676M755701
5873g692740N83784k047446j738742n78476L40182K205066N507342Q156085P670216
5864A2405271M083595l11500l268223l809112k205379N698P40152n51834k075255
5855E013413k148816j645128k424610m129880m500779k517633N40675K712702
5847i100056K343441j458197o829719q650138l501228N029620R551127P562451
5839e052699L243440L28698k060426m903980n524530j687496L949654O971897
5831d735442O469433M404713K152086M42548M15516J890325K578318J267162n98403
5822A4286256k298614n148370p979799o013730J657978P999151O785845J452087
$$ plain form
5814 10740804 9841218 9397649 7272276 1895013 -3381174 -5805436 -7844995 -11022954
5806 -11022954 -10082703 -194662 13365151 20329065 18633281 15170233 14087317 12174726
5798 12174726 7130609 3142498 5006279 11627157 18259639 21436575 19803486 14322178
5790 14322178 9779598 11590641 18217339 20962939 14720879 4997021 183068 561806
5782 561806 288122 -2412647 -3625634 -1883403 -1358690 -4885464 -8788126 -8034159 -3456619
5773 -3456619 -255102 -943835 -3273638 -4666375 -5338873 -6166331 -6134661 -3938695 -863154
5764 -863154 33812 -2486259 -6474650 -9033487 -8764731 -6178609 -3234048 -2595025 -5419046
5755 -5419046 -9068071 -8838388 -3425128 2570993 3085962 -3220350 -12139640 -17988450 -17432584
$$ packed form
5814A0740804q99586m43569k125373n377263n276187k424262k039559l177959
5806a1022954R40251R888041J3559813O963914j695784l463048j082916j912591
5798A2174726n044117l988111J863781O620878O632482L176936j633089n481308
5790A4322178m542580J811043O626698K745600o242060r723858m813953L78738
5782E61806k73684k700769j212987J742231N24713l526774l902662P53967M577540
5773c456619L201517o88733k329803j392737o72498q27458L1670K195966L075541
5764h63154Q96966k520071l988391k558837K68756K586122K944561O39023k824021
5755e419046l649025K29683N413260N996121N14969o306312q919290n848810N55866
$$ plain form
5746 -17432584 -11156754 -3872725 -1322798 -4779490 -9215286 -9035578 -4624224 -781348
5738 -781348 72051 -349295 -790969 -2818480 -7489433 -12607318 -14645246 -11580649 -3691177
5729 -3691177 5756175 10460333 5640941 -5484010 -12834841 -9530476 1159243 10660171
5721 10660171 14403300 13931451 12227560 10756683 10560741 12811110 17129053 20926134
5713 20926134 21424465 18080896 12910012 8418735 5038969 1216385 -3125740 -4596813
5705 -4596813 -432445 6044108 7886179 3380576 -1461692 -1409373 652251 -1761017 -9645502
5696 -9645502 -17920163 -22120324 -21505899 -16590509 -8214825 525935 5364570 5096937 2134132
5687 2134132 -1529835 -5712479 -8788240 -7118750 -302484 5904506 5328004 -1256598
$$ packed form
5746a7432584O275830P284029K549927l456692m435796J79708M411354L842876
5738g81348Q53399m21346m41674k027511m670953n117885k037928L064597P889472
5729c691177R447352M704158m819392j1124951p350831L304365J0689719R500928
5721A0660171L743129m71849j703891j470877j95942K250369M317943L797081
5713B0926134M98331l343569n170884m491277l379766l822584m342125j471073
5705d596813M164368O476553J842071m505603m842268N2319K061624k413268p884485
5696i645502q274661m200161O14425M915390Q375684Q740760M838635k67633k962805
5687B134132l663967m182644l075761J669490O816266O206990n76502o584602
$$ plain form
5679 -1256598 -7468944 -9206950 -7979482 -6421729 -4211096 -365847 3066926 2842521
5671 2842521 -710933 -3682553 -3562507 -1742483 -644243 -1274887 -4661043 -11932780 -20046604
5662 -20046604 -21008903 -10693883 3040894 7178609 -819582 -9938527 -10124461 -4203899
5654 -4203899 -1708633 -5950847 -12821115 -19087954 -25156509 -30357219 -31769007 -29022224
5646 -29022224 -25745844 -24635321 -24506919 -23461193 -21482587 -18361514 -12676493 -5455161
5638 -5455161 -1827124 -5305099 -11796882 -13042505 -6091357 3669752 9628602 11115281
5630 11115281 11409175 10873414 6095577 -3568895 -12364879 -14197195 -10684725 -9443476
5622 -9443476 -14364336 -21271630 -24365736 -23316239 -21319593 -18886825 -13413321 -4223132
$$ packed form
5679a256598o212346j738006J227468J557753K210633L845249L432773k24405
5671B842521l553454k971620J20046J820024J098240o30644l386156p271737q113824
5662b0046604r62299J0315020J3734777M137715p998191r118945j85934N920562
5654d203899K495266m242214o870268o266839o068555n200710j411788K746783
5646b9022224L276380J110523J28402J045726J978606L121073N685021P221332
5638e455161L628037l477975o491783j245623O951148R761109N958850J486679
5630A1115281K93894n35761m777837r664472q795984j832316L512470J241249
5622i443476m920860o907294l094106J049497J996646K432768N473504R190189
$$ plain form
5614 -4223132 5015951 9163657 5450902 -4553142 -14827961 -17977041 -11338856 32460
5606 32460 8548637 11736452 12633613 13768520 14251580 12856798 10493410 8685101 8310156
5597 8310156 10435107 15249917 19220483 17064515 8981008 2794498 5414045 13971305
5589 13971305 19146772 16498075 10664829 8065139 9356514 11082623 11664999 12226983
5581 12226983 12667557 10885820 6814744 4056392 5302465 8105751 7824854 3634340
5573 3634340 -1182577 -4341109 -6926586 -10572157 -15170034 -19795423 -23049939 -22129620
5565 -22129620 -15033502 -4696644 2725309 5118663 6080546 7707775 6726004 1079306
5557 1079306 -4752063 -6178523 -6102408 -9804510 -15342054 -16400532 -13119272 -12071430 -15153744
$$ packed form
5614d223132R239083M147706l712755j0004044j0274819l149080O638185J1371316
5606C2460Q516177L187815Q97161J134907M83060j394782k363388j808309l74945
5597H310156K124951M814810L970566k155968q083507o186510K619547Q557260
5589A3971305N175467k648697n833246k599690J291375J726109N82376N61984
5581A2226983M40574j781737m071076k758352J246073K803286k80897m190514
5573C634340m816917l158532k585477l645571m597877m625389l254516R20319
5565b2129620P096118J0336858P421953K393354R61883J627229r81771n646698
5557A079306n831369j426460P6115l702102n537544j058478L281260J047842l082314
$$ plain form
5548 -15153744 -16409554 -12200935 -7602903 -8735131 -13727456 -15729398 -11976220 -6197275
5540 -6197275 -3582242 -5637105 -8854657 -7596100 16629 8917856 12092451 8486020
5532 8486020 3050006 -352226 -2051551 -3097969 -3698466 -5499878 -10317242 -15887363
5524 -15887363 -18123935 -18096883 -20496337 -24144112 -21557830 -10659092 583658 5040002
5516 5040002 4707048 3772358 1360276 -2620816 -2239205 5376527 11953318 8732980 651602
5507 651602 -426710 6411695 10952998 8484264 5577071 7888946 11940942 12131388 8372701
5498 8372701 3621977 -170622 -1336034 673446 1990244 -2355850 -10199611 -13290745
5490 -13290745 -8416378 -1464848 1511136 885301 -1163786 -4834027 -8681929 -8184997
$$ packed form
5548a5153744j255810M208619M598032j132228m992325k001942L753178N778945
5540f197275K615033k054863l217552J258557P612729Q901227L174595l606431
5532H486020n436014l402232j699325j046418o00497j801412m817364n570121
5524a5887363k236572K7052k399454l647775K586282J0898738J1242750M456344
5516E040002l32954r34690k412082l981092L81611P615732O576791l220338q081378
5507F51602j078312O838405M541303k468734k907193K311875M051996J90446l758687
5498H372701m750724l792599j165412K009480J316798m346094p843761l091134
5490a3290745M874367O951530K975984o25835k049087l670241l847902M96932
$$ plain form
5482 -8184997 -3143842 -787709 -6160608 -14191542 -16745569 -13320763 -9152409 -6643069
5474 -6643069 -5028569 -5607203 -10372315 -16557003 -18627264 -15608061 -11606022 -9316533
5466 -9316533 -7589096 -5389840 -3680343 -2662892 -907742 1746750 3325316 2821169
5458 2821169 2123226 3851328 8138169 11719910 10261350 3047211 -4517287 -5979108
5450 -5979108 -2300817 -1180703 -5758686 -9104333 -4484910 3554453 4992003 -1945625
5442 -1945625 -10478544 -16723000 -22454049 -26266503 -21948711 -9512704 331793 -1422345
5434 -1422345 -10808878 -17728392 -19136374 -18613990 -16366409 -8048687 6368542 19524699
5426 19524699 24721395 22771289 18896764 16280823 14934260 14346557 14375738 14140318 11882564
$$ packed form
5482h184997N041155K356133n372899q030934k554027L424806M168354K509340
5474f643069J614500n78634m765112o184688k070261L019203M002039K289489
5466i316533J727437K199256J709497J017451J755150K654492J578566n04147
5458B821169o97943J728102M286841L581741j458560p214139p564498j461821
5450e979108L678291J120114m577983l345647M619423Q039363J437550o937628
5442a945625q532919o244456n731049l812454M317792J2436007R844497j754138
5434a422345r386533o919514j407982N22384K247581Q317722J4417229J3156157
5426A9524699N196696j950106l874525k615941j346563n87703K9181k35420k257754
$$ plain form
5417 11882564 6358020 -1708219 -9254892 -12481154 -10094624 -5190346 -2920867 -5885903
5409 -5885903 -12120840 -17240991 -17923119 -14066450 -8983468 -7253184 -10904981 -17408332
5401 -17408332 -22220391 -23094550 -21056941 -18056449 -15497016 -14583869 -15685583 -17041056
5393 -17041056 -16403186 -14584694 -14917082 -18023198 -19649382 -15757685 -7918103 -1333512
5385 -1333512 1049482 -1995 -3070340 -7360898 -11255451 -12899521 -12933163 -13975641 -16419515
5376 -16419515 -17146270 -13809346 -8412385 -4977187 -5074709 -7195785 -9312475 -10416508 -10358017
5367 -10358017 -9670411 -9062819 -8119320 -5436685 -1182190 1740679 943157 -1745608 -1964731
5358 -1964731 1674157 5534983 5115931 386335 -3568864 -1074310 8690007 20350098
$$ packed form
5417A1882564n524544q066239p546673l226262K386530M904278K269479k965036
5409e885903o234937n120151o82128L856669N082982J730284l651797o503351
5401a7408332m812059q74159K037609L000492K559433R13147j101714j355473
5393a7041056O37870J818492l32388l106116j626184L891697P839582O584591
5385a333512K382994j051477l068345m290558l894553j644070l3642j042478k443874
5376a6419515p26755L336924N396961L435198r7522k121076k116690j104033N8491
5367a0358017O87606O07592R43499K682635M254495K922869p97522k688765k19123
5358a964731L638888L860826m19052m729596l955199K494554R764317J1660091
$$ plain form
5350 20350098 26855715 25776823 20658152 16112524 12910773 8487331 661671 -10258701
5342 -10258701 -21437117 -28159014 -26391020 -16850432 -5259849 3297664 8630654 12266541
5334 12266541 13149074 10494407 8366835 11451135 16802692 16176529 7878572 367574
5326 367574 1455945 9040598 15656360 17257194 13507346 4320584 -7980766 -16220187
5318 -16220187 -14588685 -6286893 301162 2011008 2166008 2603074 1151498 -2176656
5310 -2176656 -3153790 -132618 2574983 1471437 -630222 77004 1511495 -890273 -6468369
5301 -6468369 -10422306 -11501703 -13335975 -17750790 -21431881 -20724165 -16119937 -10106890
5293 -10106890 -3609872 2961578 7398973 7541950 4707754 2720930 3459312 5204098
$$ packed form
5350B0350098O505617j078892n118671m545628l201751m423442p825660j0920372
5342a0258701j1178416o721897J767994R540588J1590583Q557513N332990L635887
5334A2266541Q82533k654667k127572L084300N351557o26163q297957p510998
5326C67574J088371P584653O615762J600834l749848r186762j2301350q239421
5318a6220187J631502Q301792O588055J709846J55000M37066j451576l328154
5310b176656r77134L021172K707601j103546k101659P07226J434491k401768n578096
5301f468369l953937j079397j834272m414815l681091P07716M604228O013047
5293a0106890O497018O571450M437395J42977k834196j986824P38382J744786
$$ plain form
5285 5204098 5587800 4421277 2845540 1013227 -1956865 -5783076 -7764503 -4564511
5277 -4564511 4370559 15343035 22894544 23980995 19449904 11858105 3346462 -3825583
5269 -3825583 -6708957 -3984463 1702071 5963963 7271263 7348560 7162370 5420277 1954875
5260 1954875 -425598 456316 2925022 4073581 3531298 2078606 -1173336 -6467504 -9889298
5251 -9889298 -6938382 464170 5126753 3553402 -561917 -2993767 -4301570 -5905245
5243 -5905245 -5483049 -672380 5580624 8126826 6508935 4316113 2661238 -913348
5235 -913348 -6773568 -10958766 -10250341 -6365420 -3404438 -3401614 -5783549 -9019336 -11053216
5226 -11053216 -9755328 -4876523 1156443 5604484 7942671 9296653 10366025 10953728
$$ packed form
5285E204098L83702j166523j575737j832313k970092l826211j981427L199992
5277d564511Q935070J0972476P551509J086451m531091p591799q511643p172045
5269c825583k883374K724494N686534M261892J307300P7297j86190j742093l465402
5260A954875k380473Q81914K468706J148559n42283j452692l251942n294168l421794
5251i889298K950916P402552M662583j573351m115319k431850j307803j603675
5243e905245M22196M810669O253004K546202j617891k192822j654875l574586
5235i13348n860220m185198P08425L884921K960982K824k381935l235787k033880
5226a1053216J297888M878805O032966M448041K338187J353982J069372N87703
$$ plain form
5218 10953728 10889989 10455719 10165357 10514776 11386216 11520029 9598494 6380061 4699697
5209 4699697 6488802 10588620 14394333 16856110 18565203 19218663 16633669 9247451
5201 9247451 -816455 -8234183 -8924162 -4188524 218014 -292921 -4863892 -8978691
5193 -8978691 -9593373 -7215746 -3667903 -47733 2742934 3706829 3261701 3341833 4442174
5184 4442174 4055164 62603 -5506773 -8702279 -9029724 -9437166 -10568929 -8738366 -1877874
5175 -1877874 5431110 6706015 2332254 -364902 3646389 11184934 15543201 14145855
5167 14145855 9457222 4838114 2513884 3961207 8650769 12714885 12067498 7077561
5159 7077561 1464995 -3193296 -8223701 -12852683 -13381531 -9922260 -9431078 -17236297 -28137723
$$ packed form
5218A0953728o3739m34270k90362L49419Q71440J33813j921535l218433j680364
5209D699697J789105M099818L805713K461777J709093O53460k584994p386218
5201I247451j0063906p417728o89979M735638M406538n10935m570971m114799
5193h978691o14682K377627L547843L620170K790667R63895m45128Q0132J100341
5184D442174l87010l992561n569376l195506l27445m07442j131763J830563O860492
5175a877874P308984J274905m373761k697156M011291P538545M358267j397346
5167A4145855m688633m619108k324230J447323M689562M064116o47387m989937
5159G077561n612566m658291n030405m628982n28848L459271M91182p805219j0901426
$$ plain form
5150 -28137723 -31614575 -25362445 -18030000 -17342341 -20918870 -22086984 -20418661 -20996571
5142 -20996571 -24604684 -24481756 -14838268 878238 13097428 15973461 11661921 5738859
5134 5738859 1373197 -1328994 -2668032 -2081975 888568 5300632 8316413 6299963
5126 6299963 -1915167 -12277686 -18126123 -17087924 -13471595 -11727585 -9799656 -2712029
5118 -2712029 8425292 15885680 14794561 8987308 5314170 5332569 5375328 2644035 -1769702
5109 -1769702 -5100258 -6010129 -5633676 -6169755 -7731475 -7193999 -2739797 779224 -4461441
5100 -4461441 -18403443 -30501189 -31510485 -24242856 -18272829 -17164350 -16620631 -13472003
5092 -13472003 -9840740 -7742061 -5376136 -1202318 2250072 1423048 -3551176 -9024073
$$ packed form
5150b8137723l476852O252130P332445O87659l576529j168114J668323n77910
5142b0996571l608113J22928R643488J5716506J2219190K876033m311540n923062
5134E738859m365662k702191j339038N86057K970543M412064L015781k016450
5126F299963q215130j0362519n848437J038199L616329J744010J927929P087627
5118b712029J1137321P460388j091119n807253l673138J8399M2759k731293m413737
5109a769702l330556r09871L76453n36079j561720N37476M454202L519021n240665
5100d461441j3942002j2097746j009296P267629N970027J108479N43719L148628
5092a3472003L631263K098679K365925M173818L452390q27024m974224n472897
$$ plain form
5084 -9024073 -11234074 -8705014 -3255873 328778 -2380487 -10842423 -19214074 -21765841
5076 -21765841 -18155395 -12853939 -9941010 -9031371 -6478736 -647429 4902974 5129864
5068 5129864 33839 -5211769 -7056538 -7017966 -7006397 -5491333 -1369471 2335477 2939374
5059 2939374 2984276 5703495 8434678 6335503 665401 -2807889 -2370105 -1064404 12492
5050 12492 2042587 2478595 -3494554 -14340013 -22370434 -24271761 -24102312 -23721792 -18421852
5041 -18421852 -6049951 7078560 14553675 17577017 18855630 15717934 6894997 608219
5033 608219 6288079 20313526 28823653 24797608 14890036 8223463 5331076 1422740
5025 1422740 -4171375 -6449109 -1652940 7197866 12792224 11157091 5718131 2842824
$$ packed form
5084i024073k210001K529060N449141L584651k709265q461936q371651k551767
5076b1765841L610446N301456K912929R09639K552635N831307N550403K26890
5068E129864n096025n245608j844769L8572J1569J515064M121862L704948O03897
5059B939374M4902K719219K731183k099175n670102l473290M37784J305701J076896
5050A2492K030095M36008n973149j0845459q030421j901327J69449L80520N299940
5041a8421852J2371901J3128511P475115L023342J278613l137696q822937o286778
5033F08219N679860J4025447Q510127m026045r907572o666573k892387l908336
5025A422740n594115k277734M796169Q850806N594358j635133n438960k875307
$$ plain form
5017 2842824 4577894 8109303 11342462 15042925 19113658 21034404 19454582 15818110
5009 15818110 11549616 7656380 7420327 13618402 21633139 22215930 14139132 7114567
5001 7114567 8041202 11743613 11023432 8462311 10521753 16240788 20802207 25286130 33019770
4992 33019770 39961480 39114882 32164860 26445252 22300158 14728923 6713577 8089299
4984 8089299 18914151 26087358 21207969 11488041 7231154 7664205 6141636 1757420
4976 1757420 -2247708 -6268093 -12536624 -18770146 -20456603 -17355814 -12104127 -4603358
4968 -4603358 6323756 17035961 20813317 16100191 8818353 5434640 6433566 7486532
4960 7486532 5274918 1255458 -20946 3575191 8359544 8472655 2925963 -2968628
$$ packed form
5017B842824J735070L531409L233159L700463M070733J920746j579822l636472
5009A5818110m268494l893236k36053O198075Q014737N82791q076798p024565
5001G114567R26635L702411p20181k561121K059442N719035M561419M483923P733640
4992C3019770O941710q46598o950022n719608m145094p571235q015346J375722
4984H089299J0824852P173207m879389r719928m256887M33051j522569m384216
4976A757420m005128m020385o268531o233522j686457L100789N251687P500769
4968d603358J0927114J0712205L777356m713126p281838l383713R98926J052966
4960G486532k211614m019460j276404L596137M784353J13111n546692n894591
$$ plain form
4952 -2968628 -3527659 2030255 10350002 17092780 18541867 13286466 4433114 -1733459
4944 -1733459 -1188090 4498265 10600833 13428599 11954247 7662163 3813879 3245244 6008414
4935 6008414 9946463 13153722 14641036 13846963 11776452 11559031 15256504 20981407 25482349
4926 25482349 27898576 28173758 24392297 16153429 8496661 7038893 10249682 11785999
4918 11785999 9464173 6401710 4403213 2587128 2007940 4738246 8050168 6280051
4910 6280051 -709731 -7198872 -10043697 -10726861 -8947014 -2223121 6737326 10336832
4902 10336832 6278150 570444 -1679058 -1710948 -1755311 -1299472 -296012 701818 4221403
4893 4221403 12377185 20332304 22096953 21406894 25755183 31322202 27956007 18493123
$$ packed form
4952b968628n59031N557914Q319747O742778J449087n255401q853352o166573
4944a733459N45369N686355O102568K827766j474352m292084l848284n68635K763170
4935F008414L938049L207259J487314p94073k070511k17421L697473N724903M500942
4926B5482349K416227K75182l781461q238868p656768j457768L210789J536317
4918A1785999k321826l062463j998497j816085n79188K730306L311922j770117
4910F280051o989782o489141k844825o83164J779847O723893Q960447L599506
4902A0336832m058682n707706k249502l1890m4363M55839J003460R97830L519585
4893D221403Q155782P955119J764649o90059M348289N567019l366195r462884
$$ plain form
4885 18493123 16341708 22810999 25870420 23988114 29092904 40810324 43379529 37081770
4877 37081770 43630121 66656587 81418318 87238812 130624547 232490247 321939652
4870 321939652 302344412 176700195 50098508 1435991 6776224 5648484 -11881524
4863 -11881524 -19122143 -12141468 -9606958 -13495438 -10133753 -1325558 -1817243 -10683917
4855 -10683917 -12904968 -6580336 -4142652 -7993463 -7484084 -432211 2906049 -871038
4847 -871038 -3478142 -2015660 -3822925 -10336344 -11638297 -2870589 6658210 7127900 1112711
4838 1112711 -3007132 -2873622 -2229883 -4582639 -10356186 -16636620 -18698479 -15447660 -12311141
4829 -12311141 -14188854 -18010449 -18294310 -16960286 -19655280 -24694009 -24818530 -19048036
$$ packed form
4885A8493123k151415O469291L059421j882306N104790J1717420K569205o297759
4877C7081770O548351K3026466J4761731N820494M3385735J01865700Q9449405
4870C21939652j9595240j25644217j26601687m8662517N340233j127740j7530008
4863a1881524p240619O980675K534510l888480L361685Q808195m91685q866674
4855a0683917k221051O324632K437684l850811N09379P051873L338260l777087
4847h71038k607104J462482j807265o513419j301953Q767708R528799M69690o015189
4838A112711m119843J33510O43739k352756n773547o280434k061859L250819L136519
4829a2311141j877713l821595k83861J334024k694994n038729j24521N770494
$$ plain form
4821 -19048036 -13656406 -11434145 -8977990 -5300882 -4302676 -7093587 -9769615 -10547810
4813 -10547810 -11950383 -14481646 -15058297 -13019191 -11148378 -9970673 -7646648 -5619887
4805 -5619887 -6895494 -8555100 -4304471 4733363 10416628 10053590 9490352 11871555 12753316
4796 12753316 9372173 5390605 2448245 -3903418 -14882490 -23516070 -24565409 -21864951
4788 -21864951 -20250253 -17716736 -11803803 -6553560 -5962451 -6614826 -4121770 -1521141
4780 -1521141 -3864983 -9168797 -12303158 -13888508 -17657546 -22118167 -22455206 -18717351
4772 -18717351 -15348297 -14174121 -13841775 -14574340 -17802784 -22409648 -26109434 -28734409
4764 -28734409 -29974155 -26828530 -18050610 -7809021 29344 7196216 14940089 17715996
$$ packed form
4821a9048036N391630K222261K456155L677108R98206k790911k676028p78195
4813a0547810j402573k531263n76651K039106J870813J177705K324025K026761
4805e619887j275607j659606M250629R037834N683265l63038n63238K381203Q81761
4796A2753316l381143l981568k942360o351663j0979072q633580j049339K700458
4788b1864951J614698K533517N912933N250243N91109o52375K493056K600629
4780a521141k343842n303814l134361j585350l769038m460621l37039L737855
4772a8717351L369054J174176L32346p32565l228444m606864l699786k624975
4764b8734409j239746L145625Q777920J0241589P838365P166872P743873K775907
$$ plain form
4756 17715996 10833681 318168 -3836592 -1191222 1715680 4303119 10859322 17994010
4748 17994010 16305810 6375186 518100 4583994 9656024 7429708 2796614 3605750
4740 3605750 7648132 8953477 9024943 11690785 13242940 8812142 3828407 7052837 14700348
4731 14700348 14142841 3538425 -4757752 -3148409 665018 -2367053 -8435876 -8866921
4723 -8866921 -4889847 -4634602 -9388725 -12674739 -11938586 -12060634 -15841753 -18739968 -16426875
4714 -16426875 -11848227 -10481921 -12347152 -13150202 -11090961 -8198403 -5909533 -3424287
4706 -3424287 -740667 138117 -1555461 -3169557 -1631658 2206916 3888098 278485
4698 278485 -6669768 -11866186 -12747323 -11948757 -13358451 -16417518 -16546400 -11514292 -4941149
$$ packed form
4756A7715996o882315j0515513m154760K645370K906902K587439O556203P134688
4748A7994010j688200r930624n857086M065894N072030k226316m633094Q09136
4740C605750M042382J305345P1466K665842J552155m430798m983735L224430P647511
4731A4700348n57507j0604416q296177J609343L813427l032071o068823m31045
4723h866921L977074K55245m754123l286014P36153j22048l781119k898215K313093
4714a6426875M578648J366306j865231q03050K059241K892558K288870K485246
4706c424287K683620Q78784j693578j614096J537899L838574J681182l609613
4698B78485o948253n196418q81137P98566j409694l059067j28882N032108O573143
$$ plain form
4689 -4941149 -2008297 -3475974 -5647367 -4730528 581666 9243341 18160238 23493354
4681 23493354 24069679 22665697 21978192 21027992 18198043 15531793 15700395 16213007 12016222
4672 12016222 3608812 -3086126 -5616224 -7792052 -11854583 -14155542 -12170483 -10325121
4664 -10325121 -14031402 -21855361 -28348143 -31451834 -32500638 -31845122 -29288938 -26313805
4656 -26313805 -23121989 -16099104 -3381420 9624325 16104190 16990963 17806014 18326774
4648 18326774 13326484 3436694 -3001424 -923130 5450771 9803711 10532432 8059302
4640 8059302 2238927 -3841788 -3824489 3269683 9434338 7725877 1330263 -2787801 -4909062
4631 -4909062 -10522665 -20055363 -27732760 -29806699 -27677207 -22962428 -15412741 -6674729
$$ packed form
4689d941149K932852j467677k171393R16839N312194Q661675Q916897N333116
4681B3493354N76325j403982o87505r50200k829949k666250J68602N12612m196785
4672A2016222q407410o694938k530098k175828m062531k300959J985059J845362
4664a0325121l706281p823959o492782l103691j048804O55516K556184K975133
4656b6313805L191816P022885J2717684J3005745O479865Q86773Q15051N20760
4648A8326774n000290r889790o438118K078294O373901M352940P28721k473130
4640H059302n820375o080715J7299P094172O164655j708461o395614m118064k121261
4631d909062n613603r532698p677397k073939K129492M714779P549687Q738012
$$ plain form
4623 -6674729 -887189 461192 530366 2167342 3935662 2861273 -1216162 -5813624 -8827231
4614 -8827231 -10018915 -10348502 -10665059 -10853947 -10491265 -10430570 -12210925 -14961425 -15118870
4605 -15118870 -11313532 -7280913 -6763085 -7390686 -3753768 4392795 11488149 13707330
4597 13707330 12739268 11433532 10062054 8293031 6917808 5762546 3221052 -502716
4589 -502716 -3058752 -4303309 -6886441 -10401029 -9837870 -3847048 -181875 -7009393 -21026122
4580 -21026122 -30346780 -28635255 -20613904 -13262942 -7818058 -3051314 -1112401 -5070839
4572 -5070839 -12735983 -17593995 -16193186 -11652111 -8968928 -8824923 -7442054 -1835758
4564 -1835758 6140186 11415533 10992163 7145533 5150074 7796393 12106346 11610219 2573409
$$ packed form
4623f674729N787540J348381O9174J636976J768320j074389m077435m597462l013607
4614h827231j191684l29587l16557j88888L62682O0695j780355k750500j57445
4605a5118870L805338M032619N17828o27601L636918Q146563P095354K219181
4597A3707330r68062j305736j371478j769023j375223j155262k541494l723768
4589e02716k556036j244557k583132l514588N63159N990822L665173o827518j4016729
4580b1026122r320658J711525Q021351P350962N444884M766744J938913l958438
4572e070839p665144m858012J400809M541075K683183J44005J382869N606296
4564a835758P975944N275347m23370l846630j995459K646319M309953m96127r036810
$$ plain form
4555 2573409 -11438136 -21845928 -23124406 -18290807 -14892948 -15903329 -17067824 -13785568
4547 -13785568 -7470979 -2889414 -1542471 -748342 1964416 6565425 11966500 16936498
4539 16936498 19902976 20335687 19778987 18950646 15035593 5817603 -4080467 -6281231 746977
4530 746977 9030001 11282165 9010453 7042226 4716609 -1709668 -10407253 -14270282
4522 -14270282 -10147706 -2752994 1740889 1996915 55129 -2765396 -6244267 -9846921
4514 -9846921 -13112530 -16352105 -19750456 -22666007 -24244224 -23593859 -19638294 -12881267
4506 -12881267 -7158256 -6606485 -10137769 -12106496 -9916800 -7585570 -9245981 -12271750
4498 -12271750 -10695219 -3590893 4077009 8075098 8191250 5145230 -1042855 -8087086
$$ packed form
4555B573409j4011545j0407792j278478M833599L397859j010381j164495L282256
4547a3785568O314589M581565J346943P94129K712758M601009N401075M969998
4539A6936498K966478M32711n56700q28341l915053r217990r898070k200764P028208
4530G46977Q283024K252164k271712j968227k325617o426277q697585l863029
4522a4270282M122576P394712M493883K56026j941786k820525l478871l602654
4514i846921l265609l239575l398351k915551j578217O50365L955565O757027
4506a2881267N723011N51771l531284j968727K189696K331230j660411l025769
4498a2271750J576531P104326P667902L998089J16152l046020o188085p044231
$$ plain form
4490 -8087086 -10952752 -7383349 -1657629 47847 -3197366 -6902814 -6968299 -3156838 2406158
4481 2406158 7204770 8598481 4975449 -1963424 -7720552 -9136653 -7113060 -4577859
4473 -4577859 -3130459 -2656070 -2636316 -2074719 693866 5768199 9619670 7764331 113045
4464 113045 -8216089 -12171140 -11186115 -7634836 -3092300 1922889 5898782 6636209 3790915
4455 3790915 -378134 -3014710 -2647533 300044 3728537 4989381 3211505 329527
4447 329527 -1462617 -2787285 -5808596 -10130740 -12353559 -10464134 -6655542 -4498207
4439 -4498207 -4724338 -5169161 -3916655 -1215089 1177221 1643982 216010 -1022564 150988
4430 150988 3185522 4790320 2721373 -1473868 -4500287 -5105698 -4529949 -3957890 -3203514
$$ packed form
4490h087086k865666L569403N725720J705476l245213l705448o5485L811461N562996
4481B406158M798612J393711l623032o938873n757128j416101K023593K535201
4473d577859J447400M74389J9754N61597K768585N074333L851471j855339p651286
4464A13045q329134l955051R85025L551279M542536N015189L975893P37427k845294
4455C790915m169049k636576L67177K947577L428493J260844j777876k881978
4447C29527j792144j324668l021311m322144k222819J889425L808592K157335
4439d498207k26131m44823J252506K701566K392310M66761j427972j238574J173552
4430A50988L034534J604798k068947m195241l026419o05411N75749N72059P54376
$$ plain form
4421 -3203514 -1938445 -940303 -1580655 -4383879 -8160164 -10607170 -10265276 -7967148 -5739678
4412 -5739678 -4382787 -3148470 -1566417 187594 2868146 7674758 13224213 15622634
4404 15622634 13458795 10393108 10210223 11311904 9456233 4656275 1411780 2132119
4396 2132119 4032479 3557838 1080047 -102961 2385137 7901863 13022301 13921518 10608547
4387 10608547 8557203 13239850 22730197 28934752 27026569 20296069 14278185 9841155
4379 9841155 4806823 -718147 -4405850 -5547884 -5542467 -5408890 -5432312 -6264068 -7700541
4370 -7700541 -7289285 -2985002 3387799 8027958 9978481 11265518 12681046 12563270 9849288
4361 9849288 5290403 -703072 -8365763 -16179694 -21397984 -23907816 -26178996 -27883070
$$ packed form
4421c203514J265069R98142o40352k803224l776285k447006L41894K298128K227470
4412e739678J356891J234317J582053J754011K680552M806612N549455K398421
4404A5622634k163839l065687j82885J101681j855671m799958l244495P20339
4396B132119J900360m74641k477791j183008K488098N516726N120438Q99217l312971
4387A0608547k051344M682647R490347O204555j908183o730500o017884m437030
4379I841155n034332n524970l687703j142034N417J33577k3422q31756j436473
4370g700541M11256M304283O372801M640159J950523J287037J415528j17776k713982
4361I849288m558885n993475p662691p813931n218290k509832k271180j704074
$$ plain form
4353 -27883070 -24364454 -13521051 -1405601 3018594 -2234588 -10623470 -14760697 -12863421
4345 -12863421 -8172621 -5151055 -6579142 -11663167 -16067633 -15609037 -10487780 -4458909
4337 -4458909 -123638 2631379 3703423 1802370 -2205047 -4212612 -1754389 2248162
4329 2248162 3587213 3009160 4810306 9739246 13087342 10849029 4934548 675405
4321 675405 1103096 5282959 10655863 14906984 16243368 14074499 10121768 7832783 9722749
4312 9722749 15041959 20225997 22006498 20109098 16258439 10603027 1169648 -11364908
4304 -11364908 -20216529 -17675130 -4373169 9803682 15657327 13245508 9150549 7928830
4296 7928830 8740971 8463550 5163815 -594808 -5496052 -5375295 373164 7142949 9971987
$$ packed form
4353b7883070L518616J0843403J2115450M424195n253182q388882m137227J897276
4345a2863421M690800L021566j428087n084025m404466M58596N121257O028871
4337d458909M335271K755017J072044j901053m007417k007565K458223M002551
4329B248162J339051n78053J801146M928940L348096k238313n914481m259143
4321F75405M27691M179863N372904M251121J336384k168869l952731k288985J889966
4312I722749N319210N184038J780501j897400l850659n655412r433379j2534556
4304a1364908q851621K541399J3301961J4176851N853645k411819m094959j221719
4296G928830Q12141k77421l299735n758623m901244J20757N748459O769785K829038
$$ plain form
4287 9971987 8972150 7768265 8167316 9382925 11027296 13005185 13320792 10232589 6183932
4278 6183932 4969101 5011456 930391 -7071380 -11399941 -7689178 -1950532 -2584417 -8973589
4269 -8973589 -13000799 -9633742 -1323794 6644879 10720784 9715959 4946074 -85609
4261 -85609 -2902702 -4703806 -7744748 -11400413 -13472396 -13866823 -13763309 -12598364 -9626042
4252 -9626042 -7287788 -8647386 -11785417 -11138872 -5017607 1870594 4124447 904772
4244 904772 -4700970 -8551111 -7782684 -3416888 -246993 -906177 -1470436 2307350 6025881
4235 6025881 1186585 -10698977 -16818532 -9529985 2788000 6543796 -695296 -10364472
4227 -10364472 -15371982 -16153290 -16484113 -18792438 -22741275 -24815983 -20998266 -12817826
$$ packed form
4287I971987r99837j203885L99051J215609J644371J977889L15607l088203m048657
4278F183932j214831M2355m081065q001771m328561L710763N738646o33885o389172
4269h973589m027210L367057Q309948P968673M075905j004825m769885n031683
4261h5609k817093j801104l040942l655665k071983l94427J03514J164945K972322
4252i626042K338254j359598l138031O46545O121265O888201K253853l219675
4244I04772n605742l850141P68427M365796L169895o59184n64259L777786L718531
4235F025881m839296j1885562o119555P288547J2317985L755796p239092r669176
4227a0364472n007510p81308l30823k308325l948837k074708L817717Q180440
$$ plain form
4219 -12817826 -7712538 -9742741 -13714104 -13144700 -9678871 -8148435 -6474775 651987
4211 651987 10221550 13119279 8308888 4904202 7674019 10035541 6057902 837158
4203 837158 2041232 7398568 8586935 4007308 -170860 -502896 -864857 -5666713 -13420523
4194 -13420523 -18997760 -19803587 -18240129 -18654262 -21963094 -23675371 -18919262 -9275373
4186 -9275373 -1602121 556513 623975 2604693 5426398 6534691 7139104 9937128 14364034
4177 14364034 17585555 17702711 13351300 4056566 -5520730 -6651636 2588957 11793855
4169 11793855 10321531 1359330 -3905709 -3183442 -4389565 -10617450 -14163063 -8258927
4161 -8258927 3509099 13066005 16558358 14154201 7599562 1582831 1856330 8199827
$$ packed form
4219a2817826N105288k030203l971363N69404L465829J530436J673660P126762
4211F51987R569563K897729m810391l404686K769817K361522l977639n220744
4203H37158J204074N357336J188367m579627m178168l32036l61961m801856p753810
4194a3420523n577237q05827J563458m14133l308832j712277M756109R643889
4186i275373P673252K158634O7462J980718K821705J108293O04413K798024M426906
4177A4364034L221521J17156m351411r294734r577296j130906R240593R204898
4169A1793855j472324q962201n265039P22267j206123o227885l545613N904136
4161h258927J1768026R556906L492353k404157o554639o016731K73499O343497
$$ plain form
4153 8199827 13706536 13560493 9737355 5650671 2707010 3862954 12235992 22876525
4145 22876525 25028439 17395131 11631668 14767743 19192062 18277881 18560838 22199700
4137 22199700 9981446 -35699506 -95322629 -124170287 -104183767 -63699650 -38555849
4130 -38555849 -33061291 -30769258 -25403298 -22460669 -20949370 -13836091 -3818218 -1996778
4122 -1996778 -10244940 -17936910 -17491475 -11921161 -5530751 1735826 7751150 6538116
4114 6538116 -1789633 -7689223 -4424910 2843303 5726553 4541995 5106341 7900728
4106 7900728 7795729 3029285 -1961520 -3011303 -870114 1483935 2726936 3231433 3576454
4097 3576454 4185319 5197405 6137251 6526244 6705789 6924695 5780422 1184764 -6424623
$$ packed form
4153H199827N506709j46043l823138m086684k943661J155944Q373038J0640533
4145B2876525K151914p633308n763463L136075M424319r14181K82957L638862
4137B2199700j2218254m5680952n9623123k8847658J9986520M0484117K5143801
4130c8555849N494558K292033N365960K942629J511299P113279J0017873J821440
4122a996778q248162p691970M45435N570314O390410P266577O015324j213034
4114F538116q327749n899590L264313P268213K883250j184558N64346K794387
4106G900728j04999m766444m990805j049783K141189K354049J243001N04497L45021
4097C576454O08865J012086R39846L88993J79545K18906j144273m595658p609387
$$ plain form
4088 -6424623 -12996456 -14355132 -10788760 -7105386 -7468575 -10838853 -12538457 -9817208
4080 -9817208 -4294999 847991 3656434 2853787 -2155891 -8398754 -9436416 -2449893
4072 -2449893 6146225 6622401 -2499387 -12719803 -15730499 -11182699 -3444062 4520181
4064 4520181 11058413 13306614 9065425 175216 -8799299 -14591581 -16222439 -13571970
4056 -13571970 -7548711 -898354 3513256 5033454 4378451 1281488 -5131873 -13948906
4048 -13948906 -21912646 -25121503 -20955981 -10087400 2041477 7875367 4684463 -2117827
4040 -2117827 -5119067 -3371326 -1722476 -2471591 -1785571 4428904 14294284 21622818 22026849
4031 22026849 15970065 7496022 1546219 1109649 5073335 9304712 10917503 10835024 11479316
$$ packed form
4088f424623o571833j358676L566372L683374l63189l370278j699604K721249
4080i817208N522209N142990K808443q02647n009678o242863j037662O986523
4072b449893Q596118M76176r121788j0220416l010696M547800P738637P964243
4064D520181O538232K248201m241189q890209q974515n792282j630858K650469
4056a3571970O023259O650357M411610J520198o55003l096963o413361q817033
4048a3948906p963740l208857M165522J0868581J2128877N833890l190904o802290
4040b117827l001240J747741J648850p49115O86020O214475R865380P328534M04031
4031B2026849o056784q474043n949803m36570L963686M231377J612791q2479O44292
$$ plain form
4022 11479316 13355537 15385214 17301501 19416482 20523685 18702285 14789471 12568733
4014 12568733 13886221 15467035 13073604 7823853 5065325 6474480 6941365 1989398
4006 1989398 -4411193 -4024243 4068225 11155657 10237561 5277040 5004936 10413490 14249056
3997 14249056 12601860 10711485 14483719 20962412 21932578 14793603 5074441 -1332332
3989 -1332332 -3929915 -4925439 -5066329 -4411515 -4143065 -4708737 -4221586 -1659129 168465
3980 168465 -1435269 -3363206 109943 7917795 11381663 5743883 -2007150 -1845868 5394081
3971 5394081 9067316 3524089 -4540035 -6149531 -2189504 -456913 -3261496 -4104532
3963 -4104532 2444331 12430370 17296056 14650716 10446766 10485216 13399086 14285255 12865982
$$ packed form
4022A1479316J876221K029677J916287K114981J107203j821400l912814k220738
4014A2568733J317488J580814k393431n249751k758528J409155M66885m951967
4006A989398o400591L86950Q092468P087432r18096m960521k72104N408554L835566
3997A4249056j647196j890375L772234O478693R70166p138975r719162o406773
3989a332332k597583r95524j40890O54814K68450n65672M87151K562457J827594
3980A68465j603734j927937L473149P807852L463868n637780p751033J61282P239949
3971E394081L673235n543227q064124j609496L960027J732591k804583q43036
3963d104532O548863R986039M865686k645340m203950L8450K913870Q86169j419273
$$ plain form
3954 12865982 13838535 18817127 22261290 18378328 9302392 2285707 120893 -714502
3946 -714502 -2185348 -629606 6525301 14345052 15476611 9858194 4798295 5520431 9382262
3937 9382262 10284027 5975540 -289042 -3531599 -1361233 4208428 8276698 7185954
3929 7185954 1894997 -2993221 -3593213 141925 5028383 7434164 5866641 1942116
3921 1942116 -1184267 -1989251 -1930238 -3272785 -6534867 -10842854 -15410629 -19091010 -19681916
3912 -19681916 -15946782 -9969819 -5619444 -4941332 -7560229 -12558637 -18421881 -21864843
3904 -21864843 -20083686 -14666903 -10369457 -9237076 -8751858 -6784601 -5256543 -6909134
3896 -6909134 -11030201 -14975627 -18098469 -21245486 -23331752 -21576279 -15625055 -9193732
$$ packed form
3954A2865982R72553M978592L444163l882962r075936p016685k164814q35395
3946g14502j470846J555742P154907P819751J131559n618417n059899P22136L861831
3937I382262R01765m308487o264582l242557K170366N569661M068270j090744
3929G185954n290957m888218n99992L735138M886458K405781j567523l924525
3921A942116l126383q04984N9013j342547l262082m307987m567775l680381n90906
3912a9681916L735134N976963M350375O78112k618897m998408n863244l442962
3904b1864843J781157N416783M297446J132381M85218J967257J528058j652591
3896f909134m121067l945426l122842l147017k086266J755473N951224O431323
$$ plain form
3888 -9193732 -6319038 -6869109 -7036337 -4511476 -2203895 -5241055 -13877167 -21445310 -21421652
3879 -21421652 -15127748 -9509117 -8141504 -8302835 -7053509 -5526532 -5315580 -4896757 -2815975
3870 -2815975 -1203987 -2635289 -6058821 -9258679 -12652043 -16601717 -17664790 -12881833
3862 -12881833 -6270415 -5191325 -10528700 -16106685 -17999870 -18310658 -18704740 -16998846
3854 -16998846 -13021809 -11462285 -14391392 -16257421 -11808557 -4801783 -2634660 -5433704
3846 -5433704 -7338852 -6776828 -7985107 -12275003 -14846748 -11936047 -5404755 1456185
3838 1456185 7178217 9334800 4641751 -4766894 -10592147 -8266099 -3163959 -2392686
3830 -2392686 -4732186 -4379819 -1092314 180065 -2168533 -4936130 -6322833 -7233477 -6819020
$$ packed form
3888i193732K874694n50071j67228K524861K307581l037160q636112p568143K3658
3879b1421652O293904N618631J367613j61331J249326J526977K10952M18823K080782
3870b815975J611988j431302l423532l199858l393364l949674j063073M782957
3862a2881833O611418J079090n337375n577985j893185l10788l94082J705894
3854a6998846L977037J559524k929107j866029M448864P006774K167123k799044
3846e433704j905148N62024j208279m289896k571745K910701O531292O860940
3838A456185N722032K156583m693049r408645n825253K326048N102140P71273
3830b392686k339500L52367L287505J272379k348598k767597j386703r10644M14457
$$ plain form
3821 -6819020 -3331593 330560 -1103759 -6175484 -6846813 -110148 7285717 8922997
3813 8922997 6924744 5840281 4710728 942793 -3139264 -4027310 -3257555 -3555909 -2553229
3804 -2553229 2690775 8183822 7797831 3258554 1213335 1965046 -9457 -4878445 -6399484
3795 -6399484 -3190846 -1559744 -4467959 -6769681 -5156572 -3975081 -6172687 -6991507
3787 -6991507 -3114581 -293512 -4007724 -9167968 -8118111 -3555667 -3420836 -6572638
3779 -6572638 -4475918 4146971 11037024 11416842 9436444 8651215 6302396 569510 -4573744
3770 -4573744 -6360392 -8498399 -14396214 -20394720 -20962332 -16649108 -12020365 -8953184
3762 -8953184 -6631156 -5529912 -6881963 -9967851 -13526680 -17852471 -22274013 -23328548
$$ packed form
3821f819020L487427L662153j434319n071725o71329O736665P395865J637280
3813H922997j998253j084463j129553l767935m082057q88046P69755k98354J002680
3804b553229N244004N493047l85991m539277k045219P51711j974503m868988j521039
3795f399484L208638J631102k908215k301722J613109J181491k197606q18820
3787f991507L876926K821069l714212n160244J049857M562444J34831l151802
3779f572638K096720Q622889O890053L79818j980398p85229k348819n732886n143254
3770d573744j786648k138007n897815n998506n67612M313224M628743L067181
3762h953184K322028J101244j352051l085888l558829m325791m421542j054535
$$ plain form
3754 -23328548 -19617513 -16015636 -17952974 -22869214 -22762556 -15228521 -6944658 -5086886
3746 -5086886 -9492061 -15061558 -18379220 -19335474 -18393596 -15268020 -10247834 -5253543 -2906586
3737 -2906586 -4392781 -8066855 -10535498 -9561906 -5604183 -578681 3603570 5043368
3729 5043368 2670065 -1514812 -3245282 -1364884 -450107 -4972251 -12259231 -15061434
3721 -15061434 -10644814 -3390206 1899896 5129695 8055576 10176325 9852975 6758420
3713 6758420 912365 -8062411 -17874722 -22172440 -16311137 -3962760 5636970 7472334
3705 7472334 4909831 3493445 3775201 2455503 -1439635 -4660067 -3941264 273731 5033139
3696 5033139 7849013 7184313 1955585 -6535180 -12752753 -10877822 -2380236 3347267
$$ packed form
3754b3328548L711035L601877j937338m916240J06658P534035Q283863J857772
3746e086886m405175n569497l317662r56254R41878L125576N020186M994291K346957
3737b906586j486195l674074k468643R73592L957723N025502M182251J439798
3729E043368k373303m184877j730470J880398R14777m522144p286980k802203
3721a5061434M416620P254608N290102L229799K925881K120749l23350l094555
3713F758420n846055q974776r812311m297718N861303J2348377R599730J835364
3705G472334k562503j416386K81756j319698l895138l220432P18803M214995M759408
3696E033139K815874o64700n228728q490765o217573J874931Q497586N727503
$$ plain form
3688 3347267 -983128 -11643142 -18443247 -16973668 -12001382 -8959110 -7587058 -6226645
3680 -6226645 -7309810 -13871288 -23296983 -29509001 -30396411 -28715972 -26198274 -21716473
3672 -21716473 -16218183 -14563446 -19358332 -25791963 -26014489 -17736420 -6261306 1342993
3664 1342993 2409217 -158452 -1024040 2950488 9707182 13677379 11417643 5218907
3656 5218907 275494 -954294 -220547 50519 -150251 777617 3554823 7209996 10238440
3647 10238440 11995973 12982249 13839387 14190642 12939624 9899749 6487301 4365641 3978004
3638 3978004 4732865 5647475 5160553 1599533 -4768160 -11012974 -14414643 -15355079 -15654777
3629 -15654777 -14873064 -10887528 -4231545 1026159 1987374 319859 -599755 63652 1356100
$$ packed form
3688C347267m330395j0660014o800105J469579M972286L042272J372052J360413
3680f226645j083165o561478r425695o212018q87410J680439K517698M481801
3672b1716473N498290J654737m794886o433631k22526Q278069J1475114P604299
3664A342993J066224k567669q65588L974528O756694L970197k259736o198736
3656E218907m943413j229788P33747K71066k00770R27868K777206L655173L028444
3647A0238440J757533R86276Q57138L51255j251018l039875l412448k121660l87637
3638C978004P54861R14610m86922l561020o367693o244814l401669r40436k99698
3629a5654777P81713L985536O655983N257704R61215j667515r19614O63407J292448
$$ plain form
3620 1356100 3783152 8407988 12857809 11941189 4276494 -4034735 -5404519 263369
3612 263369 5744236 6126029 4821230 7588097 13339832 15178060 9796436 1118745 -6337617
3603 -6337617 -12932567 -20115459 -25417324 -25477671 -21343579 -16284606 -10505928 -3043817 2910131
3594 2910131 2878767 -1092281 -2269943 151357 -594564 -7344383 -13245287 -12255699 -8759129
3585 -8759129 -9757492 -12452915 -8384900 2169564 9039201 6261396 -406679 -2626474
3577 -2626474 88998 2570682 1867623 -1160031 -5064118 -8712245 -10595909 -10348118 -10071289
3568 -10071289 -11885742 -14806879 -15775867 -13397420 -9687467 -8589819 -12854988 -21015860
3560 -21015860 -27369077 -27102136 -22135679 -19617985 -23562510 -30401758 -34410288 -34934713
$$ packed form
3620A356100K427052M624836M449821r16620p664695q311229j369784N667888
3612B63369N480867L81793j304799K766867N751735J838228n381624q677691p456362
3603f337617o594950p182892n301865o0347M134092N058973N778678P462111N953948
3594B910131l1364l971048j177662K421300p45921o749819n900904R89588L496570
3585h759129r98363k695423M068015J0554464O869637k777805o668075k219795
3577b626474K715472K481684p03059l027654l904087l648127j883664K47791K76829
3568a0071289j814453k921137r68988K378447L709953J097648m265169q160872
3560b1015860o353217K66941M966457K517694l944525o839248m008530n24425
$$ plain form
3552 -34934713 -35475784 -37239436 -36993270 -31453402 -21539701 -11787377 -6849686 -8597452
3544 -8597452 -15120954 -21868459 -24511241 -21586815 -14904944 -7806076 -2804063 -33124
3536 -33124 2327737 5621602 8805087 9707645 7830190 4583898 989233 -3009986 -6721044
3527 -6721044 -8368489 -7570054 -6279999 -5931822 -5247931 -2557138 928312 2166597 338257
3518 338257 -1666830 -116196 5649392 12031855 14036195 10274375 5144365 4528856 8913419
3509 8913419 12664573 11249815 7232941 6965101 12407614 18871950 21131087 19488348
3501 19488348 18221643 19143006 19272905 15986348 12197258 12824333 16147027 13496589 771209
3492 771209 -13437990 -16600256 -7616983 2387103 4569025 1325655 -971929 -1781239
$$ packed form
3552c4934713n41071j763652K46166N539868R913701R752324M937691j747766
3544h597452o523502o747505k642782K924426O681871P098868N002013K770939
3536c3124K360861L293865L183485R02558j877455l246292l594665l999219l711058
3527f721044j647445P98435J290055L48177O83891K690793L485450J238285j828340
3518C38257k005087J550634N765588O382463K004340l761820n130010o15509M384563
3509H913419L751154j414758m016874k67840N442513O464336K259137j642739
3501A9488348j266705R21363J29899l286557l789090O27075L322694k650438j2725380
3492G71209j4209199l162266Q983273J0004086K181922l243370k297584q09310
$$ plain form
3484 -1781239 -4625414 -9857976 -14197473 -15357747 -13220951 -8064182 -1000732 5231617
3476 5231617 8770206 10435681 10859017 8357907 2605770 -2441424 -3246337 -1982751 -2697570
3467 -2697570 -4127407 -1461558 5705961 12463402 15650419 16932744 18186709 18516498
3459 18516498 17405232 16946346 18828922 21581597 22228211 18734265 10383746 -1559869
3451 -1559869 -12664840 -17466016 -14468119 -7791608 -3159693 -3223535 -6498365 -9210106
3443 -9210106 -8422346 -4934409 -2589984 -3440583 -5252785 -5832060 -7194513 -11558908 -15297217
3434 -15297217 -12253294 -2624836 6796479 11628650 13858734 15829759 15945051 12984251
3426 12984251 10062067 10811333 14598439 18298850 20170843 19468616 14922615 6745767
$$ packed form
3484a781239k844175n232562m339497j160274K136796N156769P063450O232349
3476E231617L538589J665475M23336k501110n752137n047194q04913J263586p14819
3467b697570j429837K665849P167519O757441L187017J282325J253965L29789
3459A8516498j111266m58886J882576K752675O46614l493946q350519j1943615
3451a559869j1104971m801176K997897O676511M631915o3842l274830k711741
3443i210106P87760L487937K344425q50599j812202n79275j362453m364395l738309
3434a5297217L043923R628458R421315M832171K230084J971025J15292k960800
3426A2984251k922184P49266L787106L700411J871993p02227m546001q176848
$$ plain form
3418 6745767 -1421461 -5433846 -5190418 -4805096 -8383369 -15772206 -21908792 -21264293 -14352152
3409 -14352152 -8268593 -8408462 -11801917 -12390953 -10407574 -10619748 -12666456 -10682975 -3428879
3400 -3428879 2626824 2788275 155719 -665345 485416 2889570 7841282 13676207 14198374
3391 14198374 7357968 120514 -747283 2316303 3446786 2792735 3439296 3624455 -106049
3382 -106049 -5068379 -5397473 -716118 4992177 10705052 17216669 20968600 17387584 9594195
3373 9594195 5780397 7900588 10421829 10288879 10144667 10801320 8788560 3834962 1441986
3364 1441986 4610149 8893315 8969631 5174782 757313 -2547410 -3582184 -1182102 2645172
3355 2645172 3286784 -45490 -2574348 -1075842 1630601 2036127 1412550 2636476 5272028
$$ packed form
3418F745767q167228m012385K43428L85322l578273p388837o136586O44499O912141
3409a4352152O083559j39869l393455n89036J983379k12174k046708J983481P254096
3400c428879O055703J61451k632556q21064J150761K404154M951712N834925N22167
3391A4198374o840406p237454q67797L063586J130483o54051O46561J85159l730504
3382a06049m962330l29094M681355N708295N712875O511617L751931l581016p793389
3373I594195l813798K120191K521241j32950j44212O56653k012760m953598k392976
3364A441986L168163M283166P6316l794849m417469l304723j034774K400082L827274
3355B645172O41612l332274k528858J498506K706443M05526o23577J223926K635552
$$ plain form
3346 5272028 7080436 7220896 5204141 233754 -5398046 -5992001 642667 8792770 11155587
3337 11155587 7400935 3025547 1548465 1181255 -1860568 -9184962 -18310133 -23500908
3329 -23500908 -20433756 -11442898 -3889479 -2152190 -4077707 -6341313 -9063863 -12764663
3321 -12764663 -15135274 -14540252 -13212140 -12986402 -11025763 -4364673 3679351 6562786
3313 6562786 2860954 -2623154 -5317557 -4791704 -2957505 -1949245 -3595554 -8099978
3305 -8099978 -13280377 -16984046 -19378642 -21178138 -21398228 -19203512 -16105542 -13603200
3297 -13603200 -10391866 -4804506 1612363 5880760 7388980 7237838 5852471 4241409
3289 4241409 5158372 9186685 11948777 9625102 5238071 4435674 6669241 6431769 2695735
$$ packed form
3346E272028J808408J40460k016755m970387n631800n93955O634668Q150103K362817
3337A1155587l754652m375388j477082l67210l041823p324394r125171n190775
3329b3500908L067152Q990858P553419J737289j925517k263606k722550l700800
3321a2764663k370611N95022J328112K25738J960639O661090Q044024K883435
3313F562786l701832n484108k694403N25853J834199J008260j646309m504424
3305h099978n180399l703669k394596j799496k20090K194716L097970K502342
3297a3603200L211334N587360O416869M268397J508220j51142j385367j611062
3289D241409R16963M028313K762092k323675m387031q02397K233567k37472l736034
$$ plain form
3280 2695735 852274 4301857 9700322 12376011 11776446 9504263 6170982 2627862
3272 2627862 801163 740540 -409720 -4239900 -8332153 -9841231 -9619049 -10503192 -13107873
3263 -13107873 -15398978 -15418249 -12831063 -8504470 -3720349 520885 3742086 5266690
3255 5266690 4169951 1288939 28579 2610739 6189458 5784731 1045224 -3185822
3247 -3185822 -3579689 -2256887 -2716140 -4680399 -4831863 -908132 6191067 12953354 15413159
3238 15413159 12604283 8207304 6722490 7940534 7791749 4710890 1666765 941663
3230 941663 573885 -1984584 -5648026 -7608466 -7433758 -7054467 -8047258 -10375468 -12351555
3221 -12351555 -10959030 -4290548 5284002 12580346 15157801 14889244 13305592 9194348
$$ packed form
3280B695735j843461L449583N398465K675689n99565k272183l333281l543120
3272B627862j826699o0623j150260l830180m092253j509078K22182q84143k604681
3263a3107873k291105j9271K587186M326593M784121M241234L221201J524604
3255E266690j096739k881012j260360K582160L578719m04727m739507m231046
3247c185822l93867J322802m59253j964259j51464L923731P099199O762287K459805
3238A5413159k808876m396979j484814J218044j48785l080859l044125p25102
3230I41663l67778k558469l663442j960440J74708L79291r92791k328210j976087
3221a2351555J392525O668482R574550P296344K577455k68557j583652m111244
$$ plain form
3213 9194348 2893932 -881303 1921493 9226386 15630589 18517777 18120436 13802690
3205 13802690 4751144 -6244362 -13597690 -14062738 -9001425 -2099859 3020901 3977063
3197 3977063 1192223 -2201821 -4322619 -7409118 -14150168 -22484176 -27647836 -28732901
3189 -28732901 -29140151 -30367792 -29768194 -25976377 -22542142 -23218449 -26137329 -26030543 -21404353
3180 -21404353 -16638513 -16454787 -19932924 -21044270 -14987124 -3586078 6106589 8900369
3172 8900369 6609231 5400955 8620918 13565252 15279347 12103535 6896353 3668995
3164 3668995 3661000 4492417 3085001 -480150 -2619500 -458418 4212515 6333766 2748910
3155 2748910 -4907558 -11997794 -14290843 -10175269 -1698292 5905419 7550451 2806859
$$ packed form
3213I194348o300416l775235K802796P304893O404203K887188l97341m317746
3205A3802690r051546j0995506p353328m65048N061313O901566N120760R56162
3197C977063k784840l394044k120798l086499o741050q334008n163660j085065
3189b8732901m07250j227641N99598L791817L434235o76307k918880J06786M626190
3180b1404353M765840J83726l478137j111346O057146J1401046R692667K793780
3172H900369k291138j208276L219963M944334J714095l175812n207182l227358
3164C668995p995Q31417j407416l565151k139350K161082M670933K121251l584856
3155B748910p656468p090236k293049M115574Q476977P603711J645032m743592
$$ plain form
3147 2806859 -3390810 -5613123 -3410462 -1332310 -3754968 -10434535 -17220183 -20441305
3139 -20441305 -20120144 -19255658 -20678495 -24657158 -28801648 -29841476 -26203035 -19772692
3131 -19772692 -14924126 -14995416 -19595607 -25440394 -29035149 -28159312 -22426680 -14203692 -7797474
3122 -7797474 -5294848 -3810209 531363 6460032 8888029 6610194 4659799 7349037
3114 7349037 12535531 15373075 15019850 14682631 16799094 20772786 24092763 23629491 17505224
3105 17505224 7870152 200319 -2301323 -2001525 -2724508 -4561377 -5023139 -2990199 1047397
3096 1047397 6136706 9403461 6461723 -2961467 -12605746 -17104603 -18948341 -23062640
3088 -23062640 -27566204 -26696521 -21112743 -17574893 -18394495 -18654982 -14989262 -10092249 -6799079
$$ packed form
3147B806859o197669k222313K202661K078152k422658o679567o785648l221122
3139b0441305L21161Q64486j422837l978663m144490j039828L638441O430343
3131a9772692M848566p1290m600191n844787l594755Q75837N732632Q222988O406218
3122g797474K502626J484639M341572N928669K427997k277835j950395K689238
3114G349037N186494K837544l53225l37219K116463L973692L319977m63272o124267
3105A7505224r635072p669833k501642K99798p22983j836869m61762K032940M037596
3096A047397N089309L266755k941738r423190r644279m498857j843738m114299
3088b3062640m503564Q69683N583778L537850q19602k60487L665720M897013L293170
$$ plain form
3079 -6799079 -4380601 -2796717 -3987185 -6545159 -5998055 -3244753 -5178832 -12837345
3071 -12837345 -16835656 -10623496 -1126109 1318096 -2495733 -4850350 -4857680 -7757473 -13108890
3062 -13108890 -14275474 -9586078 -4501397 -1625744 2572598 9113816 13084830 12117052
3054 12117052 10746550 12285027 13182318 10483115 8912956 14170232 22991760 26263690
3046 26263690 20187435 9203963 -865087 -7847359 -11972578 -13803051 -13922127 -12316901
3038 -12316901 -8338520 -2985187 174687 -1238428 -5034878 -7370996 -7649570 -7642839 -7236450
3029 -7236450 -4947040 -2281929 -3485122 -9817094 -16918957 -19187949 -15100745 -7804644
3021 -7804644 -2387132 -2813451 -9136734 -16681228 -19658311 -16481144 -10474257 -5618226
$$ packed form
3079f799079K418478J583884j190468k557974N47104K753302j934079p658513
3071a2837345l998311O212160R497387K444205l813829k354617p330k899793n351417
3062a3108890j166584M689396N084681K875653M198342O541218L971014r67778
3054A2117052j370502J538477Q97291k699203j570159N257276Q821528L271930
3046B6263690o076255j0983472j0069050o982272m125219j830473j19076J605226
3038a2316901L978381N353333L159874j413115l796450k336118k78574O731M06389
3029g236450K289410K665111j203193o331972p101863k268992M087204P296101
3021g804644N417512m26319o323283p544494k977083L177167O006887M856031
$$ plain form
3013 -5618226 -3582092 -4461418 -6960845 -6998961 -80202 12261878 21325783 20057877 11255262
3004 11255262 3488164 357355 -1807740 -6038804 -9821291 -9915907 -7671291 -6174602
2996 -6174602 -5017079 -1871049 2209107 3154433 -561631 -6219169 -11194749 -15815363
2988 -15815363 -20757358 -24464965 -25043323 -22754444 -18797172 -13259492 -6259761 242935
2980 242935 4026869 5217762 5274986 4062584 286781 -5225717 -8999045 -8388030 -4172514
2971 -4172514 857115 4805210 7745930 10702082 13807477 15243108 12823618 7517754
2963 7517754 4083394 6228810 11853671 15260777 13621083 8972898 4434989 1502383
2955 1502383 1083700 3730672 7869448 10741703 11944564 12947029 12545991 7245682 -1936217
$$ packed form
3013e618226K036134q79326k499427l8116O918759J2342080R063905j267906q802615
3004A1255262p767098l130809k165095m231064l782487r4616K244616J496689
2996f174602J157523L146030M080156R45326l716064n657538m975580m620614
2988a5815363m941995l707607n78358K288879L957272N537680O999731O502696
2980B42935L783934J190893N7224j212402l775803n512498l773328O11015M215516
2971d172514N029629L948095K940720K956152L105395J435631k419490n305864
2963G517754l434360K145416N624861L407106j639694m648185m537909k932606
2955A502383m18683K646972M138776K872255J202861J002465m01038n300309r181899
$$ plain form
2946 -1936217 -7835729 -5917360 -791606 235716 -3373569 -7283017 -10326635 -14266148
2938 -14266148 -17361706 -15194794 -7825612 138073 6741192 13447895 18420604 16916595
2930 16916595 10581493 8196217 12867129 16032119 10315538 1696526 888189 7490710
2922 7490710 12036566 11134306 10496700 12806286 12384609 5146074 -3591006 -5679479 138816
2913 138816 8443309 13083967 10261477 17440 -11910469 -17236306 -13642568 -7521224
2905 -7521224 -5558210 -6862261 -6679162 -4551955 -4387304 -8374465 -14807803 -20516746 -22116322
2896 -22116322 -16766336 -5638281 4859045 9429030 10337263 13376521 18622966 20427285
2888 20427285 16630448 12291678 12520113 16067915 18530468 18513852 17840977 17921450 18465269
$$ packed form
2946a936217n899512J918369N125754J027322l609285l909448l043618l939513
2938a4266148l095558K166912P369182P963685O603119O706703M972709j504009
2930A6916595o335102k385276M670912L164990n716581q619012q08337O602521
2922G490710M545856r02260o37606K309586m21677p238535q737080k088473N818295
2913A38816Q304493M640658k822490j0244037j1927909n325837L593738O121344
2905g521224J963014j304051J83099K127207J64651l987161o433338n708943j599576
2896b2116322N349986J1128055J0497326M569985R08233L039258N246445J804319
2888B0427285l796837m338770K28435L547802K462553j6616o72875Q0473N43819
$$ plain form
2879 18465269 18394970 16245862 10996992 3943867 -1616050 -3859870 -4324197 -5332298 -7107995
2870 -7107995 -8546005 -9128338 -8662743 -6717898 -3982151 -2846542 -4772722 -7893331 -8885368
2861 -8885368 -6793361 -3843789 -2976998 -5309677 -9018235 -9843135 -4196448 6437563
2853 6437563 15067410 15224567 7539340 -995883 -4350819 -2945092 -1814733 -4565549
2845 -4565549 -9963794 -14203545 -15621741 -16167972 -17963200 -19639096 -17597964 -10624566
2837 -10624566 -1821953 4076483 4289784 -505675 -6504850 -9084909 -7045442 -4406575
2829 -4406575 -5561620 -8903630 -8566251 -2831629 3169521 4561985 2552529 904728
2821 904728 486922 516901 1749131 4438106 5900493 4368743 2809686 4156982 5010194
$$ packed form
2879A8465269p0299k149108n248870p053125n559917k243820m64327j008101j775697
2870g107995j438010n82333M65595J944845K735747J135609j926180l120609r92037
2861h885368K092007K949572Q66791k332679l708558q24900N646687J0634011
2853F437563Q629847J57157p685227q535223l354936J405727J130359k750816
2845d565549n398245m239751j418196n46231j795228j675896K041132O973398
2837a0624566Q802613N898436K13301m795459n999175k580059K039467K638867
2829d406575j155045l342010L37379N734622O001150J392464k009456j647801
2821I04728m17806K9979J232230K688975J462387j531750j559057J347296Q53212
$$ plain form
2812 5010194 -12833 -8703852 -12542466 -8166774 -1502604 1255877 1113449 1913105 3492298
2803 3492298 3229449 1117347 -754634 -1784378 -2519079 -2249563 2796 3162105 5346817
2794 5346817 6541396 7877668 9379344 10624558 12459597 15503699 17750399 16337549
2786 16337549 11539628 6728508 4330474 3749022 3266593 2044536 55796 -2050094
2778 -2050094 -2511011 366337 5654361 9684657 9622555 6546668 3915700 3087536 1390436
2769 1390436 -4494360 -13302093 -18550234 -14621121 -3597178 5393111 4623428 -5008605
2761 -5008605 -15684611 -20551519 -18832199 -13965253 -8778968 -3544467 2068786 6917317
2753 6917317 9533236 10894722 14028638 19630849 23682852 21828512 15546459 11162601
$$ packed form
2812E010194n023027q691019l838614M375692O664170K758481j42428P99656J579193
2803C492298k62849k112102j871981j029744p34701K69516K252359L159309K184712
2794E346817J194579J336272J501676J245214J835039L044102K246700j412850
2786A6337549m797921m811120k398034n81452m82429j222057j988740k105890
2778b050094m60917K877348N288024M030296o2102l075887k630968q28164j697100
2769A390436n884796q807733n248141L929113J1023943Q990289p69683r632033
2761e008605j0676006m866908J719320M866946N186285N234501N613253M848531
2753F917317K615919J361486L133916N602211M052003j854340o282053m383858
$$ plain form
2745 11162601 12338226 16272425 18348403 17745046 16561489 15759888 14557777 12338873
2737 12338873 8708296 2933555 -4117847 -8733751 -8142554 -4813663 -3605101 -4937785
2729 -4937785 -4775088 -1928725 -633001 -3201345 -4289599 2589214 14468137 20133548
2721 20133548 12766571 -2626439 -15993928 -22764094 -24726269 -23437636 -17714595 -7766776
2713 -7766776 2376922 8625836 10905630 11850687 13042890 14051300 13723478 10809296
2705 10809296 4661337 -2911731 -7803038 -7736928 -5271217 -4599980 -6464749 -8699076 -10613621
2696 -10613621 -13404107 -16593806 -17908506 -17311240 -17503117 -19060854 -18427673 -12786454 -4286695
2687 -4286695 2801808 7042520 9682231 11155648 10022143 4777666 -4362748 -14620962
$$ packed form
2745A1162601J175625L934199K075978o03357j183557q01601j202111k218904
2737A2338873l630577n774741p051402m615904N91197L328891J208562j332684
2729d937785J62697K846363J295724k568344j088254O878813J1878923N665411
2721B0133548p366977j5393010j3367489o770166j962175J288633N723041R947819
2713g766776J0143698O248914K279794R45057J192203J008410l27822k914182
2705A0809296o147959p573068m891307O6110K465711O71237j864769k234327j914545
2696a0613621k790486l189699j314700N97266j91877j557737O33181N641219Q499759
2687d286695P088503M240712K639711J473417j133505n244477r140414j0258214
$$ plain form
2679 -14620962 -21444306 -22170629 -19314487 -17733124 -18261094 -17627725 -15221114 -14871871 -17523949
2670 -17523949 -17473744 -10338597 -469136 4966885 5816821 6688899 7625641 4437830 -2548923
2661 -2548923 -7579762 -8021016 -6997174 -6112764 -2476043 4272841 8460901 6164026 1403026
2652 1403026 -152877 512777 -922854 -3670012 -2807075 2468847 7273430 8076097 6569222
2643 6569222 5259559 3169251 -1737878 -8334038 -13214153 -14930138 -15172974 -15577480 -14893255
2634 -14893255 -10374277 -1600316 8064409 14110717 14451217 10401769 5346396 2953844
2626 2953844 5058116 9686787 12234066 10289420 6300984 3690103 1986918 -1128907
2618 -1128907 -4265423 -3262940 1913097 5701617 4258938 680781 389315 3945763
$$ packed form
2679a4620962o823344p26323K856142J581363n27970O33369K406611L49243k652078
2670a7523949N0205P135147R869461N436021Q49936Q72078R36742l187811o986753
2661b548923n030839m41254J023842Q84410L636721O748884M188060k296875m761000
2652A403026j555903O65654j435631k747158Q62937N275922M804583Q02667j506875
2643F569222j309663k090308m907129o596160m880115j715985k42836m04506O84225
2634a4893255M518978Q773961R664725O046308L40500m049448n055373k392552
2626B953844K104272M628671K547279j944646l988436k610881j703185l115825
2618a128907l136516J002483N176037L788520j442679l578157k91466L556448
$$ plain form
2610 3945763 7205080 6966069 4102242 2071872 3750377 8461457 11314690 7729618
2602 7729618 -131420 -4319401 -792289 4521878 2668842 -7039405 -16303634 -17763143
2594 -17763143 -12344477 -6662610 -5972777 -10339836 -15558321 -16739392 -12144543 -4450159
2586 -4450159 1797521 3828859 1841988 -2243144 -6329860 -9229544 -11124293 -12602067
2578 -12602067 -13091118 -11205735 -6754178 -1176517 3913541 6997785 6008709 267604
2570 267604 -6865699 -10782369 -11764132 -14301867 -18932169 -19683576 -12802808 -3514488 375367
2561 375367 -1906851 -5753166 -9185385 -13139233 -15704651 -12879697 -5289783 1390405
2553 1390405 3438517 1984405 -1153384 -5422184 -8722732 -8000496 -4288395 -2502789
$$ packed form
2610C945763L259317k39011k863827k030370J678505M711080K853233l585072
2602G729618p861038m187981L527112N314167j853036r708247r264229j459509
2594a7763143N418666N681867O89833m367059n218485j181071M594849P694384
2586d450159O247680K031338j986871m085132m086716k899684j894749j477774
2578a2602067m89051J885383M451557N577661N090058L084244r89076n741105
2570B67604p133303l916670r81763k537735m630302p51407O880768R288320L889855
2561C75367k282218l846315l432219l953848k565418K824954P589914O680188
2553A390405K048112j454112l137789m268800l300548P22236L712101J785606
$$ plain form
2545 -2502789 -4397968 -6090146 -4473180 -1571681 -63699 1078358 3273372 4623243
2537 4623243 3269600 1137856 302282 -1422663 -6544077 -11747093 -11231699 -5662322 -2322109
2528 -2322109 -5179760 -9486639 -8796132 -3829297 -589344 -1351460 -1976115 976261 4263750
2519 4263750 2245626 -4690351 -10186429 -10635532 -9397319 -10188844 -10737838 -7635351 -4396235
2510 -4396235 -8005423 -17732468 -24204686 -21767308 -16018801 -15559659 -20963492 -26401342
2502 -26401342 -28461127 -27800801 -24251932 -16587091 -7304101 -2021216 -2144223 -2238048 2587226
2493 2587226 9535615 11642361 6977038 804073 -1646324 -1347303 -2513092 -5614281
2485 -5614281 -6747033 -4001226 -935656 -1505135 -3771603 -1918420 6008988 15283514
$$ packed form
2545b502789j895179j692178J616966K901499J507982J142057K195014J349871
2537D623243j353643k131744q35574j724945n121414n203016N15394N569377L340213
2528b322109k857651m306879O90507M966835L239953p62116o24655K952376L287489
2519D263750k018124o935977n496078m49103J238213p91525n48994L102487L239116
2510d396235l609188r727045o472218K437378N748507M59142n403833n437850
2502b6401342k059785O60326L548869P664841R282990N282885j23007r3825M825274
2493B587226O948389K106746m665323o172965k450397K99021j165789l101189
2485e614281j132752K745807L065570n69479k266468J853183P927408R274526
$$ plain form
2477 15283514 19781686 17955123 13133272 9643527 8983251 8586471 4715483 -2210498
2469 -2210498 -6711130 -5190211 -2022531 -4565171 -12938274 -19755259 -20153334 -16539632
2461 -16539632 -12291576 -7133734 -1805793 -1150088 -7355173 -14399267 -14814874 -9174048
2453 -9174048 -3768605 -1520270 -721734 -710289 -2557757 -4676006 -3481943 1025871 4860558
2444 4860558 5523888 3856291 600720 -4336880 -8915688 -9869592 -7554550 -5904988 -6675778
2435 -6675778 -7462126 -6059875 -2882847 1400346 6185059 8330530 4609955 -1690797
2427 -1690797 -2457976 3968768 8803180 4552764 -4048081 -6618460 -1277841 4383734
2419 4383734 4893555 2546784 941317 -712123 -4001372 -6601806 -5253508 -1453914
$$ packed form
2477A5283514M498172j826563m821851l489745o60276l96780l870988o925981
2469b210498m500632J520919L167680k542640q373103o816985l98075L613702
2461a6539632M248056N157842N327941O55705o205085p044094m15607N640826
2453i174048N405443K248335P98536J1445j847468k118249J194063M507814L834687
2444D860558O63330j667597l255571m937600m578808r53904K315042J649562p70790
2435f675778p86348J402251L177028M283193M784713K145471l720575o300752
2427a690797p67179O426744M834412m250416q600845k570379N340619N661575
2419D383734N09821k346771j605467j653440l289249k600434J348298L799594
$$ plain form
2411 -1453914 -422561 -4483204 -10089446 -12157906 -9595696 -5264574 -1656267 1197775
2403 1197775 3440971 3755085 2015237 1619705 5795326 12062487 14095731 9832057 4080095
2394 4080095 1444633 467135 -2062634 -4152103 -777661 7968055 15594134 16886717
2386 16886717 13359625 9719197 7768659 5849804 2553657 -1251317 -3626516 -3380764
2378 -3380764 -806018 2494780 4418337 3464962 -562914 -6394380 -11424728 -12738336
2370 -12738336 -9306193 -3405426 1010439 1814268 394637 50031 3053506 8726551
$$ packed form
2411a453914J031353m060643n606242k068460K562210M331122L608307K854042
2403A197775K243196L14114j739848l95532M175621O267161K033244m263674n751962
2394D080095k635462r77498k529769k089469L374442Q745716P626079J292583
2386A6886717l527092l640428j950538j918855l296147l804974k375199K45752
2378c380764K574746L300798J923557r53375m027876n831466n030348j313608
2370a2738336L432143N900767M415865Q03829j419631l44606L003475N673045
$$ [...]
##END NTUPLES=NMR SPECTRUM
##END=
