##TITLE=31Pdec_LR-793-O-C2-KA
 DMSO-d6, 64 sc
 26.12.2024
##JCAMPDX= 6.0         $$ Bruker NMR JCAMP-DX V2.0
##DATA TYPE= NMR SPECTRUM
##DATA CLASS= NTUPLES
##ORIGIN= UXNMR, Bruker Analytische Messtechnik GmbH
##OWNER= root
$$ XWIN-NMR		Version 3.5
$$ Thu Dec 26 14:26:35 2024 Russian Standard Time (UT+4h)  she@DPX200
##.OBSERVE FREQUENCY= 81.013821
##.OBSERVE NUCLEUS= ^31P
##.ACQUISITION MODE= SIMULTANEOUS
##.ACQUISITION SCHEME= undefined
##.AVERAGES= 64
##.DIGITISER RES= 17
##SPECTROMETER/DATA SYSTEM= spect
##.PULSE SEQUENCE= zgpg30
##.SOLVENT NAME= DMSO
##.SHIFT REFERENCE= (INTERNAL, DMSO, 0, 198.062)
##AUDIT TRAIL= $$ (NUMBER, WHEN, WHO, WHERE, WHAT)
$$ ##TITLE= Audit trail, XWIN-NMR		Version 3.5
$$ ##JCAMPDX= 5.01
$$ ##ORIGIN= Bruker BioSpin GmbH
$$ ##OWNER= she
$$ F:/spectra/data/she/nmr/P31/2/pdata/1/auditp.txt
$$ ##AUDIT TRAIL=  $$ (NUMBER, WHEN, WHO, WHERE, WHAT)
(   1,<2024-12-26 14:25:12.43 +0400>,<she>,<DPX200>,
      <continue with go, POWCHK disabled, PULCHK disabled
       configuration hash MD5:
       00 E9 B6 7A A2 85 ED C7 34 08 36 98 17 FE 4E 26
       data hash MD5: 32K
       7D 01 F5 AD F9 CE 51 CA 4C 07 2F 27 6D 6B 7D E8>)
(   2,<2024-12-26 14:25:14.37 +0400>,<she>,<DPX200>,
      <Start of raw data processing
       efp BC_mod = 2 LB = 1.5 FT_mod = 6 PKNL = 1 PHC0 = 2069.147 PHC1 = 181.0863 SI = 64K 
       data hash MD5: 64K
       8A E8 5E 90 16 38 8E 26 00 DA 75 11 43 20 09 A4>)
(   3,<2024-12-26 14:25:42.42 +0400>,<she>,<DPX200>,
      <abs ABSG = 5 
       data hash MD5: 64K
       7F D5 0A FF 15 92 19 86 74 6D 04 8B EA 09 54 C5>)
(   4,<2024-12-26 14:26:00.03 +0400>,<she>,<DPX200>,
      <pk PHC0 = -13.98351 PHC1 = 0 
       data hash MD5: 64K
       C5 72 12 E5 35 F0 65 CA 3C C4 1D E1 8B 96 10 9C>)
$$ ##END=
$$ 
$$ hash MD5
$$ F0 7E CD 1A B4 E0 4F CF 05 65 DA 47 1F 5C 06 7E
##$RELAX= 
##$RELAX= 
##$RELAX= 
##$RELAX= 
##$RELAX= 
##$RELAX= 
##$RELAX= 
##$RELAX= 
$$ Bruker specific parameters
$$ --------------------------
##$DU= <F:/spectra>
##$EXPNO= 2
##$NAME= <P31>
##$PROCNO= 1
##$TYPE= <nmr>
##$USER= <she>
##$AMP= (0..31)
100 100 100 100 100 100 100 100 100 100 100 100 100 100 100 100 100 100 
100 100 100 100 100 100 100 100 100 100 100 100 100 100 
##$AQSEQ= 0
##$AQ_mod= 1
##$AUNM= <au_zg>
##$AUTOPOS= <>
##$BF1= 81.014009
##$BF2= 200.13
##$BF3= 200.13
##$BF4= 200.13
##$BF5= 200.13
##$BF6= 200.13
##$BF7= 200.13
##$BF8= 200.13
##$BYTORDA= 1
##$CFDGTYP= 0
##$CFRGTYP= 5
##$CHEMSTR= <none>
##$CNST= (0..31)
1 1 145 1 1 1 1 1 1 1 1 1 1 1 1 1 1 1 1 1 1 1 1 1 1 1 1 1 1 1 1 1 
##$CPDPRG= <waltz16>
##$CPDPRG1= <>
##$CPDPRG2= <waltz16>
##$CPDPRG3= <>
##$CPDPRG4= <mlev>
##$CPDPRG5= <mlev>
##$CPDPRG6= <mlev>
##$CPDPRG7= <mlev>
##$CPDPRG8= <mlev>
##$CPDPRGB= <>
##$CPDPRGT= <>
##$D= (0..31)
0 1 0 0 0 0 0 0 0 0.06 0 0.03 2e-05 3e-06 0 0 0.0002 0 0 0 0 0 0 0 0 0 
0 0 0 0 0 0 
##$DATE= 1735208634
##$DBL= (0..7)
120 120 120 11 120 120 24 19 
##$DBP= (0..7)
150 150 150 150 150 150 150 150 
##$DBP07= 0
##$DBPNAM0= <>
##$DBPNAM1= <>
$$ [...]
##$SUBNAM3= <"">
##$SUBNAM4= <"">
##$SUBNAM5= <"">
##$SUBNAM6= <"">
##$SUBNAM7= <"">
##$SUBNAM8= <"">
##$SUBNAM9= <"">
##$SW= 400.765351723535
##$SWIBOX= (0..15)
0 1 3 0 0 0 0 0 0 0 0 0 0 0 0 0 
##$SW_h= 32467.5324675325
##$TD= 32768
##$TD0= 1
##$TE= 0
##$TE2= 300
##$TE3= 300
##$TEG= 300
##$TL= (0..7)
0 120 53 12 22 120 120 120 
##$TP= (0..7)
150 150 150 150 150 150 150 150 
##$TP07= 0
##$TPNAME0= <>
##$TPNAME1= <>
##$TPNAME2= <>
##$TPNAME3= <>
##$TPNAME4= <>
##$TPNAME5= <>
##$TPNAME6= <>
##$TPNAME7= <>
##$TPOAL= (0..7)
0.5 0.5 0.5 0.5 0.5 0.5 0.5 0.5 
##$TPOFFS= (0..7)
0 0 0 0 0 0 0 0 
##$TUNHIN= 0
##$TUNHOUT= 0
##$TUNXOUT= 0
##$USERA1= <user>
##$USERA2= <user>
##$USERA3= <user>
##$USERA4= <user>
##$USERA5= <user>
##$V9= 5
##$VALIST= <valist>
##$VCLIST= <CCCCCCCCCCCCCCC>
##$VD= 0
##$VDLIST= <DDDDDDDDDDDDDDD>
##$VPLIST= <PPPPPPPPPPPPPPP>
##$VTLIST= <TTTTTTTTTTTTTTT>
##$WBST= 1024
##$WBSW= 4
##$XGAIN= (0..3)
0 0 0 0 
##$XL= 0
##$YL= 0
##$YMAX_a= 10730
##$YMIN_a= -7513
##$ZGOPTNS= <>
##$ZL1= 120
##$ZL2= 120
##$ZL3= 120
##$ZL4= 120
##$ABSF1= 198.0616
##$ABSF2= -202.7028
##$ABSG= 5
##$ABSL= 3
##$ALPHA= 0
##$AQORDER= 0
##$ASSFAC= 0
##$ASSFACI= 0
##$ASSFACX= 0
##$ASSWID= 0
##$AUNMP= <proc_1d>
##$AZFE= 0.1
##$AZFW= 0.5
##$BCFW= 0
##$BC_mod= 2
##$BYTORDP= 0
##$COROFFS= 0
##$CY= -3
##$DATMOD= 1
##$DC= 0
##$DFILT= <>
##$DTYPP= 0
##$F1P= 0
##$F2P= 0
##$FCOR= 1
##$FTSIZE= 65536
##$FT_mod= 6
##$GAMMA= 0
##$GB= 0
##$INTBC= 1
##$INTSCL= 9.790993e-09
##$ISEN= 30
##$LB= 1.5
##$LEV0= 0
##$LPBIN= 0
##$MAXI= 10000
##$MC2= 0
##$MEAN= 0
##$ME_mod= 0
##$MI= 50
##$NCOEF= 0
##$NC_proc= -8
##$NLEV= 6
##$NOISF1= 182.463
##$NOISF2= 159.3651
##$NSP= 0
##$NTH_PI= 0
##$NZP= 0
##$OFFSET= 198.0616
##$PC= 4
##$PHC0= 2055.164
##$PHC1= 181.0863
##$PH_mod= 1
##$PKNL= yes
##$PPARMOD= 0
##$PSCAL= 0
##$PSIGN= 0
##$REVERSE= no
##$SF= 81.0140089999434
##$SI= 65536
##$SIGF1= 159.3651
##$SIGF2= -187.1042
##$SINO= 113.3802
##$SIOLD= 16384
##$SREGLST= <1H.CDCl3>
##$SSB= 0
##$STSI= 65536
##$STSR= 0
##$SW_p= 32467.5324675325
##$SYMM= 0
##$S_DEV= 0
##$TDeff= 32768
##$TDoff= 0
##$TI= <>
##$TILT= no
##$TM1= 0
##$TM2= 0
##$TOPLEV= 0
##$USERP1= <user>
##$USERP2= <user>
##$USERP3= <user>
##$USERP4= <user>
##$USERP5= <user>
##$WDW= 1
##$XDIM= 65536
##$YMAX_p= 355404121
##$YMIN_p= -209657726
$$ End of Bruker specific parameters
$$ ---------------------------------
##NTUPLES= NMR SPECTRUM
##VAR_NAME=  FREQUENCY,     SPECTRUM/REAL,   SPECTRUM/IMAG
##SYMBOL=    X,             R,               I
##VAR_TYPE=  INDEPENDENT,   DEPENDENT,       DEPENDENT
##VAR_FORM=  AFFN,          ASDF,            ASDF
##VAR_DIM=   65536,         65536,           65536
##UNITS=     HZ,            ARBITRARY UNITS, ARBITRARY UNITS
##FACTOR=    0.49542278885378, 1,            1
##FIRST=     16045.7642231865, 0,            0
##LAST=      -16421.768244346, 0,            0
##MIN=       -16421.768244346, -209657726,   0
##MAX=       16045.7642231865, 355404121,    0
$$ Real data points
##PAGE= N=1
##DATA TABLE= (X++(R..R)), XYDATA
$$ [...]
43100a254255J993096R25940K41363L69273J053688J968518J797134m08829k377582
$$ -1254255 738841 1664781 1906144 2275417 3329105 5297623 7094757 6685928 4308346
43091D308346o45857L653971N066203J507189k426481k191084O23199J937678
$$ 4308346 3662489 7316460 12382663 13889852 11463371 9272287 9895486 11833164
43083A1833164J266019N03846l59452k259718l873111l300986j523961q14599
$$ 11833164 13099183 13603029 13243577 10983859 7110748 3809762 2285801 1471202
43075A471202j047574p39459l57637j246248k284304r41475K744192N911584O270339
$$ 1471202 423628 -315831 -673468 -1919716 -4204020 -5145495 -2401303 3510281 9780620
43066I780620L821420M3730k865906l151872j572790p90587j311201m95008K542082
$$ 9780620 13602040 13645770 10779864 7627992 6055202 5264615 3953414 3458406 6000488
43057F000488M254130J845289j919590k728841q80736M97455Q12472J209151P60195
$$ 6000488 10254618 12099907 10180317 7451476 6570740 7068195 7880667 9089818 9850013
43048I850013j694336l742361k372395P99706K114383J895431K622108L000880
$$ 9850013 8155677 4413316 2040921 2840627 4955010 6850441 9472549 12473429
43040A2473429Q6561l989617m190036r21426O55224n65604q39974K01889j310954
$$ 12473429 12559990 8570373 4380337 3458911 4114135 3548531 2708557 2910446 1599492
43031A599492m743290l888182K368048O403927L068836k719512m335031k637521
$$ 1599492 -3143798 -7031980 -4663932 1739995 4808831 2089319 -2245712 -4883233
43023d883233j406405Q6340L533759N819337L611518j62134q17478N96728N43530
$$ -4883233 -6289638 -6203298 -2669539 3149798 6761316 6599182 5781704 6378432 6921962
43014F921962K45844K798259N775722M099923j170089l951287k454607q69372
$$ 6921962 7167806 9966065 15741787 19841710 18671621 14720334 12265727 11396355
43006A1396355j746909k794095j945222l99778L20759J35182j180874l543340
$$ 11396355 9649446 6855351 4910129 4510351 4831110 4966292 3785418 242078
42998B42078m714120k736294L67821J289063P52948J647590L140543K068626o95257
$$ 242078 -4472042 -7208336 -6840515 -5551452 -4798504 -3150914 -10371 2058255 1362998
42989A362998j264097K03046j79059k458762k420981L29378J020776j596279k446673
$$ 1362998 98901 301947 122888 -2335874 -4756855 -4427477 -3406701 -5002980 -7449653
42980g449653R47835L785242K331515K87506J576518K844684k80226m302372k873422
$$ -7449653 -6501818 -2716576 -385061 -97555 1478963 4323647 4043421 -258951 -3132373
42971c132373K292074L463079j115977m721892k410913K541430M437860K524934
$$ -3132373 -840299 2622780 1506803 -3215089 -5626002 -3084572 1353288 3878222
42963C878222j8118j068696q30758O408J145494K308300L063859K891477J478064
$$ 3878222 3860104 2791408 1960650 1967058 3112552 5420852 8484711 11376188 12854252
42954A2854252o42533k314119l111484l405258k615810M91482M449220M770725
$$ 12854252 12211719 9897600 6786116 3380858 765048 1256530 5705750 10476475
42946A0476475j65782n167279m117591J408266L939587M38719l932611l705395
$$ 10476475 10310693 5143414 1025823 2434089 6373676 6812395 2879784 -825611
42938h25611l28570J276881N8819j027194n10261j00783r42557j463811j16229
$$ -825611 -1154181 122700 181519 -845675 -1355936 -1456719 -2399276 -3863087 -3979316
42929c979316J946029K538842J531735N48522K33766k84095j149920j012707N94163
$$ -3979316 -2033287 505555 2037290 2585812 2819578 2535483 1385563 372856 967019
42920I67019J871555J336708L66513J006499K266143J388244j476562k981409
$$ 967019 2838574 4175282 4541795 5548294 7814437 9202681 7726119 4744710
42912D744710j535592M75710O12513l21929o16454p08171j721506l015188l416800
$$ 4744710 3209118 3684828 4297341 3975412 3358958 2650787 929281 -2085907 -5502707
42903e502707l152749k504739m91695K835536M831195L627410J109168k95990
$$ -5502707 -8655456 -11160195 -11651890 -8816354 -3985159 -357749 751419 455429
42895D55429j525880m010315n220683j967950L183086M352545J119402p94408
$$ 455429 -1070451 -5080766 -10301449 -12269399 -9086313 -4733768 -3614366 -4408774
42887d408774J409712L560222J882600p64375K69547M115608O043836M036086
$$ -4408774 -2999062 561160 2443760 1679385 1948932 6064540 12108376 16144462
42879A6144462m6114m076400o815061o665107k945662J761488L437361J124044
$$ 16144462 16098348 12021948 5206887 -1458220 -4403882 -2642394 794967 1919011
42871A919011k250216l461894j872921Q72356K437013J426029j127452k275992
$$ 1919011 -331205 -3793099 -5666020 -4793664 -2356651 -930622 -2058074 -4334066
42863d334066m14768K501928L235787J128496j567881k547956j359064Q43268
$$ -4334066 -4748834 -2246906 988881 2117377 549496 -1998460 -3357524 -2514256
42855b514256K143378J179284j130142j973848j9445K585018K965295J137547
$$ -2514256 -370878 808406 -321736 -2295584 -2315029 269989 3235284 4372831
42847D372831p72318j718558k123375k096321j527335j240004j828968k008806
$$ 4372831 3600513 1881955 -241420 -2337741 -3865076 -5105080 -6934048 -8942854
42839h942854l78093J894821K603236J956531J736059J784700O93424n10477O17918
$$ -8942854 -9320947 -7426126 -4822890 -2866359 -1130300 654400 1347824 837347 1455265
42830A455265L030319K726883o60953k396539O4303K681130J069281k581644l142578
$$ 1455265 4485584 7212467 6551514 4154975 4219278 6900408 7969689 5388045 2245467
42821B245467n05467R28240n34125j950613j034842P99845J499107J134998M83512
$$ 2245467 1740000 2668240 2134115 183502 -851340 -51495 1447612 2582610 3066122
42812C066122n62363j952492k732479k236154o75017J577496L664131L590734
$$ 3066122 2503759 551267 -2181212 -4417366 -5092383 -3514887 149244 3739978
42804C739978L52282l345838l449693j61843J966079O09307j060583L36169L104602
$$ 3739978 4092260 746422 -2703271 -2865114 -899035 -289728 -1350311 -1014142 2090460
42795B090460L592514K136529K008831L630634L885706J299896j688171k665887
$$ 2090460 5682974 7819503 9828334 13458968 17344674 18644570 16956399 14290512
42787A4290512k594080l560309n151659n063721k500929P14481K451773K671748
$$ 14290512 11696432 8136123 2984464 -2079257 -4580186 -3865705 -1413932 1257816
42779A257816L003751M076153L941616K57642n701598q791584n404236J634045
$$ 1257816 4261567 8337720 12279336 12536978 6835380 -1956204 -7360440 -5726395
42771e726395N627182L500121j218678l343407j945592q8391j48298j284545j323815
$$ -5726395 -99213 3400908 2182230 -1161177 -3106769 -3195160 -3343458 -4628003 -5951818
42762e951818K51036J718636J162955j191488k922018j953784J072652L501403
$$ -5951818 -5700782 -3982146 -2819191 -4010679 -6932697 -8886481 -7813829 -4312426
42754d312426L514631J607403n33502j657430j515491q33323q02129j651557j829382
$$ -4312426 -797795 809608 276106 -1381324 -2896815 -3730138 -4532267 -6183824 -8013206
42745h013206J61981L165584M214452K308025l01751j166291k66520J213119K807558
$$ -8013206 -7851225 -4685641 -471189 1836836 1535085 368794 102274 1315393 4122951
42736D122951M032633L413140L00435l207375m098291j929907Q79023J892884
$$ 4122951 8155584 11568724 11869159 8661784 4563493 2633586 3512609 5405493
42728E405493O72339j521182k856229k236658m87538L63998j70724j14045J975712
$$ 5405493 6077832 4556650 1700421 -536237 -1023775 -659777 -830501 -944546 1031166
42719A031166M403343M508433K329242K8018j434032k691450l667537l462147
$$ 1031166 5434509 9942942 12272184 12300202 10866170 8174720 4507183 1045036
42711A045036k376209j558244o64562J533273M056419M097286J212726j554427
$$ 1045036 -1331173 -2889417 -3553979 -2020706 2035713 6132999 7345725 5791298
42703E791298j827409p09551j96886k04465J44477L50757l67906j349190j651431
$$ 5791298 3963889 3254338 3057452 2852987 2997464 3348221 2980315 1631125 -20306
42694b0306j612853j584861n08443K303664N030060N023428K118431j307795l058473
$$ -20306 -1633159 -3218020 -3726463 -1422799 3607261 8630689 10749120 9441325 6382852
42685F382852k609700o65197J288925J594607L9759j557415j529314m87494j29981
$$ 6382852 3773152 3107955 4396880 5991487 6031246 4473831 2944517 2457023 2327042
42676B327042p73025j480301j877209k222935k205619j302556o1718M66113M07899
$$ 2327042 1554017 73716 -1803493 -4026428 -6232047 -7534603 -7596321 -7130208 -6722309
42667f722309Q50250K075575L198527L390659K402500K10335k608438m353171
$$ -6722309 -5872059 -3796484 -597957 2792702 5195202 5405537 2797099 -1556072
42659a556072l403544k01231K824944L569726K118148L81069Q2676R17583Q98363
$$ -1556072 -4959616 -5160847 -2335903 1233823 3351971 3733040 3815716 4733299 5631662
42650E631662r02766k623548k037955j8766P59291J78516M95403J605514O67424
$$ 5631662 4728896 2105348 67393 48627 807918 986434 1481837 3087351 3754775
42641C754775k201145k527125J469017M993425L770709P15445M55070J137798
$$ 3754775 1553630 -973495 495522 5488947 9259656 9975101 10430171 11567969
42633A1567969j758799o287031o340080j930088O73986p59817j745053Q7991J163521
$$ 11567969 9809170 3522139 -2817941 -4748029 -4074043 -4833860 -6578913 -6490922 -5327401
42624e327401n97380j691001K91287K403973K419536K833353M660380L688782
$$ -5327401 -5924781 -7615782 -7324495 -4920522 -2500986 332367 4992747 8681529
42616H681529j780847n496284k062141L799984M011066p35082l259175j551242
$$ 8681529 6900682 1404398 -657743 3142241 7153307 6418225 3159050 1607808
42608A607808j70622j341945k300173j385384o3217J317167L668463N007812K274680
$$ 1607808 1437186 95241 -2204932 -3590316 -3653533 -2336366 1332097 6339909 8614589
42599H614589k469154l837621j519220m47386j910093j592830J773633L158062
$$ 8614589 6145435 2307814 788594 341208 -1568885 -3161715 -1388082 1769980
42591A769980j48899l305946j572860K405152L603818K083450N50398j258462
$$ 1769980 1621081 -1684865 -3257725 -852573 2751245 4834695 5385093 4126631
42583D126631m334592n919091k971062K082489M341429L511308K960961L134792
$$ 4126631 -207961 -6127052 -9098114 -7015625 -2674196 837112 3798073 6932865
42575F932865J327762k342252l996055j875811J050884J640971M06355n85789
$$ 6932865 8260627 5918375 1922320 46509 1097393 2738364 3144719 2558930
42567B558930r75030j648880k676409l104345k219600m97315N87925J93181l24165
$$ 2558930 1583900 -64980 -2741389 -5845734 -8065334 -8562649 -7974724 -7781543 -8105708
42558h105708J073799L503337L418479q1965k899632j401319K253927L564457
$$ -8105708 -7031909 -3528572 -110093 -192058 -3091690 -4493009 -2239082 1325375
42550A325375K273993J361623J035098j252881n075996o412564l726351k50608
$$ 1325375 3599368 4960991 5996089 4743208 -332788 -6745352 -10471703 -10722311
42542a0722311J265917K039058L551278M194758K372215M6187J20429K122719
$$ -10722311 -9456394 -7417336 -3866058 328700 2700915 2747102 2867531 4990250
42534D990250L209661K198321L20003j016836j290567o18564l2365r73458l115177
$$ 4990250 8199911 10398232 10718235 9701399 8410832 7792268 7759903 6786445 3671268
42525C671268l950516k006997R72624K645586L117094L308837K228206j037863
$$ 3671268 -279248 -2286245 -1313621 1331965 4449059 7757896 9986102 8948239
42517H948239l923205k833101J148687K911471N47266j822983l74104K593707
$$ 8948239 5025034 2191933 3340620 6252091 6799357 4976374 4602270 7195977
42509G195977K245295j558023m327715l417257p54129J115196K205101L029274
$$ 7195977 9441272 7883249 3555534 138277 -615852 499344 2704445 5733719
42501E733719K395774m16962l244670l406904j444192q6991k37057n00220l22313
$$ 5733719 8129493 7712531 4467861 1060957 -383235 -470226 -707283 -1207503 -1529816
42492a529816p73203j914982k113985q06813N09000J082397K192190M152648M582469
$$ -1529816 -2303019 -4218001 -6331986 -7138799 -6629799 -5547402 -3355212 797436 5379905
42483E379905J916996j361469j704593N61784J954785P40441j391803k196178
$$ 5379905 7296901 5935432 4230839 4792623 6747408 7487849 6096046 3899868
42475C899868j207497N94208J644336P09490j408379j855717P18356L616846L417297
$$ 3899868 2692371 3286579 4930915 5640405 4232026 2376309 3094665 6711511 10128808
42466A0128808P96356q10969n67299q66045k785713m415625m186362k704415p20947
$$ 10128808 10925164 10114195 9546896 8680851 5895138 1479513 -2706849 -5411264 -6132211
42457f132211J605123K911470J578722o99975q6624L266696M226304O0343m937971
$$ -6132211 -4527088 -1615618 -36896 -736871 -823495 2443201 6669505 6729848 1791877
42448A791877n262470j514150J575003J932675J100475R1088j670200l765773
$$ 1791877 -3470593 -4984743 -3409740 -1477065 -376590 -285502 -1955702 -5721475
42440e721475m458079l037734l44929K630208M853212M982629L131741J781678
$$ -5721475 -10179554 -13217288 -13562217 -10932009 -6078797 -1096168 2035573 3817251
42432C817251K593806L440949J264738l043459n513030m353668j600214K14964
$$ 3817251 6411057 9852006 11116744 8073285 2560255 -1793413 -3393627 -3178663
42424c178663M49573m06838j455409j470922l51825L4296j367255k195135K22295
$$ -3178663 -2729090 -3135928 -4591337 -6062259 -6414084 -6379788 -7747043 -9942178 -9719883
42415i719883M026467M723354J733750q04073k80716J184133J000266j5134N0452
$$ -9719883 -5693416 -970062 763688 -40385 -321101 863032 1863298 1848164 1898616
42406A898616Q42360Q48668j09543j286107k311206k769537k084754q36975m16703
$$ 1898616 2740976 3589644 3480101 2193994 -117212 -2886749 -4971503 -5808478 -6225181
42397f225181n42491O81064L187328L945915J223949k353313l052405p20061J693002
$$ -6225181 -6767672 -6086608 -2899280 1046635 2270584 -82729 -3135134 -3855195 -2162193
42388b162193K003206M98780j147303j307154K71827J733267J040672q93778j058719
$$ -2162193 -158987 339793 -807510 -2114664 -1842837 -109570 931102 37324 -1021395
42379a021395J080910K570936J612973O0048m46995j310426l267967l376540M57188
$$ -1021395 59515 2630451 4243424 4303472 3856477 2546051 -721916 -4098456 -3641268
42370c641268M727825M597473R61597j396510j213078j227783k103365j425571
$$ -3641268 1086557 5684030 6645627 5249117 4036039 2808256 704891 -720680
42362g20680Q76626J497461n35580j921027o15310J122340J246182J095016J484946
$$ -720680 155946 1653407 1117827 -803200 -1418510 -296170 950012 2045028 3529974
42353C529974L6026m025601o265900k804312L025175M660305J350032j625829
$$ 3529974 3566000 -459601 -6725501 -9529813 -6504638 -1844333 -494301 -2120130
42345b120130r84563J130237J875841J314302L08225j189198k254955r33443K094810
$$ -2120130 -3104693 -1974456 -98615 1215687 1523912 334714 -1920241 -2853684 -758874
42336g58874K981927J60387k543090j171146K292544K748933l95700k480827o21954
$$ -758874 2223053 2383440 -159650 -1330796 961748 3710681 3314981 834154 212200
42327B12200K265242J996308j071125l076212k087849r8748K33551j031500j675697
$$ 212200 2477442 4473750 3402625 326413 -1761436 -1860184 -1626633 -2658133 -4333830
42318d333830l70853J666274K119047L58948j636181j508212N69808J956344P41939
$$ -4333830 -4704683 -3038409 -919362 -560414 -2196595 -3704807 -3134999 -1178655 -436716
42309d36716j846677k883790j205943J320435K041938M59431j441288j623716
$$ -436716 -2283393 -5167183 -6373126 -5052691 -3010753 -2551322 -3992610 -5616326
42301e616326k56720Q53928P56227K87911K63129L4801j026905j815084j119464
$$ -5616326 -5873046 -5019118 -4262891 -3974980 -3711851 -3677050 -4703955 -6519039 -7638503
42292g638503j65313r86880k521042j480379K250257M577666L170567Q96106O74523
$$ -7638503 -7803816 -8790696 -11311738 -12792117 -10541860 -5964194 -2793627 -1897521 -1222998
42283a222998N20664k210633m652188k067765L770659N964907K432700j431191
$$ -1222998 -702334 -2912967 -7565155 -9632920 -5862261 102646 2535346 1104155
42275A104155j299022N71824O75212j47215K72396J196159J359590J813879K876016
$$ 1104155 -194867 376957 1052169 904954 1177350 2373509 3733099 5546978 8422994
42266H422994K043464j248819k847775m18125J437657j611207n210653k543747
$$ 8422994 10466458 9217639 6369864 5951739 7389396 5778189 567536 -1976211
42258a976211L743397M591672j228356n142532k377903J465995P48876j512449
$$ -1976211 1767186 6358858 5130502 -12030 -2389933 -923938 -175062 -1687511
42250a687511l02503K759603L392878K057980J261295k10787l839700n692660
$$ -1687511 -1990014 769589 4162467 6220447 7481742 7270955 3431255 -2261405
42242b261405j447338N018197N563228k37062m261607j785720K489373K551430
$$ -2261405 -3708743 1309454 6872682 6635620 2374013 588293 3077666 5629096
42234E629096n64836j995271m94002J245131J394887O82948K44441K40965L86249
$$ 5629096 5064260 3068989 2574987 3820118 5215005 5897953 6142394 6383359 6769608
42225F769608N44124Q81408J595360J962966L30360l436863o242647m900635p25657
$$ 6769608 7313732 8195140 9790500 11753466 12083826 8646963 2404316 -2496319 -3221976
42216c221976J774552R34543l73137L81707K148287L138385L520800L367373J157179
$$ -3221976 -1447424 -512881 -886018 -504311 1643976 4782361 8303161 11670534 12827713
42207A2827713k981535n328050l220173L84813O72617k038124l042399n44173
$$ 12827713 9846178 4518128 1297955 1682768 2355385 317261 -2725138 -3269311
42199c269311J932967J257436q35808r51437Q15824J485718j90604k114486j909245
$$ -3269311 -1336344 -78908 -914716 -1866153 -1050329 435389 244785 -1869701 -3778946
42190c778946O4906J518783J251154L18219J10573K63629n11077j930596k024961
$$ -3778946 -3714040 -2195257 -944103 -625884 -515311 -251682 -762759 -2693355 -4718316
42181d718316j0599K106074J912359k73744j831034r25677J788642M120352M164599
$$ -4718316 -4728915 -2622841 -710482 -984226 -2815260 -3740937 -1952295 2168057 6332656
42172F332656J741347j144864j926273l79731R76660L48518q07842l57368Q06662
$$ 6332656 8074003 6929139 5002866 4623135 5599795 5948313 5140471 4783103 5589765
42163E589765K28965j656101j754490O55742K363629J078008j028922r14197M07660
$$ 5589765 5818730 4162629 2408139 3063881 5427510 6505518 5476596 4562399 4970059
42154D970059l51082l066540l815977p30855K785300K570006m71440j712994N08105
$$ 4970059 4618977 1552437 -2263540 -2994395 -209095 2360911 1889471 176477 684582
42145F84582K472839N36705l305295l914479j64943L510564L234117L55698j573200
$$ 684582 3157421 3694126 388831 -3525648 -3690591 -180027 3054090 3409788 1836588
42136A836588j823545j852982j602318J75558K733419L854300L330580K675099
$$ 1836588 13043 -1839939 -3442257 -3266699 -533280 3321020 6651600 9326699
42128I326699J512219j888699n934599n973643j169847K937931J728588k025337
$$ 9326699 10838918 8950219 3015620 -2958023 -4127870 -1189939 538649 -1486688
42120a486688k642078K24922K199044J342715J271r462L96299N27238J068082
$$ -1486688 -4128766 -3903844 -1704800 -362085 -360814 -370276 26023 553261 1621343
42111A621343J493631P2584k341640k171417J325232L644894R39552m052670n205037
$$ 1621343 3114974 3187558 845918 -1325499 -267 3644627 4584179 531509 -4673528
42102d673528r89996L786711M184001O12884k596414k514184k31111J417948J411014
$$ -4673528 -5663524 -1876813 2307188 2920072 323658 -2190526 -2421637 -1003689 407325
42093D07325Q37813K46981j219303l202712k989223O46679M254442L767791P28900
$$ 407325 1245138 1492119 272816 -2929896 -5919119 -5272440 -1017998 2749793 3478693
42084C478693K70897K981284L671012l71848m797156m668728j345487P57545Q24173
$$ 3478693 3749590 6730874 10401886 10030038 5232882 564154 -781333 -23788 800385
42075H00385Q28044Q68006N5936M3194K571054M750410K183379l506272n723486
$$ 800385 1628429 2496435 2552371 2595565 5166619 9917029 12100408 8594136 2870650
42066B870650k189916K006708K206589J78535j85961Q78460L72837k438041n339007
$$ 2870650 680734 2687442 4894031 5072566 4886605 5765065 6137902 3699861 -1639146
42057a639146n989651l574039P13688L619940K567001l81678k59945L523651N320331
$$ -1639146 -7628797 -11202836 -10489148 -6869208 -4302207 -4683885 -4943830 -1420179 3900152
42048C900152J358552l993515m151110M10616L724211L276084J866346J171721
$$ 3900152 5258704 1265189 -2885921 -2475305 1248906 4524990 6391336 7563057
42040G563057o89900m064462n438344k652912J391166K946392K393590K266493
$$ 7563057 6873157 2808695 -2629649 -5282561 -3891395 -945003 1448587 3715080
42032C715080K747638K223709P45578j51669l04469q43429j581915j026734Q28258
$$ 3715080 6462718 8686427 9432005 9280336 8975867 8132438 6550523 5523789 6352047
42023F352047J950242J116749m33602r63608m42378P8066J20689k15119j016824
$$ 6352047 8302289 9419038 8985436 8021828 7579450 7657516 7778205 7563086 6546262
42014F546262k121101k469182j238465N26423P99613o15954j533120m47388J051622
$$ 6546262 4425161 1955979 717514 1243937 2043550 1427596 -105524 -552912 498710
42005D98710L77049k201176l600901j934442J234818L284792L636078L288233
$$ 498710 875759 -1325417 -4926318 -6860760 -5625942 -2341150 1294928 4583161
41997D583161K495203P04732j517850k309248q71952J041949R57231j239457k828130
$$ 4583161 7078364 7783096 6265246 3955998 3084046 4125995 5083226 3843769 1015639
41988A015639j361848K010936L333274O23535l086617l118626Q17296M187421
$$ 1015639 -346209 1664727 4998001 5621536 2534919 -583707 233589 4421010
41980D421010L702201J269544L62550Q78845L43669j349589j839013n75315J65684
$$ 4421010 8123211 9392755 9755305 10634150 10977819 9628230 7789217 7213902 7379586
41971G379586q58866j934677j463007m14785j80230j21836Q50483J958493J896074
$$ 7379586 6520720 4586043 3123036 2708251 2528021 2406185 3256668 5215161 7111235
41962G111235J246804J354704J617849L17319k068158k822467q91805J149408
$$ 7111235 8358039 9712743 11330592 11647911 9579753 6757286 5865481 7014889
41954G014889K56847l133767n622738m812314j678583Q92774J083277m73721j654530
$$ 7014889 7271736 4137969 -1484769 -6297083 -7975666 -7082892 -5999615 -6473336 -8127866
41945h127866q82941J454800L363907L218036J538061M62400J195035K483614
$$ -8127866 -9010807 -7556007 -4192100 -974064 563997 1026397 2221432 4705046
41937D705046K235601K01268j912189k772225k617282k053566j166018l63114
$$ 4705046 6940647 7141915 5229726 2457501 -159781 -2213347 -3379365 -3742479
41929c742479n34010j387126j147209P77515K346476J830265O81086J130750K248642
$$ -3742479 -4276489 -5663615 -6810824 -6033309 -3686833 -1856568 -1175482 -44732 2203910
41920B203910J473417o52494r43494J046460J975328K22833j337283k57139J187560
$$ 2203910 3677327 3024833 2081339 3127799 5103127 5325960 3988677 3731538 4919098
41911D919098j74704k785860k477548R54868L212860J594920j685069l120581
$$ 4919098 4744394 1958534 -519014 435854 3648714 5243634 3558565 437984
41903D37984k278531j215409j204674j550318j107665J3172N43897p1811l06849
$$ 437984 -1840547 -3055956 -4260630 -5810948 -6918613 -6905441 -6361544 -6433355 -6740204
41894f740204J737528N009189N778173K489966j505731k103546K63631K035764
$$ -6740204 -5002676 6513 5784686 8274652 6768921 4665375 4929006 6964770
41886F964770J828722J021137n7397k386070m467934k743620K522920N685454
$$ 6964770 8793492 9814629 9757232 7371162 2903228 159608 2682528 8367982
41878H367982K734592l107513n816054m145274j403605L75430J947821L354657
$$ 8367982 11102574 7995061 2179007 -1966267 -3369872 -2994442 -1046621 2308036
41870B308036L095706J299941K70152Q46016J065243l76864j939500k001287j490530
$$ 2308036 5403742 6703683 6973835 7819851 8885094 8508230 6568730 4567443 3076913
41861C076913j889356k513342j914551n67267J12624M02008J506709K725959J956573
$$ 3076913 1187557 -1325785 -3240336 -3807603 -3694979 -3292971 -1786262 939697 2896270
41852B896270p92577k713508j803632N94226J806664J094343m7627N2672J663829
$$ 2896270 2103693 -609815 -2413447 -1819221 -12557 1081786 1034159 1086831 2750660
41843B750660L457717L435270Q01045k769950m626739m108580k860663j998255
$$ 2750660 6208377 9643647 10444692 7674742 3048003 -1060577 -3921240 -5919495
41835e919495o61075J796501L888843L717128J509342q20516j719250o96430J632301
$$ -5919495 -6580570 -4784069 -895226 2821902 4331244 3510728 1791478 1095048 2727349
41826B727349L142884J650712j745667k877982j33396K555562J351445j384298
$$ 2727349 5870233 7520945 5775278 2897296 2763900 5319462 6670907 5286609
41818E286609j033936J181568k2945m503860n737409j104175L406454K348956
$$ 5286609 4252673 5434241 5411296 907436 -4829973 -5934148 -2527694 -178738
41810a78738j026790q07134J942253J821041j417495k770069m70426J777752J534519
$$ -178738 -1205528 -2012662 -70409 1750632 333137 -2436932 -2907358 -1129606 404913
41801D04913R40687J846609K476499J158122m54922l52927N64325N33906j35606
$$ 404913 1345600 3192209 5668708 6826830 6371908 6018981 6583306 7117212 6981606
41792F981606m08524p94324k018192k962123k144186k39234Q40566P61448R63131
$$ 6981606 6573082 5778758 3760566 798443 -1345743 -1584977 -744411 17037 980168
41783I80168K219146L248143K041853j665721n275003n292879j330867K604238
$$ 980168 3199314 6447457 8489310 6823589 1548586 -3744293 -5075160 -2470922
41775b470922K474866o82221k290158o47134J180583N58214q46733k77132J605553
$$ -2470922 3944 -678277 -2968435 -3615569 -2434986 -1876772 -2723505 -3000637 -1395084
41766a395084K019189L59689j295771j252864K19337J885260K530370J422377
$$ -1395084 624105 983794 -311977 -1564841 -1345504 539756 3070126 4492503
41758D492503q14495k172195j262220J009766K594013K540433J405398K55415
$$ 4492503 3678008 1505813 243593 1253359 3847372 6387805 7793203 8048618
41750H048618L726P94596J340937L1245k543486l621307j890397M98928J006826
$$ 8048618 8052344 8846940 10187877 10219122 7675636 4054329 2163932 2662860 3669686
41741C669686K57857N50777J911883J938325o28038l968885n052387k542803J905092
$$ 3669686 3927543 4478320 6390203 8328528 7700490 3731605 -1320782 -3863585 -1958493
41732a958493M690614L405450l94790k640387j665633r0918o99602k432603k479106
$$ -1958493 2732121 6137571 5742781 3102394 1436761 1345843 646241 -1786362 -4265468
41723d265468o83321P43639R55704J209698K122983K585977J689662M9942j064789
$$ -4265468 -4948789 -4205150 -3249446 -2039748 83235 2669212 4358874 4408816 3344027
41714C344027r28806Q4565M74557r09814k637742j678943K073503M479693K531067
$$ 3344027 2415221 2499786 2974343 2064529 -573213 -2252156 -178653 4301040 6832107
41705F832107j177894k322599j134331r60478k013111j219384J919203L968335
$$ 6832107 5654213 3331614 2197283 1236805 -776306 -1995690 -76487 3891848
41697C891848K912602Q42869j6059m41726j727259k974185k666293q84770J251395
$$ 3891848 6804450 7647319 7631260 7189534 5462275 2488090 -178203 -1062973 188422
41688A88422K588415J991323m14852k078073r06118Q56368o80896m366731m647790
$$ 188422 2776837 4768160 4353308 2275235 1369117 2225485 1544589 -2822142 -7469932
41679g469932k0846M183106L784959J637920K115717M118242L971734J872209
$$ -7469932 -7490778 -3307672 477287 2115207 4230924 8349166 12320900 14193109
41671A4193109N54201m8049j854139l909540l404041o46853J262703J265208R40222
$$ 14193109 14747310 14699261 12845122 8935582 5531541 4884688 6147391 7412599 8352821
41662H352821P49499l71163j815719j549688K16161J032285J13131r87463j613108
$$ 8352821 9102320 8731157 6915438 5365750 5581911 6614196 6727327 5739864 4126756
41653D126756k500195k999174j531801Q34231J194594j41941L60080L173691L930438
$$ 4126756 1626561 -1372613 -2904414 -2070183 -875589 -1017530 -657450 2516241 6446679
41644F446679K96611l572507k929630M85405J418035r65639k580156j093579J119891
$$ 6446679 6743290 3170783 241153 726558 2144593 1178954 -1401202 -2494781 -1374890
41635a374890J209605l52116j466435j495664j051587j91432J445913L203320
$$ -1374890 -165285 -517401 -1983836 -3479500 -4531087 -4722519 -3276606 -73286
41627g3286L541235J919320k33011j050904m95919l04790j458046k600465j823301
$$ -73286 3467949 5387269 5154258 4103354 3607435 3302645 1844599 -755866 -2579167
41618b579167O36403K689517L054930K241596R76518o75069k183042k195065l72378
$$ -2579167 -1942764 746753 3801683 6043279 7019797 6344728 4161686 1966621 1594243
41609A594243J511033J507817n9123j172816q33940j22455l51059r95204l47014
$$ 1594243 3105276 4613093 4553970 3381154 2547214 2424759 2073700 1078496 731482
41600G31482J715605K698183M90472l048806l595500r4364L293956K686395j81194
$$ 731482 2447087 5145270 5635742 2586936 -1008564 -1102928 2191028 4877423 4696229
41591D696229q36441J187713K070941j42533k789989k813408o82505J180950J491890
$$ 4696229 3859788 5047501 7118442 6975909 4185920 1372512 690007 1870957 3362847
41582C362847L92222j261017j859288l13433J809509J645824p06926j938054n53449
$$ 3362847 3755069 2494052 634764 321331 2130840 3776664 3069738 1131684 578235
41573E78235Q87130J83785j019708n34897M93194R852r81084j94024J843001K665530
$$ 578235 1465365 1649150 629442 94545 587739 597591 -383493 -577517 1265484 3931014
41563C931014J607551j95742k197128l947522l716342q56945J804131J496502
$$ 3931014 5538565 5342823 3145695 -801827 -4518169 -5375114 -3570983 -2074481
41555b074481J96141J749137N177530N523230J484039k487563k765753r58158
$$ -2074481 -1878340 -129203 5048327 10571557 12055596 9568033 6802280 5844122
41547E844122r5858k82755l87990q83831k326512l192552j714895J428240L937320
$$ 5844122 5748264 5465509 5077519 4193688 1867176 -1325376 -3040271 -1612031 2325289
41538B325289M251243K173501j209234l440389k553972L8223P00473j378585k754641
$$ 2325289 6576532 8750033 7540799 4100410 1546438 1584661 2285134 906549 -1848092
41529a848092o79383L070440N033141M306473K048906q21822l164386l127369
$$ -1848092 -2527475 542965 5576106 9882579 11931485 11109663 7945277 4817908
41521D817908p43952Q84780l54221k118113j001506K229150L878708K570747J71452
$$ 4817908 4073956 4958736 4604515 2486402 1484896 3714046 7592754 10163501 10334953
41512A0334953j524870j953061n67467K168850L212085n9715n333816p309289
$$ 10334953 8810083 6857022 6289555 8458405 11670490 11610775 6276959 -1032330
41504a032330m459890n79558Q63477M79636J20158k88368j286605j931823j343152
$$ -1032330 -5492220 -6071778 -5208301 -4728665 -4608507 -4896875 -6183480 -8115303 -9458455
41495i458455l53742N2794L54840J083847J361481L75077r57147j247397o00431
$$ -9458455 -9812197 -9759403 -9404563 -8320716 -6959235 -6584158 -7541305 -8788702 -9389133
41486i389133j22799k58223m78885N2417J841423M065143M286100R61290l534616
$$ -9389133 -9511932 -9770155 -10249040 -10196623 -8355200 -4290057 -3957 957333 -2577283
41477b577283m657004j263473K786279L636687J709169l55697j483416j903756
$$ -2577283 -7234287 -8497760 -5711481 -2074794 -365625 -721322 -2204738 -4108494
41469d108494j392042k23340n5407j352536j661833P81163L431477K783271O5970
$$ -4108494 -5500536 -5723876 -5779283 -7131819 -8793652 -8012489 -4581012 -1797741 -1731771
41460a731771l58197K136002L399800J026940k067542k300754m34222M05284n59694
$$ -1731771 -2089968 46034 3445834 4472774 2405232 104478 -329744 75540 -484154
41451d84154j551685j384345m56091P61231K232119L441340L430125K020668K82122
$$ -484154 -2035839 -3420184 -3876275 -3115044 -882925 2558415 5988540 8009208 8291330
41442H291330l99372M21543J671809J512441o84065l173827l582983j784224J52608
$$ 8291330 7891958 8313501 9985310 11497751 10813686 7639859 4056876 2272652 2425260
41433B425260Q87421J022021R95814j32628k479484l731533j850153J595120L007203
$$ 2425260 3312681 4334702 5330516 5197888 2718404 -1013129 -2863282 -1268162 1739041
41424A739041J366039q33761j388770j026397j317076j643336l6568L424200N807645
$$ 1739041 3105080 2271319 882549 -143848 -1460924 -3104260 -3140828 283372 6091017
41415F091017M645309J101016j384180j420218j113825k430708l673292j704621
$$ 6091017 10736326 11837342 10453162 9032944 7919119 5488411 1815119 110498
41407A10498K820723N183557K508233k320440m388795k715802k74435P43363Q55957
$$ 110498 2931221 8114778 10623011 8302571 3913776 1197974 923539 1666902 2522859
41398B522859O94615n22693k812156l933763j884316K156894M901953M501753
$$ 2522859 3217474 2694781 -117375 -4051138 -5935454 -3778560 1123393 5625146
41390E625146J910445q56892k643676l365494l318981k708372j543837J67555
$$ 5625146 7535591 6678699 4035023 669529 -2649452 -5357824 -6901661 -6734106
41382f734106K091512L606884M316040M280256L652752K491767J118971Q8433
$$ -6734106 -4642594 -1035710 3280330 7560586 11213338 13705105 14824076 14912509
41374A4912509o05995j696331l388819m513127l854694k007154p63048o53922
$$ 14912509 14306514 12610183 9221364 4708237 853543 -1153611 -1916659 -2570581
41366b570581l03775J387568L555101M594325M159297K995016J506597l18728
$$ -2570581 -2874356 -1486788 2068313 6662638 10821935 13816951 15323548 15004820
41358A5004820j969196k659172k433340j869147p83551J356072L593111L763662
$$ 15004820 13035624 10376452 7943112 6073965 5290414 6646486 10239597 14003259
41350A4003259J404296j122134j587523p54319q41362k162472l085276k782522
$$ 14003259 15407555 14285421 12697898 11943579 11102217 8939745 5854469 3071947
41342C071947k106280j739120j192193J7037J479919K466196K407637R96201r95549
$$ 3071947 965667 -773453 -1965646 -1948609 -468690 1997506 4405143 5401344 4405795
41333D405795j473953N98491K927727K319314n94128j866447r7334J421255n76
$$ 4405795 2931842 3530333 6458060 8777374 8183246 6316799 6219465 7640720 7640144
41324G640144k135928j411698J670139L735549L308881J211521k110449n931778
$$ 7640144 5504216 4092518 5762657 9498206 12807087 14018608 11908159 5976381
41316E976381p160300l287844K752032N007656K324981m32394J05816J564863
$$ 5976381 -1183919 -4471763 -1719731 3287925 5612906 5180512 5286328 6851191
41308F851191R36532n09731m56612J14244l99038k89736K250998M305247J760735
$$ 6851191 7787723 7277992 6821380 6935624 6536586 6246850 8497848 12803095 14563830
41299A4563830l394357m722261o15753L162392J692717k831881n348692m572598
$$ 14563830 11169473 6447212 5831459 8993851 10686568 7854687 2505995 -2066603
41291b066603k340509N64182M049231O015424M146218j5833k305360j469808l18346
$$ -2066603 -4407112 -3842930 206301 6221725 10367943 10352110 8046750 6576942 6258596
41282F258596o82482m47372K568472O255634O513684K905521o99938j270998j16985
$$ 6258596 5576114 5128742 7697214 13952848 20466532 23372053 22672115 21401117 21284132
41273B1284132k65062k015017k886282j465707N65648Q37116o08430j821298j846111
$$ 21284132 21019070 19004053 16117771 14652064 15217712 16054828 15446398 13625100 11778989
41264A1778989j509389j285646k12565K020244L369082J697245j871743l925236
$$ 11778989 10269600 8983954 8771389 10791633 14160715 15857960 13986217 10060981
41256A0060981l102994j342876l44019P06613K465015L013526Q18219j609091
$$ 10060981 6957987 5615111 5271092 5977705 8442720 11456246 12274465 10665374
41248A0665374n41643L070824M393740J794245q79915n43523P10409J93080j72156
$$ 10665374 10123731 13194555 17588295 19382540 18502625 17959102 18669511 18862591 18690435
41239A8690435K531522O137920O286135M071508M820141Q862734R690135L565428
$$ 18690435 21221957 27359877 33646012 37717520 42537661 51400395 61090530 64655958
41231F4655958m517400q136155q087695q860006r987543p189219q11293L306947
$$ 64655958 60138558 52002403 43914708 35054702 25067159 17877940 17066647 20373594
41223B0373594K316842L20696J694918M769424N281516L175742K307405M529406
$$ 20373594 22690436 23011132 24706050 29475474 34756990 37932732 40240137 44769543
41215D4769543P122393O190836R06456n723298r475029q671535n883471n092447
$$ 44769543 51891936 58082772 58989228 53265930 43790901 35119366 29235895 24143448
41207B4143448o738117p060361l353592J858627L797109J414520j860636k831955
$$ 24143448 17405331 10344970 6991378 8850005 12647114 14061634 12200998 9369043
41199I369043j594114J82418J560281J960084M59149k817796n515161m917442
$$ 9369043 7774929 7957347 9517628 11477712 11936861 9119065 3603904 -1313538
41191a313538j005322L315536N089099L747409P68111k129803l893445l881284
$$ -1313538 -2318860 996676 6085775 9833184 10601295 8471492 4578047 696763
41183F96763j877361J147994K966633J860125j276468l339511k149096J164069
$$ 696763 -1180598 -32604 2934029 4794154 3517686 178175 -1970921 -806852
41175h06852L515568L360425J976298J150381O71118q34929l002856l304136m20474
$$ -806852 2708716 6069141 8045439 9195820 9866938 9032009 6029153 2725017 2304543
41166B304543L113330L501450P94817q15214J217474L952462L159445l06968j772326
$$ 2304543 5417873 8919323 9714140 8898926 10116400 14068862 17228307 16921339 15149013
41157A5149013L8533J165068j006273l435796k602528n73118j487147l988802
$$ 15149013 15187546 16352614 15346341 11910545 9308017 8734899 7247752 3258950
41149C258950k611901L289057P471958N561450J183136J04546J890294J736083
$$ 3258950 647049 3936106 11408064 16969514 18152650 18257196 20147490 21883573
41141B1883573j550913m271390m040215k721113k396562k322157j475545q51474
$$ 21883573 20332660 16061270 12021055 9299942 6903380 4581223 3105678 2254204
41133B254204j022020o9964L306963O515189N966406K260593n93674p87670m38347
$$ 2254204 1232184 1162220 4469183 10984372 16950778 19211371 18617697 17830027 17391680
41124A7391680j345994k147852j128319O30031J032055L25250L89538J523988
$$ 17391680 16045686 13897834 12769515 13399546 14431601 14756851 15146389 16670377
41116A6670377K171328J576940O73506K09663r3168j42227Q22601K271407J997583
$$ 16670377 18841705 20418645 21092151 21301814 21208646 21066419 21889020 24160427 26158010
41107B6158010p78926l305174k320846J436249L873373K732769J01889q82548
$$ 26158010 25379084 22073910 19753064 21189313 25062686 27795455 27897344 27014796
41099B7014796Q1319J235788K019886L584653O454069R461359J1203501J1085189
$$ 27014796 27096115 28331903 30351789 33936442 40390511 49851870 61055371 72140560
41091G2140560Q550827K888671n034739j1842545j4023710j1334044p012656m520264
$$ 72140560 80691387 83580058 78545319 66702774 52679064 41345020 34332364 29812100
41083B9812100m500543m784791k897430J252513M824603M773932J721288J03593
$$ 29812100 25311557 20526766 17629336 18881849 23706452 28480384 30201672 30305265
41075C0305265L058142P956556R213716N397730Q31259p04866q91009l271025
$$ 30305265 33363407 41319963 50533679 55931409 56762668 56057802 55166793 51895768
41067E1895768p101850q240861n318418j514247J12032n8884m56386r72837j711977
$$ 51895768 44793918 36553057 31234639 29720392 29832424 29773540 29317154 28344317 26632340
41058B6632340j495194J72898J378112M60024q34725M28154L607126M908893K935368
$$ 26632340 25137146 25310044 26688156 27148180 26313455 26741609 30348735 35257628 38192996
41049C8192996J043909K811952P081769R315318O865739J214923m522631q544148
$$ 38192996 39236905 42048857 49130626 58445944 65311683 66526606 62003975 53459827
41041E3459827j0488364j0093419p078493k349688J663318K770228J137545j043359
$$ 53459827 42971463 32878044 25799551 23449863 25113181 27883409 29020954 27977595
41033B7977595k211087k862001l685511l417036k66747M853643Q611986R296430
$$ 27977595 25766508 22904507 19218996 15801960 15535213 20388856 29000842 38297272
41025C8297272Q616892Q329070O993694K282691m593097r485235j0359054r210418
$$ 38297272 46914164 55243234 62236928 64519619 59926522 50441287 40082233 30871815
41017C0871815q233722o584148k732378J769768L465720J489485j382545k439273
$$ 30871815 22638093 16053945 13321567 15091335 18557055 20046540 18663995 16224722
41009A6224722j931990j614856j975491k064175j178784L76259J792311K287171
$$ 16224722 14292732 12677876 10702385 8638210 7459426 7835685 9627996 11915167
41001A1915167J531149R3718r81978j423317j835670k220925j610664j5424P18741
$$ 11915167 13446316 13540034 12558056 11134739 9299069 7078144 5467480 5452056 6170797
40992F170797m49137j600680n87613J125531M13387k013215j857230J979255M771362
$$ 6170797 5721660 4120980 3533367 4658898 5072285 3059070 1201840 3181095 7952457
40983G952457K690850j149926j194048K192859L506106N56687k728826k764835
$$ 7952457 10643307 9493381 8299333 10492192 13998298 14554985 11826159 9061324
40975I061324j051347m33684m71567L96258R22591r56031l763219l932610j190913
$$ 9061324 8009977 7576293 7104726 7500984 8423575 7467544 3704325 -228285 -1419198
40966a419198R04686Q7793j872391k233268o19030J592340L114174L034834J165940
$$ -1419198 -514512 -426719 -2299110 -4532378 -5151408 -3559068 -444894 2589940 3755880
40957C755880q98064q61869J133277K300246J180413l29904m10476l69029j889738
$$ 3755880 2857816 1995947 3129224 5429470 6609883 6279979 5869503 5500474 3610736
40948C610736l334002k025321J011727K130488M46548j321810j395499p11729
$$ 3610736 276734 -1748587 -736860 1393628 1840176 518366 -877133 -1588862
40940a588862L08091K786716N719995N213399P0716m991724n037671j537851K65804
$$ -1588862 -1280771 1505945 7225940 12439339 12510055 7518331 2480660 942809 1208613
40931A208613j016960j872913J74994L367350M764455L491552M74279k539907
$$ 1208613 191653 -1681260 -1506266 1861084 6625539 10117091 10591370 8051463
40923H051463l393764j382406J055718Q86858j256737k045200o19034N83230O15104
$$ 8051463 4657699 3275293 4331011 5217869 3961132 1915932 1296898 1880128 2495232
40914B495232J716156M692937O370678M165626K35589j683325j207552m26133
$$ 2495232 4211388 8904325 15275003 19440629 19676218 17992893 16785341 16359208
40906A6359208l04331o73886j723838k761851j672283J470160K769069J07897
$$ 16359208 16054877 15380991 13657153 10895302 9223019 10693179 13462248 13570145
40898A3570145k272982M03479N210460N147287J25469k532329N29156L757804
$$ 13570145 11297163 11700642 16911102 22058389 22183858 19651529 20180685 23938489
40890B3938489J918878j981033k418882j20423L53349j448346k135096j037795
$$ 23938489 25857367 23876334 21457452 21337029 21690378 20242032 18106936 17069141
40882A7069141q78864k205461k290260l47488N92560j398997l913392l934839
$$ 17069141 16190277 13984816 11694556 11347068 11939628 10540631 6627239 2692400
40874B692400k114247j010252r34773l9525K276224M214304L911967J608062q18559
$$ 2692400 578153 -432099 -1366872 -1406397 869827 5084131 8996098 10604160 9785601
40865I785601j826697j530172j268859j917020k773235k494232r56697N17579
$$ 9785601 7958904 6428732 5159873 3242853 469618 -2024614 -2981311 -2463732
40857b463732Q53765L38809k28993o53223r92887p97257L56452J776135K073258
$$ -2463732 -1609967 -1271158 -1500151 -2153374 -3146261 -3943518 -3587066 -1810931 262327
40848B62327R06056m25749n97503P1012K59973l38981n90271L73985J904971K737979
$$ 262327 1168383 742634 145131 216143 476116 137135 -453136 -79151 1825820 4563799
40838D563799K382401J087632p12942k106105j760386M09563K232615J465622
$$ 4563799 6946200 8033832 7320890 5214785 3454399 3863962 6096577 7562199
40830G562199j265113l225511l083581j943576r63539n6380O65129M77968N1113
$$ 7562199 6297086 3071575 -12006 -1955582 -2919121 -2975501 -2310372 -1832404 -1781291
40821a781291J545040N079426P103174M523139q41953m269937l844260j894279
$$ -1781291 -236251 4843175 11946349 16469488 15627535 11357598 7513338 5619059
40813E619059j102257j452691j347954K2751K002025L044817J750583j692010
$$ 5619059 4516802 3064111 1716157 1738908 3740933 6785750 8536333 6844323
40805F844323m998616n659040l378360L0425K812347M334224M438849L181959
$$ 6844323 1845707 -3813333 -7191693 -7161268 -4348921 -14697 4424152 7606111
40797G606111J299025k32063j274289k290365l073254k765978j258398L84075
$$ 7606111 8905136 8673073 7398784 5108419 2035165 -730813 -1989211 -1605136
40789a605136J103811P78050q0497q61942j025734l09590J029053K274999K467951
$$ -1605136 -501325 276725 196228 -665714 -1691448 -2001038 -971985 1303014 3770965
40780C770965R31937j558546k553399n50290K223141K069956o25390j287393J844598
$$ 3770965 4702902 3144356 590957 40667 2263808 4333764 3708374 2420981 4265579
40771D265579M253228J794495k544962l112166l70559M58662j589692j970377
$$ 4265579 8518807 10313302 7768340 4656174 4285615 4744277 3154585 1184208
40763A184208J000877K867795M54391k869579k704489j08658J160976N21907j50991
$$ 1184208 2185085 5052880 5507271 2637692 -66797 -175455 985521 1507428 1356437
40754A356437m98848j193113j472732n68908J71654l09587k01223K056497M043516
$$ 1356437 857589 -335524 -1808256 -2377164 -2205510 -2515097 -2716320 -659823 3383693
40745C383693K553867r93051k332575n67895J291672J310329L06370r31893k220786
$$ 3383693 5937560 4944509 2611934 2044039 3335711 4646040 4952410 4020517 1799731
40736A799731k083878P07126L712997L058540n98324k490757p51068J332765J142213
$$ 1799731 -284147 422979 4135976 7194516 6596192 4105435 3354367 4687132 5829345
40727E829345L03965N80443M80401j376673l124206k809422j711762j692570j991305
$$ 5829345 6133310 6713753 7194154 5817481 2693275 -116147 -1827909 -3520479 -5511784
40718e511784j408478q74459r77510L7439K493992K797083j019439m372886k204475
$$ -5511784 -6920262 -7794721 -8772231 -8734792 -6240800 -3443717 -4463156 -8836042 -11040517
40709a1040517K401707K257722k317762l385565K158173P477846O223517J514788
$$ -11040517 -8638810 -6381088 -8698850 -12084415 -9926242 -2448396 3775121 5289909
40701E289909j81645J078368Q87167j001796r53257J243586J723708o48290k402481
$$ 5289909 5108264 6186632 7073799 6072003 5118746 6362332 8086040 7437750 5035269
40692E035269j450960Q656K67594J115708L433069L909686k5195m889696n150141
$$ 5035269 3584309 3592965 3860559 4976267 8409336 12319022 12293827 7404131 2253990
40683B253990j048320J940150J097412l97871P51936K852131K179153j296944
$$ 2253990 1205670 3145820 4243232 3845361 4597297 7449428 9628581 8331637
40675H331637l860839k918429J99938K298748J817112j1776q21466L06490J871735
$$ 8331637 4470798 1552369 1752307 4051055 5868167 5856391 5034925 5341415 7213150
40666G213150J824917K41730q46438n59836p01376k963070n629088n073705o48038
$$ 7213150 9038067 9279797 8433359 7873523 7172147 4209077 -1420011 -6493716 -7141754
40657g141754L816176M419369J851332Q7750R90298K191068R43467j737833k545237
$$ -7141754 -3325578 1093791 2945123 3032873 4023171 6214239 7157706 5419873 2874636
40648B874636o00684J569397J900803J258456J031979N86133q78874j755316j30142
$$ 2874636 2273952 3843349 5744152 7002608 8034587 8620720 7741846 5986530 5856388
40639E856388K561121L141212J582276Q22046J441902N28802k715021m339364
$$ 5856388 8417509 11558721 13140997 13963043 15404945 15933747 13218726 8879362
40631H879362j587967J873213P64765l856094o011474l304866O00250K192366
$$ 8879362 7291395 9164608 9929373 6073279 61805 -3243061 -2642811 -450445
40623d50445K268292K525753K066698j95272k534632k675835j242281l44314o9936
$$ -450445 1817847 4343600 6410298 6215026 3680394 1004559 -237722 -582036 -651972
40614f51972J011758K703813L207158K153005J229635J361727J235994m65261
$$ -651972 359786 3063599 6270757 8423762 9653397 11015124 12251118 11785857
40606A1785857k725284l249993j333760J204940J941673L46988j682329j771958
$$ 11785857 9060573 5810580 4476820 5681760 7623433 7970421 6288092 4516134
40598D516134M15409K737918K756470J97327k837788l795640j628713K659974
$$ 4516134 4931543 7669461 10425931 10623258 7785470 3989830 2361117 5021091
40590E021091O751712Q307293O265498J659112k631407l613494p56562K984716
$$ 5021091 11772803 20080096 26345594 28004706 25373299 21759805 21003243 23987959
40582B3987959L794058J253064j143400p18519N87539p71038m145633n079314
$$ 23987959 27782017 29035081 27891681 27173162 27760701 26989663 22844030 17764716
40574A7764716j865146J587673J187929j727782k856242j165683N38421N47701
$$ 17764716 15899570 17487243 18675172 16947390 14091148 12925465 13463886 14011587
40566A4011587M09545J668567L234400L283729J885248K79757j134440k517545
$$ 14011587 14421132 16089699 19324099 22607828 24493076 24772833 23638393 21120848
40558B1120848l030144j257222K586944N952158O176430L299662K47632o2632
$$ 21120848 18090704 16833482 19420426 25372584 31549014 34848676 35096308 35033676
40550C5033676K295495M550409M498945K816229J820448K797177N312032Q422564
$$ 35033676 37329171 41879580 46378525 49194754 51015202 53812379 59124411 67546975
40542F7546975J1404906J3656390J5100756J6642438J9329863K3381935K8856181
$$ 67546975 78951881 92608271 107709027 124351465 143681328 167063263 195919444
40535A95919444L6059725M3050585M3484400L0762057O127910j9830306l6147603
$$ 195919444 231979169 275029754 318514154 349276211 355404121 335573815 299426212
40528B99426212m0717206l9044370l6035632l2233363k7055994k1583558j6944126
$$ 299426212 258709006 219664636 183629004 151395641 124339647 102756089 85811963
40521H5811963j2725131q616862n830911n389962o313770o801729o180213m695289
$$ 85811963 73086832 64469970 58639059 53249097 46935327 40133598 33953385 29258096
40513B9258096k636041q43281q21747k841168m845138m703418k767855q47816
$$ 29258096 26622055 25778774 24957027 22115859 17270721 12567303 9799448 8951632
40505H951632M12172J544082K516263K767262K341633J365427o84927l312814
$$ 8951632 9363804 10907886 13424149 16191411 18533044 19898471 19213544 15900730
40497A5900730l913146j086236K097096J750111n19825N20276N072354O706038
$$ 15900730 11987584 10901348 12998444 14748555 14228730 14749006 19821360 26527398
40489B6527398J672445m955491o168351k317056R26547J078365J81006p00113
$$ 26527398 28199843 23244352 17076001 14758945 15685492 16763857 16944863 16244750
40481A6244750k761543n301016n262270j939825J784969L905595N390041O773593
$$ 16244750 13483207 8182191 2919921 980096 2765065 6670660 12060701 18834294
40473A8834294O344836L472641O17472j0791O49905P72139N02227O92468P96205
$$ 18834294 25179130 28651771 29269243 29258452 29908357 30680496 31182723 31875191 32671396
40464C2671396n6026j465224k765488l977498m485863k778043Q85894L480938
$$ 32671396 32615370 31150146 28384658 24407160 19921297 17143254 18029148 21510086
40456B1510086K728460k0344j999236k318066j432509N08926K639347K751855
$$ 21510086 24238546 24218202 22218966 19900900 18468391 18977317 21616664 24368519
40448B4368519L16671j560101j1366L121373L693551J115745j393391j890146
$$ 24368519 24685190 23125089 23113723 26235096 29928647 31044392 29651001 27760855
40440B7760855j705073k120977k159331p63442J083612J827615J596540J715862
$$ 27760855 26055782 23934805 21775474 21012032 22095644 23923259 25519799 27235661
40432B7235661K525766K653772P47231k298690l697483k206416k78792q58667
$$ 27235661 29761427 32415199 33162430 30863740 27166257 24959841 24681049 23822382
40424B3822382k709638j995793J426152L257135J493397m57136K47540J331623
$$ 23822382 21112744 19116951 20543103 23800238 25293635 24836499 25084039 26415662
40416B6415662M39170K56569L483815O389503L718114k380889n114872l328025
$$ 26415662 26854832 27111401 30595216 36984719 40702833 38321944 33207072 29879047
40408B9879047j929510k613257j766190J571654L255836J629589N10309J766429
$$ 29879047 27949537 25336280 23570090 25141744 28397580 30027169 30537478 32303907
40400C2303907J717838j350066k610391J476542O365176O094387K224543J63388
$$ 32303907 34021745 32671679 30061288 31537830 37903006 43997393 46221936 46385324
40392D6385324K74822r62140l513833m036596k296696j397473k020782j676487
$$ 46385324 46660146 45698006 42184173 38147577 35850881 34453408 32432626 30756139
40384C0756139K98204J615890J194763M81919L50083N6634o78529j544470l080331
$$ 30756139 31054343 32670233 33864996 34346915 34696998 34753632 34075103 32530633 29450302
40375B9450302n216545n400466j778984K717257L492570P70138j261184j130661
$$ 29450302 24233757 18833291 17054307 19771564 23264134 24034272 22773088 21642427
40367B1642427j171054k083394j552593R46401K720889K372263J429027O03596
$$ 21642427 20471373 18387979 16835386 17781787 20502676 22874939 24303966 24907562
40359B4907562r88887k005665M11724M519252M304340j443044o140394n098611
$$ 24907562 23918675 21913010 22324734 26843986 31148326 29705282 23564888 18466277
40351A8466277k476299l621222n804155l328517J875947K651195j824499m566938
$$ 18466277 15989978 12368756 6564601 3236084 5112031 7763226 5938727 1371789
40343A371789j421986L541129M980133K957370K97535j911138l217888k117802
$$ 1371789 -50197 3490932 8471065 11428435 11725970 9814832 6596944 4479142
40335D479142J137639K822347K03757m099762n196665j996815K408532N138495
$$ 4479142 5616781 8439128 8642885 4543123 -653542 -2650357 -241825 4896670
40327D896670N502252L561536j17205l276626l376031r07663Q18660l1710j680808
$$ 4896670 10398922 13960458 13843253 10566627 7190596 6282933 7101593 7069883 5389075
40318E389075j882945j281322j872033l339129l116032j4538L965795N921521
$$ 5389075 3506130 2224808 352775 -2986354 -6102386 -6116924 -2151129 3770392
40310C770392M937687K197628o78391k550060k808393j658149k07968N24278O67667
$$ 3770392 8708079 10905707 10227316 7677256 4868863 3210714 3002746 3527024 4194691
40301D194691J002646J651527K040051K008347J963741J809631Q25799q73416
$$ 4194691 5197337 6848864 8888915 10897262 12861003 14670634 15496433 14623017
40293A4623017j771842p58994J116896J719621L53764j721488l094083l402437
$$ 14623017 12851175 12092181 13209077 14928698 15282462 13560974 10466891 7064454
40285G064454k682304q35172J521920K675006J500719p68451j606173j55985J756625
$$ 7064454 4382150 3546978 5068898 7743904 9244623 8476172 6869999 6714014 8470639
40276H470639J865226k5944k117128k481420m50343L005451N527392M794147Q56503
$$ 8470639 10335865 10309921 8192793 5711373 5261030 8266481 13793873 18588020 19444523
40267A9444523l301017m602304l025455r17399K59814Q73105J077824L6012k156236
$$ 19444523 16143506 11541202 8515747 7598348 7858162 8731267 9809091 9845103 7688867
40258G688867l685962l326756k045721j152724l28264J065598K099943J577109
$$ 7688867 4002905 676149 -1369572 -2522296 -2850560 -1784962 314981 1892090
40250A892090L08236J63606J309647K101453J449707j54778j636259k048640q40275
$$ 1892090 2200326 2363932 3673579 5775032 7224739 7069961 5433702 3385062 2544787
40241B544787J249853K289818J586967R68613J832688K349252L47199k218516
$$ 2544787 3794640 6084458 7671425 8640038 10472726 12821978 13169177 10950661
40233A0950661j478776J898613K782950q06415m298794l061474J115765L055484
$$ 10950661 9471885 11370498 14153448 13347033 9048239 5986765 7102530 10158014
40225A0158014J248203j483742k849772l198041l250433k696203j361878K11584
$$ 10158014 11406217 9922475 7072703 3874662 624229 -2071974 -3433852 -3222268
40217c222268J684952L102640M172599M400358L678025J985541o91311l258045
$$ -3222268 -1537316 1565324 5737923 10138281 13816306 15801847 15110536 11852491
40209A1852491l627260j407604Q05370P15697l09748M28514K227507J702569j744987
$$ 11852491 8225231 6817627 7622997 8338694 8028946 8457460 10684967 12387536 10642549
40200A0642549m404092l321070l17204P59073j007581l282797l997692l206185
$$ 10642549 6238457 2917387 2600183 3359256 2351675 -931122 -4928814 -8134999
40192h134999j794072j29388J535410K410682J790385J77018p89014J00576K182359
$$ -8134999 -9929071 -10058459 -8523049 -6112367 -4321982 -4144964 -4933978 -4833402 -2651043
40183b651043L433061K597347N04162r47903p91829K73239Q06168j6962j701959
$$ -2651043 782018 3379365 3883527 2935624 2143795 2417034 3223202 3206240 1504281
40174A504281k892481k733290j660837m31940J097382L111811M279033L022904
$$ 1504281 -1388200 -4121490 -5782327 -6214267 -5116885 -2005074 2273959 5296863
40166E296863M48617m18194R26440J501094j95321j320337M88400K329299K82647
$$ 5296863 5745480 5327286 6253726 7754820 7559499 6239162 6727562 9056861 9339508
40157I339508l439899k910121K167592N174881K230872k136055k179519N19109
$$ 9339508 5899609 2989488 5157080 10331961 12562833 10426778 8247259 8766368
40149H766368L37122l205048m925483k140126J571583J900211o41076k608022
$$ 8766368 9103490 5898442 972959 -1167167 404416 2304627 1663551 -944471
40141i44471k413682r96262N83547J927632K568317K455659K688465L924610M426762
$$ -944471 -3358153 -4354415 -3770868 -1843236 725081 3180740 5869205 9793815 14220577
40132A4220577J835976k905964n703113m374172j513156o81460j637273j800371
$$ 14220577 16056553 13150589 7447476 3073304 1560148 878688 -758585 -2558956
40124b558956j024532j427550k681099j445642L045462O310891M265068p95078
$$ -2558956 -3583488 -5011038 -7692137 -9137779 -6092317 218574 4483642 3688564
40116C688564l078926r14117J823954J539136r39809k550323j851334K76312K112674
$$ 3688564 609638 -304479 1519475 3058611 2118802 -431521 -2282855 -2006543 106131
40107A06131K382326J063632o26305j667982k298291k722012j781185J202462
$$ 106131 2488457 3552089 2925784 1257802 -1040489 -3762501 -5543686 -4341224
40099d341224M030085L655224N55683j586939j020542n8060j094626l015607l236685
$$ -4341224 -311139 3344085 3899768 2312829 1292287 1234227 139601 -2876006 -6112691
40090f112691j493574K70189Q06943Q43209J796183L875787N243683L493988j026401
$$ -6112691 -7606265 -7336076 -6529133 -5685924 -3889741 -13954 5229729 8723717 7697316
40081G697316m322296l255409j09428L84161j861908k254423Q38853L163433J437429
$$ 7697316 3375020 119611 10183 394344 -1467564 -3721987 -2883134 280299 1717728
40072A717728j402532j284192N01637L17373j193549o09390J802141K377776L18816
$$ 1717728 315196 -968996 -467359 -149986 -1343535 -1952925 -150784 2226992 2545808
40063B545808j273944q94646n90516j533854j806031r5737J880406K334557J880613
$$ 2545808 1271864 377218 -213298 -1747152 -3553183 -3648920 -1768514 566043 2446656
40054B446656J505680P96116k19475q1686J424724J964896K827k565704l126078
$$ 2446656 3952336 4748452 4528977 4447291 5872015 7836911 7839738 5274034 2147956
40045B147956j902364p88679k74861K38675L25369r40142k966353m023295l234327
$$ 2147956 245592 -543087 -817948 -579273 -253904 -1194046 -4160399 -8183694 -11418021
40036a1418021r34469K132949M699464N133658L284764J212323N32832J50560
$$ -11418021 -12352490 -10219541 -5520077 -386419 2898345 4110668 4643500 4794060
40028D794060j555610l480512l149421o58546J327354J372923N84297j178p76452
$$ 4794060 3238450 -242062 -3391483 -4050029 -2722675 -1349752 -765455 -766633 -1543085
40019a543085j711565j583144j66631Q38659L54067l89299o5073O08880O47095
$$ -1543085 -3254650 -4837794 -5004425 -4165766 -3811699 -4200998 -4266071 -3657191 -3010096
40010c010096J024534K782591M077495K060793k393811m742595k474885J535449
$$ -3010096 -1985562 797029 4874524 6935317 4541506 -201089 -2675974 -1140525
40002a140525K827203P53416j720539k401823j851774j331146r22637k67500L13829
$$ -1140525 1686678 2440094 719555 -1682268 -3534042 -4865188 -5787825 -6055325 -5741496
39993e741496L13003j10400l31887J74407J585266L254353L497259J142474k320688
$$ -5741496 -5428493 -5538893 -5870780 -5696373 -4111107 -856754 2640505 3782979 1462291
39984A462291l654663j839484L36778J1969j797704j934275J84842K047762J978933
$$ 1462291 -2192372 -4031856 -3695078 -3683109 -5480813 -7415088 -7230246 -5182484 -3203551
39975c203551R80044K37272o14100j616950j231658J240848L683336L684643J903783
$$ -3203551 -2223507 -1986235 -2600335 -4217285 -5448943 -4208095 -524759 3159884 5063667
39966E063667Q23330R68275O82367o02626j265986j51364J582586K084519R61302
$$ 5063667 5886997 6855272 7537639 6935013 5669027 5517663 7100249 9184768 10146070
39957A0146070q43223k137872j919543m2986J799460J116843k239609n064548
$$ 10146070 9302847 7164975 5245432 5202446 7001906 8118749 5879140 814592
39949H14592m267133n83216K551843L177784K203444R99587k99572j539074j491331
$$ 814592 -3452541 -4035757 -1483914 1693870 3897314 4896901 4597329 3058255 1566924
39940A566924M68534K623218K509016R8240k021373j965031q18278p30817j625896
$$ 1566924 2035458 4658676 7167692 7265932 5244559 3279528 2461250 1730433 104537
39931A04537j316037J039904L177954K541129j04967j566330n94892N12645n97292
$$ 104537 -1211500 -171596 3006358 5547487 5442520 3876190 3281298 3793943 3196651
39922C196651k943057l739022k128476M06085K575567M076236M133608J768455
$$ 3196651 253594 -3485428 -5613904 -5207819 -2632252 1443984 5577592 7346047
39914G346047j863343l681358k482269p11147r50102k245469j826134O74207K854298
$$ 7346047 5482704 1801346 -680923 -1392070 -2342172 -4587641 -6413775 -5739568 -2885270
39905b885270K901845J406587k1931l96950K49658Q52487P4801j738265k225864
$$ -2885270 16575 1423162 1401231 1004281 1253939 2106426 2181227 442962 -1782902
39896a782902k00425J996043J635324o710L83417K384782K148045r40867k420076
$$ -1782902 -1983327 12716 1648040 1641330 2024747 4409529 6557574 5616707 3196631
39887C196631K63945K997175P81669m559439o664696l199050J901423M257755
$$ 3196631 3460576 6457751 7239420 2679981 -3984715 -7183765 -5282342 -1024587
39879a024587L375791R22750j841550l746844l389057p16958K320488L615844
$$ -1024587 2351204 3273954 1432404 -2314440 -5703497 -6420455 -4099967 -484123
39871d84123K587234k756k601549l232476r73320K417698L670907J455518k102555
$$ -484123 2103111 2100355 -501194 -3733670 -4706990 -2289292 1381615 2837133 734578
39862G34578l626837j665024K132392M375455L046749p869p55403J750032L384848
$$ 734578 -2892259 -4557283 -2424891 1950564 4997313 4989444 4234041 5984073 9368921
39853I368921L59600m882393o299421k187892K893864M290810K054501j027543
$$ 9368921 9728521 4846128 -1453293 -3641185 -747321 3543489 5597990 4570447
39845D570447k937502k786330o55772J328040K77824l457214n764642l749135
$$ 4570447 1632945 -1153385 -1809157 -481117 -203293 -3660507 -9425149 -13174284
39837a3174284Q25623M332276N154497L459532m8742l178575k855648P64603L222346
$$ -13174284 -12348661 -8016385 -2861888 597644 548902 -2629673 -5485321 -4720718 -1498372
39828a498372J544805j254387o98514K276548K953774J21171k457184j771125
$$ -1498372 46433 -1207954 -1906468 370080 3323854 3445025 987841 -783284
39820g83284Q21018K233543J205294j262957k989771k128081O23235J929809q8220
$$ -783284 37734 2271277 3476571 2213614 -776157 -2904238 -2281003 -351194 -439414
39811d39414k801949k648368l81822O44347K60537J182809L278255L078099o0192
$$ -439414 -3241363 -5889731 -6271553 -5627206 -5366669 -4183860 -905605 2172494 2112302
39802B112302k114514p17815R13319q79019m504311n631372k902707J609966N479745
$$ 2112302 -2212 -720027 193292 -685727 -5190038 -10821410 -13724117 -12114151 -6634406
39793f634406O882093M664034K55853k340546j232696M51742q54098l569361l440187
$$ -6634406 247687 4911721 5167574 2827028 1594332 2046074 1191976 -2377385 -5817572
39784e817572k10803K154038J498153j43488o10185n91993j381169k313283j937146
$$ -5817572 -6028375 -3874337 -2376184 -2519672 -3129857 -3721850 -5103019 -7416302 -9353448
39775i353448j14319K055143L233124K412747j56678k438785k481461q93702J28958
$$ -9353448 -9467767 -7412624 -4179500 -1766753 -1923431 -4362216 -6843677 -7737379 -7608421
39766g608421J11735N41705J692820J773959J54077r55930L87560K855149L691067
$$ -7608421 -7496686 -6954981 -5262161 -3488202 -3334125 -4290055 -3902495 -1047346 2643721
39757B643721K318718M42174n27204n34872J6046P02926Q36386l3380j351744
$$ 2643721 4962439 5404613 4877409 4342537 4358583 5061509 5897895 5864515 4512771
39748D512771j995763j350139L84834K419513L532154K830445R89941j13067K20688
$$ 4512771 2517008 1166869 1551703 3971216 7503370 10333815 11323756 11210689 11431377
39739A1431377L92684j216700l634374m251012k042795J262874L049694K042847
$$ 11431377 11824061 10607361 6972987 2721975 679180 1942054 4991748 7034595
39731G034595q74023l150579k398682J109691M094486L585820L70767k032582
$$ 7034595 6160572 3009993 611311 1721002 5815488 9401308 9772075 7739493
39723G739493j625412J64467P95011n61946k771956m060666l139517r6941L220165
$$ 7739493 6114081 6278548 7073559 6511613 3739657 -321009 -3460526 -3557467 -337302
39714c37302M433605K733175o03457l653138n104997m490214k503452j025421
$$ -337302 4096303 6829478 6226021 2572883 -2532114 -7022328 -9525780 -10551201
39706a0551201j267706j725886K24954M183675O225193L775978p71695k965538
$$ -10551201 -11818907 -13544793 -13319839 -9136164 -2910971 865007 93312 -2872226
39698b872226j458493J494825L494653L808152K493381J00551j779676j712998
$$ -2872226 -4330719 -2835894 658759 4466911 6960292 7060843 5281167 3568169
39690C568169m49349j10166j156710j808048p55725J208584K737954L484374L445028
$$ 3568169 3118820 3008654 1851944 43896 -711829 496755 3234709 6719083 10164111
39681A0164111K268747J47842j727279k443094k201732j409457j31455R54760
$$ 10164111 12432858 12580700 10853421 8410327 6208595 4799138 4667683 5622443
39673E622443N01946j567679l236146k666067m16814J589816K316995J789990
$$ 5622443 6124389 4556710 1320564 -1345503 -1762317 -172501 2144494 3934484
39665C934484K07643j676756k250178q15850R04674O80020j256434k760143k860240
$$ 3934484 4142127 2465371 215193 -600657 304017 984037 -272397 -3032540 -5892780
39656e892780k380233j642669K13932L070306M990076M655670L167494K204958
$$ -5892780 -8273013 -9915682 -9701750 -6631444 -1641368 3014302 6181796 8386754
39648H386754J606210K10965j745431k751226k269459j279520l42361J391814
$$ 8386754 9992964 10203929 8458498 5707272 3437813 2158293 1815932 3207746
39640C207746M361764O756537N865037J289129m112279o812660n649129k199092
$$ 3207746 7569510 14326047 20191084 21480213 17367934 10555274 4906145 2707053
39632B707053J029881K329952J571181J92189n616J105284J592079K4347k217895
$$ 2707053 3736934 6066886 7638067 7830256 7824640 8929924 10522003 10546350 8328455
39623H328455k585806q20619J035138J879471K558162L263311K399488p40268
$$ 8328455 5742649 4922030 5957168 7836639 10394801 13658112 16057600 15317332
39615A5317332m185516n626547m894774k878806M9279K926734L632109J570885
$$ 15317332 11131816 5505269 610495 -2268311 -2219032 707702 4339811 5910696
39607E910696q75957j737166k202356l456997l354580m7156L296482K395368q26700
$$ 5910696 5034739 3297573 1095217 -2361780 -5716360 -5763516 -2467034 -71666 -898366
39598h98366o68218K749870K893408k558944p147018n296104p55205j46022k481934
$$ -898366 -1566584 1183286 4076694 1517750 -5629268 -10925372 -11680577 -11826599 -14308533
39589a4308533j588666L384776O672376M906809J409358J81152M89067k98335
$$ -14308533 -15897199 -12512423 -5840047 -933238 476120 657272 1146339 848004
39581H48004j972374k240709l38169K134747L037517J440671j439318k818257
$$ 848004 -1124370 -3365079 -3703248 -1568501 1469016 2909687 1470369 -1347888
39573a347888j285634Q90517M13372k090798k518680O17025L633165K953638J39260
$$ -1347888 -2633522 -1743005 -1329633 -3420431 -5939111 -5322086 -1688921 1264717 1403977
39564A403977j007493k87831p58164l451411n672583m667925n33549M662521Q401523
$$ 1403977 396484 108653 -649511 -4100922 -9773505 -14441430 -14974979 -10312458 -1910935
39555a910935Q369722M292922l82392j453086M60829L79182l437349o010453k991886
$$ -1910935 6458787 10751709 10369317 8916231 9377060 9756242 6318893 308440 -2683446
39546b683446J808006J360183l813482o031690j979068K646403K467227K90846
$$ -2683446 -875440 484743 -3328739 -9360429 -11339497 -8693094 -6225867 -5935021
39538e935021J104313L183575J503970k979808m514120j942511J01146k37886
$$ -5935021 -4830708 -1647133 -143163 -3122971 -7637091 -9579602 -9478456 -9716342
39530i716342O75718M137068N320460J161074l510169k761915J436334K542520
$$ -9716342 -9040624 -4903556 416904 1577978 -1932191 -4694106 -3257772 -715252
39522g15252o48505l031390j239671K380421M140942L339487J403664k76900p66932
$$ -715252 -1363757 -4395147 -5634818 -3254397 886545 4226032 5629696 5352796 4585864
39513D585864N6442R73911O75845n44389j580230k198901k411020j340487J250938
$$ 4585864 4642306 5616217 6292062 5747673 4167443 1968542 -442478 -1782965 -532027
39504e32027L432823L320452J746538N16686n96349k499620l942734l186702j232643
$$ -532027 2900796 6221248 7967786 8484472 7888123 5388503 1445769 -1740933 -2973576
39495b973576q0991Q32482K739855L712374J437656j443516m52251K752520J997870
$$ -2973576 -3054567 -2222085 517770 4230144 5667800 4224284 3772033 6524553 8522423
39486H522423l102102n501651j703839K523054J356129k323735k663277l07705
$$ 8522423 5420321 -81330 -1785169 737885 2094014 -229721 -2892998 -3200703
39478c200703J25290j438163j174420J325972K651103J782460J131198J426326
$$ -3200703 -3075413 -4513576 -5687996 -4362024 -1710921 71539 1202737 2629063
39470B629063O41711j530901k674451j844607p44542j071J716050L861648L410522
$$ 2629063 3270774 1739873 -934578 -2779185 -3523727 -3524798 -1808748 2052900 5463422
39461E463422j00104k502375m39361L731753N007982J934036k527904m996566
$$ 5463422 5363318 2860943 2421582 6153335 11161317 13095353 10567449 5570883
39453E570883m414432j654230J534428L217667K383937q9717j966635j501508
$$ 5570883 1156451 -497779 1036649 4254316 6638253 6548536 4581901 3080393
39445C080393Q97095K735699J804342j120799k920104k185347j115538j842240
$$ 3080393 3977488 6713187 8517529 7396730 4476626 2291279 1175741 -666499
39437f66499k632453n91685K902120L232275o47704m150643l327582j00059J055242
$$ -666499 -3298952 -3890637 -988517 2243758 1596054 -2554589 -5882171 -5982230 -4926988
39428d926988o81246k362818k066036r11643m54721l67611N89903K511595L977011
$$ -4926988 -5608234 -7971052 -10037088 -10948731 -11403452 -11771063 -11181160 -8669565 -4692554
39419d692554L454247R34150j791548k763764j832647n89704l92201j137466j945747
$$ -4692554 -1238307 -304157 -2095705 -4859469 -6692116 -7281820 -7674021 -8811487 -10757234
39410a0757234k102611j175667P82685K826243L817871L800712L739869L762404
$$ -10757234 -12859845 -14035512 -13252827 -10426584 -6608713 -2808001 931868 4694272
39402D694272K860594O95428j549005k655909k642687k093987j374518r45866
$$ 4694272 7554866 8250294 6701289 4045380 1402693 -691294 -2065812 -3011678
39394c011678j229440j668970j212731j34165J85458k31777L56265K289657L237182
$$ -3011678 -4241118 -5910088 -7122819 -7256984 -7071526 -7303303 -6947038 -4657381 -1420199
39385a420199J606561p82240j479409j114529j789232l026835k263346J004095
$$ -1420199 186362 -595878 -2075287 -3189816 -4979048 -8005883 -10269229 -9265134
39377i265134M215423N006040L365737N96110j790497k211709l35376J589690
$$ -9265134 -5049711 -43671 3322066 3918176 2127679 -84030 -419406 1170284
39369A170284R65912j438442k461667j414537q77609j801621j422397J761394
$$ 1170284 2136196 697754 -1763913 -3178450 -4056059 -5857680 -7280077 -5518683
39361e518683M233458K188544k114653k855469J241387N327198N279138K456314
$$ -5518683 -1285225 903319 -1211334 -4066803 -2825416 2501782 7780920 10237234
39353A0237234M10381l7865m79849j799845l388166m199115l199743j36771K945549
$$ 10237234 10647615 10609750 10129901 8330056 4941890 742775 -2456968 -2593739 351810
39344C51810K804631o56001l061723r96534K913785L466784L19602j818355l23162
$$ 351810 3156441 2500440 -561283 -1557817 1355968 4822752 5142354 3323999 3000837
39335C000837K009660J810051l36006k082279k974611l501217k933648p69686
$$ 3000837 5010497 6820548 6484542 4402263 1427652 -2073565 -5007213 -5776899
39327e776899J474149K348116K607887K924697J669845j888937m370990k466010
$$ -5776899 -4302750 -1954634 653253 3577950 5247795 3358858 -1012132 -3478142
39319c478142J136195R48402k717093l907834n10420K319700O09081k061773o87178
$$ -3478142 -2341947 -1393545 -4110638 -8018472 -8528892 -6209192 -5600111 -7661884 -8349062
39310h349062L045298L977784J985943J497508L653044M615050K159991r60782
$$ -8349062 -5303764 -1325980 659963 2157471 5810515 10425565 12585556 11624774
39302A1624774j781351j306708j789403k760343k284444m02704R65746O86466
$$ 11624774 9843423 8536715 6747312 3986969 1702525 1299821 2265567 2952033
39294B952033o79106k072402k843325k812298k217718j392802l08112J058144
$$ 2952033 2272927 200525 -2642800 -5455098 -7672816 -9065618 -9373730 -8315586
39286h315586K049081K032409J668740K115796K875703K072465o49012l135709
$$ -8315586 -6266505 -4234096 -2565356 -449560 2426143 4498608 3849596 713887
39278G13887l409223j872345m7291J310634J825137R19472q65250j402576L52560
$$ 713887 -2695336 -4567681 -4614972 -3304338 -1479201 -559729 -1424979 -2827555 -2474995
39269b474995K319465J887959k65298j184403p7886O98737m79460j862521q03468
$$ -2474995 -155530 1732429 1467131 282728 204842 903579 424119 -1438402 -2241870
39260b241870K414589M610043L229127r56869m664574n310565l326182j143270
$$ -2241870 172719 4782762 8011889 7055020 2390446 -2920119 -6246301 -7389571
39252g389571j16644N52627J525309J590903k46422k200162j582689J135956K654635
$$ -7389571 -7506215 -6953588 -5428279 -3837376 -4083798 -6283960 -7866649 -6730693 -4076058
39243d076058J437900n29792j263890j441746k154510k349833n64500K422867
$$ -4076058 -2638158 -3167950 -4431840 -5873586 -8028096 -10377929 -10942429 -8519562
39235h519562M675811N499484M924914K433882j409143l567109j867007J146655
$$ -8519562 -3843751 1655733 6580647 9014529 7605386 4038277 2171270 3317925
39227C317925J081215j892939l203599r10511J323318o6799l233549l805779p80662
$$ 3317925 4399140 2506201 -697398 -1607909 -284591 -351390 -3584939 -7390718 -8171380
39218h171380L007245M704006L466112N0380l421873m367650k375440K0874O91066
$$ -8171380 -5164135 -460129 3005983 3056363 -365510 -4733160 -7108600 -7087726 -6396660
39209f396660M53240N90702J63531j414551j445218K317120O433800N176821r83114
$$ -6396660 -5943420 -5352718 -5189187 -6603738 -8048956 -5731836 701964 5878785 4895671
39200D895671n236213l672773J43420J565407J067967J173693J387673J87595
$$ 4895671 -340542 -4013315 -3869895 -2304488 -1236521 -62828 1324845 1512440
39192A512440r90169j35423J028005m28734l142821l105596k95825R92204j110691
$$ 1512440 522271 386848 1414853 986119 -2156702 -5262298 -5558123 -4565919 -5676610
39183e676610l404165l009698j386318q53075n05007J556195M342635N450843
$$ -5676610 -9080775 -12090473 -13476791 -14329866 -14834873 -13278678 -8936043 -3485200
39175c485200M918320M535510M110959J580474k966807o152556n292076j676467
$$ -3485200 1433120 5968630 10079589 11660063 8693256 2540700 -2751376 -4427843
39167d427843J345803K265347K071843J950323J935301J648729Q67917r13558
$$ -4427843 -3082040 -816693 1255150 3205473 5140774 6789503 7657420 6743862
39159F743862m041594p027077o745505k045544L515292M766453J066877k797432
$$ 6743862 2702268 -4324809 -11070314 -13115858 -9600566 -4834113 -3767236 -6564668
39151f564668k826930p24827o41295k794296l410281n56760L216561M811208M322110
$$ -6564668 -9391598 -10116425 -10757720 -13552016 -16962297 -17519057 -14302496 -9491288 -5169178
39142e169178L313216J739545j032665l582347l564030j155018J038842J708676
$$ -5169178 -1855962 -116417 -1149082 -4731429 -8295459 -9450477 -8411635 -6702959
39134f702959K171390L231044L011868k65673m829634p040501o028982m189254
$$ -6702959 -4531569 -1300525 1711343 1445670 -3383964 -10424465 -16453447 -20642701
39126b0642701k794112R7805N667180J0482907R666959L397955k668023m015548
$$ -20642701 -23436813 -23339008 -17671828 -7188921 2478038 5875993 3207970 -807578
39118h07578j852671j12612k89202j049946j144649m04984J102004K738616K847795
$$ -807578 -2660249 -2772861 -3062063 -4112009 -5256658 -5661642 -4559638 -1821022 1026773
39109A026773P57935j396385j146506M93289K98901k163094l742864k522475n11362
$$ 1026773 1784708 388323 -758183 -264894 34007 -2129087 -5871951 -8394426 -8905788
39100h905788k00729r76529q32859L11716J091155J128140J084857J260300J644498
$$ -8905788 -9106517 -10083046 -10915905 -10604189 -9513034 -8384894 -7300037 -6039737 -4395239
39091d395239K288978K345940L20480l072603m192057j013669L269702M179841
$$ -4395239 -2106261 239679 560159 -2512444 -6704501 -7718170 -4448468 -268627
39083b68627K159949J240974K304250K079714o86019k663982j474053J78561j113251
$$ -268627 1891322 3132296 5436546 7516260 6830241 4166259 2692206 2870767 1757516
39074A757516l878611m098489j254620J559434K598562L009779L558081L043945
$$ 1757516 -2121095 -6219584 -7474204 -5914770 -3316208 -306429 3251652 6295597
39066F295597P14758k062800l382229k609177m83292J115485p0889m004483o768567
$$ 6295597 7010355 4947555 1565326 -1043851 -1527143 -411658 -482547 -4487030 -11255597
39057a1255597m438902J256704M270560K052245j315483j383198P60477J574300
$$ -11255597 -15694499 -14437795 -10167235 -8114990 -9430473 -10813671 -10053194 -8478894
39049h478894R67661J270236K301426J824520J25222j23979J382280J986381Q42355
$$ -8478894 -7511233 -6240997 -3939571 -2115051 -1989829 -2113808 -731528 1254853 2097208
39040B097208L97219J858197K840055J416982o94275j290416j227430k210663
$$ 2097208 2494427 4352624 7192679 8609661 7915386 6624970 5397540 3186877
39032C186877l421154l213120k255430k002458j626812L91791K877869L435517
$$ 3186877 -234277 -3447397 -5702827 -7705285 -9332097 -8940306 -6062437 -2626920
39024b626920K399671J947213J949784M43552j911076j891669R58568K854759
$$ -2626920 -227249 1719964 3669748 4113300 2202224 310555 1269123 4123882
39016D123882J183238j833448k798480j679104m85060K05790Q95982J146393M49910
$$ 4123882 5307120 3473672 675192 -1003912 -1488972 -1283182 -387200 759193 1209103
39007A209103j73785J85240K64767j349489l159213k525253n8916P56397j276262
$$ 1209103 1035318 1220558 1485325 135836 -3023377 -5548630 -5607546 -4851149 -6127411
38998f127411l055923j521576K140109M307828L555633J558246K1206j197095
$$ -6127411 -9183334 -10704910 -8564801 -4256973 -701340 856906 878112 -318983
38990c18983k489095k806051j055427J529095K265703O23341p51970K45520J853902
$$ -318983 -2808078 -5614129 -6669556 -5140461 -2874758 -2251417 -3003387 -2757867 -903965
38981i03965P87889k799329n093708l570264O3525K615938L073462K371284J319655
$$ -903965 -116076 -2915405 -8009113 -11579377 -11515852 -8899914 -5826452 -3455168 -2135513
38972b135513L59241J38744P48243J178660P33135N6022k68654q40993j852670
$$ -2135513 -1776272 -1637528 -889285 289375 1022510 1078532 809878 -31115 -1883785
38963a883785j867358k5359J883237J802168P71460J251708K798892K522449p8740
$$ -1883785 -3751143 -3776502 -1893265 -91097 680363 1932071 4730963 7253412 7174672
38954G174672j944852j050756O97454P59260k20424n8499J111824J128115o57308
$$ 7174672 5229820 4179064 4876518 5635778 5415354 5356855 6468679 7596794 6939486
38945F939486k378032k411174j465275j271043k204550k981474k299007j57337
$$ 6939486 4561454 2150280 685005 -586038 -2790588 -5772062 -8071069 -8228406
38937h228406K385315M240388M771755L639690R77656k002601l330829k002779
$$ -8228406 -5843091 -1602703 3169052 6808742 7786398 5783797 2452968 450189
38929D50189Q04206K795045K662643P87678j571510l025289k553734m50677J339524
$$ 450189 1254395 4049440 6712083 7499761 5928251 2902962 349228 -101449 1238075
38920A238075R39791j277446l107842l121867j872684m95216O29927J389980J332107
$$ 1238075 2177866 900420 -2207422 -5329289 -7201973 -7697189 -7067262 -5677282 -4345175
38911d345175M26237l09489R3566J143459J404451M31376m51535L65689K746907
$$ -4345175 -3918938 -4228427 -4134861 -2991402 -1586951 -1155575 -1607110 -1241421 1505486
38902A505486M666988M264120J762810r56216k345872k130539p08401J099578
$$ 1505486 6172474 10436594 12199404 11243188 8897316 6766777 6058376 7157954
38894G157954J737858O7260k550889l069681p61102J350994O60822j177459r09043
$$ 7157954 8895812 8963072 6412183 3342502 2581400 3932394 4593216 3415757 2506714
38885B506714J197117J882491L2187j848621j589368j3052J068872J117418K43794
$$ 2506714 3703831 5586322 5618509 3769888 2180520 2167468 3236340 4353758 4597552
38876D597552j531883l369770l716625k233725j92457J420443K484928K427314
$$ 4597552 3065669 -304101 -4020726 -6254451 -6446908 -5026465 -2541537 -114223
38868a14223P45251r05441j37954J933430J324525k535699m885368k400312J719503
$$ -114223 631028 -274413 -412367 1521063 2845588 309889 -4575479 -6975791 -5256288
38859e256288K769806J377780J014224J351172m54021l173095k275013K239577
$$ -5256288 -2486482 -1108702 -94478 1256694 802673 -2370422 -4645435 -2405858
38851b405858M513070J329995k941970k919967K06688J487897j11059j222384
$$ -2405858 2107212 3437207 495237 -2424730 -2218042 -730145 -841204 -2063588
38843b063588q0210J241437Q36420l00733o64973o75041j086532r18880R58310
$$ -2063588 -2143798 -902361 -65941 -366674 -1031647 -1706688 -2793220 -3712100 -2753790
38834b753790L202885L173036O32662j632761j401388M02434J581843J591838
$$ -2753790 449095 3622131 4254793 2622032 1220644 1623078 3204921 4796759
38826D796759J110297o5762k469422m723509m313126j102822J970773K492676
$$ 4796759 5907056 5841294 3371872 -1351637 -5664763 -6767585 -4796812 -2304136
38818b304136J019362q00110k366818l152319j889720J242378L496844K912021
$$ -2304136 -1284774 -2084884 -4451702 -7604021 -9493741 -8251363 -4754519 -1842498
38810a842498J199893Q61750J126921j25049j823492j033911J677757K432516
$$ -1842498 -642605 219145 1346066 1221017 -602475 -1636386 41371 2473887
38802B473887M0517k283282k306363j791541k235049j620637J509773M042667
$$ 2473887 2514404 231122 -2075241 -3866782 -6101831 -7722468 -6212695 -2170028
38794b170028K347105j676124k813281L3140K649011J872970m44197q46499J158405
$$ -2170028 177077 -1499047 -4312328 -4279188 -1630177 242793 -201404 -1047903 110502
38785A10502L360908L778247K035660p49128k357097j011959K293907M028703
$$ 110502 3471410 7249657 9285317 8536189 6179092 5167133 7461040 11489743
38777A1489743J938440k028771l891016k410027l83784r25741l580538n067476
$$ 11489743 13428183 11399412 7508396 5098369 4714585 3788844 208306 -4859170
38769d859170l480591n58496P20672j10686q54231M7280J560677J903669R85857
$$ -4859170 -8339761 -8898257 -8177585 -8288271 -9142502 -9095222 -7534545 -5630876 -4645019
38760d645019J1707l48776j68641O06433J844615K535725J900320R11750J134992
$$ -4645019 -4633312 -4982088 -5150729 -4544296 -2699681 -163956 1736364 2648114 3783106
38751C783106K165540K028617L43959r38591p45674p30854k324083l660403j903775
$$ 3783106 5948646 7977263 8321222 7382631 6636957 5906103 3582020 -78383 -1982158
38742a982158K079982M094644K118407q92578j030336J401850K712396J093439
$$ -1982158 97824 4192468 6310875 5418297 4387961 5789811 8502207 9595646
38734I595646j175357j314742m876j79552k609268m620965l715753r23565Q08356
$$ 9595646 8420289 7105547 7100671 6921119 4311851 -309114 -4024867 -4948432 -4140076
38725d140076P64717J116479L215238N111462M073385M52105k699309l468947
$$ -4140076 -3375359 -2258880 956358 6067820 10141205 10593310 7894001 4425054
38717D425054k735945j830363n02728J729766L728886L884013K417855R83169
$$ 4425054 1689109 -141254 -643982 1085784 4814670 8698683 11116538 12099707
38709A2099707L11137j95687o90927m78471K88102K52255r67842j791111j059975
$$ 12099707 12410844 12215157 11524230 11045759 11333861 11586116 10618274 8827163 7767188
38700G767188p7633o42378k014398j859121R8223J441524M33862j773780l005426
$$ 7767188 7689555 7047177 5032779 3173658 3271881 4713405 5147267 3373487 368061
38691C68061k591704j120876Q78789K647361K750594P51684j216144n14660K267282
$$ 368061 -2223643 -3344519 -2465730 181631 2932225 3683909 2467765 1953105 4220387
38682D220387L538804J333934j983404k892744j304594k11580j350924l180650
$$ 4220387 7759191 9093125 7109721 4216977 2912383 2700803 1349879 -1830771
38674a830771l411228j867842o6836Q52841Q68332N79360P64507J695931K306450
$$ -1830771 -5241999 -7109841 -7176677 -6323836 -5455504 -4876144 -4111637 -2415706 -109256
38665a09256J109611j269373j975483J79734K245124R58241k029690j994153J891190
$$ -109256 1000355 -269018 -2244501 -2064767 180357 1138598 -891092 -2885245 -994055
38656i94055N016617L822749M17061j259859q44875l54722n2207R82598J685728
$$ -994055 4022562 7845311 8262372 7002513 6157638 5802916 5750709 6733307 8419035
38647H419035J97896k364054k918482j180628K383o15221j126787n35734p99907
$$ 8419035 8616931 6252877 3334395 2153767 2156150 1540929 414142 -121592 -921499
38638i21499l015688m615230k864001R86631L569992L883592L456297L179645
$$ -921499 -3937187 -8552417 -11416418 -10429787 -6859795 -2976203 480094 3659739
38630C659739K447719R67160n98381j562033j394178L50378K797596L383328O78727
$$ 3659739 6107458 7074618 6476237 4914204 3520026 3870404 6668000 10051328 10730055
38621A0730055l041278m154580k281000l98601n40127j681782k187493k013329
$$ 10730055 7688777 3534197 1253197 854596 314469 -1367313 -3554806 -5568135
38613e568135j631139p64961N91788J428134J237739J089098J964388L051619
$$ -5568135 -7199274 -7964235 -7372447 -5944313 -4706574 -3617476 -1653088 1398531
38605A398531K931029J625844K27256q23794j792216k526912k596397k180875
$$ 1398531 4329560 5955404 6182660 5358866 3566650 1039738 -1556659 -3737534
38597c737534j590370l20377J940991L716854L087270Q29157J08951K136417M033321
$$ -3737534 -5327904 -5648281 -3707290 9564 3096834 3925991 4034942 6171359 10204680
38588A0204680K517237j780098n408121o251775m586016j183701K874754N051584
$$ 10204680 12721917 10941819 5533698 -718077 -5304093 -6487794 -3613040 1438544
38580A438544L260935o03994k076251N6856K374975K467054K315823L703924M009891
$$ 1438544 4699479 4095485 2019234 2076090 4451065 6918119 9233942 12937866 16947757
38571A6947757N69959l639037l773761r49370n57167l114168l084599J677935
$$ 16947757 17517716 13878679 10104918 9155548 8598381 5484213 2399614 4077549
38563D077549N376117K553729l771172o566419m095199k78406J937367K875928
$$ 4077549 9453666 12007395 8236223 1669804 -2425395 -2703801 -766434 2109494
38555B109494K980829J890313N56447N11577P41787j398239n568901p668381m694234
$$ 2109494 5090323 6980636 7537083 8048660 8790447 7392208 1823307 -5845074 -10539308
38546a0539308J638399O826901P578242L854345j178759l199986p32466K755343
$$ -10539308 -8900909 -2074008 5504234 9358579 8179820 4979834 4247368 7002711
38538G002711K614607j245719m598437m739018l263751k479575k001720l77109
$$ 7002711 9617318 8371599 3773162 -965856 -4229607 -6709182 -8710902 -9088011
38530i088011K222653M654901O442609P163110N696463J820813k434191m584103
$$ -9088011 -6865358 -2210457 4232152 11395262 17091725 18912538 16478347 11894244
38522A1894244m255034k903662j740926j009602o43957n03032k54573J77749K99108
$$ 11894244 7639210 4735548 2994622 1985020 1341063 838031 583458 761207 1060315
38513A060315k95999j198944j461594m73962J310686K287035R95809j735845k872451
$$ 1060315 764316 -434628 -1896222 -2370184 -1059498 1227537 2223346 487501 -2384950
38504b384950p84257K094746K204896k06393j638939o08219O48374K44968o44296
$$ -2384950 -3169207 -1074461 1130435 924042 -714897 -1323116 -674742 -429774 -1074070
38495a074070l64590O74410J536190K334544K711652J355864j098798j453976
$$ -1074070 -1438660 -764250 771940 3106484 5818136 7174000 6075202 4621226
38487D621226J331285L469160J481586k335476l304027j407355o12650k085983
$$ 4621226 5952511 9421671 10903257 8567781 5263754 3856399 3243749 1157766
38479A157766k780752j077027O37312L57557l42246N27456J993598K146320J284461
$$ 1157766 -1622986 -2700013 -2062701 -1705144 -2047390 -1519934 473664 2619984 3904445
38470C904445P79097N33558j82203o84304R5936J429521J762850J212179Q94992
$$ 3904445 4683542 5217100 5034897 4350593 4446529 5876050 7638900 8851079 9746071
38461I746071K13006k525830o281974o819725j955121M472004O482417L294625
$$ 9746071 9959077 7433247 1151273 -5668452 -7623573 -3151569 3330848 6625473
38453F625473J4300M76157K300173J059574k931178n236887l719121p22512J219442
$$ 6625473 6639773 7115930 9416103 10475677 7544499 2307612 -1411509 -2134021 -914579
38444i14579K119422K050286q4438l169934l128368J058777L876514L74153n657064
$$ -914579 1204843 3255129 3170691 757 -3127611 -2068834 1807680 2181833 -3475231
38435c475231o178965n40739L605975J698210j740434j077529K038935K563684
$$ -3475231 -9654196 -10194935 -6588960 -4890750 -6631184 -7708713 -5669778 -3106094
38427c106094L10365q35070K69483J143256Q13884J057978K211428J947933n24574
$$ -3106094 -2795729 -3630799 -3361316 -2218060 -1404176 -346198 1865230 3813163 3288589
38418C288589k399620j175797J746496L154291K010588k59768k086493k676610
$$ 3288589 888969 -286828 1459668 4613959 6624547 6364779 4278286 1601676
38410A601676j601496P60595K682093K442765L64052j422718j365654J52J015002
$$ 1601676 180 760775 3442868 5885633 6249685 4826967 3461313 3461465 4476467
38401D476467P67244k81862j223905j802033k316296k552031j499029J173484
$$ 4476467 5243711 4961849 3737944 1935911 -380385 -2932416 -4431445 -3257961
38393c257961L748816L774958J077813j627864j918045n88137k88366j785825
$$ -3257961 490855 4265813 5343626 3715762 1797717 1209580 921214 -864611
38385h64611l035772k053839O16528K821132L166399J823194j96846j742325k054167
$$ -864611 -3900383 -5954222 -5337694 -2516562 649837 2473031 2276185 533860 -1520307
38376a520307j381215p14867m51419m8370M07493m34648k806268l940660r76740
$$ -1520307 -2901522 -3616389 -4067808 -4116178 -3708685 -4143333 -6949601 -10890261 -11867001
38367a1867001M486776P385820N366783J476697m55080n58818j060761j977791
$$ -11867001 -7380225 5595 5372378 6849075 6393995 5835177 4774416 2796625
38359B796625j688844n50187o15431j975945k488890j528260j043286j926153
$$ 2796625 1107781 557594 -57837 -2033782 -4522672 -6050932 -7094218 -9020371
38351i020371k118084K0391K767107L603970K997177L110559L768859K492794
$$ -9020371 -11138455 -11118064 -8350957 -4746987 -1749810 1360749 5129608 7622402
38343G622402j379906n012113n391606k808085j3628J095898R02313O59982P44810
$$ 7622402 6242496 1230383 -4161223 -6969308 -6982936 -5887038 -4984725 -4324743 -3579933
38334c579933N49279l57535j411879j557279m69046J026145J919100K100619K071551
$$ -3579933 -3030654 -3388189 -4800068 -6357347 -6826393 -5800248 -3881148 -1780529 291022
38325B91022J777199M86879j794472l431250k657711j7638J773313J083168m52201
$$ 291022 2068221 2555100 760628 -2670622 -5328333 -5345971 -3572658 -2489490 -2941691
38316b941691k48856J393814J700402l37349k426272k519421j510420p31899Q19297
$$ -2941691 -3190547 -1796733 -96331 -433680 -2859952 -5379373 -6889793 -7621692 -6802395
38307f802395L964104N954284L517013j376910l091389k22491K346765Q47893
$$ -6802395 -2838291 3115993 6633006 5256096 2164707 1942216 4288981 5136874
38299E136874k109240k449512j083700j374940k742717j768002J245168J887027
$$ 5136874 3027634 578122 -505578 -1880518 -4623235 -6391237 -5146069 -3259042
38291c259042j441769m574344l393317O66640L257509K909649J625858J150216
$$ -3259042 -4700811 -9275155 -12668472 -12001832 -8744323 -5834674 -4208816 -3058600
38283c058600J242150J189433R04213L73315n29141j427157j615182j012578k45168
$$ -3058600 -1816450 -627017 277196 650511 121370 -1305787 -2920969 -3933547 -4178715
38274d178715K24886L63603J4455j063139k350897k533929r55904J203387J962723
$$ -4178715 -3953829 -3590226 -3575771 -4638910 -6989807 -9523736 -10479640 -9276253 -7313530
38265g313530R36387N2467J212285L560964M196059J912510r67043j558627k72728
$$ -7313530 -6377143 -6324676 -5112391 -1551427 2644632 4557142 3590099 2031472 1758744
38256A758744M8475j427002k196332m36168J680360P51556k690054m267635j410954
$$ 1758744 1807219 380217 -1816115 -2252283 -571923 179633 -2510421 -6778056 -8189010
38247h189010L112448M562320J872204j643469k682846j353534L9177Q8654p43961
$$ -8189010 -5076562 -514242 1357962 -285507 -2968353 -4321887 -4282710 -4194056 -4938017
38238d938017j372255j185561k12174Q87006J041925k41099k032617k686489j454281
$$ -4938017 -6310272 -7495833 -7708007 -6821001 -5779076 -6020175 -8052792 -10739281 -12193562
38229a2193562R84354L358112M596351M184559K672412J559862J539171J121817
$$ -12193562 -11209208 -7851096 -3254745 929814 3602226 5162088 6701259 7823076
38221G823076j391290m610769m942901j584357J668636J327431j027138j342715
$$ 7823076 6431786 1821017 -3121884 -4706241 -3037605 -1710174 -2737312 -4080027
38213d080027R24387K502469J548543m1540j57522N65869N79304j07063q05431
$$ -4080027 -3155640 -653171 895372 853832 696310 1262179 1841483 1734420 928989
38204I28989j577449k138051j125866J573077L345806K035344n94456j189693
$$ 928989 -648460 -2786511 -3912377 -2339300 1006506 3041850 2447394 1257701
38196A257701K79558R75432J76017J99422J709608J890603p36089k998547j646673
$$ 1257701 1537259 2512691 2688708 2888130 4597738 6488341 5752252 2753705 1107032
38187A107032J192165R34692k415189m295944k440265M71389J782155K427021
$$ 1107032 2299197 3233889 818700 -3477244 -5917509 -5446120 -3663965 -1236944
38179a236944L714822M200432K583140Q85300J374999K389552R40388j912655
$$ -1236944 2477878 6678310 9261450 10146750 11521749 13911301 14851689 12939034
38171A2939034k380979j11880J216579j01109j336109k67335J098097l5066k925935
$$ 12939034 10558055 10446175 11662754 11561645 10225536 9958201 11056298 11021232 8095297
38162H095297m868564m915085l654193j254378J621636K593850K94640k604146
$$ 8095297 3226733 -1688352 -5342545 -6596923 -4975287 -2381437 -2086797 -4690943
38154d690943k121527J572332M252763L362293R84327L84165J842814L149871
$$ -4690943 -6812470 -5240138 -987375 2374918 3359245 3743410 5586224 8736095
38146H736095K664791N46303k098356l975204l899205j513704J937540M115709
$$ 8736095 11400886 11947189 9848833 5873629 1974424 460720 2398260 6513969
38138F513969L515046J002091j084548j649207j833771k573450k449096Q6442
$$ 6513969 10029015 11031106 9946558 8297351 6463580 3890130 1441034 1527476
38130A527476L234264L516411R09944j024761q65340j330982l784142m833180
$$ 1527476 4761740 8278151 9188095 8163334 7297994 5967012 2182870 -2650310
38122b650310j672472K720164L954948K978301L511598M899132L310034q88706
$$ -2650310 -4322782 -1602618 2352330 5330631 8842229 13741361 17051395 16162689
38114A6162689l130371k284338k162015m065721l906138N44049M857138M146190
$$ 16162689 13032318 10747980 8585965 4520244 614106 1158155 6015293 10161483
38106A0161483j1342k697642k433125j032851M58175J687363J140359j568040
$$ 10161483 10150141 7452499 5019374 3986523 4444698 6132061 7272420 5704380
38098E704380l290636j249425K028278J798885j726016l530457j044948K728036
$$ 5704380 2413744 1164319 3192597 4991482 3265466 -264991 -1309939 1418097
38090A418097L939374K236898o73208l698981n883904n500217j750671L424839
$$ 1418097 5357471 7594369 6921161 3222180 -2661724 -8161941 -9912612 -6487773
38082f487773O650301O151073L131464M01578k64456M53037Q14541N55243Q84794
$$ -6487773 162528 6313601 9445065 9846643 9582187 10035224 10849765 11405008 12289802
38073A2289802J926692K096253Q97034K07219J188895K005052Q73430m88383O08465
$$ 12289802 14216494 16312747 17209781 17417000 18605895 20610947 21484377 20995994 21604459
38064B1604459L293509M702221N443929R409151J7130049K2712231J9634893Q154025
$$ 21604459 24897968 29600189 35044118 44453269 61583318 84295549 103930442 112084467
38056A12084467m708046j1930021j2357633j0259645r808351j0613926r417015
$$ 112084467 107376421 95446400 83088767 72829122 63020771 52406845 42989830
38049D2989830n582457k486411k558752l735309l102895j628040k023061l726514
$$ 42989830 37407373 34920962 32362210 28626901 25524006 23895966 21872905 18146391
38041A8146391l889562k350667j556889j936462j508215j58444K1070p41204M39792
$$ 18146391 14256829 11906162 10349273 8412811 6904596 6746152 6767222 6026018 6465810
38032F465810L519379M087109m6410m646513m560427o18915K140884J138627j809078
$$ 6465810 9985189 14072298 14025888 9379375 4818948 4200033 6340917 7479544 5670466
38023E670466l742923l144957l66543K371942K413217j90233k187600j301771
$$ 5670466 1927543 -1217414 -1583957 787985 3201202 3010969 823369 -478402
38015d78402P41337J109963k7842n43459N1754N56808N41177M28135n1317j193383
$$ -478402 262935 1372898 1345056 801597 853351 1410159 1951336 2379471 2328154 1134771
38005A134771j810506o16522J423558K235385J629190J100032J129833Q54852
$$ 1134771 -675735 -1292257 131301 2366686 3995876 5095908 6225741 7080593
37997G080593J34211k41760l75747j155750k060169j106064K260170N718586O449133
$$ 7080593 7214804 6973044 6597297 5441547 3381378 2275314 4535484 10254070 16703203
37988A6703203M143724J013284p25125q89953r46354j810075k563807j969337
$$ 16703203 20846927 21860211 21135086 20245133 19298779 17488704 14924897 12955560
37980A2955560o81390m99446j541328k038497j239736l77294r3063O63381K042732
$$ 12955560 12274170 11774724 10233396 8194899 6955163 6577869 6484806 7148187 9190919
37971I190919K217281N79278n64276L78579J508348Q35396j08204Q07480K194147
$$ 9190919 11408200 11987478 11423202 11801781 13310129 14145525 14037321 14844801 17038948
$$ [...]
##END NTUPLES=NMR SPECTRUM
##END=
