##TITLE=31Pdec_LR-793-O-C2-K
 DMSO-d6, 64 sc
 25.12.2024
##JCAMPDX= 6.0         $$ Bruker NMR JCAMP-DX V2.0
##DATA TYPE= NMR SPECTRUM
##DATA CLASS= NTUPLES
##ORIGIN= UXNMR, Bruker Analytische Messtechnik GmbH
##OWNER= root
$$ XWIN-NMR		Version 3.5
$$ Wed Dec 25 13:10:37 2024 Russian Standard Time (UT+4h)  she@DPX200
##.OBSERVE FREQUENCY= 81.013821
##.OBSERVE NUCLEUS= ^31P
##.ACQUISITION MODE= SIMULTANEOUS
##.ACQUISITION SCHEME= undefined
##.AVERAGES= 64
##.DIGITISER RES= 17
##SPECTROMETER/DATA SYSTEM= spect
##.PULSE SEQUENCE= zgpg30
##.SOLVENT NAME= DMSO
##.SHIFT REFERENCE= (INTERNAL, DMSO, 0, 198.062)
##AUDIT TRAIL= $$ (NUMBER, WHEN, WHO, WHERE, WHAT)
$$ ##TITLE= Audit trail, XWIN-NMR		Version 3.5
$$ ##JCAMPDX= 5.01
$$ ##ORIGIN= Bruker BioSpin GmbH
$$ ##OWNER= she
$$ F:/spectra/data/she/nmr/P31/2/pdata/1/auditp.txt
$$ ##AUDIT TRAIL=  $$ (NUMBER, WHEN, WHO, WHERE, WHAT)
(   1,<2024-12-25 13:09:33.09 +0400>,<she>,<DPX200>,
      <created by zg, POWCHK disabled, PULCHK disabled
       configuration hash MD5:
       00 E9 B6 7A A2 85 ED C7 34 08 36 98 17 FE 4E 26
       data hash MD5: 32K
       F8 20 E8 A7 33 28 2F 40 78 3F 2B 3E 93 A6 73 84>)
(   2,<2024-12-25 13:09:35.87 +0400>,<she>,<DPX200>,
      <Start of raw data processing
       efp BC_mod = 2 LB = 1.5 FT_mod = 6 PKNL = 1 PHC0 = 2256.423 PHC1 = -320.1141 SI = 64K 
       data hash MD5: 64K
       25 6F DE 0E 5C D8 2B 72 58 72 A7 83 09 AA 8B 82>)
(   3,<2024-12-25 13:10:00.37 +0400>,<she>,<DPX200>,
      <pk PHC0 = -196.9969 PHC1 = 495.6004 
       data hash MD5: 64K
       3F 3A 8F 8E D2 A9 DF AB C4 1C EB 30 40 EC 50 0A>)
(   4,<2024-12-25 13:10:05.89 +0400>,<she>,<DPX200>,
      <abs ABSG = 5 
       data hash MD5: 64K
       03 8B 0C A9 67 68 13 B9 16 FC 69 89 9E 6D D5 FF>)
$$ ##END=
$$ 
$$ hash MD5
$$ 23 19 37 7C E1 45 29 6F 60 76 16 2E 75 BC D6 75
##$RELAX= 
##$RELAX= 
##$RELAX= 
##$RELAX= 
##$RELAX= 
##$RELAX= 
##$RELAX= 
##$RELAX= 
$$ Bruker specific parameters
$$ --------------------------
##$DU= <F:/spectra>
##$EXPNO= 2
##$NAME= <P31>
##$PROCNO= 1
##$TYPE= <nmr>
##$USER= <she>
##$AMP= (0..31)
100 100 100 100 100 100 100 100 100 100 100 100 100 100 100 100 100 100 
100 100 100 100 100 100 100 100 100 100 100 100 100 100 
##$AQSEQ= 0
##$AQ_mod= 1
##$AUNM= <au_zg>
##$AUTOPOS= <>
##$BF1= 81.014009
##$BF2= 200.13
##$BF3= 200.13
##$BF4= 200.13
##$BF5= 200.13
##$BF6= 200.13
##$BF7= 200.13
##$BF8= 200.13
##$BYTORDA= 1
##$CFDGTYP= 0
##$CFRGTYP= 5
##$CHEMSTR= <none>
##$CNST= (0..31)
1 1 145 1 1 1 1 1 1 1 1 1 1 1 1 1 1 1 1 1 1 1 1 1 1 1 1 1 1 1 1 1 
##$CPDPRG= <waltz16>
##$CPDPRG1= <>
##$CPDPRG2= <waltz16>
##$CPDPRG3= <>
##$CPDPRG4= <mlev>
##$CPDPRG5= <mlev>
##$CPDPRG6= <mlev>
##$CPDPRG7= <mlev>
##$CPDPRG8= <mlev>
##$CPDPRGB= <>
##$CPDPRGT= <>
##$D= (0..31)
0 1 0 0 0 0 0 0 0 0.06 0 0.03 2e-05 3e-06 0 0 0.0002 0 0 0 0 0 0 0 0 0 
0 0 0 0 0 0 
##$DATE= 1735117772
##$DBL= (0..7)
120 120 120 11 120 120 24 19 
##$DBP= (0..7)
150 150 150 150 150 150 150 150 
##$DBP07= 0
##$DBPNAM0= <>
$$ [...]
##$SUBNAM3= <"">
##$SUBNAM4= <"">
##$SUBNAM5= <"">
##$SUBNAM6= <"">
##$SUBNAM7= <"">
##$SUBNAM8= <"">
##$SUBNAM9= <"">
##$SW= 400.765351723535
##$SWIBOX= (0..15)
0 1 3 0 0 0 0 0 0 0 0 0 0 0 0 0 
##$SW_h= 32467.5324675325
##$TD= 32768
##$TD0= 1
##$TE= 0
##$TE2= 300
##$TE3= 300
##$TEG= 300
##$TL= (0..7)
0 120 53 12 22 120 120 120 
##$TP= (0..7)
150 150 150 150 150 150 150 150 
##$TP07= 0
##$TPNAME0= <>
##$TPNAME1= <>
##$TPNAME2= <>
##$TPNAME3= <>
##$TPNAME4= <>
##$TPNAME5= <>
##$TPNAME6= <>
##$TPNAME7= <>
##$TPOAL= (0..7)
0.5 0.5 0.5 0.5 0.5 0.5 0.5 0.5 
##$TPOFFS= (0..7)
0 0 0 0 0 0 0 0 
##$TUNHIN= 0
##$TUNHOUT= 0
##$TUNXOUT= 0
##$USERA1= <user>
##$USERA2= <user>
##$USERA3= <user>
##$USERA4= <user>
##$USERA5= <user>
##$V9= 5
##$VALIST= <valist>
##$VCLIST= <CCCCCCCCCCCCCCC>
##$VD= 0
##$VDLIST= <DDDDDDDDDDDDDDD>
##$VPLIST= <PPPPPPPPPPPPPPP>
##$VTLIST= <TTTTTTTTTTTTTTT>
##$WBST= 1024
##$WBSW= 4
##$XGAIN= (0..3)
0 0 0 0 
##$XL= 0
##$YL= 0
##$YMAX_a= 6327
##$YMIN_a= -6489
##$ZGOPTNS= <>
##$ZL1= 120
##$ZL2= 120
##$ZL3= 120
##$ZL4= 120
##$ABSF1= 198.0616
##$ABSF2= -202.7028
##$ABSG= 5
##$ABSL= 3
##$ALPHA= 0
##$AQORDER= 0
##$ASSFAC= 0
##$ASSFACI= 0
##$ASSFACX= 0
##$ASSWID= 0
##$AUNMP= <proc_1d>
##$AZFE= 0.1
##$AZFW= 0.5
##$BCFW= 0
##$BC_mod= 2
##$BYTORDP= 0
##$COROFFS= 0
##$CY= -3
##$DATMOD= 1
##$DC= 0
##$DFILT= <>
##$DTYPP= 0
##$F1P= 0
##$F2P= 0
##$FCOR= 1
##$FTSIZE= 65536
##$FT_mod= 6
##$GAMMA= 0
##$GB= 0
##$INTBC= 1
##$INTSCL= 9.790993e-09
##$ISEN= 30
##$LB= 1.5
##$LEV0= 0
##$LPBIN= 0
##$MAXI= 10000
##$MC2= 0
##$MEAN= 0
##$ME_mod= 0
##$MI= 50
##$NCOEF= 0
##$NC_proc= -9
##$NLEV= 6
##$NOISF1= 182.463
##$NOISF2= 159.3651
##$NSP= 0
##$NTH_PI= 0
##$NZP= 0
##$OFFSET= 198.0616
##$PC= 4
##$PHC0= 2059.426
##$PHC1= 175.4863
##$PH_mod= 1
##$PKNL= yes
##$PPARMOD= 0
##$PSCAL= 0
##$PSIGN= 0
##$REVERSE= no
##$SF= 81.0140089999434
##$SI= 65536
##$SIGF1= 159.3651
##$SIGF2= -187.1042
##$SINO= 113.3802
##$SIOLD= 16384
##$SREGLST= <1H.CDCl3>
##$SSB= 0
##$STSI= 65536
##$STSR= 0
##$SW_p= 32467.5324675325
##$SYMM= 0
##$S_DEV= 0
##$TDeff= 32768
##$TDoff= 0
##$TI= <>
##$TILT= no
##$TM1= 0
##$TM2= 0
##$TOPLEV= 0
##$USERP1= <user>
##$USERP2= <user>
##$USERP3= <user>
##$USERP4= <user>
##$USERP5= <user>
##$WDW= 1
##$XDIM= 65536
##$YMAX_p= 378716402
##$YMIN_p= -374017223
$$ End of Bruker specific parameters
$$ ---------------------------------
##NTUPLES= NMR SPECTRUM
##VAR_NAME=  FREQUENCY,     SPECTRUM/REAL,   SPECTRUM/IMAG
##SYMBOL=    X,             R,               I
##VAR_TYPE=  INDEPENDENT,   DEPENDENT,       DEPENDENT
##VAR_FORM=  AFFN,          ASDF,            ASDF
##VAR_DIM=   65536,         65536,           65536
##UNITS=     HZ,            ARBITRARY UNITS, ARBITRARY UNITS
##FACTOR=    0.49542278885378, 1,            1
##FIRST=     16045.7642231865, 0,            0
##LAST=      -16421.768244346, 0,            0
##MIN=       -16421.768244346, -374017223,   0
##MAX=       16045.7642231865, 378716402,    0
$$ Real data points
##PAGE= N=1
##DATA TABLE= (X++(R..R)), XYDATA
$$ [...]
##PAGE= N=2
##DATA TABLE= (X++(I..I)), XYDATA
7366f695563M962973N426311R90086l876963m723071j175189L482893N264163
7358C655640K539027k261939m292250j099158M458627P356791N728530J402095
7350A7487363l550707p754857q821269n020506O33622K491626K35665J9016M703784
7341D23737Q035197L612191m494627o917547k456284J220316j26823k082844j27389
7332b914073L716348N680571N726673M787387J741253l026660n487727l270655
7324F953117P75962L664537O347567Q847475O708054j792711r358206p899615
7316A4246180l33159L268394l09285m851513n547525m434283l938140k467730
7308d367061Q31936K908002J592712r05567j885487j499260k45193K447397M962121
$$ plain form
7366 -6695563 -1732590 3693721 4683807 806844 -3916227 -5091416 -1608523 3655640
7358 3655640 6194667 3932728 -359522 -1458680 2999947 10356738 16085268 17487363
7350 17487363 13936656 6181799 -2639470 -7659976 -7026354 -4534728 -4299063 -4280047 423737
7341 423737 8458934 12071125 7576498 658951 -1797333 -577017 -703840 -2786684 -2914073
7332 -2914073 802275 6482846 12209519 16996906 18738159 15711499 10223772 6953117
7324 6953117 7729079 11393616 17741183 26588658 33296712 31504001 22145795 14246180
7316 14246180 13913021 17181415 16872130 12020617 6473092 2038809 -1899331 -4367061
7308 -4367061 -3535125 -627123 965589 60022 -1825465 -3324725 -3569918 -1122521 3839600
7299C839600L562797j494859m524897k334988R36145O85864j037615j48311J859649
7290A343385R87459j406915n47484L247287M727336K470125R93787K699844L681966
7281A8196790M70316l769969l661768O66794M034287K862001j632517n937086
7273A1228848p361798n183868r26127K486133L309783K599768K216076J945912
7265A0314727K83486k253949k697482O27809N198886O397582K354270l969966
7257A6255363p620965o307416k153856J036636J896569K365983M438754O968936
7249A6880004O745198K529113l175611o814849p311578o190604m974470l657830
7241e970627j645967Q77769K871384L195313J404780j662572m159266m742305
$$ plain form
7299 3839600 7402397 5907538 1382641 -952347 -16202 669662 -367953 -516264 1343385
7290 1343385 2330844 923929 376445 3623732 8351068 10821193 11814980 14514824 18196790
7281 18196790 18667106 14897137 11235369 11902163 15936450 18798451 17165934 11228848
7273 11228848 3867050 -1316818 -2242945 243188 3552971 6152739 8368815 10314727
7265 10314727 10598213 8344264 5646782 6274591 11473477 17871059 20225329 16255363
7257 16255363 8634398 2326982 173126 1209762 3106331 5472314 9911068 16880004
7249 16880004 23625202 26154315 22978704 16163855 8852277 2661673 -2312797 -5970627
7241 -5970627 -7616594 -6738825 -3867441 -672128 732652 -929920 -5089186 -9831491
7233i831491l699600j931352N74904L836507N949949M479587L73207j931359J92942
7224a986706M083046N336659K981291j053261n675261j0555440j3308145j0696851
7216c0874668l418998L293895N221621L429378K062888L577534P073217R892164
7208B57031R909057P210522M017050K165795Q82331j722329n470385q241347q776632
7199B31093p151575l047251L362373Q750539Q434690K037164n398264q906197
7191a687428p569647k712183L901042Q838059Q487886M270542K207741M244096
7183A9980108M339427k514486j1361858j3067712o484369J219367M863241N491271
7175B464989M760301J955675j930108l218359j395420j068382m761532p793236
$$ plain form
7233 -9831491 -13531091 -15462443 -14887539 -11051032 -5101083 -621496 -248289 -2179648 -1986706
7224 -1986706 2096340 7432999 10414290 9361029 3685768 -6869672 -20177817 -30874668
7216 -30874668 -34293666 -30999771 -25778150 -22348772 -20285884 -16708350 -9635133 257031
7208 257031 10166088 17376610 21393660 23559455 24441786 22719457 17249072 9007725 231093
7199 231093 -6920482 -9967733 -6605360 2145179 10579869 12617033 7218769 -1687428
7191 -1687428 -9257075 -11969258 -8068216 769843 9257729 13528271 15736012 19980108
7183 19980108 24319535 21805049 10443191 -2624521 -9108890 -7889523 -3026282 2464989
7175 2464989 7225290 9180965 7250857 4032498 2637078 1568696 -3192836 -10986072
7167a0986072m505548K931322O429235K147273m828864o790943k293709K727270
7159a5170036K363626k093298l914196J75839N505733N852325J908235l67401
7151e739173J430147L727278L612939K920259L820133M678524L201902L60311
7143A8012320k000632m579003p975553r016673m332613L259941O661365L544998
7135C574150m48519M96660M388700M315191j941570q583708q895110l171754K410303
7126g855657L372018O53844k672355m830277m533944o00642M948176O587549J919046
7117c012242l660597l240433K385676O626071O773395N837340N201481K471710
7109A9382401j970546l278791m9750K327640J56574k509726j151790J116288j226261
$$ plain form
7167 -10986072 -15491620 -12560298 -6131063 -3983790 -8812654 -15603597 -17897306 -15170036
7159 -15170036 -12806410 -14899708 -18813904 -18638065 -13132332 -7280007 -5371772 -5739173
7151 -5739173 -4309026 -581748 3031191 5951450 9771583 14450107 17652009 18012320
7143 18012320 16011688 11432685 3457132 -5559541 -9892154 -6632213 29152 3574150
7135 3574150 3125631 3622291 8010991 12326182 10384612 1800904 -7094206 -10265960 -7855657
7126 -7855657 -4483639 -3829795 -6502150 -11332427 -15866371 -16467013 -11518837 -4931288 -3012242
7117 -3012242 -6672839 -9913272 -7527596 -901525 5871870 11709210 16910691 19382401
7109 19382401 17411855 14133064 14083314 16410954 16567528 14057802 12906012 14022300 12796039
7100A2796039o696788r062259o374791j686084K997759P169588P994547K919324
7092A0057335m259549o324883k071262K776641M335410M350830M364238K314731
7084A5543491k588212o634219o391562l348467j242852j280674j807206p07694
7076h457395K686875O104110N195132j093923o992989o116762n46853J711799
7068g510006j679241m755460l277678k95744R90437K830635O983160R344734N981196
7059H612033l34047m987851q252793j1308972j0399273k557239O261960P346641
7051a5619541J960497o82060K129841L296421j075415m339736J25195P812773
7043f392025R162361K976181k861350k736847O07767K005656R07937r1824o93159
$$ plain form
7100 12796039 6099251 -2963008 -9337799 -11023883 -8026124 -856536 7138011 10057335
7092 10057335 5797786 -527097 -2598359 178282 4513692 8864522 13228760 15543491
7084 15543491 12955279 6321060 -70502 -3418969 -4661821 -5942495 -7749701 -8457395
7076 -8457395 -5770520 333590 5528722 4434799 -2558190 -8674952 -9221805 -7510006
7068 -7510006 -9189247 -13944707 -17222385 -17518129 -16527692 -13697057 -6713897 2630837 8612033
7059 8612033 8277986 3290135 -4962658 -16271630 -26670903 -29228142 -22966182 -15619541
7051 -15619541 -13659044 -14341104 -12211263 -8914842 -9990257 -14329993 -14204798 -6392025
7043 -6392025 2770336 5746517 2885167 148320 756087 2761743 3669680 3577856 2884697
7034B884697l006855o669314p513600l125639K492212L106823j398130m491815
7026a7721621j747826L428249N107014K926925J488848L312288O006207O202273
7018I002357L548828M93306l69226J092217J881696p99886m911328n096486n55416
7009D286062K429173o35303m842689k689722M118587O701914K339106j633948
7001A0073180R53171O535418P976149M384055M40381j031759j514179k976985
6993B4839431m864915n054462k567488O52763J044264k279760n439377m336758
6985A993698m71028R52664j787410n255634o036314l544810J903314Q774464J1964005
6976H492949O781917l354393r185275p374919l693209k422033m94213L744165
$$ plain form
7034 2884697 -122158 -6791472 -14305072 -17430711 -14938499 -11831676 -13229806 -17721621
7026 -17721621 -19469447 -16041198 -10934184 -8007259 -6518411 -3206123 2800084 9002357
7018 9002357 12551185 13044491 12675265 13767482 15649178 14849292 9937964 4841478 4286062
7009 4286062 6715235 6079932 1237243 -1452479 2666108 9368022 11707128 10073180
7001 10073180 11026351 17561769 25537918 29921973 30362354 29330595 27816416 24839431
6993 24839431 19974516 14920054 12352566 13005329 14049593 11769833 6330456 1993698
6985 1993698 1522670 2475334 687924 -4567710 -10604024 -14148834 -12245520 -3471056 8492949
6976 8492949 15274866 11920473 2735198 -4639721 -8332930 -10754963 -11249176 -7505011
6968g505011M515190j559559o893200l387328L832879L530078l981464p413363
6960a8861778k012838M502294N143606K771762K545370L705573L493586K690574
6952C978149K566399J408039j833135m819621n914304o254162n067918R16730
6944a5019823R433424J0980144J648205q117372n879766N432871J1664625P129518
6936A7271826M43351l4051K979043L011586J10002j818545k550470m161631n215022
6927A0036089k518933K444057M247378Q26769m250937p187129p451589n071888
6919h926183Q84625Q492040J1581784O490051j867629n286597k856021j291184
6911G220886m132385o109497j340494P164037J0948529O841377n68996o028337
$$ plain form
6968 -7505011 -2989821 -4549380 -11442580 -14829908 -10997029 -7466951 -11448415 -18861778
6960 -18861778 -20874616 -16372322 -11228716 -8456954 -5911584 -2206011 1287575 3978149
6952 3978149 6544548 7952587 6119452 1299831 -4614473 -10868635 -15936553 -15019823
6944 -15019823 -5586399 5393745 7041950 -1075422 -6955188 -1522317 10142308 17271826
6936 17271826 17715177 17681126 20660169 23671755 23781757 21963212 19412742 15251111 10036089
6927 10036089 7517156 9961213 14208591 15035360 10784423 3597294 -3854295 -8926183
6919 -8926183 -8041558 450482 12032266 18522317 16654688 11368091 8512070 7220886
6911 7220886 3088501 -3020996 -4361490 2802547 13751076 20592453 20023457 13995120
6903A3995120q111713o754131j879406L730463N063937J399377j561359N01543
6895F383831L898257K418097l006878n426970j982209K347171K028529k339891
6887D319937o366885p292669m819413M58080O451061R268744O607947P88855l818877
6878E596780n645014o065668n707774l599215n0774K502732K512158J151172L43220
6869h962383P57932K269465M149564M154210L53538m748488n360309k28939M185631
6860c429779K249044k428691k609335J127772J990346p74944k39374N474780Q094575
6851I454394K156072m994669l942866K172876L195101j838173m487848j456924
6843B57963J364440L12005p75771M65332n0253m481118p693375n456954j198597
$$ plain form
6903 13995120 5883407 -870724 -2750130 980333 6044270 7443647 5882288 6383831
6895 6383831 10282088 12700185 9693307 4266337 2284128 4631299 6659828 4319937
6887 4319937 -2046948 -9339617 -14159030 -13700950 -7249889 2018855 8626802 9415657 5596780
6878 5596780 -48234 -6113902 -11821676 -15420891 -15471665 -12968933 -10456775 -9305603 -8962383
6869 -8962383 -8204451 -5934986 -1785422 2368788 2722326 -2026162 -7386471 -7615410 -3429779
6860 -3429779 -1180735 -3609426 -6218761 -5090989 -3100643 -3875587 -4114961 1359819 9454394
6851 9454394 11610466 6615797 2672931 4845807 8040908 6202735 1714887 257963
6843 257963 1622403 1934408 1158637 1623969 1573716 -2907402 -10600777 -16057731 -17256328
6834a7256328P67318K303483N859268Q018182N537149K439020L513670N428571
6826A6610333K514359k702886l899077k645386n472366j0988793j0924874m207024
6818b1715714J083271J627180L586775R618505J2043091N338677l587824n316423
6810B677538j110554J635693J224164O64447j88102k602730k790754K816660Q372429
6801A0698791M539819o709112j2682646o801347L501235Q058492N682897J526288
6793G814417o27141L35148L820482O168025L105753l289985n337451r68423J806544
6784A2827369l113096r217781o199476M267230J0223358N809563k382898o130746
6776F083523m933242k032063J792793N830880O128321N31407n704100n306967
$$ plain form
6834 -17256328 -16489010 -14185527 -8326259 -308077 5229072 7668092 11181762 16610333
6826 16610333 19124692 16421806 12522729 9877343 4404977 -6583816 -17508690 -21715714
6818 -21715714 -20632443 -19005263 -15418488 -5799983 6243108 11581785 7993961 2677538
6810 2677538 1566984 3202677 4426841 5091288 4903186 2300456 -490298 2326362 10698791
6801 10698791 15238610 8529498 -4153148 -10954495 -7453260 605232 6288129 7814417
6793 7814417 7187276 7522424 11342906 17510931 20616684 17326699 11989248 11020825 12827369
6784 12827369 9714273 496492 -5702984 -1435754 8787604 14597167 12214269 6083523
6776 6083523 1150281 -881782 911011 6741891 12870212 13401619 7697519 2390552
6768B390552P26450L745084o58589o248654m657156K969562P393617L695976k516926
6759F839916l327620Q75576L239068J099036p72821J500743M669130L668486p99966
6750A6991548m215032m893794m020614j336390L556780O802705L525293m258541
6742A2151955r038075q055855n853459n058585k028752M646702Q603941M768419
6734A36291j662311k463490J554078L492245K294396K938029N863348N326852
6726A7479438m92102n773932n927406l455401k178352j720802r57041j282194
6718d307792k670623j501523L449324P105255M670135j203815m075275j863729
6710c98043K326945M845365L574577j606482o872774o193414R51387O811369M835589
$$ plain form
6768 2390552 3117002 6862086 6203497 -45157 -4702313 -1732751 5660866 9356842 6839916
6759 6839916 3512296 4387872 7626940 8725976 7953155 9453898 14123028 17791514 16991548
6750 16991548 12776516 7882722 3862108 2525718 6082498 12885203 16410496 12151955
6742 12151955 3113880 -4941975 -10795434 -15854019 -17882771 -13236069 -4632128 136291
6734 136291 -1526020 -3989510 -2435432 1056813 3351209 6289238 12152586 17479438
6726 17479438 16987336 11213404 5285998 1830597 -347755 -2068557 -3025598 -4307792
6718 -4307792 -6978415 -8479938 -5030614 2074641 6744776 5540961 1465686 -398043
6710 -398043 1928902 6774267 10348844 8742362 1869588 -4323826 -3372439 3438930 8274519
6701H274519j292885l367057m99446J135138j244860l674967k655299K63193K090725
6692i70939J874993j84798k958576l458492J51107M665086N360532L026228K253863
6683I759004K961873K18683o175498q972316l829986L458381M817585P49254j830473
6674A156507j768K141066L69413l750310m862058l41146N952290P227665J942361
6665I834020l399723k437296K120056K777897p53931j016662M665618Q986195
6657B0776174N679144j352479n244271o261208p906453q080808k554591N487987
6649E43495Q048762L977039K59932Q79284J487615k589762q832535j1183029p474503
6640a4883702n46941N391243P472794N291554R97404k658498m487051m079991
$$ plain form
6701 8274519 6981634 3614577 3115131 4250269 3005409 -669558 -3324857 -3061664 -970939
6692 -970939 904054 719256 -2239320 -5697812 -5546705 -881619 4478913 7505141 9759004
6683 9759004 12720877 12939560 6764062 -2208254 -6038240 -2579859 2237726 2986980 1156507
6674 1156507 1154739 3295805 3665218 -85092 -4947150 -5288296 663994 7891659 9834020
6665 9834020 6434297 3997001 6117057 8894954 8141023 7124361 11789979 20776174
6657 20776174 26455318 25102839 19858568 13597360 5690907 -2389901 -4944492 543495
6649 543495 8592257 12569296 12829228 13708512 15196127 12606365 3773830 -7409199 -14883702
6640 -14883702 -15430643 -10039400 -2566606 2724948 3722352 1063854 -3423197 -7503188
6632g503188n69807M908030P126207J797979p271379j0771522m898762M136166
6624a3046276Q082072N443948N31790k671182l099888j775940j093272l113113
6616a0741861o401381o341968q19361N947184P662956L188635k631294m912501
6608a5049591l493467j557993j141486j216615n3138J786954K218921J204461
6600a7301954J417319M256073P228488P178231M284073N76211l424950p309434
6592c095943p974263k867612M589003P717188N152350K038414J813821J858878
6584I231836o54251l435763k981081j98879J581949J758431K096498K969008L144615
6575A3512363K157860J96812l328995q496986j2687239j1995187n224499M213074
$$ plain form
6632 -7503188 -8072995 -3164965 3961242 5759221 -1512158 -12283680 -17182442 -13046276
6624 -13046276 -4964204 479744 1011534 -1659648 -4759536 -6535476 -7628748 -10741861
6616 -10741861 -17143242 -23485210 -24304571 -18357387 -10694431 -7505796 -10137090 -15049591
6608 -15049591 -18543058 -20101051 -21242537 -22459152 -22512290 -20725336 -18506415 -17301954
6600 -17301954 -15884635 -11628562 -4400074 2778157 7062230 7638441 4213491 -3095943
6592 -3095943 -11070206 -13937818 -9348815 -1631627 3520723 5559137 7372958 9231836
6584 9231836 8577585 5141822 2160741 1961862 3543811 5302242 7398740 10367748 13512363
6575 13512363 15670223 15867035 12538040 4041054 -8646185 -20641372 -25865871 -21652797
6567b1652797J0250493Q589578R46345n346768m440039J308956M587532K862276
6559b894424O04884J254002K428163J505422M97876J432164J695483r81303k923558
6550B618709J42433N039828M979813n1197l301437j483634J087663m32679n234278
6541C365221r173251r429519n750543k86450L194934K831491J287334J769843
6533a2190940K460352o17374n791481o434204l76062O663755Q761906O188470
6525a335578K370933o86075j674857N07352L596222K750406k247766m925947j005590
6516b650900M918866O091037K939850K00680j771731n820517j0000541q607104
6508a4700360j745336L305234K538647Q50444L757327Q698569R409010N432536
$$ plain form
6567 -21652797 -11402304 -2812726 -1866381 -7213149 -11653188 -10344232 -5756700 -2894424
6559 -2894424 -2289540 -1035538 1392625 2898047 3395923 4828087 6523570 5542267 2618709
6550 2618709 2761142 7800970 12780783 12729586 9428149 7944515 9032178 8599499 3365221
6541 3365221 -5808030 -15237549 -20988092 -21274542 -18079608 -15248117 -13960783 -12190940
6533 -12190940 -9730588 -10347962 -16139443 -22573647 -22949709 -16285954 -7524048 -1335578
6525 -1335578 1035355 349280 -1325577 -818225 2777997 5528403 3280637 -1645310 -2650900
6516 -2650900 2267966 8359003 11298853 11499533 9727802 3907285 -6093256 -14700360
6508 -14700360 -16445696 -13140462 -10601815 -9751371 -5994044 2704525 12113535 17546071
6500A7546071J748297N84323p10765l371652m121200p83674K745210R05382n521891
6491I020101r388819n709744K066881N617204P75936p867077j1417519n730016
6483b2633053M036381Q676598M991210j034758k200860J207614L753571L784606
6475E81309M636630O798692N245357k362709j0042657j0592723m563237K473658
6467g825680P782995J0833102Q463850j298024j1944834j3512566n692569J828641
6459a1365085L465934L788558O627236P163998R08976o695522p587093l377518
6451g070516k106176n259367o156240q51377O460305R988958Q823771N405796
6443I235154J768958j034196k593687l420345l930311l323936j133623J142009
$$ plain form
6500 17546071 19294368 19878691 19167926 15796274 11675074 10891400 13636610 14541992 9020101
6491 9020101 -368718 -6078462 -4011581 1605623 2381559 -5485518 -16903037 -22633053
6483 -22633053 -18596672 -9920074 -4928864 -5963622 -8164482 -6956868 -3203297 581309
6475 581309 5217939 12016631 17261988 14899279 4856622 -5736101 -10299338 -7825680
6467 -7825680 -42685 10790417 19254267 17956243 6011409 -7501157 -13193726 -11365085
6459 -11365085 -7899151 -4110593 2516643 9680641 10589617 3894095 -3692998 -7070516
6451 -7070516 -9176692 -14436059 -20592299 -21443676 -14983371 -4994413 3829358 9235154
6443 9235154 11004112 9969916 7376229 3955884 25573 -3298363 -4431986 -3289977
6435c289977J918471J559778N80917j673979l911210j996474M417265P871401
6427E476192J999716p808513r976233k269609N848476O962326L950718K346816
6419F529889K118357J230635J242872L995008O619516M860612q06207n977636
6411A9813046p475074n283743j525485N09540j277140m745305n454199k705095
6403h143455j63775N14531K012471N474414P450736N538808K120448o56428m289188
6394I858562q509909q312276j737826M583754L971044o32411k202837p52153j246963
6385d981015l598742l169093L00430K323918J607662J035410J260064L39599r22196
6376e803963l88559l07676l817899o917246l080946M541981N959722L19327k149714
$$ plain form
6435 -3289977 -1371506 188272 769189 -904790 -4816000 -6812474 -2395209 5476192
6427 5476192 7475908 -332605 -10308838 -12578447 -6729971 232355 4183073 6529889
6419 6529889 8648246 9878881 11121753 15116761 21736277 26596889 25790682 19813046
6411 19813046 12337972 7054229 5528744 6038284 4761144 15839 -5438360 -8143455
6403 -8143455 -8307230 -7792699 -5780228 -305814 7144922 12683730 14804178 14147750 9858562
6394 9858562 1348653 -6963623 -8701449 -4117695 -146651 -779062 -2981899 -3734052 -4981015
6385 -4981015 -8579757 -11748850 -11448420 -9124502 -7516840 -6481430 -5221366 -4881767 -5803963
6376 -5803963 -6192522 -6500198 -10318097 -17235343 -20316289 -15774308 -9814586 -9495259 -11644973
6367a1644973L180305Q314052O828567L521748L405357K247530l347315o659436
6359E845835k131640K818931q06032p555257o179586J038089K283887l258751
6351g944524m426834J973415N577671N76723m418029j122761N146536N073834
6343D36031k89048l337836k229910j257470k586681m470010n346997m575412j341326
6334b4998659L216074N616218N068278N056175O485343M435158l151308q852479
6326g125200n072446L876453P306827L577740R52228L273933M294161r66926p483915
6317B632855q038955m044765k425428m858472o267544l226284J453014L545042
6309b1230537K907339K069360J876842J392146J122578L084603O841517Q344703
$$ plain form
6367 -11644973 -8464668 -150616 6677951 10199699 13605056 15852586 12505271 5845835
6359 5845835 3714195 6533126 5727094 -1828163 -8007749 -6969660 -4685773 -7944524
6351 -7944524 -12371358 -10397943 -4820272 -4243549 -8661578 -9784339 -4637803 436031
6343 436031 146983 -3190853 -5420763 -6678233 -9264914 -13734924 -19081921 -23657333 -24998659
6334 -24998659 -21782585 -16166367 -11098089 -6041914 443429 4878587 1727279 -7125200
6326 -7125200 -12197646 -8321193 -1014366 2563374 3515602 6789535 11083696 10116770 2632855
6317 2632855 -5406100 -9450865 -11876293 -16734765 -23002309 -26228593 -24775579 -21230537
6309 -21230537 -18323198 -16253838 -14376996 -12984850 -11862272 -8777669 -1936152 6408551
6301F408551N049882K38170j055052O08044o4833m672236q273484o810636k883070
6292a1454664q53535l9688K732781O477331P134556M127317R34314n18359j458785
6283G081268k205558j145301J332499K126914J75732j684978j275302j67657k55097
6274C982520k47815J827399M691085M958879J326043l910045o724742m322768
6266A580556K013536O534594M077758l168965o694109j722146O039229O792073
6258A5452526j455085j0694317j2545358p033947o75014J900983K101078L588493
6250i360641O688103Q278084O611999L867094K711608K176508o77583n662892
6242A4632280q723582o861406j856175J847787J750774q94760k968289k572317
$$ plain form
6301 6408551 11458433 11696603 10641551 11249595 11184762 6512526 -1760958 -8571594 -11454664
6292 -11454664 -12308199 -12347887 -9615106 -3137775 3996781 8124098 9058412 8540053 7081268
6283 7081268 4875710 3730409 5062908 7189822 7365554 5680576 4405274 4237617 3982520
6274 3982520 3734705 5562104 10253189 15212068 16538111 12628066 5903324 1580556
6266 1580556 3594092 10128686 14206444 11037479 4343370 2621224 8660453 15452526
6258 15452526 13997441 3303124 -9242234 -16276181 -16951195 -15050212 -12949134 -9360641
6250 -9360641 -2672538 5605546 12217545 16084639 18796247 20972755 20295172 14632280
6242 14632280 5908698 -952708 -2808883 -961096 789678 -105082 -3073371 -5645688
6234e645688n97243P34176P71363Q09341J373651J268163M27048R81552L306921
6225C429284M001182J136965j441044M19037M063559L981151O22194j535270l090267
6216A1586791q437170j5371983j5445518o982508J413000L960703N132715Q972060
6208a5171910J0368814M418418l506078n699368l582386k325759m28256N084166
6200a0842359Q778254M193602k795100j025571P524825R942234K948838k689075
6192A6035648n36254K488426J04591k962866j277449J325461m18152m052341n198366
6183E508698m673884l373959J629097Q912716R501373K90676p856612n281107
6175D656998J219483k02959o876266p025648M5240L895684R77906j914833k193266
$$ plain form
6234 -5645688 -6242931 -5508755 -4737392 -3928051 -2554400 -1286237 -859189 122363 3429284
6225 3429284 7430466 8567431 7126387 7545424 11608983 15590134 16212328 14677058 11586791
6216 11586791 3149621 -12222362 -27667880 -34650388 -33237388 -29276685 -24143970 -15171910
6208 -15171910 -4803096 -384678 -3890756 -9590124 -13172510 -15498269 -15926525 -10842359
6200 -10842359 -2064105 2129497 -665603 -1691174 5833651 15775885 18724723 16035648
6192 16035648 15499394 17987820 18092411 15129545 13852096 15177557 14759405 10707064 5508698
6183 5508698 834814 -2539145 -910048 8002668 17504041 17794717 9938105 4656998
6175 4656998 5876481 5673522 -1202744 -8228392 -8183152 -4287468 -3309562 -5224395 -7417661
6166g417661m920185r649046q004445J181634P226669L980090q82928J17769K164906
6157a6203197j100583m672991r88010N738677N843523J42857k314504L20003J441645
6148a1792580m07181J360821Q294706J1575307M829375n657147r601791o069822
6140g468312j881671m60468Q76001L681751M858195J901866k616284m477708l447814
6131i034444k635504l069311k008447K348133O979568P427793L958975J165102
6123E131865J203828Q62987k893964p353471p101707j320191N019556P060504
6115F09407M732232J287011p92518j576353k428711l795229m394802k942815m34967
6106i736745O41472k22961n59257J630955N084081P231998P264146N625214K265764
$$ plain form
6166 -7417661 -12337846 -21986892 -29991337 -28809703 -21583034 -17602944 -18485872 -18368103 -16203197
6157 -16203197 -17303780 -21976771 -22964781 -17226104 -11382581 -11239724 -13554228 -13234225 -11792580
6148 -11792580 -12199761 -10838940 -2544234 9031073 13860448 8203301 -1398490 -7468312
6140 -7468312 -9349983 -9810451 -8934450 -5252699 -394504 1507362 -1108922 -5586630 -9034444
6131 -9034444 -11669948 -14739259 -16747706 -14399573 -7420005 7788 3966763 5131865
6123 5131865 6335693 7198680 4304716 -3048755 -10150462 -11470653 -6451097 609407
6115 609407 5341639 6628650 5836132 4259779 1831068 -1964161 -6358963 -9301778 -9736745
6106 -9736745 -9095273 -9318234 -9877491 -8246536 -3162455 4069543 11333689 16958903 19224667
6097A9224667k289242n419643m575685m79769L836723O529613P548648O680885
6089C1056197L462261j156722n030383o668139n770547k926130q6614K82243j672008
6080A1490158k836192j972942k159658n202250o832967k582110L929603N040197
6072a126161M41546k606975q86758O40130j448722k805878Q18511N852092O661702
6063E539487M164312K593446J444015k673120q371605j0307544o942228j873610
6055a6426847K183742N462020P315257N753259J654189j286451j985316l050840
6047c80987n136912m661190M65976O422502P805253M171232m39949l031659m089719
6038A124547m950372m910707k015013L443318P223737M875327k107504o295437
$$ plain form
6097 19224667 16935425 11515782 6940097 6460328 10297051 16826664 24375312 31056197
6089 31056197 34518458 33361736 28331353 21663214 15892667 12966537 12879923 13162166 11490158
6080 11490158 8653966 6681024 4521366 -680884 -7513851 -10095961 -6166358 -1126161
6072 -1126161 -684615 -3291590 -4178348 -3538218 -4986940 -7792818 -6974307 -1122215 5539487
6063 5539487 9703799 12297245 13741260 11068140 2696535 -7611009 -14553237 -16426847
6055 -16426847 -14243105 -8781085 -1465828 4287431 5941620 4655169 2669853 -380987
6047 -380987 -5517899 -10179089 -9713113 -3290611 4514642 8685874 8245925 5214266 1124547
6038 1124547 -3825825 -8736532 -10751545 -7308227 -84490 4790837 2683333 -3612104
6030c612104k844383L926516N742785Q14956m811138n632382k084894K434842
6022f065802N289451M438660q06740o992989q469061m288585L10060J253739O13350
6013a4717917J775764L686418L530353J976489J616378K195055J233621j775949
6005d79788m759735n539001k929627K580299P268357O313183K38866m176452k876702
5996d360600m97159k669779o490280n328158l9454K815393K452015M303025Q414296
5987a400701P272819j339362q310047n799893J246955L241456K14479j50530M428436
5978e96388Q199935P150501L866130J574318l91195l070326m796080m311390l326503
5969D299002l345225k855864m59935J466663m88334n225996p295296l184342M181813
$$ plain form
6030 -3612104 -6456487 -2529971 3212814 4027770 -783368 -6415750 -8500644 -6065802
6022 -6065802 -776351 3662309 2855569 -4137420 -12606481 -16895066 -16585006 -15331267 -14717917
6013 -14717917 -12942153 -9255735 -5725382 -3748893 -2132515 62540 1296161 -479788
6005 -479788 -5239523 -10778524 -13708151 -11127852 -3859495 2453688 2692554 -1483898 -4360600
5996 -4360600 -4857759 -7527538 -14017818 -19345976 -19385430 -16570037 -14118022 -9814997 -1400701
5987 -1400701 5872118 4532756 -3777291 -9577184 -8330229 -5088773 -4874294 -5024824 -596388
5978 -596388 7603547 14754048 18620178 20194496 19803301 16732975 11936895 7625505 4299002
5969 4299002 953777 -1902087 -2362022 -895359 -1383693 -6609689 -13904985 -17089327 -12907514
5960a2907514Q155330N169015j624477n581058l339889J957187M436318J913602
5952a821486k274220l604427j313446J586483K452882J917329K151660L089766
5944B184541K096594j854884n338593m072300J158669M989702M461775K535215
5936F160719K939392M401091L140608o74261k924459j801600l17292j382787l296226
5927F245185k270569J937260M966769K519228m552715j0037171p947408Q27912
5919h311509Q338109P800070J426955k467172r7106L523400K372170k126219l963678
5910F495020j710458j7536j782848l501360r14031L944029N169400J258010k971985
5901E968241l148812n89206Q20771J90341m79372j84558K09913J56623k20323
$$ plain form
5960 -12907514 -4752184 416831 -1207646 -6788704 -10128593 -8171406 -3735088 -1821486
5952 -1821486 -4095706 -7700133 -9013579 -7427096 -4974214 -3056885 -905225 2184541
5944 2184541 4281135 2426251 -2912342 -6984642 -5825973 -836271 3625504 6160719
5936 6160719 9100111 13501202 16641810 15967549 13043090 11241490 10924198 9541411 6245185
5927 6245185 3974616 5911876 10878645 13397873 8845158 -1192013 -9139421 -8311509
5919 -8311509 26600 7826670 9253625 6786453 6689347 10212747 12584917 10458698 6495020
5910 6495020 4784562 4767026 2984178 -517182 -1431213 2512816 7682216 8940226 5968241
5901 5968241 2819429 2230223 3050994 3241335 2761963 2577405 2787318 2943941 2723618
5892B723618j383151l230706l305187L87658M906743M933437O10582j824846Q51486
5883D669634M100841L332633J339186K666981M593280R09618p147069j1369430
5875C095674q023125j604432L700203Q556680J1999167Q623727k231787j0973678
5867A3142429q745076N6905L866878J48184k717552N21599M430012K071795m846163
5858G929011r372809q510636m352560J122294P211670J1276071R347074J495133
5850A6145248o531813r325820p904197p413784r402391r351301l199628O064164
5842c0919522J1345605J0272329P502245P317239P634568M296240j362215l679587
5834A2406902r41342J804077m69624o210545r447678o656353J69708N847408N940930
$$ plain form
5892 2723618 1340467 -1890239 -5195426 -4807768 98975 5032412 5642994 3818148 4669634
5883 4669634 8770475 12103108 13442294 16109275 20702555 21612173 14465104 3095674
5875 3095674 -4927451 -6531883 -2831680 5725000 17724167 26347894 24116107 13142429
5867 13142429 4397353 4454258 8321136 8469320 5751768 6273367 10703379 12775174 7929011
5858 7929011 -1443798 -9954434 -14306994 -13184700 -5973030 5303041 14650115 16145248
5850 16145248 9613435 287615 -7616582 -15030366 -24432757 -33784058 -36983686 -30919522
5842 -30919522 -19573917 -9301588 -1799343 5517896 13152464 17448704 16086489 12406902
5834 12406902 11465560 13269637 12800013 6589468 -2858210 -9514563 -9344855 -3497447 2443483
5825B443483j10336p819378j0506979n465411K791798O985838M671344j68607
5817g178248k936783l395121l610138l144935O91410P907047J3942967J4105564
5809A6381763Q272850o2628p599584j2092794j1429769n629648N86828J412025
5801a0160957k642240m689321q04791M321137M233790k11779l251199l291678
5793a6497038l685471n018194l194264K854682P289986N061545m47822k034632
5785a5671208J448993M641610M101232K256975K220153K968745J978694k60262
5777C684932j343239j089050j487491k806803k797675o41806J078705L42942o64243
5768e723728R88910L404091K231469j369236p57700N599646R064728J930854r914854
$$ plain form
5825 2443483 2333147 -5486231 -15993210 -21458621 -18666823 -11680985 -7009641 -7178248
5817 -7178248 -10115031 -13510152 -17120290 -20265225 -19573815 -11666768 2276199 16381763
5809 16381763 24654613 24591985 16992401 4899607 -6530162 -12159810 -11572982 -10160957
5801 -10160957 -12803197 -17492518 -18297309 -13976172 -9742382 -9954161 -13205360 -16497038
5793 -16497038 -20182509 -25200703 -28394967 -25540285 -18250299 -13188754 -13636576 -15671208
5785 -15671208 -14222215 -9580605 -5479373 -3222398 -1002245 1966500 3945194 3684932
5777 3684932 2341693 1252643 -234848 -3041651 -5839326 -6481132 -5402427 -5059485 -5723728
5768 -5723728 -4734818 -1330727 900742 -468494 -1226194 4373452 13438180 15369034 5454180
5759E454180j2827214l258801P762211R710109N000836K413526M013574M679358
5751B2947779J348337l601840p154916q476946p005241k348719L268197O242174
5743E218825O038348N188327M419467J489067l954035p986211p070805k498646
5735H44337J933473M407143N060398L714494N35644k379879l056881k619618l413121
5726E025990m552794k618764K572557O126204L993270j482873m557252l397141
5718A109197j414193j378454j372259J807161P346118J0965244J0096836O282215
5710C3441865K263559j282923n053501q446349r269569o343074j535095J613516
5702E388429J542749M07486J276477L822904M439536J298228k679387l768768
$$ plain form
5759 5454180 -7373034 -10631835 -2869624 6840485 11841321 14254847 18268421 22947779
5751 22947779 24296116 20694276 13539360 5062414 -1942827 -4291546 -1023349 5218825
5743 5218825 11257173 16445500 20864967 22354034 18399999 10413788 3342983 844337
5735 844337 2777810 7184953 12245351 15959845 16495489 14115610 11058729 8439111 5025990
5726 5025990 473196 -2145568 426989 6553193 10546463 9063590 4506338 1109197
5718 1109197 -304996 -1683450 -3055709 -1248548 6097570 17062814 27159650 33441865
5710 33441865 35705424 34422501 29369000 20922651 11653082 5310008 3774913 5388429
5702 5388429 6931178 7338664 8615141 12438045 16877581 18175809 15496422 11727654
5694A1727654k805910l767648p550746j0332492q664029l459800K014676N643701
5686a7194594O769976N375291K591000L09896j004294k480869m021715l732324
5678a3387633j454413j56227j835089m497169n317594m169713j612939L412084
5670b9018693J0167803J3252908Q260987q95852n388070k154017L290620N039974
5662B555660L336265J754848J771273K144298J283645j253351m093354m606922
5654B892362j909151J198664J599389J19332p20627j742452n237548q880415p420829
5645b0101275j109427L677034L937709L865808O289753O831662J528208n047025
5637a27553n539296l91136L428062K275886j102271l014867k243756J056935N249370
$$ plain form
5694 11727654 8921744 5154096 -2396650 -12729142 -21393171 -24852971 -22838295 -17194594
5686 -17194594 -10424618 -5049327 -2458327 -2148431 -3152725 -5633594 -9655309 -13387633
5678 -13387633 -14842046 -14998273 -16833362 -21330531 -26648125 -30817838 -32430777 -29018693
5670 -29018693 -18850890 -5597982 2663005 1767153 -3620917 -5774934 -2484314 2555660
5662 2555660 5891925 7646773 9418046 11562344 12845989 11592638 7499284 2892362
5654 2892362 983211 2181875 3781264 3900596 3179969 1437517 -3800031 -12680446 -20101275
5645 -20101275 -21210702 -17533668 -13595959 -9730151 -3440398 3391264 4919472 -127553
5637 -127553 -5666849 -6057985 -2629923 -354037 -1456308 -4471175 -6714931 -5657996 -408626
5628d08626O746853L855404Q8029m59164N77782q78658l404427j902648K965936
5619G180481M432158K59991l273265j319401J844261k6033m957018n761560q13168
5610b433554M080546M065414M36657l262165o020291q150253q189745m160830
5602b3634221K543094P049521O029469J768259m79173J003076K825545K339898
5594e54532K100099N391789R414117P911134P41596m523664k865265J064399J97221
5585A8876894m159236m678520R4153K947889r15921n717701k866816N971881R610229
5576A9162852J753122j0310397j4366406p541267J984264O028938M551332K175167
5568C437605J081680K94968m61627K56925L114697O644799Q459216O901100K320311
$$ plain form
5628 -408626 6338227 10193631 10281660 9822496 10400278 9521620 6117193 4214545 7180481
5619 7180481 11612639 11872630 8599365 7279964 9124225 9098192 4141174 -1620386 -2433554
5610 -2433554 1646992 5712406 6149063 2886898 -3133393 -11283646 -19473391 -23634221
5602 -23634221 -21091127 -14041606 -8012137 -6243878 -6723051 -5719975 -2894430 -554532
5594 -554532 1545567 6937356 16351473 24262607 25004203 20480539 17615274 18679673 18876894
5585 18876894 14717658 10039138 10133291 13081180 12165259 6447558 3580742 9552623 19162852
5576 19162852 20915974 10605577 -3760829 -11302096 -9317832 -3288894 1262438 3437605
5568 3437605 4519285 4814253 4352626 4609551 7724248 14369047 22828263 29729363 32049674
5559C2049674k433567m199111l264942l089467m957820n631257k769983K42593
5551E946120j123420n207315o208671k652704J168667K151302J764728J720036
5543b441257J055406r18321k909653m482705o720243q569054o692911r39308M060526
5534b8557520M920401L226657J251200j373941l842280k110950M899404J1106628
5526a0480401J0292762M308594n02836k129511k974837l764439l143866j687642
5518a0082176q10596Q86350M775960P402349M686527l97791j317374J481164J331320
5509G955733k802424l800198J707653P185459O427388K752158K161117L271213
5501B4858099J071195l426313m759839k117556K8093m23150r69117R7597J289891
$$ plain form
5559 32049674 29616107 25416996 22152054 19062587 14104767 8473510 5703527 5946120
5551 5946120 4822700 -384615 -6593286 -9245990 -8077323 -5926021 -4161293 -2441257
5543 -2441257 -1385851 -2304172 -5213825 -9696530 -16416773 -24985827 -31678738 -32618046 -28557520
5534 -28557520 -23637119 -20410462 -19159262 -20533203 -24375483 -26486433 -21587029 -10480401
5526 -10480401 -187639 4120955 3618119 1488608 -1486229 -5250668 -8394534 -10082176
5518 -10082176 -10892772 -10006422 -5230462 2171887 6858414 6460623 5143249 6624413 7955733
5509 7955733 5153309 1353111 3060764 10246223 16673611 19425769 21586886 24858099
5501 24858099 25929294 22502981 17743142 15625586 15653679 15230529 14261412 14359009 15648900
5492A5648900J285651L19662j869604n323084p304820m987822o00935J063370
5484a768682L75220K173930O243785N423059l189748j1329848r526611J80736
5476a1418159P649566Q010263N091385K921164R21492j688569l059813k535542
5468E891787k362826l166610k260919O96745J001392l966919q744596o352714
5460a9264660J441699O380816N373129L547200M700892N117424N13642n616513
5452B193629o122437q40934K450017j357432p392225o949149J107252Q585320
5444h325959P895793P70749m967058n346552l390526k588941j740605J344870
5436a6348229M676702M760010K439570J442193J907872L36434l607711n249614
$$ plain form
5492 15648900 16934551 17254213 15384609 10061525 2756705 -2231117 -2832052 -1768682
5484 -1768682 -1393462 780468 7024253 12447312 9257564 -2072284 -11598895 -11418159
5476 -11418159 -3768593 4241670 9333055 12254219 13175711 11487142 8427329 5891787
5468 5891787 3528961 362351 -1898568 -1201823 -200431 -4167350 -12911946 -19264660
5460 -19264660 -17822961 -11442145 -6069016 -2521816 2179076 7296500 7810142 2193629
5452 2193629 -3928808 -4769742 -2319725 -3677157 -11069382 -18018531 -16911279 -8325959
5444 -8325959 -430166 340583 -4626475 -9973027 -13363553 -15952494 -17693099 -16348229
5436 -16348229 -11671527 -6911517 -4471947 -3029754 -1121882 -785448 -4393159 -9642773
5428i642773j706219L593696N649351L929673J304026j68060L993J487241K288538
5419F739466j07764m443379n611459j613624K821349L101431J691766L369622
5411E947408O609657N949869J525695n61148K064847M259312J334229m241849
5403B2888020p013953n683745l042099j426218j213145k146201l484749l626037
5395d748127j606833J218737K217744K65554k852495l816309r41295L681106O056687
5386e25231M884925K945970L019323M379834M873333M088523K177473j768923
5378B4075227o858556q609860m468022J031711J749815j146560j693567P17228
5370D797416Q26491k784897n205913m078812l296111m765655l905717K035863
$$ plain form
5428 -9642773 -11348992 -7755296 -2105945 1823728 3127754 2959694 2963687 4450928 6739466
5419 6739466 6631702 2188323 -3423136 -5036760 -2215411 886020 2577786 5947408
5411 5947408 12557065 18506934 20032629 19471481 21536328 25795640 27129869 22888020
5403 22888020 15874067 10190322 7148223 5722005 4508860 2362659 -1122090 -4748127
5395 -4748127 -6354960 -5136223 -2918479 -2652925 -5505420 -9321729 -10263024 -6581918 -525231
5386 -525231 4359694 7305664 10324987 14704821 19578154 23666677 25844150 24075227
5378 24075227 17216671 8606811 4138789 5170500 6920315 5773755 4080188 4797416
5370 4797416 5623907 2839010 -2366903 -6445715 -9741826 -14507481 -18413198 -16377335
5362a6377335P625027O838232J871228j445810k569467m413425o369069n748024
5354b0588643l453927j809185Q60057O699838J1342892Q115831j058631o425743
5346f317511l233333K739483M269572J243633k437177m985860o114468m520693
5338a9356354k03477L245268K451711r92433k520592m04658K786398L862720K125978
5329i005439q13786k622574j653623J941222O116337Q404482P681981M574088
5321A4622688N69249k921189m854071m638128k811343j654144l484921o948375
5313a2120234o727076N4317Q154635R300992L253219j455325K68418L031774L37250
5304D097970m600137m289191M77406K011263j374567k748799J577629N839376
$$ plain form
5362 -16377335 -8752308 -1914076 -42848 -1488658 -4058125 -8471550 -14840619 -20588643
5354 -20588643 -24042570 -25851755 -24991698 -18291860 -6948968 1166863 108232 -6317511
5346 -6317511 -9550844 -6811361 -2541789 -1298156 -3735333 -8721193 -14835661 -19356354
5338 -19356354 -19559831 -16314563 -13862852 -14855285 -17375877 -17780535 -14994137 -11131417 -9005439
5329 -9005439 -9819225 -12441799 -14095422 -12154200 -6037863 2366619 10048600 14622688
5321 14622688 15191937 12270748 7416677 2778549 -32794 -1686938 -5171859 -12120234
5313 -12120234 -18847310 -18792993 -10638358 -1337366 1915853 460528 728946 3760720 4097970
5304 4097970 -502167 -4791358 -4313952 -2302689 -3677256 -6426055 -4848426 990950
5296I90950M353510M66136L79683K863210J835869l001101m851794K81377P510140
5287A0827980R043645L298931m348538q401940q316530o714571m832839j757360
5279a1201222K351974M900634M114248J906990J448521K887195L649683K282580
5271A2340603k85422k753121m201219l229954P12352M929363N361133J582077
5263A4455812k771043n247203p101417r172634q703807l350624L769762O786712
5255a1334442M416280J250265J026766J691610n74783m443091m415488R18262
5247a1464621N706930M727574J115130J299387M239881K762064l787970o416449
5239a818074j1395P505073O364653n62261l226463l82859L20330l050424l267725
$$ plain form
5296 990950 5344460 5810596 6190279 9053489 10889358 7888257 3036463 3317840 10827980
5287 10827980 19871625 23170556 18822018 10420078 2103548 -4611023 -9443862 -11201222
5279 -11201222 -8849248 -3948614 165634 2072624 3521145 6408340 10058023 12340603
5271 12340603 12055181 9302060 5100841 1870887 2583239 7512602 12873735 14455812
5263 14455812 11684769 6437566 -663851 -9836485 -18540292 -21890916 -18121154 -11334442
5255 -11334442 -6918162 -5667897 -4641131 -2949521 -3524304 -7967395 -12382883 -11464621
5247 -11464621 -5757691 -1030117 85013 1384400 5624281 8386345 4598375 -1818074
5239 -1818074 -1829469 5675604 12040257 11477996 8251533 7868674 8189004 5138580 1870855
5230A870855K832320P945750N660700j18296k689645k589390l676915m650540
5222D584839j707868L567756N656196K795212j950174n668448p098210n108325
5214d929022m44744K692173J517016n92211Q23367L314445Q32442n637554p798554
5205a0222642j925280N382125O554976K964875J025692K213376K663501J088219
5197I744842Q35255K895057K460547l639790r715574p260735K461722Q180470
5189E961794L153659n673751p544416k459878P67529j328873k788614R10742N624649
5180c377159N638035K156735J72179Q31396J538614J053439K85724l19991p14213
5171G264759Q2734K282728L586108J841913j541107l069044j248137K228412M231567
$$ plain form
5230 1870855 4703175 12648925 18309625 18191329 15501684 12912294 9235379 4584839
5222 4584839 2876971 6444727 12100923 14896135 12945961 7277513 179303 -4929022
5214 -4929022 -5373766 -2681593 -1164577 -1756788 -933421 2381024 3213466 -2424088 -10222642
5205 -10222642 -12147922 -6765797 -210821 2754054 3779746 5993122 8656623 9744842
5197 9744842 10580097 13475154 15935701 12295911 2580337 -4680398 -2218676 5961794
5189 5961794 9115453 3441702 -4102714 -6562592 -5795063 -7123936 -9912550 -9001808 -3377159
5180 -3377159 2260876 4417611 4589790 5421186 6959800 8013239 8298963 7978972 7264759
5171 7264759 7347493 9630221 13216329 15058242 13517135 10448091 9199954 11428366 15659933
5162A5659933K313357l117858q096723q801211o160033l825778k044896J587858
5154a2485351N164970L065083m325768q721406n652385r34671k60183J89285N310901
5145a8649525J0061286O700923j428805m075785K77998L618719K462557J869146
5137H36514M277255M772816O83336l017687k101076L37550o9675k397255l848277
5128e26499m246858l444525L70081N917730P568703L042104k333068l272238j745831
5119A329599j788142j764430J988831O956283O728782O48960m665608m018730
5111E415545L83795K590701l26127n891294q770362n559472J592358O516259N303437
5102A254840K23128l604300l896868k063179j18451R27211O29282n95051j130343
$$ plain form
5162 15659933 17973290 14855432 6758709 -2042502 -8202535 -12028313 -14073209 -12485351
5154 -12485351 -7320381 -4255298 -8581066 -17302472 -22954857 -23889528 -24149711 -23960426 -18649525
5145 -18649525 -8588239 -1887316 -3316121 -7391906 -7113908 -3495189 -1032632 836514
5137 836514 5113769 9886585 10569921 7552234 5451158 5788708 5719033 3321778 -526499
5128 -526499 -4773357 -8217882 -7847801 -1930071 5638632 8680736 6347668 3075430 1329599
5119 1329599 -458543 -2222973 -234142 6722141 13450923 14099883 9434275 5415545
5111 5415545 5799340 8390041 8063914 2172620 -6597742 -12157214 -10564856 -4048597 1254840
5102 1254840 1477968 -2126332 -6023200 -8086379 -8204830 -7277619 -6648337 -7243388 -8373731
5093h373731l849J248920K74058k671174m551735l092846N55879L064213K360487
5084a1189778l21074j665751L82583M436572O857431N014515m39488n730856o377521
5075i033367r93696O408479R329115N246954j963816o894477p825583n755586
5067a1481977j195839M911795R136061Q247862L263680k002697n210534n681695
5059a3344k667683K523997M737022M44320o041539p109787k028901K817224L481033
5050c857658K238800J526187N09923q68163m91940J311047J399548m5212Q79735
5041B602267L697295J971529o059407j1855361p595405K058753O081008K039439
5033g059882j975994M58844O039233P026890R68641o383500o852595J279958J0107328
$$ plain form
5093 -8373731 -8377580 -7128660 -6854602 -9525776 -14077511 -17170357 -16614478 -13550265 -11189778
5084 -11189778 -11510852 -13176603 -12794020 -8357448 -1500017 3514498 3075010 -2655846 -9033367
5075 -9033367 -10027063 -3618584 5710531 10957485 8993669 2099192 -5726391 -11481977
5067 -11481977 -12677816 -7766021 1370040 9617902 12881582 10878885 5668351 -13344
5059 -13344 -2681027 -157030 4579992 5024312 -1017227 -8127014 -10155915 -7338691 -3857658
5050 -3857658 -1618858 -92671 417252 -450911 -942851 368196 1767744 1722532 2602267
5041 2602267 6299562 8271091 2211684 -9643677 -17239082 -15180329 -9099321 -7059882
5033 -7059882 -9035876 -8577032 -2537799 4489091 5457732 -925768 -7778363 -6498405 3608923
5024C608923R985761J226362n462953k069966O838826J0533723N423642k314980
5016B7769338n966145n706145o041650q573150r498386m903399K420199M558510
5008e940828r98787n907451j320961Q367989R699609j222760j2298965j1117942
5000b0740096k34234Q321840Q487087M124586R93200Q32557K169071K466492j01196
4991F319307m370741o694256n340877k511430q15750n36570j438802l503871m345940
4982b3238930l60236P138209J1240671P829941Q84896l201431k830511m13468
4974b950859J525643J149211j693947l498202p43545L447661K434025k966925
4966c296938m564833l03203J612981l372424p730051m094361K771308M485337
$$ plain form
5024 3608923 13594684 14821046 9358093 7288127 14126953 24660676 30084318 27769338
5016 27769338 21803193 16097048 10055398 1482248 -8016138 -12919537 -10499338 -5940828
5008 -5940828 -6939615 -12847066 -14168027 -5800038 3899571 2676811 -9622154 -20740096
5000 -20740096 -20974330 -12652490 -4165403 -40817 952383 1784940 3954011 6420503 6319307
4991 6319307 1948566 -4745690 -10086567 -12597997 -13413747 -13950317 -15389119 -18892990 -23238930
4982 -23238930 -23599166 -16460957 -5220286 2609655 3494551 293120 -2537391 -2950859
4974 -2950859 -1425216 -276005 -1969952 -5468154 -6211699 -2764038 -330013 -3296938
4966 -3296938 -7861771 -8164974 -6551993 -9924417 -17654468 -21748829 -18977521 -14492184
4958a4492184K020548J220622J827715M78221o61392K139886N743332M736684
4950C013432Q90723k92512J163547J704975J361932J244872j112539n847201n972938
4941c845709K283027J0209055P972495l83156m443607m240793o861595j1059347
4933a0369630r362528k677169J171802J631019M521393Q580113P003457J585423
4925B083880R16202M429836K803567m744911q155105l624924J035061R18053L40508
4916c997833J464921p3875m281239m283979Q37003K544795l113159q721750p266406
4907b6891522j193210L764836N144000K242239l457220o237755l095717j90667
4899b9915016k387171k022702P979893J6657707R400496n753900q422584J278804
$$ plain form
4958 -14492184 -12471636 -11251014 -9423299 -8945078 -9606470 -7466584 -1723252 3013432
4950 3013432 3904155 3611643 4775190 6480165 7842097 9086969 7974430 2127229 -3845709
4941 -3845709 -1562682 8646373 16618868 16235712 11792105 7551312 689717 -10369630
4933 -10369630 -19732158 -22409327 -21237525 -19606506 -15085113 -6505000 498457 2083880
4925 2083880 3000082 7429918 10233485 5488574 -2666531 -6291455 -5256394 -4338341 -3997833
4916 -3997833 -2532912 -2606787 -6888026 -11172005 -10335002 -7790207 -10903366 -19625116 -26891522
4907 -26891522 -28084732 -24319896 -19175896 -16933657 -20390877 -26628632 -29724349 -29915016
4899 -29915016 -32302187 -34324889 -26344996 -9687289 -286793 -6040693 -14463277 -13184473
4891a3184473N108973k67260o05508N392670L510206n259542m240763L981092
4883e564605j632305j7599191j4806053P758102J4229363m666127j0751694J1167935
4875b1864575J9669686k397131O400145Q9737668J69610672J30233625j2128908
4868C79261182j17221454j04208872l8097923j0398548j9510227j6460758J04880
4861G3468280j080951j6153538j6073828k469045r20867j1534740j1502998J002455
4853A4734768N692244j211270l016374L870434M537042m629901r110962l049940
4845G816041J620698k014747m886824R5853O275922N710590K10954m886577p504937
4836B436973o516852j583198L458897M561540L771162M446160L786197j371484
$$ plain form
4891 -13184473 -8075500 -8342760 -8948268 -3555598 -45392 -5304934 -9545697 -5564605
4883 -5564605 -7196910 -24796101 -39602154 -31844052 -17614689 -22280816 -33032510 -21864575
4875 -21864575 -2194889 -4592020 1808125 91545793 261156465 391390090 379261182
4868 379261182 262039728 157830856 119732933 109334385 89824158 73363400 73468280
4861 73468280 72387329 56233791 40159963 37690918 36770051 25235311 13732313 14734768
4853 14734768 20427012 19215742 16199368 20069802 24606844 19976943 10865981 7816041
4845 7816041 9436739 7421992 2535168 2631021 8906943 14617533 14828487 9941910 2436973
4836 2436973 -4079879 -5663077 -2204180 2357360 6128522 10574682 14360879 12989395
4828A2989395o074650m682993j838113m601140q421789l943339N848104R251054
4820a473471M572657J152600K437519K190842j569436k636108P69749J874995
4812G319347k416874n837324l309123J785578M394247L950072J094918m035606
4804B945235p888755n450507J392569M487078O83610m145154m295821r31748K339154
4795a0864339M360851M850854L319465J142082K22473m82639k398684k779866
4787b629803J081812M960406K749968k994529m395278j279417q03189l715311
4779g025341k197369N918680J1675621Q475359J614704j293439j235198k844422
4771A3088595n402638n503681l646042k134286m16384K381254L940338K301062
$$ plain form
4828 12989395 6914745 2231752 393639 -4207501 -12629290 -16572629 -10724525 -1473471
4820 -1473471 3099186 4251786 6689305 8880147 7310711 4674603 5444352 7319347
4812 7319347 4902473 -934851 -4243974 -2458396 1935851 5885923 6980841 2945235
4804 2945235 -4943520 -10394027 -9001458 -4514380 -3830770 -7975924 -12271745 -13203493 -10864339
4795 -10864339 -6503488 -1652634 1666831 2808913 3031386 2548747 150063 -2629803
4787 -2629803 -1547991 3412415 6162383 3167854 -1227424 -2506841 -3310030 -7025341
4779 -7025341 -9222710 -3304030 8371591 16846950 18461654 17168215 15933017 13088595
4771 13088595 7685957 2182276 -1463766 -3598052 -4014436 -1633182 2307156 4608218
4763D608218l89455j384689j101934k73271K458421O651591Q088709M536303l71252
4754B2822641k537170k708650l012415k726913j448917j815867m457975m788959
4746f74225k09470L718775O46453o305310q620625m609493k91965J046514K586443
4737a2712903O222590Q142878N292610J077013N27574K902299L180119n64535
4729A4067645m987882o507599n412018m015154k986148j272659J534319M696626
4721d882870P565845R253969P585891J367101n934413q354930m868706j085668
4713F46219j163004j997395P08622M446652L599845j333784m583541m017340k728163
4704f421889k069880K9666L005498K746173j279612m154909l160896j460333j523614
$$ plain form
4763 4608218 4218763 2834074 1732140 1458869 3917290 10568881 18657590 23193893 22822641
4754 22822641 20285471 17576821 14564406 11837493 10388576 8572709 4114734 -674225
4746 -674225 -883695 2835080 3481533 -2823777 -11444402 -16053895 -16345860 -15299346 -12712903
4737 -12712903 -6490313 1652565 6945175 8022188 8549762 11452061 14632180 14067645
4729 14067645 9079763 2572164 -2839854 -6855008 -9841156 -11113815 -9579496 -4882870
4721 -4882870 2682975 11936944 19522835 20889936 14955523 6600593 1731887 646219
4713 646219 -516785 -2514180 -1805558 2641094 6240939 4907155 323614 -3693726 -6421889
4704 -6421889 -8491769 -8462103 -5456605 -2710432 -3990044 -8144953 -11305849 -12766182 -14289796
4695a4289796q40506K458597N453052N833713N896524O689804L931991m376694
4687A0756685j1396161r784003l034384o29262l948240n327940r48781L676160
4679b0635926L246524O60202J412296M751348N174186O40661m620229n177650
4671a4548588o99O990932J0659007Q812165L350006k170566n441057n842982l619441
4662a811223j32806K146821K055463J714198L840410P134989P023387J955729
4654B3926968l512217m005411j78921K357182N70198k463225k640624q57878j198392
4645A1997680m192437n461609k122801K391143K469609k071442n390802k851341
4637e232000L286716O554340L696348k016846n204199m784775l986217m172697
$$ plain form
4695 -14289796 -15130302 -12671705 -7218653 -1384940 4511584 11201388 15133379 10756685
4687 10756685 -639476 -10423479 -13457863 -14087125 -18035365 -23363305 -24312086 -20635926
4679 -20635926 -17389402 -16729200 -15316904 -10565556 -5391370 -4750709 -9370938 -14548588
4671 -14548588 -14549287 -7558355 3100652 11912817 15262823 13092257 7651200 1808218 -1811223
4662 -1811223 -1944029 202792 2258255 3972453 7812863 14947852 21971239 23926968
4654 23926968 20414751 16409340 16230419 18587601 19157799 16694574 14053950 13196072 11997680
4645 11997680 7805243 2343634 220833 2611976 5081585 3010143 -2380659 -5232000
4637 -5232000 -1945284 4609056 8305404 6288558 1084359 -3700416 -7686633 -11859330
4629a1859330k324550K941320O700421M316765O1097J596113O602500M509904
4621A2544240o097872j2363997n543226N216393O721912J317996P12135N798398
4613H305979O704434J112523j881620K052385N517121K667910j826740k513334
4605B0138658k310955n707537j0271119j0909529o841092Q4690Q126511J3157419
4597E467046J0201051J338725m745291m661739m048099n836723m416082K724078
4589c977034P418514L074350m044789m885193j357482l14877r19741J126373K926423
4580i53456j67910l404243M05683O282835K866260q653267j4761814r424887j229921
4571b9040720J291767M3245j56193O44465J325585L029063M985516M048103J216510
$$ plain form
4629 -11859330 -14183880 -11242560 -4542139 -225374 -164277 1431836 8034336 12544240
4621 12544240 6446368 -5917629 -11460855 -6244462 477450 1795446 2507581 8305979
4613 8305979 15010413 16122936 14241316 16293701 21810822 24478732 22651992 20138658
4605 20138658 17827703 12120166 1849047 -9060482 -15901574 -15816884 -7690373 5467046
4597 5467046 15668097 17006822 12261531 7599792 3551693 -2285030 -6701112 -3977034
4589 -3977034 3441480 6515830 2471041 -2414152 -3771634 -4086511 -5006252 -3879879 -953456
4580 -953456 -1121366 -4525609 -4119926 2162909 5029169 -3624098 -18385912 -27810799 -29040720
4571 -29040720 -27748953 -27705708 -27861901 -27217436 -25891851 -22862788 -17877272 -13829169 -12612659
4562a2612659J785980O552495R646375P390910K670268j389439n050571p393365
4554A599994n610699j308359j72283k806487l346448K19387K459037N96476k36191
4545h605573L459866O627948L969771j513550m054343l312731j693451O67223
4537d454840K884406J346867l449177m218979K356647Q114559M419950m225569
4529B773864o268237M21646O872770O341349J408619k113282j911048O19616K194051
4520A0339348j26392m955372o412336j633346M043448L864522j001296l990332
4512A28244k566040L95055K538495L567038K463902j033137l370155j048757L587797
4503D662442N539353M423545L173005J671080j954424n682572o337760o233599
$$ plain form
4562 -12612659 -10826679 -4274184 5372191 12763101 15433369 14043930 8993359 1599994
4554 1599994 -4010705 -5319064 -5491347 -8297834 -11644282 -11424895 -8965858 -8369382 -8605573
4545 -8605573 -5145707 1482241 5452012 3938462 -115881 -3428612 -5122063 -4454840
4537 -4454840 -1570434 -223567 -3672744 -7891723 -5535076 2579483 6999433 2773864
4529 2773864 -3494373 -3072727 3800043 10141392 11550011 9436729 7525681 8145297 10339348
4520 10339348 10212956 5257584 -1154752 -2788098 1255350 5119872 4118576 128244
4512 128244 -2437796 -2042741 495754 4062792 6526694 5493557 2123402 1074645 4662442
4503 4662442 10201795 14625340 17798345 19469425 17515001 11832429 5494669 -738930
4495g38930r167433j1282339n417373N474673R831944M527490k92635K345216
4487d719387N505012J047392o005873n401358J947565N774901J907725l606918
4479c550941n140788l750883j871773R30164M551976O281133M955330L211312
4471E615530L057911K523333o14476m346488m658063r21740L343570M458016J687887
4462A0145480k762855n153312k516776M104799R018367P155844N66618l215747
4454A7342418p73109K423904o2326n909833p496172l618063p95517j970774j795931
4445b655403K900527N617023K12269p511928p543318j300719J106949k141027
4437a1315627k233488L946529P272869J371020o439515o767163j998997M92684
$$ plain form
4495 -738930 -9906363 -21188702 -26606075 -21131402 -11299458 -6771968 -7064603 -4719387
4487 -4719387 785625 1833017 -4172856 -9574214 -7626649 -1851748 55977 -3550941
4479 -3550941 -8691729 -12442612 -14314385 -13384221 -8832245 -2551112 2404218 5615530
4471 5615530 8673441 11196774 10582298 6235810 1577747 656007 3999577 8457593 10145480
4462 10145480 7382625 2229313 -287463 3817336 12835703 19991547 20558165 17342418
4454 17342418 16569309 18993213 18930887 13021054 5524882 1906819 1111302 -859472 -2655403
4445 -2655403 245124 5862147 6074416 -1437512 -8980830 -10281549 -9174600 -11315627
4437 -11315627 -13549115 -9602586 -2329717 -958697 -7398212 -14165375 -16164372 -15671688
4429a5671688J739571O845672J2035831Q273921l301491j0846217p952116o92345
4421i568862L473061M700530N354520M016329n4114k864436j431080J162026J119839
4412E907813k8449N38218J002771j593226n015347m601625n99379K210281J179991
4403i98952j958349m455357m660018k165720Q49866L13528m137631o575487k173261
4394b5961381N153811P751129M831243J845161P21070j677719n152187m459299
4386a6948172J566308O653868O564714N126386O146541N901559K47031o053920
4378I204315n258851J020529L836338L83011k747039q34283J986072O1016n204588
4369B446520q058959o032772j393318K491788L518947J736423J2832J588911N208538
$$ plain form
4429 -15671688 -13932117 -7086445 4949386 13223307 9921816 -924401 -8876517 -9568862
4421 -9568862 -6095801 -1395271 3959249 7975578 7921464 5057028 3625948 4787974 5907813
4412 5907813 5879364 6417582 7420353 5827127 811780 -3789845 -4389224 -2178943 -998952
4403 -998952 -2957301 -7412658 -12072676 -14238396 -13388530 -13075002 -17212633 -23788120 -25961381
4394 -25961381 -20807570 -13056441 -8225198 -6380037 -5658967 -7336686 -12488873 -16948172
4386 -16948172 -15381864 -8727996 -2163282 2963104 9109645 15011204 15258235 9204315
4378 9204315 3945464 4965993 8802331 9185342 6438303 5604020 7590092 7651108 2446520
4369 2446520 -5612439 -11645211 -13038529 -10546741 -7027794 -5291371 -5278539 -3689628 1518910
4360A518910N576814Q56571l727545l146234j68140r26611n113183o506542k858104
4351a4494064R25957R40800j2377K088745N832467P224229N887981L982967J369077
4342A3745782l183191p371739p249015l442047l61463R10156L178465N629004
4334A855952K682173o214200j2144361p787036J919763O762787N015282K513161
4326e396479R26905l413721r250372r100109j036746O870858P907594M925398
4318g566672K872290R76803j770165j101798M551712P148348j30361r914704r527602
4309a4462149p7002N145473Q43209l902469j458336L907344N775985N158516M239553
4300E170124P0097p697535j0809700l464345O525084P454582L83927m186361l297552
$$ plain form
4360 1518910 7095724 7952295 4224750 1078516 910376 -16235 -5129418 -11635960 -14494064
4351 -14494064 -13568107 -12627307 -12639684 -10550939 -4718472 2505757 8393738 12376705 13745782
4342 13745782 10562591 3190852 -4058163 -7500210 -7861673 -6951517 -3773052 1855952
4334 1855952 4538125 -1676075 -13820436 -21607472 -19687709 -12924922 -7909640 -5396479
4326 -5396479 -4469574 -7883295 -17133667 -26233776 -27270522 -20399664 -12492070 -7566672
4318 -7566672 -4694382 -3717579 -5487744 -6589542 -2037830 5110518 4980157 -4934547 -14462149
4309 -14462149 -14539151 -9393678 -8550469 -12452938 -13911274 -10003930 -4227945 930571 5170124
4300 5170124 5240221 -2457314 -13267014 -16731359 -10206275 -2751693 -2367766 -6554127 -9851679
4291i851679l600864o784199n188041M335633J2548376J0261349J413933l427650
4283b93142j709008M23323q63389l039736l644097l867697m266399k343574K903597
4274a6700122P762983Q135925M727212J162660j242161l701953n860504n000538
4266a0716498k53619M859292N904399K631196r34152j468481l29104j681716o621975
4257h610658j0348906o987775K684007J0738092J0778743M788040j080987m721761
4249b761205p510001p574954q56319R945625J4966297R867612K733537K529426
4241B1340018N932971L326875n579095j1267772q784058l503461j119814l38133
4233G531J231074J468252j077144k406326P05731M005675J482749m820557o842905
$$ plain form
4291 -9851679 -13452543 -20236742 -25424783 -21089150 -8540774 1720575 3134508 -293142
4283 -293142 -2002150 -1578827 -2442216 -5481952 -9126049 -12993746 -17260145 -19603719 -16700122
4274 -16700122 -8937139 -801214 3925998 5088658 3846497 144544 -5715960 -10716498
4266 -10716498 -10970117 -6110825 -206426 2424770 1490618 22137 -306967 -1988683 -8610658
4257 -8610658 -18959564 -25947339 -23263332 -12525240 -1746497 3041543 1960556 -2761205
4249 -2761205 -10271206 -17846160 -18702479 -8756854 6209443 16077055 18810592 21340018
4241 21340018 27272989 30599864 25020769 13752997 4968939 1465478 345664 7531
4233 7531 1238605 2706857 1629713 -776613 -70882 3934793 5417542 596985 -6245920
4224f245920j464865N831451Q520838O058026K366306L72512l28619j545062l311775
4215A0252892l187342L39390M251497L497058k065916o285759m390741O29582
4207C040661K249305r81907m531624m635712k479348j435598k806099n023730
4199a6604052n399996k227492L408871P483144O137161Q225n324059m714626M77456
4190a6755368L271939o10899o766785p267518j132035M484713M221211O12198
4182a9942544j939651l593966n128991l093603M461828J1374535J0056176K345611
4174e460605l543371m468863l123600j96250M992134P969132L435241m649891
4166e046073p398465m523583k791771k506998J386049N496982Q50357r061506
$$ plain form
4224 -6245920 -7710785 -1879334 6641504 12699530 15065836 15438348 15109729 13564667 10252892
4215 10252892 7065550 7404940 11656437 15153495 13087579 6801820 2411079 3040661
4207 3040661 5289966 4308059 -223565 -4859277 -7338625 -8774223 -11580322 -16604052
4199 -16604052 -22004048 -24231540 -20822669 -13339525 -7202364 -7194139 -12518198 -17232824 -16755368
4190 -16755368 -13483429 -14094328 -20861113 -28128631 -29260666 -24775953 -20554742 -19942544
4182 -19942544 -21882195 -25476161 -30605152 -33698755 -29236927 -17862392 -7806216 -5460605
4174 -5460605 -9003976 -13472839 -16596439 -16792689 -11800555 -3831423 -396182 -5046073
4166 -5046073 -12444538 -16968121 -19759892 -22266890 -20880841 -15383859 -14533502 -23595008
4158b3595008r931554J69524O901768M078522K863285Q855624J0273839L77482
4150f518q119340n282754j742453p892143j3532080o893581L112933L668072M68710
4141c6219154K531660K235274o571661r891576P71985N670248r028725j8993795
4133f9495744l683014P022212j5499351k3676063N0405635J65112500J86070555
4126B96256730O4897592p9668762j12836099m9691055k350941j3964010l0881558
4119G1761897j5234878M134062q40557j2119145r107750l844010r020324j1815115
4111A3914180j871692P304584M344659m88228J651866J664785n606591p894953
4103A3018610O45776N690986j565943p502617r67924O551351K940029k711064
$$ plain form
4158 -23595008 -33526562 -33357038 -26455270 -22376748 -19513463 -10657839 -384000 -6518
4150 -6518 -8125858 -13408612 -15151065 -23043208 -36575288 -43468869 -40355936 -36687864 -36219154
4141 -36219154 -33687494 -31452220 -38023881 -47915457 -47143472 -41473224 -50501949 -69495744
4133 -69495744 -73178758 -66156546 -81655897 -105331960 -54926325 110186175 296256730
4126 296256730 361154322 281485560 168649461 118958406 116607465 102643455 71761897
4119 71761897 56527019 60661081 59820524 47701379 38593629 34749619 25729295 13914180
4111 13914180 12042488 19347072 23691731 23203503 24855369 26520154 20913563 13018610
4103 13018610 13664386 19355372 17789429 10286812 9318888 15870239 18810268 16099204
4095A6099204J053463N816023j94682r177249p652764q0513J161744k042506n99101
4086D383619K781053O25319k283345K092944O921915O10568j1252379j3234908
4078i355214m718826J508184J910685M621514J0612652J0856454L477660k503765
4070A6409344k739990k649871m911240n113192k144537o72887j164225R07130
4062b079468M191683J893045m641080n123508L132574R602995O550532J08783
4054A3635556p37565K666521L336347j40617l630556m282494k371098L72336J117354
4045I965784k078140o750182q069233n231321j633113J288526M925418Q118146
4037E35885P361002L317335O95257M82329j056509m339588m607325j76014M422847
$$ plain form
4095 16099204 17152667 22968690 22774008 13596759 5943995 5863482 7025226 4982720 4383619
4086 4383619 7164672 7789991 5506646 7599590 14521505 15132073 3879694 -9355214
4078 -9355214 -14074040 -12565856 -10655171 -6033657 4578995 15435449 18913109 16409344
4070 16409344 13669354 11019483 6108243 995051 -1149486 -1822373 -2986598 -2079468
4062 -2079468 2112215 4005260 -635820 -5759328 -2626754 6976241 13526773 13635556
4054 13635556 12897991 15564512 18900859 18760242 15129686 10847192 8476094 8848430 9965784
4045 9965784 7887644 1137462 -6931771 -12163092 -13796205 -12507679 -7582261 535885
4037 535885 7896887 11214222 11909479 12391808 11335299 6995711 2388386 2212372 6635219
4028F635219N866359N616573L829438k393944j1276215j4987132j0698595n471990
4020b2880287m843776m255713J454279P448550O480058J396644L22482L116721
4012a1761042K862342j004271j564863L131878O406477M247324J506571K703086
4004F527502M213945J403738k312139o97181M482002N590318J046893k576933
3996A7678145j598454q48480m334559o855785j948959N781539N405606l593587
3988I685466q919613l154883M859668L017552o222837j0149523m656756J261801
3980a4279125J05058m318263m708947o76020L207644M886773N620814O005138
3972d156928N128574K655007l01054j527767J155994O824569R868321N320057
$$ plain form
4028 6635219 12501578 18118151 21947589 19553645 8277430 -6709702 -17408297 -22880287
4020 -22880287 -27724063 -31979776 -30525497 -23076947 -16596889 -15200245 -14877763 -11761042
4012 -11761042 -8898700 -9902971 -11467834 -8335956 -1929479 2317845 3824416 6527502
4004 6527502 10741447 12145185 9833046 9135865 13617867 19208185 20255078 17678145
3996 17678145 16079691 15231211 10896652 4040867 2091908 7873447 13279053 9685466
3988 9685466 765853 -2389030 2470638 5488190 -734647 -10884170 -15540926 -14279125
3980 -14279125 -14174067 -18492330 -23201277 -23877297 -20669653 -15782880 -10162066 -4156928
3972 -4156928 971646 3626653 3325599 1797832 2953826 9778395 19646716 24966773
3964B4966773l916257r579421q537658n601026m519310k644414J893622M095694
3956c841997o49154p451792p213045O88599P517088O854363J612101j521980j99087
3947d204904K675024L250553M50926l123696l521043K83212M937174O798478O247929
3938A3793653N954403O124895M272768p07116o780438j1026138j1587943p835214
3930g791130j204574L942316L076349l393408r197523p998723l0790P829314Q980760
3921e787409L813712j218501j170516K564939O041310Q530108J0945914J0609359
3913C4328916L490978p842813j4645294j2817685p963057o379436o429982l615787
3905b1874160O66846J833832L07908J33296J300950M24487j726567m27763M775996
$$ plain form
3964 24966773 21050516 11471095 2933437 -2667589 -7186899 -9831313 -7937691 -3841997
3956 -3841997 -4491151 -11942943 -19155988 -18467389 -10950301 -4095938 -2483837 -4005817 -4204904
3947 -4204904 -1529880 1720673 2171599 -952097 -4473140 -4189928 747246 7545724 13793653
3938 13793653 19748056 25872951 30145719 29438603 22658165 11632027 44084 -7791130
3930 -7791130 -8995704 -5053388 -1977039 -5370447 -14567970 -22566693 -22597483 -14768169 -5787409
3921 -5787409 -1973697 -3192198 -4362714 -1797775 4243535 12773643 23719557 34328916
3913 34328916 37819894 29977081 15331787 2514102 -5448955 -11828391 -18258373 -21874160
3905 -21874160 -21207314 -19373482 -19065574 -18932278 -17631328 -17206841 -18933408 -19361171 -14585175
3896a4585175Q596270Q035696N836555M217561J361166l065232m836131j866162
3888C694548Q80544j479874n094962k085869P201831J2856642P888482k469828
3880B1391514p242735l318309J437701q05046p340407q791112j958202O060314
3872e66282P802275M600291K263655J742095k24010l418893l862706j150056L83395
3863G569764p80550o15889L043196N707043K550488m398020r131552q740022m341740
3854i137282J980132P375932P838078J846383o600282j1612534j1007965o207992
3846b5525530R91072Q163773J0902981O328750k155621p163495n009636R69929
3838a2497777M719001L338903r25133l077444m06712L938695M052622j035386
$$ plain form
3896 -14585175 -5988905 2046791 7883346 12100907 13462073 10396841 5560710 3694548
3888 3694548 4575092 3095218 -1999744 -4085613 3116218 15972860 23861342 21391514
3880 21391514 14148779 10830470 12268171 11463125 4122718 -4668394 -6626596 -566282
3872 -566282 7235993 11836284 14099939 15842034 15618024 12199131 8336425 7186369 7569764
3863 7569764 6789214 6173325 9216521 14923564 17474052 13076032 3944480 -4795542 -9137282
3854 -9137282 -7157150 218782 8056860 9903243 3302961 -8309573 -19317538 -25525530
3846 -25525530 -24534458 -16370685 -5467704 861046 -1294575 -8458070 -13467706 -12497777
3838 -12497777 -7778776 -4439873 -5365006 -8442450 -8849162 -4910467 -857845 -1893231
3830a893231n609907n196999k600863k348941k657249J359479Q414734J1642343
3822A109366Q555397M094928K316193J040929k315847m874624k819949J495467
3814H601860K075171k182140n908060m655787l87488K009737J382279Q66588K333298
3805D135458L337366J315902j552896j299876R48469l8938m713729o458884j479145
3796e806273M373008M071557K68405M17646M040059L671200k194384o449516n193461
3787b801759l168886m050490l854487P32990M838905K923667j760444k356618
3779i497122J065202L177667K313589O42179j913811o443821r365051n729639
3771b5750807J984479N641631K768913m92754Q96705M370370N082962K468435
$$ plain form
3830 -1893231 -7503138 -12700137 -15301000 -17649941 -20307190 -18947711 -10532977 1109366
3822 1109366 9664763 13759691 16075884 17116813 14800966 9926342 7106393 8601860
3814 8601860 10677031 8494891 2586831 -2068956 -2456444 -446707 935572 1802160 4135458
3805 4135458 7472824 8788726 7235830 5935954 6884423 6845485 2131756 -4327128 -5806273
3796 -5806273 -1433265 2638292 2906697 3324343 7364402 11035602 8841218 2391702 -2801759
3787 -2801759 -5970645 -10021135 -13875622 -13142632 -8303727 -5380060 -7140504 -9497122
3779 -9497122 -8431920 -5254253 -2940664 -2298485 -4212296 -10656117 -20021168 -25750807
3771 -25750807 -23766328 -18124697 -15355784 -15848538 -14951833 -10581463 -5498501 -3030066
3763c030066j029022l575465m095285k296890o4315N05439R82090M191950P530228
3754h81336M569237m677270j1168802q088956M53295O006912O245666M095149
3746c446105R39873l119542n174930k218487L267820N996346N145417L640909
3738E031301J497846l549184q850626p710228K25522O025209K937319m352847
3730h745688o782431l124448P76911K325707M636497Q702963J0009998N633204
3722A3432713m14292k740982j860824j619945k100536m48771K390738J755447
3714H393548l000295o302918m218194J34599K040001J689059J338307K25590k358517
3705b058820k529083K767080P994358M810973m644916q917788l527036K603498
$$ plain form
3763 -3030066 -4059088 -7634553 -11729838 -14026728 -14091043 -13585604 -12603514 -8411564 -881336
3754 -881336 3687901 -989369 -12158171 -20247127 -19793832 -13786920 -7541254 -3446105
3746 -3446105 -2506232 -5625774 -10800704 -13019191 -9751371 -3755025 1390392 5031301
3738 5031301 6529147 2979963 -5870663 -13580891 -13355369 -7330160 -4392841 -8745688
3730 -8745688 -15528119 -18652567 -17875656 -15549949 -10913452 -2210489 7799509 13432713
3722 13432713 13018421 10277439 8416615 6796670 4696134 4247363 6638101 8393548
3714 8393548 5393253 -909665 -5127859 -4993260 -2953259 -1264200 74107 299697 -2058820
3705 -2058820 -4587903 -1820823 6173535 10984508 6339592 -2578196 -6105232 -3501734
3697c501734J053433l979297l973185J73327J244599j447601j608729K766983
3689i272204O227550M907282J593755j35388q07771j616268j196059J153931K955361
3680C810189K172645L04793n15914n41985k90920J394608M406277N470533K550985
3671A8761211j223430j699149J16737J73333j475290n36707L969429O800742L672641
3662B8559517j995154l238310R46795M253929J804087l277813m538032j428533
3654B1086486j3477l982134q630915o786868R49074N832615J704372p000412j0469969
3645g311228n327736J856731L278490p11331l222254m07731M080427N126840L421138
3636G83346L641107O867615Q656075N166650j902462p758436r453847p109689
$$ plain form
3697 -3501734 -2448301 -6427598 -10400783 -10227456 -8982857 -10430458 -12039187 -9272204
3689 -9272204 -3044654 1862628 3456383 3320995 2513224 896956 -299103 854828 3810189
3680 3810189 5982834 6287627 5771713 5229728 4938808 6333416 10739693 16210226 18761211
3671 18761211 17537781 15838632 15955369 16128702 14653412 14116705 18086134 24886876 28559517
3662 28559517 26564363 23326053 24272848 28526777 30330864 27053051 22515019 21086486
3654 21086486 21073009 17090875 8459960 1673092 2622166 8454781 10159153 3158741 -7311228
3645 -7311228 -12638964 -10782233 -7503743 -8215074 -11437328 -11845059 -7764632 -2637792 783346
3636 783346 4424453 11292068 19948143 25114793 23212331 15453895 6000048 -1109641
3628a109641k704302N66899P359l258428m526530j346712K767626L113886M22279
3619f067564p22320J153970K984202K514304J224122J100345J668382J445673
3611E301114o4977k787497o134692p685600m334854L481474J0482617J1412162
3603I669747O405304K18422l071738l280176k570336k309415k153571j619460
3595A288777j293766j702144j793000j53805K422263L508207K417757Q67216o1552
3586E499953r12911j303458l171J270627j254070o331422o831387o9964O387004
3577c548799N170390K94372R1741L338606K544962j465502l90941N678914O110462
3568A7824205k638829r390186n135551K937024L423407j706798k376871K412777
$$ plain form
3628 -1109641 -3813943 -3247044 -3239685 -6498113 -11024643 -12371355 -9603729 -6489843 -6067564
3619 -6067564 -6789884 -5635914 -2651712 -137408 1086714 2187059 3855441 5301114
3611 5301114 5236137 2448640 -3686052 -11371652 -15706506 -12225032 -1742415 9669747
3603 9669747 16075051 16293473 13221735 9941559 7371223 5061808 2908237 1288777
3595 1288777 -4989 -1707133 -3500133 -3653938 -1231675 2276532 4694289 5561505 5499953
3586 5499953 4587042 3283584 3280413 4551040 3296970 -3034452 -9865839 -9935803 -3548799
3577 -3548799 1621591 1915963 2007704 5346310 7891272 6425770 6034829 11713743 17824205
3568 17824205 15185376 5795190 659639 3596663 7020070 5313272 2936401 5349178
3560E349178M394284N29710l371646l475479k736431l562642l881668k628281
3552i382975k158227k719665o67034M918938R081917P637261K729101j223048
3544H216268l256906m306598l314059J052503O505760Q558608N544804J15750
3536A9116130l910519m697726k876968l48936J215081J229194j84005k824565
3528F717686n906499p492527n870280j552368L231560O980278R595289J0619334
3520A6322473Q486875K607665m458755q168060o106359q64631K180979O04746
3512A0604933k704118m098797m198515n439388o228208k499779M654092Q539928
3504a369852O128810K355458J838840J746339j958590n834310l579740L118657
$$ plain form
3560 5349178 9743462 10273172 6901526 3426047 689616 -2873026 -6754694 -9382975
3552 -9382975 -11541202 -14260867 -14927901 -10008963 -927046 6710215 9439316 8216268
3544 8216268 4959362 652764 -2661295 -1608792 4896968 13455576 19000380 19116130
3536 19116130 15205611 10507885 7630917 7281981 8497062 9726256 9542251 6717686
3528 6717686 811187 -6681340 -12551620 -14103988 -10872428 -3892150 5703139 16322473
3520 16322473 24809348 27417013 22958258 14790198 8683839 7819208 10000187 10604933
3512 10604933 7900815 3802018 -396497 -5835885 -12064093 -14563872 -9909780 -1369852
3504 -1369852 4758958 7114416 8953256 10699595 8741005 2906695 -673045 2445612
3496B445612N834800J319251m375617m782970o87401K783982K623877k13530k513116
3487B434888j345192K781318N411457L370645l97912o80739K310147L465639N77208
3478A7927459l225718n097513n540321m857585j542780L743735O775158M952578
3470A3135013J032353m70309J512589M375268N011654K506748r30243k246010
3462B3927063k214543n306786j1706918j3287397l969127Q708592J1273490L017717
3454A0442091l149587l67458K800620k013520q515412o148070K327292M822852
3446A98808j649427p258186m249191L361662P331828N788861K719188R29736m91802
3437F681477k669685l705319o35806N224112P295661J418477o669056o945655
$$ plain form
3496 2445612 8280412 9599663 5224046 441076 -246325 2537657 5161534 4948004 2434888
3487 2434888 1089696 3871014 9282471 12653116 12255204 11574465 13884612 17350251 17927459
3478 17927459 14701741 9604228 4063907 -793678 -2336458 1407277 8182435 13135013
3470 13135013 14167366 13697057 15209646 19584914 24596568 27103316 26173073 23927063
3462 23927063 21712520 16405734 4698816 -8588581 -12557708 -3849116 7424374 10442091
3454 10442091 7292504 6925046 9725666 7712146 -803266 -6951336 -4624044 198808
3446 198808 -1450619 -8708805 -12957996 -9596334 -2264506 3524355 6243543 7173279 6681477
3437 6681477 4011792 306473 -329333 4894779 12190440 13608917 6939861 -5794
3429e794R81373N980864M99111q760016j0408009l314769M495111P775955P439848
3420D683674M577095r42520o359814p429319m446661j491917J36277K305564M382465
3411d585156L282787o09901l529434m707164o560201q037731m758744K520501
3403b6985043O645166M266886Q35669J572973L492403J389960l122025m285051
3395a6189062p42078L689565N531744L825585o63422m532821l058286L271598
3387h867177O907632L101103k007482l1230N929039N245652l267804q684605m767144
3378f442016P43387n50397l939308k07667P917838R126248J597081l570785P47042
3369E421423P017309M473448n596749j2502094j0181459k345735M395766O874293
$$ plain form
3429 -5794 975579 6956443 7455554 -1304462 -11712471 -15027240 -10532129 -2756174 4683674
3420 4683674 9260769 8318249 1958435 -5470884 -9917545 -11409462 -11273185 -8967621 -4585156
3411 -4585156 -1302369 -1912270 -5441704 -10148868 -16709069 -24746800 -29505544 -26985043
3403 -26985043 -20339877 -16072991 -15237322 -13664349 -10171946 -8781986 -11904011 -16189062
3395 -16189062 -16931140 -13241575 -7709831 -3884246 -4547668 -9080489 -12138775 -8867177
3387 -8867177 -1959545 1141558 -865924 -897154 5031885 10277537 7009733 -1674872 -6442016
3378 -6442016 -5698629 -6249026 -10188334 -10396001 -2478163 6648085 8245166 4674381 5421423
3369 5421423 12438732 16912180 11315431 -1186663 -11368122 -13713857 -9318091 -2443798
3361b443798N397837K220294M48300J252683K072602J36639k976468l379506q06066
3352A922517J054259J22808j576489j475483L22985J862171J172777k402133o435558
3343e432146o145473j51704N824528N331500L15283j303188L071713P667592P304361
3334A6482466L310819j103820n223087q081808p301173l791573k036212k578287
3326a0322675m60300N027769O303994p32400p654941m580972M577482P431461
3318d10582J033367n276693m505590k89349J047471r31765k825556k396966Q34688
3309a3720975N644652Q306796N870736J014528p74102P01952K43042l834793o461571
3300c009735l717340J305461L632718K965384J684196J81899j802194k122541
$$ plain form
3361 -2443798 2954039 5174333 5622633 6875316 8947918 9084557 6108089 2728583 1922517
3352 1922517 2976776 3099584 1523095 47612 370597 2232768 3405545 1003412 -5432146
3343 -5432146 -11577619 -11729323 -5904795 -573295 -258012 -1561200 1510513 9178105 16482466
3334 16482466 19793285 18689465 13466378 5384570 -1916603 -5708176 -7744388 -10322675
3326 -10322675 -10782975 -5755206 548788 -183612 -7838553 -12419525 -7842043 -410582
3318 -410582 622785 -4653908 -9159498 -9448847 -8401376 -9333141 -12158697 -14555663 -13720975
3309 -13720975 -8076323 230473 6101209 7115737 6341635 7043587 7286629 3451836 -3009735
3300 -3009735 -6727075 -5421614 -1788896 1176488 2860684 3042583 1240389 -882152
3292h82152J042055M908083M728924M61925k734192j349175J959527K349737n31152
3283I953580k443772q37405J820198K468564K147271K859996K353130k327680
3275A5993882p192343m819773L028333M755955m623120j4278214j1825134l95019
3267a9355433P210318O625701M276090M418626M338037K152279r0923j962416
3259G612279m998851o736381k552865N472171R497300O875911K352444j309433
3251A6212575n808926r129961n354028L822608P542064J062010o471853n715419
3243c840930l23558P62185k790860m493952j612826L439703Q269142J0591053
3235I999957P080581j556525p827535n718515J302613N617716N226747L188361
$$ plain form
3292 -882152 159903 5067986 9796910 10258835 7524643 6175468 8134995 10484732 9953580
3283 9953580 7509808 6672403 8492601 10961165 13108436 15968432 18321562 15993882
3275 15993882 8801539 3981766 7010099 11766054 7142934 -7135280 -18960414 -19355433
3267 -19355433 -12145115 -5519414 -1243324 3175302 7513339 9665618 9574695 7612279
3259 7612279 2613428 -4122953 -6675818 -1203647 8293653 15169564 17522008 16212575
3251 16212575 10403649 1273688 -4080340 -257732 7284332 8346342 1874489 -3840930
3243 -3840930 -4164488 -3402303 -6193163 -10687115 -12299941 -8860238 -591096 9999957
3235 9999957 17080538 15524013 7696478 1977963 3280576 8898292 14125039 17313400
3227A7313400J382397M21761J920265M990026M119735l357886j1007126j0780953
3219E001619l995016J236846R67629k091274m582544n029688k339369K602124
3211h229673N463655L416916l46640j150928Q35198K700121L532041K898864q95379
3202H224175o380794p934628m252188j530420k463440k31891Q287787J2478866
3194F197467L256257r411396r436694K29596K736443m656415o858349K630297
3186a5312794J0674888O754046m46919J070822P240221O395671j930470q436853
3178F008612q683524o160332m199388k947154k115859r90565J825951M878181
3170a2384078M009123p22449l609785k244055j349554l360851k760786L940148
$$ plain form
3227 17313400 18695797 19117558 21037823 26027849 30147584 26789698 15782572 5001619
3219 5001619 1006603 2243449 3211078 1119804 -3462740 -8492428 -10831797 -8229673
3211 -8229673 -2766018 650898 304258 -846670 -11472 2688649 6220690 9119554 8224175
3202 8224175 1843381 -6091247 -10343435 -11873855 -14337295 -14569186 -6281399 6197467
3194 6197467 9453724 42328 -9394366 -9164770 -6428327 -11084742 -17943091 -15312794
3186 -15312794 -4637906 2116140 1669221 2740043 9980264 16375935 14445465 6008612
3178 6008612 -2674912 -8835244 -13034632 -15981786 -18097645 -19088210 -17262259 -12384078
3170 -12384078 -8374955 -9097404 -12707189 -14951244 -16300798 -19661649 -22422435 -18482287
3162a8482287R914993P699416J085760j404979J60366j28283j959873l7819M525423
3153A372717M680494l21808k804717J135816N438867L361861l168277p025710
3145B669243m622424J504475N910397M506522j782391o902043n727250j21710
3137d565181L896016M077606K910893J409954k408739p674336q871743l109567
3129a4335097M650907P278510M029651O9027r11851j5155M62467M48699P80043
3120B457201Q73945k69675j871883k411935k548812m355021o919451n813793O55949
3111b0203475P278434P776116L212097L4673M66880L17112k809365m922039k136938
3102a0986505K893133M929689L374637J675884J677211K237415K299804K334691
$$ plain form
3162 -18482287 -8567294 -867878 217882 -1187097 -1026731 -1155014 -3114887 -3152706 1372717
3153 1372717 6053211 5731403 2926686 4062502 9501369 12863230 9694953 2669243
3145 2669243 -1953181 -448706 5461691 9968213 8185822 1283779 -4443471 -4565181
3137 -4565181 -669165 3408441 6319334 7729288 5320549 -2353787 -11225530 -14335097
3129 -14335097 -9684190 -2405680 1623971 1692998 781147 765992 1228459 1677158 2457201
3120 2457201 3331146 3061471 1189588 -1222347 -3771159 -8126180 -15045631 -20859424 -20203475
3111 -20203475 -12925041 -5148925 -1936828 -1902155 -1435275 -1118163 -3927528 -8849567 -10986505
3102 -10986505 -8093372 -3163683 210954 1886838 3564049 5801464 8101268 10435959
3094A0435959L122366M658892N565614L342734k679852q553703r257384n656952
3086I77674l745656n697435o668249k947031J874571K641025J62473j176076L20015
3077a4258689L659553P678100R710437O055818j711237n352043k76226O873375
3069A2379088O855373J73592n606662p085766o291555l979268K23331L181058
3061a50809J926089K80035L524833Q097593N911280j797250n228498j536706R83878
3052A2010445k947149p416150o078177k274879k212141m890756n398523l224994
3044b2432324j158219L78953K456077L971171L434185K029729J336776N82489
3036i401163q08805r68313J023751K570528J511933k78244j91273J187614K284404
$$ plain form
3094 10435959 13558325 18217217 23782831 27125565 24445713 15892010 6634626 977674
3086 977674 -2767982 -8465417 -15133666 -18080697 -16206126 -13565101 -13402628 -14578704 -14258689
3077 -14258689 -10599136 -2921036 6789401 12845219 11133982 5781939 5505713 12379088
3069 12379088 19234461 19408053 13801391 6715625 424070 -3555198 -3331867 -150809
3061 -150809 1775280 2055315 5580148 13677741 19589021 17791771 12563273 11026567 12010445
3052 12010445 9063296 1647146 -4431031 -6705910 -8918051 -13808807 -19207330 -22432324
3044 -22432324 -23590543 -23211590 -20755513 -16784342 -13350157 -11320428 -9983652 -9401163
3036 -9401163 -10209968 -11178281 -10154530 -7584002 -6072069 -6350313 -6541586 -5353972 -3069568
3027c069568L524713N062711M542234M48435m626680o851967n329266j740185
3019h039573J533763J887577j207628l395258K68268O951572Q118785K179718
3011H297224k273845Q1063K483946k697783j0791971j1433713l802495L514561
3003a6623013N015553K513901p88988k547856L68746P753904J2059167O823851
2995A4575265k408201m569859O05695K915041j390340m341810q26736K739331
2987G298386J22971l800920j712409L512589L754824q55591k330514K478934P212174
2978A5680444N090693k608787q992524r295290m502485J070391M147475M257678
2970D847595K005800k261102o593581o755246j219970M519782L591780k544343
$$ plain form
3027 -3069568 455145 5517856 10060090 10508525 5881845 -970122 -6299388 -8039573
3019 -8039573 -6505810 -4618233 -5825861 -9221119 -8952851 -2001279 6117506 8297224
3011 8297224 6023379 6104442 8588388 5890605 -4901366 -16335079 -20137574 -16623013
3003 -16623013 -11607460 -9093559 -9882547 -12430403 -12061657 -4307753 7751414 14575265
2995 14575265 12167064 7597205 8202900 11117941 9727601 5385791 4559055 7298386
2987 7298386 7421357 3620437 1908028 5420617 9175441 8319850 5989336 8468270 15680444
2978 15680444 20771137 18162350 9169826 -125464 -4627949 -3557558 589917 4847595
2970 4847595 6853395 4592293 -2001288 -8756534 -9976504 -5456722 -1864942 -4409285
2962d409285n547939k053235K033522J068727k681537m162422k549443Q28894
2954a7472718O021502J1001586R957255J247445o996557n961033J960671O834343
2946F592494M345852j303859n545497p211428n336852K02350M768870K839317
2938f48753l506762o707168m908822l574462m598300k393307N463127J1684898
2930i189549R229647J704900k660144k619613k365061k084162J562646O741843
2922C20507O677065K45211m549551j215532N911143P443120J408913m829694m841960
2913F569222r89910R2149k847077m506582j526183K144935J252201k367276k145007
2904d323528L272356P631340N775885J56125l583854l582712j445911J608804
$$ plain form
2962 -4409285 -9957224 -12010459 -9976937 -8908210 -11589747 -15752169 -18301612 -17472718
2954 -17472718 -11451216 -449630 9507625 10755070 3758513 -2202520 -241849 6592494
2946 6592494 10938346 9634487 4088990 -3122438 -8459290 -8256940 -3488070 -648753
2938 -648753 -4155515 -10862683 -15771505 -19345967 -23944267 -26337574 -20874447 -9189549
2930 -9189549 40098 1744998 -915146 -3534759 -5899820 -7983982 -6421336 320507
2922 320507 6997572 7242783 2693232 1477700 7388843 14831963 16240876 11411182 6569222
2913 6569222 5579312 5671461 2824384 -1682198 -3208381 -1063446 188755 -2178521 -4323528
2904 -4323528 -1051172 6580168 12356053 12512178 8928324 5345612 3899701 5508505
2896E508505M613505N182730J745781l615774p117284o830354k780445L707389
2888D14053Q510074O395124j773693o999114k664045N568685O699873m00018o049708
2879I701231m098360M86743O61909k880272m908824l548659m85163L023673N810237
2870C762515N123060j38337n942136o963962l322397k0262J53943j69788K299852
2861e217512O103253O368739J011655o040273q815194n965215j784160k04325
2853a4543032k49845O73293J640545J62164k251293j319322L083908N910501M025097
2844b867984K17052j410446l39346J703751L346703L044477m42182n056843o409947
2835h214765l674155r43298r11495j450057p35421q17019k599075k211706K808346
$$ plain form
2896 5508505 10122010 15304740 17050521 13434747 6317463 -512891 -3293336 414053
2888 414053 8924127 15319251 13545558 6546444 3882399 9451084 16150957 15750939 9701231
2879 9701231 5602871 6089614 6751523 3871251 -1037573 -4586232 -5071395 -2047722 3762515
2870 3762515 8885575 8747238 2805102 -4158860 -7481257 -7501519 -7347576 -7517364 -5217512
2861 -5217512 885741 7254480 8266135 2225862 -6589332 -12554547 -14338707 -14543032
2853 -14543032 -14792877 -14119584 -12479039 -12316875 -14568168 -15887490 -12803582 -6893081 -2867984
2844 -2867984 -2650932 -4061378 -4400724 -2696973 649730 3694207 3252025 -1804818 -8214765
2835 -8214765 -11888920 -12832218 -13743713 -15193770 -15929191 -16746210 -19345285 -21556991 -18748645
2826a8748645P780458O769562J196976k786285k954554j616685J39856K994896
2818g224421N603520N750243M348531L519295K247817r47949l052088m93719L441728
2809A3192957K241335l266683n474832j797575J699374M49526k087115j321298
2801C635689J324457K263850J687016J348777L94841k375307n038228n033050
2793a791955k796946j35952K402141L972236K392500k139314n130358l264247
2785f491895L92518M72384k902818m332229p09309M814652O945035M048593q59567
2776A377364l615117k756909l37229P75022M7314o24487O19248L863286P407507
2767F755999Q447319M877821k000569p694176r160620p834260o168109l480914
$$ plain form
2826 -18748645 -10968187 -4198625 -3001649 -5787934 -8742488 -10359173 -10219317 -7224421
2818 -7224421 -1620901 4129342 8477873 11997168 14244985 13297036 10244948 9751229 13192957
2809 13192957 15434292 12167609 6692777 4895202 6594576 7044102 4956987 3635689
2801 3635689 4960146 7223996 8911012 10259789 10654630 8279323 3241095 -1791955
2793 -1791955 -4588901 -4724853 -2322712 1649524 4042024 1902710 -3227648 -6491895
2785 -6491895 -6099377 -5626993 -8529811 -12862040 -13571349 -8756697 -1811662 2236931 1377364
2776 1377364 -2237753 -4994662 -5331891 -4556869 -4509555 -5134042 -4514794 -651508 6755999
2767 6755999 15203318 20081139 18080570 10386394 1225774 -6608486 -12776595 -16257509
2759a6257509J645502P028369R010676P457658M733125J555236j728282k170835
2751A1273940J627912M403644J82677p798912j0587955o310524j440014M78392
2743h170840K230122M269958K713370j552748j779251K955977M742525j16321
2735E292792m955470m729785l742987n132285l571809L342567P196657K340173
2727c960147k751002N56906N296034J112038o019820k892234P436715R248228
2719H026718l39477p118748k611453M951770O090361K304369j719375n420023
2711D164142o875913j698122P129613Q962748O35600p903391q280991m105304
2703g971618j333503J233207N043988N480911O14607k491046J246706N642553
$$ plain form
2759 -16257509 -14612007 -7583638 1427038 8884696 13617821 15173057 13444775 11273940
2751 11273940 12901852 17305496 17488173 9689261 -898694 -7209218 -8649232 -8170840
2743 -8170840 -5940718 -1670760 1042610 -510138 -2289389 666588 5409113 5292792
2735 5292792 337322 -4392463 -8135450 -13267735 -16839544 -13496977 -6300320 -3960147
2727 -3960147 -6711149 -6154243 -858209 253829 -5765991 -8658225 -1221510 8026718
2719 8026718 7687241 568493 -2042960 2908810 8999171 11303540 9584165 4164142
2711 4164142 -2711771 -4409893 2719720 11682468 12318068 4414677 -3866314 -7971618
2703 -7971618 -9305121 -8071914 -3027926 2452985 3067592 576546 1823252 7465805
2695G465805L770824M3252J736999N224802K112838n457422p450976j750440L535099
2686I230781L010966m71457l612044p065973j0353892r784531m087889K904829
2678b0229210P028392P550745N658229K783657O34660j64658r83908k213087j292844
2669a228024K952029O457939M724204n91942m309596m784831l693032j314677
2661a787930K448287M646957L014113J203488L719088P326790N016297k376111
2653B3210979o683047m808929k216509k604206k632906J60045K275547J269078
2645G970052O67087K908864L842997L4504m135306l316487m51004j704151n513649
2636C02907n014426j9010J896827k741303p765865o319308M39447O738071R486889
$$ plain form
2695 7465805 11236629 11279881 13016880 18241682 20354520 14897098 7446122 5695682 9230781
2686 9230781 12241747 11770290 8158246 1092273 -9261619 -19046150 -23134039 -20229210
2678 -20229210 -13200818 -5650073 8156 2791813 3426473 3261815 2277907 64820 -1228024
2669 -1228024 1724005 8181944 12906148 12314206 8004610 3219779 -473253 -1787930
2661 -1787930 660357 5307314 8321427 9524915 13244003 20570793 25587090 23210979
2653 23210979 16527932 11719003 9502494 6898288 4265382 4425427 6700974 7970052
2645 7970052 8637139 11546003 15389000 15423504 11288198 7971711 7520707 5816556 302907
2636 302907 -4711519 -4730529 -2833702 -5575005 -13340870 -19660178 -19220731 -12482660 -2995771
2627b995771Q484480L493318m024319q749795o334328K63331L765157J926112
2619d171815m37339N65545K567534J835538n76668j144240L89022J547885J753393
2610B328855K515032L941153M638063M263414K760009j529481q563181j2820034
2602b466170q732379L33156N155262L539342K690989O475485Q660159L827453
2594A9483297k632445k754689J532270K548385n18611k036482o52151n58367k695621
2585A1715586l233004j341994o24959j684094p66959K504994L323609m2306l018385
2576F832488k606682j945181l557441m265795j048539L431143N574845O260525
2568H675363O987550N380917j56353n275748m966741j256299j80505l194596o701278
$$ plain form
2627 -2995771 5488709 8982027 4957708 -3792087 -10126415 -9863084 -6097927 -4171815
2619 -4171815 -4609154 -4043609 -1476075 359463 -217205 -1361445 -972423 575462 2328855
2610 2328855 4843887 8785040 13423103 17686517 20446526 18917045 10353864 -2466170
2602 -2466170 -11198549 -10865393 -5710131 -2170789 520200 6995685 15655844 19483297
2594 19483297 16850852 14096163 15628433 18176818 17658207 15621725 14969574 14411207 11715586
2585 11715586 8482582 7140588 6515629 4831535 4064576 6569570 9893179 9850873 6832488
2576 6832488 4225806 2280625 -1276816 -5542611 -6591150 -3160007 2414838 8675363
2568 8675363 15662913 21043830 20887477 15611729 10644988 9388689 9208184 6013588 -687690
2559f87690q204720p712464m531438J785916P784384Q588920M491029Q58030R54562
2550C326529K542608K237261p2213k073066j875034N41471K925278K104052k265650
2541G391236n965303m529794J328725O713713P860056M292153k286075p882212
2533F922499p078897J155465R397424Q701885k14402p638257p181291k217603
2525A846823J069111J338642K39800j878000m591310n495582l338747j30168K691574
2516h247857O473658J0480760R438315J176163p078550o772402k37589K401634
2508G634132k187818o727605n180725q32803P12958K08010J583553M522006N435915
2499E167623L316873M3495l420238p076367r389672q417076m710956k97420M002485
$$ plain form
2559 -687690 -8892410 -16604874 -21136312 -19350396 -11566012 -2977092 1513937 2371967 3326529
2550 3326529 5869137 8106398 8034185 5961119 4086085 4627556 7552834 9656886 7391236
2541 7391236 1425933 -3103861 -1775136 4938577 12798633 17090786 14804711 6922499
2533 6922499 -156398 999067 10396491 19098376 18883974 11245717 4064426 1846823
2525 1846823 2915934 4254576 4494376 2616376 -1974934 -7470516 -10809263 -10939431 -8247857
2516 -8247857 -1774199 8706561 18144876 19321039 12242489 5470087 5232498 7634132
2508 7634132 5446314 -1281291 -6462016 -7294819 -6581861 -6373851 -4790298 -268292 5167623
2499 5167623 8484496 8527991 5107753 -1968614 -11358286 -19775362 -24486318 -24783738 -20781253
2490b0781253P552883Q183203N070071J605925J249042J905641q83153o140825
2482b238466q226622n402570k068259j482776j661396k22329J853375L577429
2474a5871614O118203Q861203Q131602L199027j008741j016866j84968k528236
2466E699610n515116m591323j307763n27675j888230o62319M088643Q465617J0056924
2457A3818368R262204N110527l357461j1311270j1049715k632520M748488M509709
2449I098330P9119k102376j225149r6694M70978Q86851K44216j299367r75594
2440E080314J795955K479417k185542p806241p420887r60752N408069P931934
2432D322267P911814O339482J741532n292477j0234629r850444o263618l357828
$$ plain form
2490 -20781253 -13228370 -5045167 24904 1630829 2879871 4785512 3902359 -2238466
2482 -2238466 -10465088 -15867658 -17935917 -19418693 -21080089 -21302418 -19449043 -15871614
2474 -15871614 -9753411 -892208 7239394 10438421 9429680 8412814 8227846 5699610
2466 5699610 184494 -4406829 -5714592 -6242267 -8130497 -8792816 -4704173 3761444 13818368
2457 13818368 23080572 28191099 24833638 13522368 2472653 -159867 4588621 9098330
2449 9098330 9177449 7075073 5849924 5753230 6224208 7111059 7355275 6055908 5080314
2440 5080314 6876269 9355686 7170144 -636097 -8056984 -9017736 -3609667 4322267
2432 4322267 12234081 18573563 20315095 15022618 4787989 -5062455 -11326073 -14683901
2424a4683901j445959J640590N422400O042580J439570m960050p569523m790634
2416a8904927J67358M178550O904736P850859M756547j813901n732377k514077
2408e107232K676551Q79662o992788r912423k298322P607079R259123L318798
2400e69552k157172l780915l935143l326777l63884L227379L389024N42203o24130
2391g598967J368787L080273K587412K183051L358975M055289K630722L99915
2383A2065457j239438k335272k146683J91487J899226j162479o664726o313119
2375e705547K408318J0729040R736305K149988l112517m131564o010715r620306
2367c556998r110146k148420M881829N607402K165588O29716K005853K873939
$$ plain form
2424 -14683901 -16129860 -14489270 -9066870 -3024290 -1584720 -6544770 -14114293 -18904927
2416 -18904927 -18737569 -14559019 -7654283 196576 4953123 3139222 -2593155 -5107232
2408 -5107232 -2430681 -1551019 -8543807 -18456230 -20754552 -13147473 -3888350 -569552
2400 -569552 -2726724 -6507639 -10442782 -13769559 -14133443 -10906064 -7517040 -6974837 -7598967
2391 -7598967 -6230180 -3149907 -562495 1620556 4979531 9034820 11665542 12065457
2383 12065457 10826019 8490747 6344064 6535551 8434777 7272298 607572 -5705547
2375 -5705547 -3297229 7431811 17168116 19318104 16205587 12074023 6063308 -3556998
2367 -3556998 -12667144 -14815564 -9933735 -4326333 -2160745 -1531029 474824 3348763
$$ [...]
##END NTUPLES=NMR SPECTRUM
##END=
