##TITLE=31Pdec_LR-789-B-C2-OF
 CDCl3, 24 sc
 3.12.2024
##JCAMPDX= 6.0         $$ Bruker NMR JCAMP-DX V2.0
##DATA TYPE= NMR SPECTRUM
##DATA CLASS= NTUPLES
##ORIGIN= UXNMR, Bruker Analytische Messtechnik GmbH
##OWNER= root
$$ XWIN-NMR		Version 3.5
$$ Tue Dec  3 16:20:03 2024 Russian Standard Time (UT+4h)  she@DPX200
##.OBSERVE FREQUENCY= 81.013821
##.OBSERVE NUCLEUS= ^31P
##.ACQUISITION MODE= SIMULTANEOUS
##.ACQUISITION SCHEME= undefined
##.AVERAGES= 24
##.DIGITISER RES= 17
##SPECTROMETER/DATA SYSTEM= spect
##.PULSE SEQUENCE= zgpg30
##.SOLVENT NAME= CDCl3
##.SHIFT REFERENCE= (INTERNAL, CDCl3, 0, 198.062)
##AUDIT TRAIL= $$ (NUMBER, WHEN, WHO, WHERE, WHAT)
$$ ##TITLE= Audit trail, XWIN-NMR		Version 3.5
$$ ##JCAMPDX= 5.01
$$ ##ORIGIN= Bruker BioSpin GmbH
$$ ##OWNER= she
$$ F:/spectra/data/she/nmr/P31/2/pdata/1/auditp.txt
$$ ##AUDIT TRAIL=  $$ (NUMBER, WHEN, WHO, WHERE, WHAT)
(   1,<2024-12-03 16:19:05.42 +0400>,<she>,<DPX200>,
      <created by zg, POWCHK disabled, PULCHK disabled
       configuration hash MD5:
       00 E9 B6 7A A2 85 ED C7 34 08 36 98 17 FE 4E 26
       data hash MD5: 32K
       65 B2 FA 4B 47 AA EB F7 3D 44 07 FF BB 16 1E 2B>)
(   2,<2024-12-03 16:19:07.71 +0400>,<she>,<DPX200>,
      <Start of raw data processing
       efp BC_mod = 2 LB = 1.5 FT_mod = 6 PKNL = 1 PHC0 = 2211.602 PHC1 = 244.6883 SI = 64K 
       data hash MD5: 64K
       6D 55 84 07 CA 60 FA CC F1 05 F1 DC BF CF 59 7B>)
(   3,<2024-12-03 16:19:27.62 +0400>,<she>,<DPX200>,
      <pk PHC0 = 42.61275 PHC1 = -111 
       data hash MD5: 64K
       D4 B8 0E A8 A1 09 59 41 EE 04 4E EC 27 37 6D 06>)
$$ ##END=
$$ 
$$ hash MD5
$$ 18 1A 3E FC 4A CF 96 01 22 CA 12 D3 7A AD 39 58
##$RELAX= 
##$RELAX= 
##$RELAX= 
##$RELAX= 
##$RELAX= 
##$RELAX= 
##$RELAX= 
##$RELAX= 
$$ Bruker specific parameters
$$ --------------------------
##$DU= <F:/spectra>
##$EXPNO= 2
##$NAME= <P31>
##$PROCNO= 1
##$TYPE= <nmr>
##$USER= <she>
##$AMP= (0..31)
100 100 100 100 100 100 100 100 100 100 100 100 100 100 100 100 100 100 
100 100 100 100 100 100 100 100 100 100 100 100 100 100 
##$AQSEQ= 0
##$AQ_mod= 1
##$AUNM= <au_zg>
##$AUTOPOS= <>
##$BF1= 81.014009
##$BF2= 200.13
##$BF3= 200.13
##$BF4= 200.13
##$BF5= 200.13
##$BF6= 200.13
##$BF7= 200.13
##$BF8= 200.13
##$BYTORDA= 1
##$CFDGTYP= 0
##$CFRGTYP= 5
##$CHEMSTR= <none>
##$CNST= (0..31)
1 1 145 1 1 1 1 1 1 1 1 1 1 1 1 1 1 1 1 1 1 1 1 1 1 1 1 1 1 1 1 1 
##$CPDPRG= <waltz16>
##$CPDPRG1= <>
##$CPDPRG2= <waltz16>
##$CPDPRG3= <>
##$CPDPRG4= <mlev>
##$CPDPRG5= <mlev>
##$CPDPRG6= <mlev>
##$CPDPRG7= <mlev>
##$CPDPRG8= <mlev>
##$CPDPRGB= <>
##$CPDPRGT= <>
##$D= (0..31)
0 1 0 0 0 0 0 0 0 0.06 0 0.03 2e-05 3e-06 0 0 0.0002 0 0 0 0 0 0 0 0 0 
0 0 0 0 0 0 
##$DATE= 1733228344
##$DBL= (0..7)
120 120 120 11 120 120 24 19 
##$DBP= (0..7)
150 150 150 150 150 150 150 150 
##$DBP07= 0
##$DBPNAM0= <>
##$DBPNAM1= <>
##$DBPNAM2= <>
##$DBPNAM3= <>
##$DBPNAM4= <>
##$DBPNAM5= <>
##$DBPNAM6= <>
##$DBPNAM7= <>
##$DBPOAL= (0..7)
0.5 0.5 0.5 0.5 0.5 0.5 0.5 0.5 
##$DBPOFFS= (0..7)
$$ [...]
##$SUBNAM3= <"">
##$SUBNAM4= <"">
##$SUBNAM5= <"">
##$SUBNAM6= <"">
##$SUBNAM7= <"">
##$SUBNAM8= <"">
##$SUBNAM9= <"">
##$SW= 400.765351723535
##$SWIBOX= (0..15)
0 1 3 0 0 0 0 0 0 0 0 0 0 0 0 0 
##$SW_h= 32467.5324675325
##$TD= 32768
##$TD0= 1
##$TE= 0
##$TE2= 300
##$TE3= 300
##$TEG= 300
##$TL= (0..7)
0 120 53 12 22 120 120 120 
##$TP= (0..7)
150 150 150 150 150 150 150 150 
##$TP07= 0
##$TPNAME0= <>
##$TPNAME1= <>
##$TPNAME2= <>
##$TPNAME3= <>
##$TPNAME4= <>
##$TPNAME5= <>
##$TPNAME6= <>
##$TPNAME7= <>
##$TPOAL= (0..7)
0.5 0.5 0.5 0.5 0.5 0.5 0.5 0.5 
##$TPOFFS= (0..7)
0 0 0 0 0 0 0 0 
##$TUNHIN= 0
##$TUNHOUT= 0
##$TUNXOUT= 0
##$USERA1= <user>
##$USERA2= <user>
##$USERA3= <user>
##$USERA4= <user>
##$USERA5= <user>
##$V9= 5
##$VALIST= <valist>
##$VCLIST= <CCCCCCCCCCCCCCC>
##$VD= 0
##$VDLIST= <DDDDDDDDDDDDDDD>
##$VPLIST= <PPPPPPPPPPPPPPP>
##$VTLIST= <TTTTTTTTTTTTTTT>
##$WBST= 1024
##$WBSW= 4
##$XGAIN= (0..3)
0 0 0 0 
##$XL= 0
##$YL= 0
##$YMAX_a= 3059
##$YMIN_a= -3265
##$ZGOPTNS= <>
##$ZL1= 120
##$ZL2= 120
##$ZL3= 120
##$ZL4= 120
##$ABSF1= 0
##$ABSF2= 0
##$ABSG= 0
##$ABSL= 0
##$ALPHA= 0
##$AQORDER= 0
##$ASSFAC= 0
##$ASSFACI= 0
##$ASSFACX= 0
##$ASSWID= 0
##$AUNMP= <proc_1d>
##$AZFE= 0.1
##$AZFW= 0.5
##$BCFW= 0
##$BC_mod= 2
##$BYTORDP= 0
##$COROFFS= 0
##$CY= -3
##$DATMOD= 1
##$DC= 0
##$DFILT= <>
##$DTYPP= 0
##$F1P= 0
##$F2P= 0
##$FCOR= 1
##$FTSIZE= 65536
##$FT_mod= 6
##$GAMMA= 0
##$GB= 0
##$INTBC= 1
##$INTSCL= 9.790993e-09
##$ISEN= 30
##$LB= 1.5
##$LEV0= 0
##$LPBIN= 0
##$MAXI= 10000
##$MC2= 0
##$MEAN= 0
##$ME_mod= 0
##$MI= 50
##$NCOEF= 0
##$NC_proc= -10
##$NLEV= 6
##$NOISF1= 182.463
##$NOISF2= 159.3651
##$NSP= 0
##$NTH_PI= 0
##$NZP= 0
##$OFFSET= 198.0616
##$PC= 4
##$PHC0= 2254.215
##$PHC1= 133.6883
##$PH_mod= 1
##$PKNL= yes
##$PPARMOD= 0
##$PSCAL= 0
##$PSIGN= 0
##$REVERSE= no
##$SF= 81.0140089999434
##$SI= 65536
##$SIGF1= 159.3651
##$SIGF2= -187.1042
##$SINO= 113.3802
##$SIOLD= 16384
##$SREGLST= <1H.CDCl3>
##$SSB= 0
##$STSI= 65536
##$STSR= 0
##$SW_p= 32467.5324675325
##$SYMM= 0
##$S_DEV= 0
##$TDeff= 32768
##$TDoff= 0
##$TI= <>
##$TILT= no
##$TM1= 0
##$TM2= 0
##$TOPLEV= 0
##$USERP1= <user>
##$USERP2= <user>
##$USERP3= <user>
##$USERP4= <user>
##$USERP5= <user>
##$WDW= 1
##$XDIM= 65536
##$YMAX_p= 262383033
##$YMIN_p= -138413049
$$ End of Bruker specific parameters
$$ ---------------------------------
##NTUPLES= NMR SPECTRUM
##VAR_NAME=  FREQUENCY,     SPECTRUM/REAL,   SPECTRUM/IMAG
##SYMBOL=    X,             R,               I
##VAR_TYPE=  INDEPENDENT,   DEPENDENT,       DEPENDENT
##VAR_FORM=  AFFN,          ASDF,            ASDF
##VAR_DIM=   65536,         65536,           65536
##UNITS=     HZ,            ARBITRARY UNITS, ARBITRARY UNITS
##FACTOR=    0.49542278885378, 1,            1
##FIRST=     16045.7642231865, 0,            0
##LAST=      -16421.768244346, 0,            0
##MIN=       -16421.768244346, -138413049,   0
##MAX=       16045.7642231865, 262383033,    0
$$ Real data points
##PAGE= N=1
##DATA TABLE= (X++(R..R)), XYDATA
$$ [...]
##PAGE= N=2
##DATA TABLE= (X++(I..I)), XYDATA
$$ plain form
6579 15384594 9213215 -3157856 -15944273 -20686740 -16833192 -11216318 -7999642 -5091402
6571 -5091402 -493143 3530878 4156351 1959664 -358197 -748489 1404165 5298889 9181375
6562 9181375 11964516 13620431 13026785 7920457 -564944 -6074960 -3730339 3033141
6554 3033141 6438834 3904189 -635410 -3624126 -4990551 -4874048 -2907967 -1472867
6546 -1472867 -4133410 -9149493 -9741636 -3364747 3928246 5509876 2411915 -106594
6538 -106594 -375408 14813 1555125 6199484 12143106 14233757 10216993 2947616 -3989281
6529 -3989281 -9290522 -12083397 -11187644 -8074986 -7056820 -9755247 -11979948 -9296502
6521 -9296502 -3686848 -700395 -999511 429648 5824832 10327201 9111460 4926875
$$ packed form
6579A5384594o171379j2371071j2786417m742467L853548N616874L216676K908240
6571e091402M598259M024021O25473k196687k317861l90292K152654L894724L882486
6562I181375K783141J655915n93646n106328q485401n510016K344621O763480
6554C033141L405693k534645m539599k988716j366425J16503J966081J435100
6546a472867k660543n016083n92143O376889P292993J581630l097961k518509
6538a06594k68814L90221J540312M644359N943622K090651m016764p269377o936897
6529c989281n301241k792875Q95753L112658J018166k698427k224701K683446
6521i296502N609654K986453k99116J429159N395184M502369j215741m184585
$$ plain form
6513 4926875 3697925 4822933 2226711 -4321244 -5660549 4739342 19611847 24854501
6505 24854501 16336413 3871329 -2142630 -2262767 -3353549 -7109576 -8348886 -3100620
6497 -3100620 6437985 15216920 19666600 17841543 9277312 -2511870 -10044395 -8386458
6489 -8386458 -1437592 1510756 -3599531 -10798660 -11371677 -4077357 4125782 6736370
6481 6736370 4471173 2714883 4319858 6935070 6990865 4280657 1626927 1088646 1863238
6472 1863238 1570957 -1743088 -8517362 -16303530 -19059058 -11264482 4252601 15133989
6464 15133989 11144487 -3171915 -12672763 -9797194 -3115595 -4433078 -12613777 -16244788
6456 -16244788 -9382313 2488273 11654334 16288314 17767756 16142711 11999006 9041779
$$ packed form
6513D926875j228950J125008k596222o547955j339305J0399891J4872505N242654
6505B4854501q518088j2465084o013959j20137j090782l756027j239310N248266
6497c100620R538605Q778935M449680j825057q564231j1789182p532525J657937
6489h386458O948866K948348n110287p199129n73017P294320Q203139K610588
6481F736370k265197j756290J604975K615212N5795k710208k653730n38281P74592
6472A863238k92281l314045o774274p786168k755528P794576J5517083J0881388
6464A5133989l989502j4316402r500848K875569O681599j317483q180699l631011
6456a6244788O862475J1870586R166061M633980J479442j625045m143705k957227
$$ plain form
6448 9041779 11011150 17548109 24839151 28444300 24983208 14728421 3982282 543611
6440 543611 4165442 5743357 -569899 -8802880 -9487848 -2696654 3426615 4526225 3202481
6431 3202481 1348294 -2696693 -7998599 -9632546 -6943590 -6808005 -13347285 -18996281
6423 -18996281 -12670951 4645192 18882889 18553678 6817259 -4219577 -7801517 -7694267
6415 -7694267 -10455168 -16512568 -20495702 -18273297 -11070356 -3058059 2452948 3686002
6407 3686002 -61331 -7349443 -14459802 -18454657 -19462642 -18263939 -13499836 -4452858
6399 -4452858 4702895 7935714 5295162 3750114 8287234 15513187 18613282 15933174
6391 15933174 11211993 6692865 -76642 -11636335 -25085053 -33073412 -30546672 -20033535
$$ packed form
6448I041779J969371O536959P291042L605149l461092j0254787j0746139l438671
6440E43611L621831J577915o313256q232981o84968O791194O123269J099610j323744
6431C202481j854187m044987n301906j633947K688956J35585o539280n648996
6423a8996281O325330J7316143J4237697l29211j1736419j1036836l581940J07250
6415g694267k760901o057400l983134K222405P202941Q012297N511007J233054
6407C686002l747333p288112p110359l994855j007985J198703M764103R046978
6399d452858R155753L232819k640552j545048M537120P225953L100095k680108
6391A5933174m721181m519128o769507j1559693j3448718p988359K526740J0513137
$$ plain form
6383 -20033535 -9592302 -5237976 -6302187 -9012333 -12774581 -19933502 -29868227 -37416091
6375 -37416091 -38925353 -36861164 -35777296 -35688381 -32472658 -24108606 -13741220 -6195104
6367 -6195104 -3171243 -2482858 -1165389 1242226 2637900 1635678 71693 912691 4198510
6358 4198510 7132342 8076733 7802277 6461127 2823366 -1915303 -3132680 1473864 7685966
6349 7685966 9478415 5975583 700918 -3797510 -6603407 -5617217 764005 9259340
6341 9259340 13610436 11638191 6678868 1585888 -4410551 -11656310 -17278112 -18998534
6333 -18998534 -18646519 -19267969 -21039518 -22371075 -23100894 -24288703 -26039511 -26948113 -24532401
6324 -24532401 -16145691 -2336445 10296904 14070638 10143638 8768960 16035114 25056979
$$ packed form
6383b0033535J0441233M354326j064211k710146l762248p158921r934725p547864
6375c7416091j509262K064189J083868Q8915L215723Q364052J0367386P546116
6367f195104L023861O88385J317469K407615J395674j002222j563985Q40998L285819
6358D198510K933832R44391k74456j341150l637761m738669j217377M606544O212102
6349G685966J792449l502832n274665m498428k805897R86190O381222Q495335
6341I259340M351096j972245m959323n092980n996439p245759n621802j720422
6333a8998534L52015o21450j771549j331557p29819j187809j750808r08602K415712
6324b4532401Q386710J3809246J2633349L773734l927000j374678P266154R021865
$$ plain form
6316 25056979 25801161 19636201 16519668 19680744 21987004 18519148 13990913 13678315
6308 13678315 14094401 8874979 -313025 -5259493 -1993487 5039765 8841042 5923636
6300 5923636 -2472501 -11078375 -13054071 -6049093 3746730 7148270 2119282 -4823767
6292 -4823767 -7721787 -7909355 -10177986 -15543522 -20403989 -21315888 -18760974 -16903215 -19933155
6283 -19933155 -26995865 -30827354 -24514012 -10659398 -457828 -1445219 -9158400 -13808231
6275 -13808231 -12137728 -8060009 -3386181 5593171 20267329 33221632 34115199 21275400
6267 21275400 4425495 -4759429 -3394981 1613212 1702315 -5623370 -16310000 -24345021
6259 -24345021 -25677324 -20116541 -12688035 -12065810 -22849269 -37763574 -41950671 -28920848
$$ packed form
6316B5056979P44182o164960l116533L161076K306260l467856m528235l12598
6308A3678315M16086n219422r188004m946468L266006P033252L801277k917406
6300E923636q396137q605874j975696P004978R795823L401540n028988o943049
6292d823767k898020j87568k268631n365536m860467r11899K554914J857759l029940
6283a9933155p062710l831489O313342J3854614J0201570r87391p713181m649831
6275a3808231J670503M077719M673828Q979352J4674158J2954303Q93567j2839799
6267B1275400j6849905r184924J364448N008193Q9103p325685j0686630q035021
6259b4345021j332303N560783P428506O22225j0783459j4914305m187097J3029823
$$ plain form
6251 -28920848 -9648175 -1167027 -7145733 -14681518 -10951310 1741519 10088103 5641048
6243 5641048 -7184414 -18045528 -22052585 -22636613 -24529954 -26656997 -23898273 -15037779
6235 -15037779 -5778727 -2359174 -4696670 -8410476 -11482614 -15080141 -18789520 -19621742
6227 -19621742 -16444545 -11425411 -5831133 1583979 9783939 13044515 7544953 -1577111
6219 -1577111 -4390446 2260726 10856955 12411245 7257235 4099478 8816908 17108739
6211 17108739 20152086 15715244 9799795 6908437 3529689 -5299122 -16854864 -23881579
6203 -23881579 -25037521 -25375721 -26030574 -20751612 -6078154 10789909 19358648 17825838
6195 17825838 13019735 10455998 9043346 5121612 -1868368 -8504985 -11056780 -10266626
$$ packed form
6251b8920848J9272673Q481148n978706p535785L730208J2692829Q346584m447055
6243E641048j2825462j0861114m007057n84028j893341k127043K758724Q860494
6235a5037779R259052L419553k337496l713806l072138l597527l709379q32222
6227a9621742L177197N019134N594278P415112Q199960L260576n499562r122064
6219a577111k813335O651172Q596229J554290n154010l157757M717430Q291831
6211A7108739L043347m436842n915449k891358l378748q828811j1555742p026715
6203b3881579j155942l38200o54853N278962J4673458J6868063Q568739j532810
6195A7825838m806103k563737j412652l921734o989980o636617k551795P90154
$$ plain form
6187 -10266626 -11837754 -19362073 -27052232 -24610726 -11183656 1087477 1074709 -8979373
6179 -8979373 -19698757 -27456693 -33932824 -37323136 -33522491 -25105421 -20370973 -22475815
6171 -22475815 -26693554 -29305936 -31717634 -33919488 -31476673 -22719969 -12976236 -7655239
6163 -7655239 -5809118 -3975545 -1738698 271194 3536457 8549787 12027958 11310000
6155 11310000 8613810 7166632 5983305 2377485 -2939666 -7260187 -10129652 -12214904
6147 -12214904 -11956183 -7742293 -2347723 -1009475 -5015517 -10153030 -11719381 -9178911
6139 -9178911 -5932111 -5469660 -7238383 -6498715 -182759 7821086 10930270 8929655 7121623
6130 7121623 5868008 -1227236 -15369755 -27071906 -28770811 -25672099 -26062005 -27375188
$$ packed form
6187a0266626j571128p524319p690159K441506J3427070J2271133j2768j0054082
6179h979373j0719384p757936o476131l390312L800645Q417070M734448k104842
6171b2475815m217739k612382k411698k201854K442815Q756704R743733N320997
6163g655239J846121J833573K236847K009892L265263N013330L478171p17958
6155A1310000k696190j447178j183327l605820n317151m320521k869465k085252
6147a2214904K58721M213890N394570J338248m006042n137513j566351K540470
6139i178911L246800M62451j768723P39668O315956Q003845L109184k000615j808032
6130G121623j253615p095244j4142519j1702151j698905L098712l89906j313183
$$ plain form
6122 -27375188 -22056578 -12380514 -7520871 -8329143 -7468795 -4042149 -4811821 -9190012 -6956408
6113 -6956408 3944143 10254669 2223183 -10940664 -14214568 -7193036 -661475 1060372
6105 1060372 2450066 4658746 3085004 -2540193 -5540325 -2049654 3737656 6221904
6097 6221904 4864323 2645277 2875322 8096345 16971227 21798646 15100921 213993
6089 213993 -10580776 -10932061 -7714499 -9877785 -15491989 -15828765 -9221935 -3695218 -5198314
6080 -5198314 -9229656 -7866667 -2061962 -1655625 -12204718 -26088785 -30623997 -23129130
6072 -23129130 -12881112 -8058394 -6731159 -3403003 1483162 4109248 5372632 9601668
6064 9601668 16824449 22723500 25707270 27986371 29847999 29121439 26560517 24962014
$$ packed form
6122b7375188N318610R676064M859643q08272Q60348L426646p69672m378191K233604
6113f956408J0900551O310526q031486j3163847l273904P021532O531561J721847
6105A060372J389694K208680j573742n625197l000132L490671N787310K484248
6097F221904j357581k219046K30045N221023Q874882M827419o697725j4886928
6089B13993j0794769l51285L217562k163286n614204l36776O606830N526717j503096
6080e198314m031342J362989N804705M06337j0549093j3884067m535212P494867
6072b3129130J0248018M822718J327235L328156M886165K626086J263384M229036
6064I601668P222781N899051K983770K279101J861628p26560k560922j598503
$$ plain form
6056 24962014 21936162 11214976 -5934761 -18062872 -17270604 -9746216 -6851148 -10267153
6048 -10267153 -12308248 -7792894 993943 9595779 15538028 17492709 15432995 12212013
6040 12212013 11373584 13076405 14811275 15481214 15849998 15845642 14836337 14269331 16760036
6031 16760036 22080586 26172144 24554731 16165159 5066378 -1322489 1241005 7790077
6023 7790077 8685908 2170457 -3142597 -1938569 -1231525 -8532887 -17685395 -17623523 -11388794
6014 -11388794 -12733142 -23558765 -29114109 -20285284 -7661200 -5320920 -11093214 -13157979
6006 -13157979 -8550971 -3554595 -449684 4013911 8468394 6659312 -1340395 -7073354
5998 -7073354 -5598795 -1846936 -1800190 -3919529 -3743780 -2085216 -3430902 -8643390 -13858116
$$ packed form
6056B4962014l025852j0721186j7149737j2128111P92268P524388K895068l416005
6048a0267153k041095M515354Q786837Q601836N942249J954681k059714l220982
6040A2212013q38429J702821J734870O69939L68784m356j009305n67006K490705
6031A6760036N320550M091558j617413q389572j1098781o388867K563494O549072
6023G790077Q95831o515451n313054J204028P07044p301362r152508O1872O234729
6014a1388794j344348j0825623n555344Q828825J2624084K340280n772294k064765
6006a3157979M607008M996376L104911M463595M454483j809082p999707n732959
5998g073354J474559L751859M6746k119339J75749J658564j345686n212488n214726
$$ plain form
5989 -13858116 -16115328 -16770921 -18493332 -20439995 -18034628 -8542259 3768588 10724412
5981 10724412 9644967 6420449 6574576 7094054 2469759 -3826995 -1754754 10596522
5973 10596522 22122693 21965056 12144297 2814155 -437658 923594 5492431 14423287
5965 14423287 25724921 31115306 22537719 1654870 -19078452 -26533065 -18789672 -5924832
5957 -5924832 1887738 4823455 9281394 16058716 18776261 14283481 7730009 4228453
5949 4228453 1508740 -4192542 -9677092 -8639043 -1461570 5116401 7124773 6594780
5941 6594780 6101977 5391908 3863859 1991132 -210337 -2556710 -3057612 -811709 893626
5932 893626 -318129 637279 10155196 23340651 26809756 16743114 4835924 1303564
$$ packed form
5989a3858116k257212o55593j722411j946663K405367R492369J2310847O955824
5981A0724412j079445l224518J54127N19478m624295o296754K072241J2351276
5973A0596522J1526171j57637r820759r330142l251813J361252M568837Q930856
5965A4423287J1301634N390385q577587k0882849k0733322p454613P743393J2864840
5957e924832P812570K935717M457939O777322K717545m492780o553472l501556
5949D228453k719713n701282n484550J038049P177473O577971K008372n29993
5941F594780m92803p10069j528049j872727k201469k346373n00902K245903J705335
5932H93626j211755R55408R517917J3185455L469105j0066642j1907190l532360
$$ plain form
5924 1303564 1161411 -4799059 -13475830 -14743345 -8277563 -3127265 -2493999 -983293 2681852
5915 2681852 2486914 -2131858 -1750802 8848721 20980911 23590793 17421514 10542865
5907 10542865 6103348 2587315 972190 2424289 2281708 -4192855 -11879062 -11196043
5899 -11196043 -3270951 -281519 -8820598 -21154457 -25965783 -20775415 -10429701 112564
5891 112564 7073588 7397402 2332774 -1581235 766875 7504146 13481544 16552095 17459913
5882 17459913 16590396 14038658 10759812 7268006 3219863 -405475 -1661555 -1159284
5874 -1159284 -1360713 -1593060 751809 2681915 -3144103 -15690764 -22169111 -14495432
5866 -14495432 -2609104 -2335820 -14217695 -23967034 -21515178 -10078373 2436905 11180133
$$ packed form
5924A303564j42153n960470q676771j267515O465782N150298O33266J510706L665145
5915B681852j94938m618772L81056J0599523J2132190K609882o169279o878649
5907A0542865m439517l516033j615125J452099j42581o474563p686207O83019
5899a1196043P925092K989432q539079j2333859m811326N190368J0345714J0542265
5891A12564O961024L23814n064628l914009K348110O737271N977398L070551R07818
5882A7459913q69517k551738l278846l491806m048143l625338j256080N02271
5874a159284k01429k32347K344869J930106n826018j2546661o478347P673679
5866a4495432J1886328K73284j1881875r749339K451856J1436805J2515278Q743228
$$ plain form
5858 11180133 13072419 7233219 -1083577 -4522481 -3361525 -4123934 -7547565 -6612061
5850 -6612061 1041985 7869746 7997567 5713811 6616861 7625809 3024660 -4974708 -9264319
5841 -9264319 -7804977 -3661613 1939053 9526238 16176992 17461080 14651793 14341566
5833 14341566 19935602 27470138 30644816 27240276 20232288 14391050 11467186 7928219
5825 7928219 -635965 -12042081 -18139716 -15190255 -9337000 -7806537 -8748107 -5462877
5817 -5462877 2054686 6527361 3885188 -1460883 -2691102 2240692 10218702 16533966
5809 16533966 18447969 17577399 18266531 21596192 22873019 17980448 9859475 4653202
5801 4653202 3510377 2968317 1823256 2284145 5094970 8627920 12276537 15837775 16369784
$$ packed form
5858A1180133J892286n839200q316796l438904J160956p62409l423631R35504
5850f612061P654046O827761J27821k283756R03050J008948m601149p999368m289611
5841i264319J459342M143364N600666P587185O650754J284088k809287l10227
5833A4341566N594036P534536L174678l404540p007988n841238k923864l538967
5825G928219q564184j1406116o097635K949461N853255J530463r41570L285230
5817e462877P517563M472675k642173n346071j230219M931794P978010O315264
5809A6533966J914003q70570O89132L329661J276827m892571q120973n206273
5801D653202j142825n42060j145061M60889K810825L532950L648617L561238N32009
$$ plain form
5792 16369784 11116313 3001498 -2304334 -3912076 -4162845 -1162404 8407359 18886182
5784 18886182 18523987 6239232 -4361537 -3523489 899493 -3851984 -16141556 -23259581
5776 -23259581 -19808969 -12335064 -6914965 -2020748 4839193 11404958 14502987 14024342
5768 14024342 10692980 4758533 -729449 -181724 7451313 15261341 15836149 10155313
5760 10155313 5674160 6696372 9872865 9280604 3526742 -3050282 -5105540 -1454116
5752 -1454116 4215206 7385021 6995939 5250705 3792310 1755810 -1769580 -4857177
5744 -4857177 -3986246 2038570 10559749 17583254 21139827 22162316 22667264 23106245 21265932
5735 21265932 14585567 4561070 -2348660 -761147 6849595 12606535 13041892 12102994
$$ packed form
5792A6369784n253471q114815n305832j607742k50769L000441R569763J0478823
5784A8886182l62195j2284755j0600769Q38048M422982m751477j2289572p118025
5776b3259581L450612P473905N420099M894217O859941O565765L098029m78645
5768A4024342l331362n934447n487982N47725P633037P810028N74808n680836
5760A0155313m481153J022212L176493n92261n753862o577024k055258L651424
5752a454116N669322L169815l89082j745234j458395k036500l525390l087597
5744d857177Q70931O024816Q521179P023505L556573J022489N04948M38981j840313
5735B1265932o680365j0024497o909730J587513P610742N756940M35357r38898
$$ plain form
5727 12102994 12204410 8135008 -3844303 -15084490 -12428744 3160751 15894667 15876774
5719 15876774 10642719 10461128 11794796 5007791 -8032335 -15609685 -12738754 -5490246
5711 -5490246 192038 3899156 5095397 2334666 -414188 3656884 13021816 18424205
5703 18424205 16942083 15283864 15622663 9754005 -5797466 -19466185 -19164298 -9314556
5695 -9314556 -3006198 -3119768 -2309689 2235001 5506205 4704858 2338619 -434532 -4544439
5686 -4544439 -7150959 -3731758 3557423 7892579 8615051 11428080 16837570 17954907
5678 17954907 12651761 8512094 10743755 13300849 8591631 -238204 -4293582 -2420605
5670 -2420605 -2217166 -8760957 -18324615 -23596865 -21117319 -13141016 -5043014 -1423222
$$ packed form
5727A2102994J01416m069402j1979311j1240187K655746J5589495J2733916j7893
5719A5876774n234055j81591J333668o787005j3040126p577350K870931P248508
5711e490246N682284L707118J196241k760731k748854M071072R364932N402389
5703A8424205j482122j658219L38799n868658j5551471j3668719L01887R849742
5695i314556O308358j13570Q10079M544690L271204q01347k366239k773151m109907
5686d544439k606520L419201P289181M335156P22472K813029N409490J117337
5678A7954907n303146m139667K231661K557094m709218q829835m055378J872977
5670b420605K03439o543791r563658n272250K479546P976303Q098002L619792
$$ plain form
5662 -1423222 -2997767 -6716573 -9069048 -8721902 -6495561 -4654673 -5708352 -9030881
5654 -9030881 -9076307 -1164222 10340095 14689712 7949080 -1153380 -2108299 4627017 10283869
5645 10283869 10238067 8442336 10326839 15902906 20449761 19319988 12035358 3436918
5637 3436918 -202879 1933031 4013545 1682060 -1259420 1491884 8348186 10930817
5629 10930817 5731139 -1211514 -3325261 -1951413 -2115602 -3967426 -3699153 -1184821
5621 -1184821 -1094125 -5771193 -11589787 -14442508 -15403415 -17830472 -20824389 -19147714 -9518015
5612 -9518015 5426804 19277191 25911286 22401065 11574537 2026646 1329545 7144929
5604 7144929 8585336 -913526 -15397839 -24449938 -26051763 -26399928 -29196753 -31499525
$$ packed form
5662a423222j574545l718806k352475L47146K226341J840888j053679l322529
5654i030881m5426P912085J1504317M349617o740632r102460r54919O735316N656852
5645A0283869m5802j795731J884503N576067M546855j129773p284630q598440
5637C436918l639797K135910K080514k331485k941480K751304O856302K582631
5629A0930817n199678o942653k113747J373848j64189j851824K68273K514332
5621a184821R0696m677068n818594k852721r60907k427057k993917J676675R629699
5612i518015J4944819J3850387O634095l510221j0826528r547891o97101N815384
5604G144929J440407r498862j4484313r052099j601825l48165k796825k302772
$$ plain form
5596 -31499525 -30187882 -26479654 -22373945 -17607437 -12522693 -9907241 -11122139 -13165674
5588 -13165674 -12023521 -7039654 -564208 4736574 7537498 9171796 13113131 19691375
5580 19691375 21976587 12437338 -5686251 -20112413 -24450921 -24229470 -24992847 -23124763
5572 -23124763 -14949678 -6875064 -6641514 -9675079 -5231128 6322189 13524195 10806282
5564 10806282 4750475 2274308 3091674 6303864 13535199 20857099 18247076 4549598
5556 4549598 -5897716 -928088 11877878 15871597 8966171 4461987 9562874 15802139
5548 15802139 14091981 8435961 7782680 11368978 10703875 3307709 -3494718 -3152514 1667938
5539 1667938 3864634 1439515 -1505212 -1960307 -1990024 -4223140 -6819297 -6500654 -4934892
$$ packed form
5596c1499525J311643L708228M105709M766508N084744K615452j214898k043535
5588a3165674J142153M983867O475446N300782K800924J634298L941335O578244
5580A9691375K285212r539249j8123589j4426162m338508K21451p63377J868084
5572b3124763Q175085Q074614K33550l033565M443951J1553317P202006k717913
5564A0806282o055807k476167Q17366L212190P231335P321900k610023j3697478
5556D549598j0447314M969628J2805966L993719o905426m504184N100887O239265
5548A5802139j710158n656020o53281L586298o65103p396166o802427L42204M820452
5539A667938K196696k425119k944727m55095k9717k233116k596157L18643J565762
$$ plain form
5530 -4934892 -7175347 -13072214 -15304579 -8802284 2030959 9442081 12067647 13422280
5522 13422280 13713102 10263717 5263948 5262038 11026376 14640265 9996339 721454 -5966845
5513 -5966845 -8112752 -7301907 -3011970 5315612 13726713 17415602 17107621 16437135 15137734
5504 15137734 11004154 6832037 7984170 13245777 15655418 13349483 11744028 12782412
5496 12782412 10441106 1463783 -7174866 -8278349 -5878790 -8522432 -15168778 -17008130
5488 -17008130 -11845881 -7314572 -8489742 -10551415 -7190935 -124606 4025186 2023780
5480 2023780 -4945677 -15124001 -26269084 -33528038 -31877651 -21454466 -8262531 769577
5472 769577 2395151 -2235150 -9090540 -13302694 -11840970 -5722094 768450 3988090
$$ packed form
5530d934892k240455n896867k232365O502295J0833243P411122K625566J354633
5522A3422280K90822l449385m999769j910N764338L613889m643926r274885o688299
5513e966845k145907Q10845M289937Q327582Q411101L688889l07981o70486j299401
5504A5137734m133580m172117J152133N261607K409641k305935j605455J038384
5496A2782412k341306q977323q638649j103483K399559k643642o646346j839352
5488a7008130N162249M531309j175170k061673L360480P066329M149792k001406
5480B023780o969457j0178324j1145083p258954J650387J0423185J3191935R032108
5472G69577J625574m630301o855390m212154J461724O118876O490544L219640
$$ plain form
5464 3988090 4236393 4598491 6423118 7260390 4656453 841162 729553 5064324 9110879
5455 9110879 9927963 11368904 18430693 29238642 37009189 38564613 36298630 32291754
5447 32291754 25522036 15849536 6487662 668324 -1518333 -2169364 -4003343 -9504468
5439 -9504468 -17907677 -23032014 -18778837 -7752103 336443 230015 -4017721 -7453677
5431 -7453677 -10950623 -15366189 -15246716 -5576624 8238209 14459404 8734180 -1725798
5423 -1725798 -7517745 -5627060 1533300 10543438 18617175 24174683 27660403 30144858
5415 30144858 30783074 27745467 21743284 16122457 12887232 10784367 8061128 5371909
5407 5371909 5071752 8556588 14608547 19824437 21138429 18634620 15058499 11965015
$$ packed form
5464C988090K48303L62098J824627Q37272k603937l815291j11609M334771M046555
5455I110879Q17084J440941P061789J0807949P770547J555424k265983m006876
5447C2291754o769718r672500r361874n819338k186657o51031j833979n501125
5439i504468q403209n124337M253177J1026734Q088546j06428m247736l435956
5431g453677l496946m415566J19473R670092J3814833O221195n725224j0459978
5423a725798n791947J890685P160360R010138Q073737N557508L485720K484455
5415C0144858O38216l037607o002183n620827l235225k102865k723239k689219
5407E371909l00157L484836O051959N215890J313992k503809l576121l093484
$$ plain form
5399 11965015 8079310 2768372 -1076461 -235173 4011342 6868618 5245823 46467
5391 46467 -5740986 -9249997 -9298564 -7953263 -9179959 -13606107 -16260197 -12319946 -3512512
5382 -3512512 4292354 8135619 9038883 7976034 5577964 4730941 7862336 11363268 8256715
5373 8256715 -2139586 -12261088 -16182023 -16713089 -19219081 -22049330 -17871678 -3688753
5365 -3688753 14004383 24879613 24439628 17740776 13662901 15568366 18656278 17226305
5357 17226305 12427424 10298633 13742886 19898171 24559259 25380311 21302220 13506418
5349 13506418 7540029 9745719 19627849 29283965 32121710 28875176 23550213 17382429
5341 17382429 9607615 1292718 -4873084 -7455471 -7168293 -6038345 -6436536 -9145328
$$ packed form
5399A1965015l885705n310938l844833Q41288M246515K857276j622795n199356
5391D6467n787453l509011m8567J345301j226696m426148k654090L940251Q807434
5382c512512P804866L843265R03264j062849k398070q47023L131395L500932l106553
5373H256715j0396301j0121502l920935n31066k505992k830249M177652J4182925
5365c688753J7693136J0875230m39985o698852m077875J905465L087912j429973
5357A7226305m798881k128791L444253O155285M661088Q21052m078091p795802
5349A3506418n966389K205690R882130R656116K837745l246534n324963o167784
5341A7382429p774814q314897o165802k582387K87178J129948l98191k708792
$$ plain form
5333 -9145328 -11812712 -11311161 -7718459 -3449790 1138563 7554994 14565127 18237603
5325 18237603 17360238 14328960 9955254 2767755 -5337933 -9250732 -9003240 -11072547
5317 -11072547 -17299275 -19589586 -11644151 419956 6824838 8273141 12099206 17678102
5309 17678102 16292984 5451448 -6484153 -12246436 -14221631 -17678969 -21876851 -22229719
5301 -22229719 -17312164 -10127884 -4856476 -4266617 -7939282 -12170509 -14365803 -17262626
5293 -17262626 -24503083 -32166955 -30816744 -17738180 -1058406 11233893 20072017 28603962
5285 28603962 33046796 27912260 17080805 11272264 14536705 20154823 21022923 17810447
5277 17810447 14336886 10274924 2726369 -7791084 -16954561 -21348345 -21171379 -19154298
$$ packed form
5333i145328k667384N01551L592702M268669M588353O416431P010133L672476
5325A8237603q77365l031278m373706p187499q105688l912799K47492k069307
5317a1072547o226728k290311P945435J2064107O404882J448303L826065N578896
5309A7678102j385118j0841536j1935601n762283j975195l457338m197882l52868
5301b2229719M917555P184280N271408N89859l672665m231227k195294k896823
5293a7262626p240457p663872J350211J3078564J6679774J2292299Q838124Q531945
5285B8603962M442834n134536j0831455n808541L264441N618118Q68100l212476
5277A7810447l473561m061962p548555j0517453r163477m393784J76966K017081
$$ plain form
5269 -19154298 -18617044 -21511213 -26513073 -29825755 -29217877 -26099880 -22448315 -17878130
5261 -17878130 -12028916 -7501690 -6823355 -8111601 -8045588 -7994983 -11853869 -18025601 -20155642
5252 -20155642 -17482248 -17346883 -23467417 -28487716 -24511215 -15651299 -11978808 -14372749
5244 -14372749 -14572506 -9248215 -4611191 -5519692 -8152172 -6416528 759597 11120213
5236 11120213 22047170 29455637 30003901 27134021 28389321 33605347 33088580 22065459
5228 22065459 9422116 5633263 8623507 9394755 6085466 3278006 1316017 -3407918
5220 -3407918 -8844935 -7733088 1456113 11810819 17290344 17889811 14776081 7660649
5212 7660649 -879426 -5055228 -2996425 442095 254629 -3590401 -9072839 -15206553
$$ packed form
5269a9154298N37254k894169n001860l312682O07878L117997L651565M570185
5261a7878130N849214M527226O78335j288246O6013N0605l858886o171732k130041
5252b0155642K673394J35365o120534n020299L976501Q859916L672491k393941
5244a4372749j99757N324291M637024r08501k632480J735644P176125J0360616
5236A1120213J0926957P408467N48264k869880J255300N216026n16767j1023121
5228B2065459j2643343l788853K990244P71248l309289k807460j961989m723935
5220c407918n437017J111847R189201J0354706N479525N99467l113730p115432
5212G660649q540075m175802K058803L438520j87466l845030n482438o133714
$$ plain form
5204 -15206553 -19991546 -19841644 -13771152 -4814046 4184869 12034654 15197134 8280687
5196 8280687 -7497839 -21007781 -21833884 -12110884 -3147007 -1632582 -3895022 -3654930
5188 -3654930 -433843 2341836 4419056 9201888 16606488 19727160 12627820 -249008
5180 -249008 -7608469 -4755649 1660083 3957155 2432671 498113 -2729869 -8539757
5172 -8539757 -12351847 -9589146 -4930716 -6984947 -14940271 -19177859 -15171113 -8304381
5164 -8304381 -3978323 -1354557 1065576 1603033 60028 -641975 -155321 -1438495 -3499793
5155 -3499793 -773120 7104191 12325158 9838906 4366686 2038282 1769009 231226
5147 231226 -760333 2050097 6851717 9444867 8889834 6730845 4933404 7351809 16856857
$$ packed form
5204a5206553m784993J49902O070492Q957106Q998915P849785L162480o916447
5196H280687j5778526j3509942q26103R723000Q963877J514425k262440K40092
5188c654930L221087K775679K077220M782832P404600L120672p099340j2876828
5180b49008p359461K852820O415732K297072j524484j934558l227982n809888
5172h539757l812090K762701M658430k054231p955324m237588M006746O866732
5164h304381M326058K623766K420133N37457j543005p02003M86654j283174k061298
5155c499793K726673P877311N220967k486252n472220k328404k69273j537783
5147B31226r91559K810430M801620K593150n55033k158989j797441K418405R505048
$$ plain form
5138 16856857 27281680 25975521 10241441 -6056364 -9319250 -2971964 194924 -4278875
5130 -4278875 -11481031 -17783507 -22208372 -21624217 -15314385 -11006291 -15343206 -20847254
5122 -20847254 -14225839 3030789 14252064 9136382 -4942060 -15309928 -17725190 -14717322
5114 -14717322 -9480778 -5866508 -7400452 -12251639 -14585649 -13257354 -13282256 -16867067
5106 -16867067 -19662322 -18311860 -15111137 -12518734 -9647575 -7175638 -9105392 -16056841
5098 -16056841 -22981476 -27261587 -32953906 -42652276 -50782620 -50016476 -40244904 -27271340
5090 -27271340 -16730787 -12432681 -15515552 -21282705 -21920129 -16480836 -12930796 -15892197
5082 -15892197 -18442173 -12303721 -887118 5325825 2672605 -3982490 -10355009 -15092830
$$ packed form
5138A6856857J0424823j306159j5734080j6297805l262886O347286L166888m473799
5130d278875p202156o302476m424865N84155O309832M308094m336915n504048
5122b0847254O621415J7256628J1221275n115682j4078442j0367868k415262L007868
5114a4717322N236544L614270j533944m851187k334010J328295k4902l584811
5106a6867067k795255J350462L200723K592403K871159K471937j929754o951449
5098a6056841o924635m280111n692319r698370q130344P66144R771572J2973564
5090b7271340J0540553M298106l082871n767153o37424N439293L550040k961401
5082a5892197k549976O138452J1416603O212943k653220o655095o372519m737821
$$ plain form
5074 -15092830 -14454842 -3684034 14578411 29824453 33942264 27847190 17636755 9393716
5066 9393716 8314007 16392251 27807988 31622713 23243798 10125399 2429823 917791
5058 917791 -1267114 -6568203 -8858309 -2892966 6929050 11390530 7973317 3005197
5050 3005197 2453246 5437340 8957897 14428205 24530006 35651147 39329227 32118840
5042 32118840 19790684 10363110 6544212 6586332 8765962 11928627 13885845 12631006
5034 12631006 8800755 5229536 4422909 7078477 11749306 14834252 12064337 1648396
5026 1648396 -13602861 -27199474 -32504096 -27491542 -17417513 -10554012 -8813139 -4855434
5018 -4855434 8109861 26086833 38636677 41563811 39355077 36177800 31764146 26761216
$$ packed form
5074a5092830O37988J0770808J8262445J5246042M117811o095074j0210435q243039
5066I393716j079709Q078244J1415737L814725q378915j3118399p695576j512032
5058I17791k184905n301089k290106N965343R822016M461480l417213m968120
5050C005197n51951K984094L520557N470308J0101801J1121141L678080p210387
5042C2118840j2328156r427574l818898M2120K179630L162665J957218j254839
5034A2631006l830251l571219q06627K655568M670829L084946k769915j0415941
5026A648396j5251257j3596613n304622N012554J0074029O863501J740873L957705
5018d855434J2965295J7976972J2549844K927134k208734l177277m413654n002930
$$ plain form
5010 26761216 24374126 24168103 21097939 13864812 7895722 6620431 6269770 3425283
5002 3425283 1136513 2354246 3550363 1187685 -848559 2658904 8893174 10726817
4994 10726817 6604796 522042 -4236295 -5116619 1339121 13356681 20428262 15202988
4986 15202988 5564483 4483221 10261274 9084111 -2862293 -13126464 -12059513 -5566035
4978 -5566035 -2851740 -2676716 -179211 1939399 -389116 -1581178 6844618 21476582
4970 21476582 30000812 28343630 24490056 24046973 22352011 15271345 9167458 12880485
4962 12880485 24630134 34056253 34916190 29535656 22313200 15478549 11140439 10748078
4954 10748078 10935293 6154253 -1856626 -3336333 6562887 19626276 25015765 23134996
$$ packed form
5010B6761216k387090k06023l070164p233127n969090j275291l50661k844487
5002C425283k288770J217733J196117k362678k036244L507463O234270J833643
4994A0726817m122021o082754m758337q80324O455740J2017560P071581n225274
4986A5202988r638505j081262N778053j177163j1946404j0264171J066951O493478
4978e566035K714295J75024K497505K118610k328515j192062Q425796J4631964
4970B1476582Q524230j657182l853574m43083j694962p080666o103887L713027
4962A2880485J1749649R426119Q59937n380534p222456o834651m338110l92361
4954A0748078J87215m781040q010879j479707R899220J3063389N389489j880769
$$ plain form
4946 23134996 21928856 22953714 20149244 11661224 3894888 2209041 5015310 9149233
4938 9149233 14192376 18902663 19703252 15681289 9816632 3440300 -4513986 -11337540
4930 -11337540 -11131146 -4051150 2701876 5788353 8995113 12547416 9773156 -15672
4922 -15672 -6245002 -2578332 2590894 524558 -3151638 308572 6194039 5094818 1107002
4913 1107002 5733235 17888791 25435432 24403197 21928503 21287992 18647097 14750925
4905 14750925 15730502 21122095 23993395 23863602 26690734 31286069 29150417 19404874
4897 19404874 10911166 7924798 6277852 4538874 5274902 4733168 -3549349 -13833972
4889 -13833972 -13178842 -2833724 2854686 678933 2205736 10527927 15359744 15955057
$$ packed form
4946B3134996j206140J024858k804470q488020p766336j685847K806269M133923
4938I149233N043143M710287Q00589m021963n864657o376332p954286o823554
4930a1337540K06394P079996O753026L086477L206760L552303k774260r788828
4922a5672o229330L666670N169226k066336l676196L460210N885467j099221l987816
4913A107002M626233J2155556P546641j032235k474694o40511k640895l896172
4905A4750925R79577N391593K871300j29793K827132M595335k135652r745543
4897A9404874q493708k986368j646946j738978P36028n41734q282517j0284623
4889a3833972O55130J0345118N688410k175753J526803Q322191M831817N95313
$$ plain form
4881 15955057 24853152 41996308 51395759 52433338 64517654 88538891 100282616 103211644
4873 103211644 144936705 240638965 315349375 279879356 149613617 30551814 -10628465
4866 -10628465 -6572405 -12837106 -30956324 -34688840 -25628021 -22945505 -24966219 -17652608
4858 -17652608 -5631682 -4141947 -10750168 -11351627 -6406864 -7867700 -15866793 -19531819
4850 -19531819 -16920352 -15513313 -16182365 -13551828 -9380973 -9771478 -11497523 -6112598
4842 -6112598 4108686 8326473 3822493 -2353160 -6615700 -10866507 -12955643 -8295122
4834 -8295122 -372383 2684547 1280362 1922952 3191744 -1799885 -9295261 -7314379
4826 -7314379 2646443 2191088 -18468660 -44369413 -54214863 -45610494 -32911627 -26944685
$$ packed form
4881A5955057Q898095J7143156R399451J037579J2084316K4021237J1743725K929028
4873A03211644M1725061R5702260P4710410l5470019j30265739j19061803m1180279
4866a0628465M056060o264701j8119218l732516R060819K682516k020714P313611
4858a7652608J2020926J489735o608221o01459M944763j460836p999093l665026
4850a9531819K611467J407039o69052K630537M170855l90505j726045N384925
4842f112598J0221284M217787m503980o175653m262540m250807k089136M660521
4834h295122P922739L056930j404185O42590J268792m991629p495376J980882
4826g314379R960822m55355k0659748k5900753r845450Q604369J2698867N966942
$$ plain form
4818 -26944685 -26145910 -24061717 -17785759 -9879723 -6020091 -9346287 -15557574 -17033347
4810 -17033347 -13049161 -10983696 -15572040 -22664208 -26269083 -25686153 -22100247 -14546667
4802 -14546667 -4535038 822826 -3176123 -11263423 -14717788 -12609712 -10649029 -11321087
4794 -11321087 -11629719 -9327585 -4989671 1739634 11593436 20632405 21954650 14796622
4786 14796622 6924007 4899429 6053776 3781155 -2594064 -8008294 -9810607 -10257019
4778 -10257019 -10672986 -8503842 -2725166 1834844 -285066 -7552278 -13349305 -15038466
4770 -15038466 -16720599 -21887393 -27423636 -27838248 -23090928 -18790418 -19128243 -22220826
4762 -22220826 -22843751 -18169314 -10058743 -2291431 3561514 8543629 12546873 12396087
$$ packed form
4818b6944685P98775K084193O275958P906036L859632l326196o211287j475773
4810a7033347L984186K065465m588344p092168l604875N82930L585906P553580
4802a4546667J0011629N357864l998949q087300l454365K108076J960683o72058
4794a1321087l08632K302134M337914O729305R853802R038969J322245p158028
4786A4796622p872615k024578J154347k272621o375219n414230j802313m46412
4778a0257019m15967K169144N778676M560010k119910p267212n797027j689161
4770a5038466j682133n166794n536243m14612M747320M300510l37825l092583
4762b2220826o22925M674437Q110571P767312N852945M982115M003244j50786
$$ plain form
4754 12396087 6104762 -2504940 -7252056 -7312570 -7175785 -8618074 -8074731 -3786142 226324
4745 226324 879157 1276828 4165740 4962233 -1826928 -12214808 -16199190 -10438038 -576572
4736 -576572 8300607 15891855 20735377 18448281 9756649 4028829 9394545 22455318
4728 22455318 32227822 32572243 27227408 23530954 24172846 25526349 22770206 15830648
4720 15830648 9429686 6951001 6302528 3820570 62456 -1750969 -1457847 -1778777 -3247367
4711 -3247367 -4027521 -4517461 -7046347 -10596521 -11097125 -7946768 -4907482 -3201349 372596
4702 372596 6072752 7989053 2034722 -7668504 -14399178 -16573130 -16047033 -13395513 -9886799
4693 -9886799 -10154368 -16963092 -25718869 -29467030 -27281403 -22805816 -17014783 -8305064
$$ packed form
4754A2396087o291325q609702m747116o0514J36785j442289N43343M288589M012466
4745B26324O52833L97671K888912P96493o789161j0387880l984382N761152R861466
4736e76572Q877179P591248M843522k287096q691632n727820N365716J3060773
4728B2455318R772504L44421n344835l696454O41892J353503k756143o939558
4720A5830648o400962k478685o48473k481958l758114j813425K93122l20930j468590
4711c247367p80154m89940k528886l550174n00604L150357L039286J706133L573945
4702C72596N700156J916301n954331r703226o730674k173952N26097K651520L508714
4693i886799k67569o808724q755777l748161K185627M475587N791033Q709719
$$ plain form
4685 -8305064 2002591 10616694 17967234 26702440 34647332 35714456 28793796 19735140
4677 19735140 13016600 7399845 1976121 167637 3754699 8250783 9288113 9414217
4669 9414217 12579910 14972195 8836298 -4857908 -14893302 -13357682 -5026800 474028
4661 474028 1191043 2055033 4398431 3466445 -2697069 -8246713 -7149979 -1705004 1241105
4652 1241105 133285 -714575 112974 -2476140 -12827139 -27640096 -39224554 -43390981
4644 -43390981 -41690924 -37587463 -32899977 -27227349 -19186263 -8852742 292998 3522437
4636 3522437 193394 -4850164 -6740561 -5705319 -5179213 -7006607 -10839858 -16226445
4628 -16226445 -22093787 -25426853 -24008216 -20243932 -19039569 -21415796 -22933971 -19350570
$$ packed form
4685h305064J0307655Q614103P350540Q735206P944892J067124o920660r058656
4677A9735140o718540n616755n423724j808484L587062M496084J037330J26104
4669I414217L165693K392285o135897j3694206j0035394J535620Q330882N500828
4661D74028P17015Q63990K343398r31986o163514n549644J096734N444975K946109
4652A241105j107820q47860Q27549k589114j0350999j4812957j1584458m166427
4644d3390981J700057M103461M687486N672628Q041086J0333521R145740L229439
4636C522437l329043n043558j890397J035242N26106j827394l833251n386587
4628a6226445n867342l333066J418637L764284J204363k376227j518175L583401
$$ plain form
4620 -19350570 -11750748 -4930686 -2063749 -2275930 -3240674 -5194399 -10940790 -20520421
4612 -20520421 -27129789 -22270448 -6446187 8908216 13188133 7557117 914071 -1687936
4604 -1687936 -1361771 1361480 8202712 17439183 23283780 23374859 21418977 19638482 14236440
4595 14236440 2765498 -8764968 -12151640 -7752752 -2966055 -1184495 1603207 8688102
4587 8688102 16678115 19855218 16776103 10363262 4275049 1270689 2740700 7409601
4579 7409601 11854741 14079565 15427095 17811893 20743543 22440684 22039308 19239958
4571 19239958 14065448 8867858 7591698 9819267 8672881 -152245 -9362775 -7210525
4563 -7210525 5913670 15708614 11958187 1298872 -3424554 -624073 1173946 -1454487
$$ packed form
4620a9350570P599822O820062K866937k12181r64744j953725n746391r579631
4612b0520421o609368M859341J5824261J5354403M279917n631016o643046k602007
4604a687936L26165K723251O841232R236471N844597R1079j955882j780495n402042
4595A4236440j1470942j1530466l386672M398888M786697J781560K787702P084895
4587H688102P990013L177103l079115o412841o088213l004360J470011M668901
4579G409601M445140K224824J347530K384798K931650J697141m01376k799350
4571A9239958n174510n197590j276160K227569j146386q825126r210530K152250
4563g210525J3124195R794944l750427j0659315m723426K800481J798019k628433
$$ plain form
4555 -1454487 -2406228 2469579 8090367 8154889 4595810 4293004 9652250 16651469 20433684
4546 20433684 19513556 15602914 11954401 11204032 13005833 14501145 14165305 13556307 13751755
4537 13751755 12083542 5244324 -4938302 -11469809 -8774716 1690537 12929727 19097695
4529 19097695 20223054 20111612 20449909 19058507 14614983 10354361 10491387 14673357 18764905
4520 18764905 19502779 15361282 5208857 -9141838 -20725900 -23568553 -20470810 -18851544
4512 -18851544 -19611812 -17467402 -12383769 -11375850 -16088074 -17842048 -10450582 -214332
4504 -214332 3316924 84922 -3720017 -5641491 -6186062 -3402847 3202861 7004807 891146
4495 891146 -12787175 -25909377 -35011491 -40666176 -40420511 -31720506 -19625728 -12219748
$$ packed form
4555a454487r51741M875807N620788O4522l559079l02806N359246O999219L782215
4546B0433684r20128l910642l648513p50369J801801J495312l35840o08998J95448
4537A3751755j668213o839218j0182626o531507K695093J0465253J1239190O167968
4529A9097695J125359j11442L38297j391402m443524m260622J37026M181970M091548
4520A8764905P37874m141497j0152425j4350695j1584062k842653L097743J619266
4512a8851544p60268K144410N083633J007919m712224j753974P391466J0236250
4504b14332L531256l232002l804939j921474n44571K783215O605708L801946o113661
4495H91146j3678321j3122202r102114n654685K45665Q700005J2094778P405980
$$ plain form
4487 -12219748 -9538619 -5763144 -659268 963358 15335 2423873 7195485 6075462
4479 6075462 -2951949 -11878335 -14605432 -12933537 -8634029 -362241 8258793 8758111
4471 8758111 1083173 -3836202 -647662 1938912 -3420835 -9216142 -4674805 7729789
4463 7729789 18062399 24170476 29287350 29445571 16564545 -6648401 -26146737 -32585574
4455 -32585574 -29995810 -27307706 -28090423 -30123278 -29536683 -23731418 -13887440 -5028551
4447 -5028551 -769845 1010994 4400027 9548650 14254519 18867850 24877896 30416014
4439 30416014 31872804 28822711 23664944 18348970 14942932 16195606 20791315 21323093
4431 21323093 12819036 791826 -5195983 -3749663 -1092802 -367758 1182376 4885187
$$ packed form
4487a2219748K681129L775475N103876J622626r48023K408538M771612j120023
4479F075462r027411q926386k727097J671895M299508Q271788Q621034M99318
4471H758111p674938m919375L188540K586574n359747n795307M541337J2404594
4463G729789J0332610O108077N116874J58221j2881026k3212946j9498336o438837
4455c2585574K589764K688104p82717k032855N86595N805265R843978Q858889
4447e028551M258706J780839L389033N148623M705869M613331O010046N538118
4439C0416014J456790l050093n157767n315974l406038J252674M595709N31778
4431B1323093q504057j2027210n987809J446320K656861P25044J550134L702811
$$ plain form
4423 4885187 7590851 6907699 4038883 591591 -3072220 -6230828 -8452284 -11016125
4415 -11016125 -13819556 -12879126 -5854594 2174348 4396688 1815799 563782 1462000
4407 1462000 -32469 -4084009 -4929730 -276062 4894869 5787492 3339769 1034061 1309822
4398 1309822 5632757 12990220 18539395 19085842 18633794 22171590 26196497 23980523 18419556
4389 18419556 18742273 24405506 24548056 15938548 8770308 9600867 10930917 5512612 142723
4380 142723 5137503 17918843 27218754 27951569 22767254 14147448 4490265 -280596
4372 -280596 2904030 6998323 3148545 -5739581 -8550724 -1724539 7113270 10692688
4364 10692688 8992504 4426756 -1792958 -7029911 -7936661 -6084019 -7552396 -14832960
$$ packed form
4423D885187K705664o83152k868816l447292l663811l158608k221456k563841
4415a1016125k803431R40430P024532Q028942K222340k580889j252017Q98218
4407A462000j494469m051540q45721M653668N170931Q92623k447723k305708K75761
4398A309822M322935P357463N549175N46447m52048L537796M024907k215974n560967
4389A8419556L22717N663233J42550q609508p168240Q30559J330050n418305n369889
4380A42723M994780J2781340R299911P32815n184315q619806r657183m770861
4372b80596L184626M094293l849778q888126k811143O826185Q837809L579418
4364A0692688j700184m565748o219714n236953r06750J852642j468377p280564
$$ plain form
4356 -14832960 -23203882 -26413952 -22396880 -13034944 -2371386 4348702 3834995 -1970833
4348 -1970833 -8398709 -13500905 -18019758 -21142164 -20614290 -16712927 -11928391 -6983380
4340 -6983380 -1286419 3277852 3868697 1842885 1239129 1883081 -341934 -5313742 -6913692
4331 -6913692 -2138940 3502481 3686044 100159 -1273825 -24440 -2002204 -10347213
4323 -10347213 -20239759 -24315984 -21110920 -16086082 -14646358 -15841601 -14272293 -7710608
4315 -7710608 -644686 880835 -3799229 -10042580 -13540055 -13480974 -10916282 -6875299 -2554397
4306 -2554397 734060 2733847 4552885 7682123 13086673 20306788 26477637 27399212
4298 27399212 21012669 9149849 -4678751 -17430453 -25842805 -26906931 -21528180 -15076880
$$ packed form
4356a4832960q370922l210070M017072R361936J0663558O720088n13707n805828
4348a970833o427876n102196m518853l122406N27874L901363M784536M945011
4340f983380N696961M564271N90845k025812o03756O43952k225015m971808j599950
4331f913692M774752N641421J83563l585885j373984J249385j977764q345009
4323a0347213r892546m076225L205064N024838J439724j195243J569308O561685
4315g710608P065922J525521m680064o243351l497475N9081K564692M040983M320902
4306b554397L288457J999787J819038L129238N404550P220115O170849R21575
4298B7399212o386543j1862820j3828600j2751702q412352j064126N378751O451300
$$ plain form
4290 -15076880 -11409412 -8778827 -4516391 -309608 1601151 4091422 10706906 17579963
4282 17579963 17217614 10177234 5215968 6181295 6477772 366528 -7109985 -7608939 -2488153
4273 -2488153 -1232419 -8196248 -17172717 -20103591 -16541287 -12158630 -10628770 -10037267
4265 -10037267 -7009015 -1959470 1383255 1064832 -526996 -58028 2375600 3938078
4257 3938078 3243639 2118143 3585160 9335374 18314258 26326133 28141827 22004884
4249 22004884 11442919 1246075 -6881140 -13014421 -15968490 -15070902 -13204425 -13734020
4241 -13734020 -14987242 -12016201 -3920498 4476229 8517245 7616148 3245509 -2668339
4233 -2668339 -6463352 -4003816 4934375 16147164 25484331 30949611 30579980 22797083
$$ packed form
4290a5076880L667468K630585M262436M206783J910759K490271O615484O873057
4282A7579963l62349p040380m961266R65327K96477o111244p476513m98954N120786
4273b488153J255734o963829q976469k930874L562304M382657J529860N91503
4265a0037267L028252N049545L342725l18423j591828M68968K433628J562478
4257C938078o94439j125496J467017N750214Q978884Q011875J815694o136943
4249B2004884j0561965j0196844q127215o133281k954069Q97588J866477n29595
4241a3734020j253222K971041Q095703Q396727M041016r01097m370639n913848
4233b668339l795013K459536Q938191J1212789R337167N465280l69631p782897
$$ plain form
4225 22797083 10076066 -1897952 -10337216 -16917006 -22175887 -23206089 -19398417 -15903409
4217 -15903409 -17541883 -22250316 -24104679 -20645109 -14145878 -7546011 -2004620 2798060
4209 2798060 7907990 13274790 15844333 12359135 5425229 2840923 7847572 13446821
4201 13446821 10544265 -358022 -9771811 -10450895 -4276508 1623409 2239016 -2131097
4193 -2131097 -7304111 -8672637 -4423401 3619153 11674268 15956217 14128837 7199691
4185 7199691 -265636 -4562803 -7446565 -12964301 -19676217 -20876954 -14221846 -6018161
4177 -6018161 -2629957 -2221391 250092 3501275 1631668 -5817460 -11523599 -9359504
4169 -9359504 -1712771 4106338 4539329 2864591 4131278 8533983 11227422 9038167
$$ packed form
4225B2797083j2721017j1974018q439264o579790n258881j030202L807672L495008
4217a5903409j638474m708433j854363L459570O499231O599867N541391M802680
4209B798060N109930N366800K569543l485198o933906k584306N006649N599249
4201A3446821k902556j0902287r413789o79084O174387N899917O15607m370113
4193b131097n173014j368526M249236Q042554Q055115M281949j827380o929146
4185G199691p465327m297167k883762n517736o711916j200737O655108Q203685
4177f018161L388204M08566K471483L251183j869607p449128n706139K164095
4169i359504P646733N819109M32991j674738J266687M402705K693439k189255
$$ plain form
4161 9038167 5278325 5550472 10283953 14848813 15963633 13578030 7181770 -3736095
4153 -3736095 -14613177 -17458153 -10162421 683213 7985675 9710187 5304470 -5311892
4145 -5311892 -15980907 -16412134 -5821396 3407072 2298529 -2325942 -427 6228640
4137 6228640 3469405 -17884385 -63826616 -137965844 -225904802 -286072555 -279794372 -214239196
4129 -214239196 -137920637 -89077722 -64724969 -44822257 -25877372 -16782543 -16877334 -16616384
4121 -16616384 -13383585 -11428465 -9819760 -3664269 4726311 7615994 4068766 437814
4113 437814 -625531 -2050633 -3549782 -796923 5274039 7315261 2302115 -4003273
4105 -4003273 -6150551 -6112936 -8332854 -13376360 -19726005 -26943760 -33666791 -36496590 -34061092
$$ packed form
4161I038167l759842K72147M733481M564860J114820k385603o396260j0917865
4153c736095j0877082k844976P295732J0845634P302462J724512m405717j0616362
4145e311892j0669015m31227J0590738R228468j108543m624471K325515O229067
4137F228640k759235k1353790m5942231p4139228q7938958o0167753O278183O5555176
4129b14239196P6318559M8842915K4352753J9902712J8944885R094829r4791K60950
4121a6616384L232799J955120J608705O155491Q390580K889683l547228l630952
4113D37814j063345j425102j499149K752859O070962K041222n013146o305388
4105d003273k147278L7615k219918n043506o349645p217755o723031k829799K435498
$$ plain form
4096 -34061092 -28920569 -23097070 -15445164 -6010705 1139406 3105526 2821192 4463900
4088 4463900 6891101 6121685 2386808 -319021 -933168 -2322317 -4963515 -4820802 -119912
4079 -119912 3742412 170896 -9520166 -17184300 -18167185 -17087189 -21820325 -33786035
4071 -33786035 -45886533 -49103801 -40199435 -24210816 -10638373 -6119988 -9506616 -14724638
4063 -14724638 -18614790 -23386774 -29960505 -32830877 -26212143 -13202815 -2896184 1461401
4055 1461401 5003317 10429295 11759028 3629479 -8440291 -13626918 -9114420 -1657829
4047 -1657829 2736851 4222581 4173591 1585757 -3092869 -5642248 -3157762 1729720 4893873
4038 4893873 6304434 8151248 9543435 7403047 2174772 -1516126 -1075367 271391
$$ packed form
4096c4061092N140523N823499P651906R434459P150111J966120k84334J642708
4088D463900K427201p69416l734877k705829o14147j389149k641198J42713M700890
4079a19912L862324l571516r691062p664134r82885J079996m733136j1965710
4071c3786035j2100498l217268Q904366J5988619J3572443M518385l386628n218022
4063a4724638l890152m771984o573731k870372O618734J3009328J0306631M357585
4055A461401L541916N425978J329733q129549j2069770n186627M512498P456591
4047a657829M394680J485730m8990k587834m678626k549379K484486M887482L164153
4038D893873J410561J846814J392187k140388n228275l690898M40759J346758
$$ plain form
4030 271391 -2060061 -7603108 -11229161 -9339689 -3767887 385722 -808831 -7740490
4022 -7740490 -17128187 -23322757 -21757355 -13175843 -3703836 901942 433314 -1691480
4014 -1691480 -4001232 -7625390 -11793900 -12443412 -7002143 1591597 7236745 5825906
4006 5825906 -2322502 -12976601 -20123780 -20117313 -15218634 -11205212 -10786284 -12015224 -13490150
3997 -13490150 -16305647 -18627849 -14124391 -1215716 10226774 8501273 -5203489 -18138976
3989 -18138976 -20875503 -14076059 -1610409 13845196 26377737 27470272 16740666 5475045
3981 5475045 3242150 6021923 3912790 -4112365 -10807510 -12662542 -12678668 -12418399 -9981331
3972 -9981331 -6534410 -6674731 -10162227 -10662435 -5780795 -1478698 -2404862 -4233455 -1152972
$$ packed form
4030B71391k331452n543047l626053J889472N571802M153609j194553o931659
4022g740490r387697o194570J565402Q581512R472007M605778m68628k124794
4014a691480k309752l624158m168510o49512N441269Q593740N645148j410839
4006E825906q148408j0654099p147179O467M898679M013422M18928j228940j474926
3997a3490150k815497k322202M503458J2908675J1442490j725501j3704762j2935487
3989a8138976k736527O799444J2465650J5455605J2532541J092535j0729606j1265621
3981E475045k232895K779773k109133q025155o695145j855032j6126K60269K437068
3972i981331L446921j40321l487496n00208M881640M302097r26164j828593L080483
$$ plain form
3963 -1152972 4285253 5474681 2255595 -110218 -515329 -3211018 -9506491 -14854133
3955 -14854133 -15498833 -12768929 -9332460 -6015557 -4089793 -6067399 -11608658 -16322114
3947 -16322114 -17280520 -16497029 -16181720 -13768884 -5562703 6311041 14435861 13753905 6612098
3938 6612098 24524 -1082301 1892048 3353528 310613 -3718674 -3327253 1278425
3930 1278425 4640837 3578973 202623 -3023757 -6206765 -8317645 -5946559 996772
3922 996772 7127278 9016120 10164210 13994943 16708158 13259078 6428914 2534414
3914 2534414 785278 -5050537 -15722942 -25510611 -31924902 -37865553 -42935211 -41258213
3906 -41258213 -31157427 -19730031 -13814992 -12324052 -11135977 -9543238 -7578903 -2939868
$$ packed form
3963a152972N438225J189428l219086k365813m05111k695689o295473n347642
3955a4854133o44700K729904L436469L316903J925764j977606n541259m713456
3947a6322114r58406P83491L15309K412836Q206181J1873744Q124820o81956p141807
3938F612098o587574j106825K974349J461480l042915m029287L91421M605678
3930A278425L362412j061864l376350l226380l183008k110880K371086O943331
3922I96772O130506J888842J148090L830733K713215l449080o830164l894500
3914B534414j749136n835815j0672405r787669o414291n940651n069658J676998
3906d1258213J0100786J1427396N915039J490940J188075J592739J964335M639035
$$ plain form
3898 -2939868 3871342 6340386 370266 -7503647 -7039670 2320294 11107440 12135726
3890 12135726 7483739 2800101 -291695 -4060255 -9851908 -15727554 -18475572 -17096667
3882 -17096667 -13524190 -9259673 -2952120 5760588 11394417 7168071 -4467486 -11819923
3874 -11819923 -7733425 1791989 6839300 6234580 5162433 4424496 -105171 -8538988
3866 -8538988 -14713851 -13948316 -8201106 -2567636 -341916 -2054576 -6284920 -11079028
3858 -11079028 -16423409 -23832514 -31170971 -31214404 -20404650 -6805072 -2882594 -10483076
3850 -10483076 -18801480 -17895992 -8758341 1086320 6360814 6000571 969320 -6350868
3842 -6350868 -12649330 -15708564 -15132988 -11590132 -7672978 -8134899 -14784470 -21372519 -18874591
$$ packed form
3898b939868O811210K469044n970120p873913M63977R359964Q787146J028286
3890A2135726m651987m683638l091796l768560n791653n875646k748018J378905
3882a7096667L572477M264517O307553Q712708N633829m226346j1635557p352437
3874a1819923M086498R525414N047311o04720j072147p37937m529667q433817
3866h538988o174863P65535N747210N633470K225720j712660m230344m794108
3858a1079028n344381p409105p338457m3433J0809754J3599578L922478p600482
3850a0483076q318404R05488R137651R844661N274494l60243n031251p320188
3842f350868o298462l059234N75576L542856L917154m61921o649571o588049K497928
$$ plain form
3833 -18874591 -7219050 3097038 3280481 -4028924 -9798224 -9640399 -6727647 -6312862
3825 -6312862 -10340738 -16116968 -18531638 -14864424 -8090173 -3583869 -2563436 -1771729
3817 -1771729 287783 1006070 -1267527 -4144255 -5264761 -5525567 -5922979 -5215800 -3648802
3808 -3648802 -4886706 -10252773 -14580329 -12696140 -7507605 -6164947 -9494567 -11142760
3800 -11142760 -7610296 -3431172 -3994280 -7741042 -9541046 -9230527 -11546485 -17278006
3792 -17278006 -19710151 -13522625 -3983666 -1363466 -6485395 -8713295 -1327461 7605720
3784 7605720 5940256 -5546560 -15091106 -16686742 -15503915 -16247229 -16203754 -13706319 -14604378
3775 -14604378 -23534659 -34506732 -37319931 -30108508 -19580937 -11518356 -6680416 -3864049
$$ packed form
3833a8874591J1655541J0316088J83443p309405n769300J57825K912752M14785
3825f312862m027876n776230k414670L667214O774251M506304J020433P91707
3817a771729K059512P18287k273597k876728j120506k60806l97412P07179J566998
3808c648802j237904n366067m327556J884189N188535J342658l329620j648193
3800a1142760L532464M179124n63108l746762j800004L10519k315958n731521
3792a7278006k432145O187526R538959K620200n121929k227900P385834Q933181
3784G605720j665464j1486816r544546j595636J182827p43314M3475K497435q98059
3775a4604378q930281j0972073k813199P211423J0527571Q062581M837940K816367
$$ plain form
3767 -3864049 -1294911 3631853 10867223 15306840 12984535 8357945 9546926 16389469
3759 16389469 19079048 10232445 -6045537 -18892868 -21335276 -15058874 -7538041 -5733829
3751 -5733829 -10479566 -16246812 -17910858 -17044313 -18842807 -23721772 -26259002 -23169288
3743 -23169288 -17959523 -15473044 -15404308 -14530297 -13061725 -14714812 -20733123 -27259450 -29750840
3734 -29750840 -27634073 -22880514 -15923254 -6200351 3454881 6922949 1763376 -6352749
3726 -6352749 -9320110 -5206198 1916614 8649688 13924361 15386592 10927650 4704935
3718 4704935 4478069 10225943 12680958 7735149 4828564 13446144 27163969 31261325
3710 31261325 23441566 15860430 15881168 15760698 6039282 -9344481 -18455088 -17219273
$$ packed form
3767c864049K569138M926764P235370M439617k322305m626590J188981O842543
3759A6389469K689579q846603j6277982j2847331k442408O276402P520833J804212
3751e733829m745737n767246j664046Q66545j798494m878965k537230L089714
3743b3169288N209765K486479O8736Q74011J468572j653087o018311o526327k491390
3734b9750840K116767M753559O957260R722903R655232L468068n159573q116125
3726f352749k967361M113912P122812O733074N274673J462231m458942o222715
3718D704935k26866N747874K455015m945809k906585Q617580J3717825M097356
3710C1261325p819759p581136K0738j20470r721416j5383763r110607J235815
$$ plain form
3702 -17219273 -12754981 -12590164 -16893498 -22003893 -26388531 -29952151 -30147911 -23388054
3694 -23388054 -11316714 -2029004 -1448401 -5121722 -3262903 6095122 14448746 14820574
3686 14820574 10241028 6640544 3500125 -2295556 -8175883 -9145089 -6245847 -3752859
3678 -3752859 -106145 9450369 21876616 27280260 21888606 11559877 1241971 -9577130
3670 -9577130 -18498401 -17933425 -6865542 4094122 6590681 6109088 11806650 21212535
3662 21212535 24436986 19381392 13030332 9734358 7490883 5338465 5736683 8449206
3654 8449206 9184186 5874333 527557 -5972649 -14729776 -23344890 -26231913 -22956366
3646 -22956366 -20112290 -21212806 -20101989 -9451891 7786778 20783755 22957704 17081999
$$ packed form
3702a7219273M464292J64817m303334n110395m384638l563620j95760O759857
3694b3388054J2071340R287710N80603l673321J858819R358025Q353624L71828
3686A4820574m579546l600484l140419n795681n880327r69206K899242K492988
3678c752859L646714R556514J2426247N403644n391654j0328729j0317906j0819101
3670i577130q921271N64976J1067883J0959664K496559m81593N697562R405885
3662B1212535L224451n055594o351060l295974k243475k152418L98218K712523
3654H449206P34980l309853n346776o500206q757127q615114k887023L275547
3646b2956366K844076j100516J110817J0650098J7238669J2996977K173949n875705
$$ plain form
3638 17081999 9133410 1575558 -6399819 -15091463 -22436065 -24973755 -20457891 -10673875
3630 -10673875 -1492706 1699791 -689013 -3066489 -1463568 1646761 1258907 -2002982
3622 -2002982 -747136 10137193 25288770 33392183 30021899 22257538 18828605 19363210
3614 19363210 17161927 10156535 3618591 1841664 2599253 2364373 2627524 6574513 11759133
3605 11759133 11401440 3437266 -6030452 -10176709 -9150497 -7749945 -8002065 -7970221 -6997336
3596 -6997336 -7600018 -10910119 -13932235 -13767421 -11830398 -10860746 -9905567 -6124098 -425527
3587 -425527 3062329 3202907 3153366 4467862 4342247 947578 -2639821 -3372479 -3868080
3578 -3868080 -8572272 -16064335 -19988308 -17296437 -11257995 -6054296 -2708152 -1362761
$$ packed form
3638A7081999p948589p557852p975377q691644p344602k537690M515864R784016
3630a0673875R181169L192497k388804k377476J602921L110329l87854l261889
3622b002982J255846J0884329J5151577Q103413l370284p764361l428933N34605
3614A9363210k201283p005392o537944j776927P57589k34880K63151L946989N184620
3605A1759133l57693p964174r467718m146257J026212J400552k52120L1844R72885
3596f997336o02682l310101l022116J64814J937023R69652R55179L781469N698571
3587d25527L487856J40578m9541J314496j25615l394669l587399p32658m95601
3578c868080m704192p492063l923973K691871O038442N203699L346144J345391
$$ plain form
3570 -1362761 -3048951 -6620736 -7677308 -4312077 -1501502 -5274570 -13434955 -16943122
3562 -16943122 -11415736 -2611716 2336938 5283576 13379397 26055913 31884549 21470030
3554 21470030 -223530 -18807943 -26294351 -27394089 -29791235 -33235171 -31751505 -23841466
3546 -23841466 -15555877 -12946164 -15052575 -16289123 -13502116 -7964720 -1405496 6424324
3538 6424324 14993002 20603840 19947232 15463846 13904726 18328427 23866426 23492140 16598164
3529 16598164 9336036 6669832 6464151 2548971 -7324914 -17682388 -19804900 -10165659
3521 -10165659 5768551 18602226 23394346 21985045 18203765 14049371 10990695 10752146
3513 10752146 12056142 9939711 2003540 -7259187 -12423039 -14750278 -18499634 -21718560
$$ packed form
3570a362761j686190l571785j056572L365231K810575l773068q160385l508167
3562a6943122N527386Q804020M948654K946638Q095821J2676516N828636j0414519
3554B1470030k1693560j8584413p486408j099738k397146l443936J483666P910039
3546b3841466Q285589K609713k106411j236548K787007N537396O559224P829820
3538F424324Q568678N610838o56608m483386j559120M423701N537999l74286o893976
3529A6598164p262128k666204k05681l915180r873885j0357474k122512R639241
3521a0165659J5934210J2833675M792120j409301l781280m154394l058676k38549
3513A0752146J303996k116431p936171r262727n163852k327239l749356l218926
$$ plain form
3505 -21718560 -17920975 -7165842 2058097 4573907 5484341 11130169 18458881 19267860
3497 19267860 12152525 4282846 1602168 1544906 -3569538 -17843484 -36752793 -50007477
3489 -50007477 -50142390 -38676239 -22849952 -7495900 6505685 16681120 18230504 11404789
3481 11404789 4211326 3630472 8113820 12682227 16828382 21770302 23816421 18002815
3473 18002815 7137794 271271 1701776 7111876 11182417 13454940 14982984 13974917
3465 13974917 7615596 -4173086 -18237220 -29605346 -33439690 -28614479 -19972420 -14322729
3457 -14322729 -13514062 -13587212 -10629849 -4796335 1292983 5071942 4820526 1037086 -2489789
3448 -2489789 -1588642 3983958 11074432 16960689 19916209 17877409 11286798 6289250
$$ packed form
3505b1718560L797585J0755133R223939K515810R10434N645828P328712Q08979
3497A9267860p115335p869679k680678n7262n114444j4273946j8909309j3254684
3489e0007477j34913J1466151J5826287J5354052J4001585J0175435J549384o825715
3481A1404789p193463n80854M483348M568407M146155M941920K046119n813606
3473A8002815j0865021o866523J430505N410100M070541K272523J528044j008067
3465A3974917o359321j1788682j4064134j1368126l834344M825211Q642059N649691
3457a4322729Q08667p3150K957363N833514O089318L778959k51416l783440l526875
3448b489789R01147N572600P090474N886257K955520k038800o590611m997548
$$ plain form
3440 6289250 9248367 17498344 21387403 17151481 11985268 13467910 19167275 20813450
3432 20813450 15073172 6028784 -606464 -2266549 -396330 804719 -1797581 -6156682
3424 -6156682 -7318340 -4857797 -3874367 -6633517 -8556204 -6336272 -4678069 -9144900
3416 -9144900 -16514173 -19192116 -16313228 -12968801 -10509932 -6205489 -1841084 -2855652
3408 -2855652 -7083361 -4367367 7844663 17505588 13824292 2899213 -1779939 609688
3400 609688 -1038999 -10603939 -18442423 -16869884 -11084840 -8637549 -6475899 2910153
3392 2910153 17237947 25483343 22050276 12642973 5974464 5595427 10204158 16316768
3384 16316768 19515563 17769364 14434446 13865437 14400960 11232131 6011585 6219269 13353508
$$ packed form
3440F289250K959117Q249977L889059m235922n166213J482642N699365J646175
3432B0813450n740278r044388o635248j660085J870219J201049k602300m359101
3424f156682j161658K460543R83430k759150j922687K219932J658203m466831
3416i144900p369273k677943K878888L344427K458869M304443M364405j014568
3408b855652m227709K715994J2212030R660925l681296j0925079m679152K389627
3400F09688j648687r564940p838484J572539N785044K447291K161650R386052
3392B910153J4327794Q245396l433067r407303o668509l79037M608731O112610
3384A6316768L198795j746199l334918n69009N35523l168829n220546K07684P134239
$$ plain form
3375 13353508 19707273 20382149 20513221 24967702 28144427 21796097 8020732 -3592175
3367 -3592175 -8524706 -9856519 -11405234 -15436797 -23602486 -32048053 -29321860 -9429040
3359 -9429040 14951239 23502031 12731071 -1424185 -6277660 -5575446 -6835433 -8272988
3351 -8272988 -5606865 -1847628 -1381320 -1436334 1873220 4785658 2089040 -2361668 -672533
3342 -672533 5978932 8311265 2790230 -3026859 -202737 11686391 25224213 31994499
3334 31994499 28738824 19965636 14243659 15633416 20009430 21619853 20225087 18637254
3326 18637254 16661258 12165540 5952820 1076525 -1023608 -72492 4717390 11629916
3318 11629916 14700786 10295313 3299108 1508760 5858591 11474630 15896329 19687595
$$ packed form
3375A3353508O353765O74876J31072M454481L176725o348330j3775365j1612907
3367c592175m932531j331813j548715m031563q165689q445567K726193J9892820
3359i429040K4380279Q550792j0770960j4155256m853475P02214j259987j437555
3351h272988K666123L759237M66308n5014L309554K912438k696618m450708J689135
3342f72533O651465K332333n521035n817089K824122J1889128J3537822O770286
3334C1994499l255675q773188n721977J389757M376014J610423j394766j587833
3326A8637254j975996m495718o212720m876295k100133R51116M789882O912526
3318A1629916L070870m405473o996205j790348M349831N616039M421699L791266
$$ plain form
3310 19687595 20698820 15326346 5460627 -2750468 -7556611 -12329691 -16844980 -15073011
3302 -15073011 -4294391 9478311 18444433 21232564 21926255 24847043 32095424 42120000
3294 42120000 48834775 46242399 35883055 25724637 19942049 14417961 4860753 -5580837
3286 -5580837 -11106813 -12291763 -15323475 -23175426 -31298435 -32433727 -23764771 -9097313
3278 -9097313 4868897 13715193 16501963 12911593 2535577 -11364976 -21373091 -23623577
3270 -23623577 -23412503 -27806440 -34625187 -35183082 -26954831 -16175587 -7669955 -178057
3262 -178057 6415898 7671660 2519694 -2522380 -2150571 510131 587763 -314023 1235771
3253 1235771 2394639 -1988537 -9830415 -13326736 -9522315 -3940489 -3397221 -8728368
$$ packed form
3310A9687595J011225n372474r865719q211095m806143m773080m515289J771969
3302a5073011J0778620J3772702Q966122K788131O93691K920788P248381J0024576
3294D2120000O714775k592376j0359344j0158418n782588n524088r557208j0441590
3286e580837n525976j184950l031712p851951q123009j135292Q668956J4667458
3278i097313J3966210Q846296K786770l590370j0376016j3900553j0008115k250486
3270b3623577K11074m393937o818747n57895Q228251J0779244Q505632P491898
3262a78057O593955J255762n151966n042074L71809K660702P7632r01786J549794
3253A235771J158868m383176p841878l496321L804421N581826N43268n331147
$$ plain form
3245 -8728368 -14354231 -12701968 -627573 16084640 26640713 25895555 18383496 9978159
3237 9978159 727180 -9819353 -15819168 -11272575 -314532 6200086 3821044 -1865121
3229 -1865121 -3909343 -158190 8569794 19596821 26988248 25419686 17095163 9643590
3221 9643590 5973171 1657787 -6090963 -12696564 -12379072 -5456637 3469155 10754760
3213 10754760 14487740 14004268 11874155 12956560 17991483 21047111 17089114 9608752
3205 9608752 6319540 8613261 10052693 5769437 -824192 -2877385 891720 5146994
3197 5146994 5335941 2719592 283714 -3348996 -11302965 -20312224 -21433112 -12107958
3189 -12107958 -2325325 -2913583 -10746407 -12687701 -3524291 7379287 8924235 1438969
$$ packed form
3245h728368n625863J652263J2074395J6712213J0556073p45158p512059q405337
3237I978159r250979j0546533n999815M546593J0958043O514618k379042n686165
3229a865121k044222L751153Q727984J1027027P391427j568562q324523p451573
3221I643590l670419m315384p748750o605601L17492O922435Q925792P285605
3213A0754760L732980m83472k130113J082405N034923L055628l957997p480362
3205I608752l289212K293721J439432m283256o593629k053193L769105M255274
3197E146994J88947k616349k435878l632710p953969r009259j120888R325154
3189a2107958R782633n88258p832824j941294R163410J0903578J544948p485266
$$ plain form
3181 1438969 -6062817 -6933575 -1547851 5682938 10202373 9884191 6246699 2350770 -790545
3172 -790545 -3700669 -5109456 -3235019 -351474 -786417 -3386402 -2074194 3925505 7218329
3163 7218329 3498841 -1160466 -134275 2781725 -24572 -6992432 -10074856 -7871031
3155 -7871031 -6456788 -7596793 -6014219 -590024 653696 -8386582 -21717559 -27146632
3147 -27146632 -19087248 -2255098 14080779 22513163 21408850 16026448 14061653 17742305
3139 17742305 21924990 21305454 16918073 13740230 14460012 17655874 19887979 17740733
3131 17740733 10115953 511737 -4971566 -3687925 1187482 5314830 7719728 9506279
3123 9506279 10888654 11079282 8737909 1874427 -9255070 -18643207 -18968898 -11321781
$$ packed form
3181A438969p501786q70758N385724P230789M519435l18182l637492l895929l141315
3172g90545k910124j408787J874437K883545m34943k599985J312208N999699L292824
3163G218329l719488m659307J026191K916000k806297o967860l082424K203825
3155g871031J414243j140005J582574N424195J243720r040278j3330977n429073
3147b7146632Q059384J6832150J6335877Q432384j104313n382402j964795L680652
3139A7742305M182685o19536m387381l177843P19782L195862K232105k147246
3131A7740733p624780r604216n483303J283641M875407M127348K404898J786551
3123I506279J382375J90628k341373o863482j1129497r388137l25691P647117
$$ plain form
3115 -11321781 -4934381 -4498478 -4140413 1548157 7265764 4817821 -4077233 -11115890
3107 -11115890 -13961336 -16752167 -20533962 -22393756 -22938105 -25278308 -26829990 -21843751
3099 -21843751 -12971574 -10258157 -16210106 -21525128 -18934738 -11629290 -3893692 5997687
3091 5997687 17045187 20031619 10317119 -1669646 -3351615 2257591 2799565 -3540645
3083 -3540645 -6467344 -609063 7613781 11665302 13465550 17031687 21109691 21929318
3075 21929318 18474517 12758959 8681587 10948092 20365118 30124833 32045411 26618045
3067 26618045 21401710 19790181 17976811 13349187 8543090 5662056 3476924 2149476
3059 2149476 3622250 5360525 1609299 -6133750 -8235419 -976731 6569076 5454687
$$ packed form
3115a1321781O387400M35903L58065N688570N717607k447943q895054p038657
3107a1115890k845446k790831l781795j859794n44349k340203j551682M986239
3099b1843751Q872177K713417n951949n315022K590390P305448P735598R891379
3091E997687J1047500K986432r714500j1986765j681969N609206N41974o340210
3083c540645k926699N858281Q222844M051521J800248L566137M078004Q19627
3075B1929318l454801n715558m077372K266505R417026R759715J920578n427366
3067B6618045n216335j611529j813370m627624m806097k881034k185132j327448
3059B149476J472774J738275l751226p743049k101669P258688P545807j114389
$$ plain form
3051 5454687 -923759 -4507555 -5358414 -7887602 -9831852 -5618258 1516939 1018607 -10650015
3042 -10650015 -25020855 -32399799 -31457970 -26637762 -21371185 -16171539 -10392905 -4549726
3034 -4549726 -2114717 -7466303 -19657490 -30850690 -34739366 -33935597 -34499928 -36068066
3026 -36068066 -33405628 -25622877 -16893842 -8983687 -381358 6956343 7531961 844250
3018 844250 -6346670 -8599931 -7251285 -5314241 -2491999 2056422 6934480 11341676
3010 11341676 16216235 19812772 16771590 5206920 -8895217 -17880136 -20193155 -19130308
3002 -19130308 -16958811 -13557831 -8519110 -1646831 6708064 13690443 14897031 9805138
2994 9805138 3867877 2523424 4994374 6282718 3388228 -2579697 -8550588 -11623372
$$ packed form
3051E454687o378446l583796q50859k529188j944250M213594P135197m98332j1668622
3042a0650015j4370840p378944R41829M820208N266577N199646N778634N843179
3034d549726K435009n351586j2191187j1193200l888676Q03769n64331j568138
3026c6068066K662438P782751Q729035P910155Q602329P337701N75618o687711
3018H44250p190920k253261J348646J937044K822242M548421M878058M407196
3010A1341676M874559L596537l041182j1564670j4102137q984919k313019J062847
3002a9130308K171497L400980N038721O872279Q354895O982379J206588n091893
2994I805138n937261j344453K470950J288344k894490n967925n970891l072784
$$ plain form
2986 -11623372 -10608052 -7063701 -3498387 -150140 4154379 8236450 9776122 10736203
2978 10736203 16150040 25416906 30436542 26034977 17314924 12427111 12719435 14936403
2970 14936403 18468455 23914063 27757700 25721517 20138796 17754952 20789379 25384181
2962 25384181 27954118 28020204 26103505 24199387 26631935 34021251 37790093 28373812
2954 28373812 9010291 -6463266 -10647289 -9392119 -9616167 -9320733 -4562653 1466659
2946 1466659 3376421 2358601 2832741 3922100 1547416 -3174401 -4886240 -2554180
2938 -2554180 -98230 1864543 7707973 17744071 23941772 19785574 10613911 7939307
2930 7939307 14181524 18929098 12465469 -1504526 -10888966 -10613245 -7372720 -8575285
$$ packed form
2986a1623372J015320L544351L565314L348247M304519M082071J539672R60081
2978A0736203N413837R266866N019636m401565q720053m887813K92324K216968
2970A4936403L532052N445608L843637k036183n582721k383844L034427M594802
2962B5384181K569937O6086j916699j904118K432548P389316L768842r416281
2954B8373812j9363521j5473557m184023J255170k24048K95434M758080O029312
2946A466659J909762j017820M74140J089359k374684m721817j711839K332060
2938b554180K455950J962773N843430J0036098O197701m156198r171663k674604
2930G939307O242217M747574o463629j3969995r384440K75721L240525j202565
$$ plain form
2922 -8575285 -12420284 -12477994 -7680374 -2294311 1633935 5558558 8712826 7507256 1923033
2913 1923033 -3104624 -4742821 -5555356 -7338784 -7178460 -3459973 -724896 -3233532 -7385211
2904 -7385211 -6449475 -547865 3971673 3912701 2330882 2483166 3667534 3428597 -133638
2895 -133638 -8081834 -18496363 -24942821 -21817115 -11574429 -2206331 2638197 6058452
2887 6058452 10146614 12018926 9751805 6580253 5768868 5860649 4573783 3227808 3344498
2878 3344498 2681712 -852077 -4551570 -4943158 -3625866 -3842103 -3625054 1351427 9011012
2869 9011012 11579153 6159154 -813954 -1661483 4208352 12079466 18264201 21993295
2861 21993295 23635812 23881235 23604328 22899398 21017743 17806807 13974592 9925213 6238150
$$ packed form
2922h575285l844999n7710M797620N386063L928246L924623L154268j205570n584223
2913A923033n027657j638197q12535j783428J60324L718487K735077k508636m151679
2904g385211R35736N901610M519538n8972j581819J52284J184368k38937l562235
2895a33638p948196j0414529o446458L125706J0242686R368098M844528L420255
2887F058452M088162J872312k267121l171552q11385R1781j286866j345975J16690
2878C344498o62786l533789l699493l91588J317292k16237K17049M976481P659585
2869I011012K568141n419999o973108q47529N869835P871114O184735L729094
2861B1993295J642517K45423k76907p04930j881655l210936l832215m049379l687063
$$ plain form
2852 6238150 5040866 7723825 10403084 5175929 -11225099 -31341253 -41829787 -34715898
2844 -34715898 -14194320 6299064 14207963 7880911 -2464731 -5479924 -294890 5028229
2836 5028229 5586800 4911495 6889234 8469742 4890618 -1747466 -4440473 -59112 8077222
2827 8077222 14883662 16867884 12561792 4175649 -2069860 -1595113 3086187 6413147
2819 6413147 7987557 11730018 17634806 20632089 18753913 16392894 16803310 16454901 10486560
2810 10486560 157048 -8684585 -11892804 -8904408 -1214438 7709234 13428515 14954447
2802 14954447 16229270 19837406 21419972 14920087 2568812 -5293120 -1753463 8420808
2794 8420808 13780816 7853257 -5209193 -15393326 -16247653 -9980719 -3853014 -2434327
$$ packed form
2852F238150j197284K682959K679259n227155j6401028k0116154j0488534P113889
2844c4715898K0521578K0493384P908899o327052j0345642l015193N185034N323119
2836E028229N58571o75305J977739J580508l579124o638084k693007M381361Q136334
2827H077222O806440J984222m306092q386143o245509M74747M681300L326960
2819F413147J574410L742461N904788K997283j878176k361019M10416l48409n968341
2810A0486560j0329512q841633l208219K988396P689970Q923672N719281J525932
2802A4954447J274823L608136J582566o499885j2351275p861932L539657J0174271
2794H420808N360008n927559j3062450j0184133q54327O266934O127705J418687
$$ plain form
2786 -2434327 -4783951 -8655960 -13860034 -19391540 -20724484 -14692040 -6068924 -4243747
2778 -4243747 -12077013 -21939039 -24937174 -21044136 -17248771 -17908009 -20838626 -22623488
2770 -22623488 -23729122 -26197370 -28539074 -26301540 -18004408 -7945465 -1468916 1197420
2762 1197420 4427384 11057010 18705783 22315111 18838418 9540432 -541111 -5520819
2754 -5520819 -3494828 905122 968849 -4507373 -10569573 -13428249 -14581210 -15839586 -14698706
2745 -14698706 -8818861 -2077015 -956420 -6106885 -12153459 -15040070 -14697271 -11069181
2737 -11069181 -3686906 3413240 2444837 -8691675 -21594825 -25824058 -19698220 -9645597
2729 -9645597 -1692534 2425503 2872674 477655 -2132796 -2191766 -520648 -917215 -5184334
$$ packed form
2786b434327k349624l872009n204074n531506j332944O032444Q623116J825177
2778d243747p833266r862026k998135L893038L795365o59238k930617j784862
2770b2623488j105634k468248k341704K237534Q297132J0058943O476549K666336
2762A197420L229964O629626P648773L609328l476693r297986j0081543m979708
2754e520819K025991M399950O3727n476222o062200k858676j152961j258376J140880
2745a4698706N879845O741846J120595n150465o046574k886611L42799L628090
2737a1069181P382275P100146r68403j1136512j2903150m229233O125838J0052623
2729i645597P953063M118037M47171k395019k610451n8970J671118l96567m267119
$$ plain form
2720 -5184334 -11077088 -15574282 -17668782 -17322302 -14549441 -11074668 -10344017 -13487479 -16900874
2711 -16900874 -16466156 -13215956 -11954831 -14502629 -17453538 -17541319 -16267903 -17035590 -19747330
2702 -19747330 -21276557 -20618325 -20538875 -23543678 -28428987 -31624729 -30180583 -22907662 -11012813
2693 -11012813 805432 5955979 1253749 -9691190 -19598626 -23205126 -19196751 -9163503
2685 -9163503 2345444 8403756 4790321 -4720178 -11313562 -10477316 -5752706 -2244370
2677 -2244370 229942 5080670 12723910 19993108 24674583 27062210 26957249 22665925
2669 22665925 14598348 7449153 6362384 11686769 19197991 24686878 26286297 22965211
2661 22965211 14185390 2589794 -5752450 -6850858 -3466766 -1505668 -2682239 -4260751
$$ packed form
2720e184334n892754m497194k094500L46480K772861L474773P30651l143462l413395
2711a6900874M34718L250200J261125k547798k950909q7781J273416p67687k711740
2702a9747330j529227O58232P9450l004803m885309l195742J444146P272921J1894849
2693a1012813J1818245N150547m702230j0944939r907436l606500M008375J0033248
2685i163503J1508947O058312l613435r510499o593384Q36246M724610L508336
2677b244370K474312M850728P643240P269198M681475K387627j04961m291324
2669B2665925q067577p149195j086769N324385P511222N488887J599419l321086
2661B2965211q779821j1595596q342244j098408L384092J961098j176571j578512
$$ plain form
2653 -4260751 -5554846 -9673764 -17128488 -22572634 -21555455 -16914689 -14093502 -13057950
2645 -13057950 -10199607 -6150144 -5132197 -6902265 -6372475 -2828533 -2693557 -9576514
2637 -9576514 -17421892 -18626620 -14503120 -11541403 -10312578 -5517204 3320671 8760829
2629 8760829 5890237 344586 1135676 8160783 12096895 6919730 -1892157 -4283778
2621 -4283778 1599403 7475539 6016390 16762 -2234384 1739085 6189468 5707157
2613 5707157 1833580 -429367 566881 2134164 1206259 -2453924 -5627472 -3665825 4378405
2604 4378405 12121965 11187361 1869404 -5841978 -4753423 646628 2088991 -470063
2596 -470063 -1366318 -279676 -2171698 -6932466 -8010709 -3277812 636838 -1614669 -6367817
$$ packed form
2653d260751j294095m118918p454724n444146J017179M640766K821187J035552
2645a3057950K858343M049463J017947j770068N29790L543942J34976o882957
2637i576514p845378j204728M123500K961717J228825M795374Q837875N440158
2629H760829k870592n545651P91090P025107L936112n177165q811887k391621
2621d283778N883181N876136j459149n999628k251146L973469M450383m82311
2613E707157l873577k262947R96248J567283r27905l660183l173548J961647Q044230
2604D378405P743560r34604r317957p711382J088555N400051J442363k559054
2596d70063q96255J086642j892022m760768j078243M732897L914650k251507m753148
$$ plain form
2587 -6367817 -7769822 -6945869 -9142386 -15539639 -22827869 -27942591 -28742563 -22943155 -11291725
2578 -11291725 328659 6461801 7764962 7193528 3697464 -4692923 -14137539 -18261605
2570 -18261605 -17137811 -16258257 -17108787 -16107344 -13181515 -13090457 -16089255 -15730483 -10137319
2561 -10137319 -7521003 -14027869 -22346940 -20443961 -7953976 4076996 7781927 5184605
2553 5184605 1311352 -1459296 -1089550 4872532 14566022 21053714 19431358 11899525
2545 11899525 4125992 -284013 -127080 5095398 14448952 24717419 31873042 32627243
2537 32627243 25365042 12603502 2102548 905695 6787802 9576063 2847996 -9332884
2529 -9332884 -19125583 -24034033 -26451378 -28175850 -29364097 -30052006 -28927042 -23223327
$$ packed form
2587f367817j402005Q23953k196517o397253p288230n114722p99972N799408J1651430
2578a1291725J1620384O133142J303161n71434l496064q390387r444616m124066
2570a8261605J123794Q79554q50530J001443K925829R1058k998798L58772N593164
2561a0137319K616316o506866q319071J902979J2489985J2030972L704931k597322
2553E184605l873253k770648L69746N962082R693490O487692j622356p531833
2545A1899525p773533m410005J56933N222478R353554J0268467P155623P54201
2537C2627243p262201j2761540j0500954j196853N882107K788261o728067j2180880
2529i332884r792699m908450k417345j724472j188247o87909J124964N703715
$$ plain form
2521 -23223327 -13599825 -6194586 -5188682 -5934685 -1220943 7104110 9222918 467143
2513 467143 -12473480 -19978090 -19086734 -12554240 -3245765 6427926 12096949 9054970
2505 9054970 -2851969 -17343074 -25293007 -20900293 -5849959 12085145 25192412 30470913
2497 30470913 28361758 19781885 7281767 -3103907 -6065948 -3236115 -1136299 -2653739
2489 -2653739 -4997415 -6752312 -11214866 -19679678 -26328275 -24658512 -16326735 -9021688
2481 -9021688 -7195518 -9131636 -11826250 -13908743 -13819217 -9965963 -4136049 -812899 -893708
2472 -893708 755120 8551926 19252472 25327611 24245891 20321546 16855102 10955798
2464 10955798 -600625 -13255369 -17471637 -9938486 2101303 9232947 9212568 5724476
$$ packed form
2521b3223327R623502P405239J005904p46003M713742Q325053K118808q755775
2513D67143j2940623p504610Q91356O532494R308475R673691N669023l041979
2505I054970j1906939j4491105p949933M392714J5050334J7935104J3107267N278501
2497C0470913k109155q579873j2500118j0385674k962041K829833K099816j517440
2489b653739k343676j754897m462554q464812o648597J669763Q331777P305047
2481i021688J826170j936118k694614k082493Q9526L853254N829914L323150q0809
2472h93708J648828P796806J0700546O075139j081720l924345l466444n899304
2464A0955798j1556423j2654744m216268P533151J2039789P131644k0379l488092
$$ plain form
2456 5724476 1121636 -5417651 -13542694 -19647418 -20203380 -15252905 -8118796 -2886741
2448 -2886741 -1880421 -4146837 -6671593 -8095673 -10187986 -14323246 -18194838 -18246394 -13894022
2439 -13894022 -6914529 1432075 9202801 11536852 4822043 -6491072 -11849305 -5373062
2431 -5373062 7751453 16755777 15489383 7205125 1063316 3258230 9865418 10387249
2423 10387249 738072 -10870588 -15406213 -15891694 -20956561 -28724309 -28311112 -18036978
2415 -18036978 -10219584 -13215727 -19170219 -16815312 -7945046 -2183185 -1393040 755684
2407 755684 6533525 10499238 7712568 -815944 -10395421 -15434866 -11477653 283638
2399 283638 11559848 14516604 9589865 2516422 -3020383 -4977200 583518 14933795
$$ packed form
2456E724476m602840o539287q125043o104724n55962M950475P134109N232055
2448b886741J006320k266416k524756j424080k092313m135260l871592n1556M352372
2439a3894022O979493Q346604P770726K334051o714809j1313115n358233O476243
2431e373062J3124515R004324j266394q284258o141809K194914O607188N21831
2423A0387249r649177j1608660m535625m85481n064867p767748M13197J0274134
2415a8036978P817394k996143n954492K354907Q870266N761861P90145K148724
2407G55684N777841L965713k786670q528512r579477n039445L957213J1761291
2399B83638J1276210K956756m926739p073443n536805j956817N560718J4350277
$$ plain form
2391 14933795 30360183 36169936 31213016 24214325 21741268 22151415 21780866 20433138
2383 20433138 18737410 15312324 9177740 1996459 -3271739 -3930219 1163473 8714410
2375 8714410 11410627 5971903 -827055 265569 8496882 14354464 12779439 8431556
2367 8431556 7158982 8806211 10261965 10096423 8212857 5360496 4091207 5874038
2359 5874038 7150717 3384150 -3282878 -6764647 -7370917 -11556565 -19810197 -23178855
2351 -23178855 -15611236 -2706750 6139401 8157103 5511507 -578906 -8647167 -14798185
2343 -14798185 -17053010 -18099119 -19575864 -18251625 -12587294 -8220757 -10920620 -17741877
2335 -17741877 -21269834 -19863596 -17866131 -18131699 -20414975 -25346227 -33567386 -41239055
$$ packed form
2391A4933795J5426388N809753m956920o998691k473057M10147l70549j347728
2383B0433138j695728l425086o134584p181281n268198o58480N093692P550937
2375H714410K696217n438724o798958J092624Q231313N857582j575025m347883
2367H431556j272574J647229J455754j65542j883566k852361j269289J782831
2359E874038J276679l766567o667028l481769o06270m185648q253632l368658
2351b3178855P567619J2904486Q846151K017702k645596o090413q068261o151018
2343a4798185k254825j046109j476745J324239N664331M366537k699863o821257
2335a7741877l527957J406238J997465k65568k283276m931252q221159p671669
$$ plain form
2327 -41239055 -42092991 -34898593 -25147992 -18853823 -17230328 -16718627 -11517752 2389975
2319 2389975 22001738 36934495 38085435 26737305 12673060 4311240 3360123 7258244
2311 7258244 12361571 14927592 13198794 9636745 8390139 9899256 10421977 7484126
2303 7484126 3449711 2553396 5826343 9955406 10516538 5915548 -1398571 -7320703 -9704899
2294 -9704899 -9676806 -9886898 -11975281 -15144236 -16635406 -14760733 -12210933 -14116981 -21079491
2285 -21079491 -27145896 -27823801 -26469549 -27601237 -27501895 -19285982 -5431732 4083499
2277 4083499 6337741 8184369 12593669 13201029 7047069 2121556 4984229 9988795
2269 9988795 9605702 7738354 12592765 22218715 28154559 29468244 31858525 34919052
$$ packed form
2327d1239055q53936P194398R750601O294169J623495N11701N200875J3907727
2319B389975J9611763J4932757J150940j1348130j4064245q361820r51117L898121
2311G258244N103327K566021j728798l562049j246606J509117N22721k937851
2303G484126m034415q96315L272947M129063N61132m600990p314119n922132k384196
2294i704899K8093k10092k088383l168955j491170J874673K549800j906048o962510
2285b1079491o066405o77905J354252j131688R9342Q215913J3854250R515231
2277D083499K254242J846628M409300O07360o153960m925513K862673N004566
2269I988795l83093j867348M854411R625950N935844J313685K390281L060527
$$ plain form
2261 34919052 31659685 20849537 9768812 3455681 73830 -1642366 707520 5991331
2253 5991331 7317173 1389101 -5869873 -7593981 -5468702 -6204886 -10961247 -12802433
2245 -12802433 -5112267 9525588 20398159 19369220 9453754 266712 -3909639 -6237649
2237 -6237649 -7379576 -1957466 10482465 19194961 15062846 3833704 -2619538 -3509150
2229 -3509150 -6943309 -13512052 -14033986 -4018236 10133195 20939306 26744703 27229948
2221 27229948 20962283 10076647 32502 -7324937 -13788196 -17331788 -12791639 -1317711
2213 -1317711 9118746 14298050 16640606 16504375 10512734 1122800 -2484988 2616469
2205 2616469 8660547 10236015 12057753 18192089 23469347 23023259 21483361 24022816
$$ packed form
2261C4919052l259367j0810148j1080725o313131l381851j716196K349886N283811
2253E991331J325842n928072p258974j724108K125279p36184m756361j841186
2245a2802433P690166J4637855J0872571j028939r915466r187042m176351k328010
2237f237649j141927N422110J2439931Q712496m132115j1229142o453242q89612
2229c509150l434159o568743n21934J0015750J4151431J0806111N805397M85245
2221B7229948o267665j0885636j0044145p357439o463259l543592M540149J1473928
2213a317711J0436457N179304K342556j36231n991641r389934l607788N101457
2205B616469O044078J575468J821738O134336N277258m46088j539898K539455
$$ plain form
2197 24022816 25725135 19181217 6764062 -3911573 -11749696 -19905867 -25831656 -23854458
2189 -23854458 -16154542 -12019125 -15853006 -22696484 -25812158 -23356766 -17866757 -13668211
2181 -13668211 -14110346 -17850070 -19507689 -16752679 -13316819 -11776157 -8630771 -1969938
2173 -1969938 1439202 -5310569 -17090101 -21783679 -16244918 -9228291 -8369435 -11283081
2165 -11283081 -10735477 -3414532 7387998 14220710 11161919 456018 -8387549 -9867044
2157 -9867044 -9647788 -15232664 -23302863 -24228923 -17263347 -12238943 -15221680 -20282238 -18149214
2148 -18149214 -7493030 4850270 11067096 8619580 2623857 1770725 8204071 12822746
2140 12822746 5676453 -10331515 -22293649 -23001098 -16740064 -9576794 -2363429 4347135
$$ packed form
2197B4022816J702319o543918j2417155j0675635p838123q156171n925789J977198
2189b3854458P699916M135417l833881o843478l115674K455392N490009M198546
2181a3668211m42135l739724j657619K755010L435860J540662L145386O660833
2173a969938L409140o749771j1779532m693578N538761P016627Q58856k913646
2165a1283081N47604P320945J0802530O832712l058791j0705901q843567j479495
2157i867044K19256n584876q070199r26060O965576N024404k982737n060558K133024
2148a8149214J0656184J2343300O216826k447516n995723q53132O433346M618675
2140A2822746p146293j6007968j1962134p07449O261034P163270P213365O710564
$$ plain form
2132 4347135 6805039 4462493 3805808 9955891 18136814 19012316 10659694 693473 -2926033
2123 -2926033 34747 3117256 115562 -9384448 -20402432 -27608252 -28961987 -24586626
2115 -24586626 -15169059 -3819042 3459369 3416307 215232 274392 3788964 6033837 5785284
2106 5785284 6451551 8590761 7373764 -543804 -12035178 -21090914 -24020255 -20723248
2098 -20723248 -14914632 -13173960 -18743188 -25709650 -24792073 -15833766 -8617883 -9812165
2090 -9812165 -15588899 -19463951 -20219699 -18045842 -10079208 3738339 15633372 18187022
2082 18187022 14426313 12891549 14930353 14074926 7211800 -770498 -4484096 -4296946
2074 -4296946 -3329179 -3204251 -5197505 -11238811 -20161765 -25767457 -22780180 -13828217 -6824189
$$ packed form
2132D347135K457904k342546o56685O150083Q180923Q75502q352622r966221l619506
2123b926033K960780L082509l001694r500010j1017984p205820j353735M375361
2115b4586626R417567J1350017P278411m3062l201075N9160L514572K244873k48553
2106E785284O66267K139210j216997p917568j1491374r055736k929341L297007
2098b0723248N808616J740672n569228o966462R17577Q958307P215883j194282
2090i812165n776734l875052p55748K173857P966634J3817547J1895033K553650
2082A8187022l760709j534764K038804q55427o863126p982298l713598J87150
2074d296946R67767J24928j993254o041306q922954n605692K987277Q951963P004028
$$ plain form
2065 -6824189 -5227957 -4556801 -308770 4000515 937062 -9602972 -18214098 -16935338
2057 -16935338 -8501020 -1516775 404602 178833 -25649 -1651583 -4685002 -4985829 561784
2048 561784 9183593 15096126 15751099 13554489 12537196 14469519 17348983 17006259 10928756
2039 10928756 878137 -8456295 -12786274 -10274439 -2657574 4376132 4822355 -1183609
2031 -1183609 -7351629 -10240531 -13957233 -21290763 -25306404 -18147043 -5425961 -1493331
2023 -1493331 -9782511 -17966166 -15492848 -6330275 608541 4815378 10474876 15710937
2015 15710937 14218019 4955147 -6698860 -15992637 -21622206 -23137168 -20964580 -18581754
2007 -18581754 -20183835 -25500426 -29077005 -24666169 -10160129 9293053 22647594 21916876
$$ packed form
2065f824189J596232O71156M248031M309285l063453j0540034q611126J278760
2057a6935338Q434318O984245J921377k25769k04482j625934l033419l00827N547613
2048E61784Q621809N912533O54973k196610j017293J932323K879464l42724o077503
2039A0928756j0050619r334432m329979K511835P616865P033706M46223o005964
2031a183609o168020k888902l716702p333530m015641P159361J2721082L932630
2023a493331q289180q183655K473318R162573O938816M206837N659498N236061
2015A5710937j492918r262872j1654007r293777n629569j514962K172588K382826
2007a8581754j602081n316591l576579M410836J4506040J9453182J3354541p30718
$$ plain form
1999 21916876 11784161 5504898 8601423 12365150 7643629 -1499580 -4911184 -1963985
1991 -1963985 -877287 -4690558 -7392566 -4651884 -180683 1010470 -728266 -2911824
1983 -2911824 -5907969 -10954969 -15913054 -16209792 -9517873 1201669 8507595 5319739
1975 5319739 -8413698 -23966484 -31142845 -27414425 -18118910 -8929859 -1452417 4216309
1967 4216309 6757973 5288619 1599987 -1115125 -1500249 -1457456 -3873521 -8120057 -8702521
1958 -8702521 -1126436 10923921 18160329 16439175 10328107 4249853 -3664591 -14643985
1950 -14643985 -22632029 -21797136 -16231686 -13786959 -13132634 -6310019 6838030 16672581
1942 16672581 17534406 14451186 13340324 12939468 10705085 9266780 11193506 12742880
$$ packed form
1999B1916876j0132715o279263L096525L763727m721521r143209l411604K947199
1991a963985J086698l813271k702008K740682M471201J191153j738736k183558
1983b911824k996145n047000m958085k96738O691919J0719542P305926l187856
1975E319739j3733437j5552786p176361L728420R295515R189051P477442N668726
1967D216309K541664j469354l688632k715112l85124M2793k416065m246536n82464
1958h702521P576085J2050357P236408j721154o111068o078254p914444j0979394
1950a4643985p988044Q34893N565450K444727O54325O822615J3148049R834551
1942A6672581Q61825l083220j110862m00856k234383j438305J926726J549374
$$ plain form
1934 12742880 8984382 1677406 -3548398 -5553231 -8096803 -12962948 -16883472 -15478710
1926 -15478710 -8180360 466795 3992813 534073 -3504232 222306 11111884 19634621
1918 19634621 20112923 17751534 18881839 20164726 14736709 5287456 1645535 5405776
1910 5405776 6245439 -2780119 -13465764 -12200990 2283902 17634110 23509250 22128180
1902 22128180 21212133 21687177 17656567 7126560 -2982456 -4913120 225930 4431595
1894 4431595 3086450 -481317 -720579 3467298 9011570 12620888 12434241 8096672 1837212
1885 1837212 -2042504 -1708192 -1133263 -5736986 -14348078 -18671571 -12529951 504575
1877 504575 11073160 14320168 13237256 11934361 9336598 1957539 -9203155 -17928351
$$ packed form
1934A2742880l758498p306976n225804k004833k543572m866145l920524J404762
1926a5478710P298350Q647155L526018l458740m038305L726538J0889578Q522737
1918A9634621M78302k361389J130305J282887n428017r449253l641921L760241
1910E405776Q39663r025558j0685645J264774J4484892J5350208N875140j381070
1902B2128180r16047M75044m030610j0530007j0109016j930664N139050M205665
1894D431595j345145l567767k39262M187877N544272L609318j86647m337569o259460
1885A837212l879716L34312N74929m603723q611092m323493O141620J3034526
1877E04575J0568585L247008j082912j302895k597763p379059j1160694q725196
$$ plain form
1869 -17928351 -19038312 -13332915 -6326451 -3787156 -7862205 -14833602 -16706965 -8332642
1861 -8332642 6000221 15971589 16416545 12071324 9856626 10416632 10139918 7750876 4476504
1852 4476504 160543 -5875944 -11341672 -13061651 -12079220 -12268948 -13991706 -13631230 -9946818
1843 -9946818 -6297635 -4924268 -3035238 2639941 9883857 12678915 8493023 2077417
1835 2077417 1177149 8223880 16910676 18838799 13654385 9337955 11021923 14042752
1827 14042752 12083990 8002452 9912578 18435699 25204087 24217344 17798559 10082071
1819 10082071 1537037 -7212979 -12288284 -11649302 -9387074 -11102442 -17651732 -25892843
1811 -25892843 -32418182 -34279591 -29812626 -21705951 -15731712 -13264369 -8638671 2252093
$$ packed form
1869a7928351j109961N705397P006464K539295m075049o971397j873363Q374323
1861h332642J4332863R971368M44956m345221k214698N60006k76714k389042l274372
1852D476504m315961o036487n465728j719979R82431j89728j722758L60476L684412
1843i946818L649183J373367J889030N675179P243916K795058m185892o415606
1835B077417r00268P046731Q686796J928123n184414m316430J683968L020829
1827A4042752j958762m081538J910126Q523121O768388r86743o418785p716488
1819A0082071q545034q750016n075305O38982K262228j715368o549290q241111
1811b5892843o525339j861409M466965Q106675N974239K467343M625698J0890764
$$ plain form
1803 2252093 14090164 17734694 11728975 3329741 -1164511 -2481073 -4350696 -7472118
1795 -7472118 -9539412 -9296945 -8233284 -8050560 -7855455 -5476363 -1349836 1616633 3260073
1786 3260073 7444961 14575323 16855471 7794063 -5631563 -8943497 1021351 11969967
1778 11969967 13178904 7554424 2321820 -2797821 -10295520 -15358979 -11832839 -3533664
1770 -3533664 283868 -1533240 -2528590 -1362912 -3918303 -11657784 -17437575 -16247230
1762 -16247230 -12345908 -11228760 -10604556 -4876154 5024207 11525534 9000119 -654119
1754 -654119 -10089255 -12241249 -5324924 5815261 13609711 13799633 7509286 -1480009
1746 -1480009 -9239980 -12019395 -7575996 2114019 11177853 14259460 10106637 1091203
$$ packed form
1803B252093J1838071L644530o005719q399234m494252j316562j869623l121422
1795g472118k067294K42467J063661J82724J95105K379092M126527K966469J643440
1786C260073M184888P130362K280148r061408j3425626l311934R964848J0948616
1778A1969967J208937n624480n232604n119641p497699n063459L526140Q299175
1770c533664L817532j817108r95350J165678k555391p739481n779791J190345
1762a6247230L901322J117148O24204N728402R900361O501327k525415r654238
1754f54119r435136k151994O916325J1140185P794450J89922o290347q989295
1746a480009p759971k779415M443399R690015R063834L081607m152823r015434
$$ plain form
1738 1091203 -9075115 -16886733 -20061854 -18094242 -11833547 -3231472 4272638 7279325
1730 7279325 6101607 4978758 6406689 7496029 5132586 2429658 5219952 12894275
1722 12894275 17774826 14304771 4807969 -4546722 -9471361 -8435450 -2359030 4375509
1714 4375509 6112123 1759574 -3654357 -4854427 -1495641 3660535 8617426 11906852
1706 11906852 11021896 4346308 -5706439 -13285909 -13303757 -5664274 3430035 5346418
1698 5346418 -3066941 -15505426 -22800846 -22930466 -20752705 -18599607 -13503721 -5728832
1690 -5728832 -3188290 -11929548 -26513396 -35997652 -37075513 -35400064 -35668933 -37058854
1682 -37058854 -38279218 -40283678 -42211896 -40588600 -35443019 -32225972 -34080837 -36530899
$$ packed form
1738A091203j0166318p811618l175121J967612O260695Q602075P504110L006687
1730G279325j177718j122849J427931J089340k363443k702928K790294P674323
1722A2894275M880551l470055r496802r354691m924639J035911O076420O734539
1714D375509J736614m352549n413931j200070L358786N156176M956891L289426
1706A1906852q84956o675588j0052747p579470j7848P639483R094309J916383
1698E346418q413359j2438485p295420j29620K177761K153098N095886P774889
1690e728832K540542q741258j4583848r484256j077861J675449k68869j389921
1682c7058854j220364k004460j928218J623296N145581L217047j854865k450062
$$ plain form
1674 -36530899 -34073090 -28211300 -23738427 -20299479 -14449405 -8488694 -9163000 -16357340
1666 -16357340 -20791149 -16409520 -8443943 -4401457 -3164887 227615 3752630 931126
$$ packed form
1674c6530899K457809N861790M472873L438948N850074N960711o74306p194340
1666a6357340m433809M381629P965577M042486J236570L392502L525015k821504
$$ [...]
##END NTUPLES=NMR SPECTRUM
##END=
