##TITLE=31Pdec_LR-788-CR4
 CDCl3, 24 sc
 10.12.2024
##JCAMPDX= 6.0         $$ Bruker NMR JCAMP-DX V2.0
##DATA TYPE= NMR SPECTRUM
##DATA CLASS= NTUPLES
##ORIGIN= UXNMR, Bruker Analytische Messtechnik GmbH
##OWNER= root
$$ XWIN-NMR		Version 3.5
$$ Fri Jan 10 14:34:17 2025 Russian Standard Time (UT+4h)  she@DPX200
##.OBSERVE FREQUENCY= 81.013821
##.OBSERVE NUCLEUS= ^31P
##.ACQUISITION MODE= SIMULTANEOUS
##.ACQUISITION SCHEME= undefined
##.AVERAGES= 24
##.DIGITISER RES= 17
##SPECTROMETER/DATA SYSTEM= spect
##.PULSE SEQUENCE= zgpg30
##.SOLVENT NAME= CDCl3
##.SHIFT REFERENCE= (INTERNAL, CDCl3, 0, 198.062)
##AUDIT TRAIL= $$ (NUMBER, WHEN, WHO, WHERE, WHAT)
$$ ##TITLE= Audit trail, XWIN-NMR		Version 3.5
$$ ##JCAMPDX= 5.01
$$ ##ORIGIN= Bruker BioSpin GmbH
$$ ##OWNER= she
$$ F:/spectra/data/she/nmr/P31/2/pdata/1/auditp.txt
$$ ##AUDIT TRAIL=  $$ (NUMBER, WHEN, WHO, WHERE, WHAT)
(   1,<2025-01-10 14:33:23.54 +0400>,<she>,<DPX200>,
      <created by zg, POWCHK disabled, PULCHK disabled
       configuration hash MD5:
       00 E9 B6 7A A2 85 ED C7 34 08 36 98 17 FE 4E 26
       data hash MD5: 32K
       CB DF 1A 23 CB 11 49 51 D0 52 C3 69 3A FB 60 2C>)
(   2,<2025-01-10 14:33:26.00 +0400>,<she>,<DPX200>,
      <Start of raw data processing
       efp BC_mod = 2 LB = 1.5 FT_mod = 6 PKNL = 1 PHC0 = 2031.504 PHC1 = 326.0856 SI = 64K 
       data hash MD5: 64K
       1E 6E 7A E5 71 81 E8 6A AA 4F FC B2 7D 4C B4 2F>)
(   3,<2025-01-10 14:33:41.82 +0400>,<she>,<DPX200>,
      <pk PHC0 = -2.812324 PHC1 = 0 
       data hash MD5: 64K
       36 04 49 DD B4 89 7A 1E CC 50 DC 50 A1 36 C5 67>)
(   4,<2025-01-10 14:33:47.48 +0400>,<she>,<DPX200>,
      <abs ABSG = 5 
       data hash MD5: 64K
       90 6C 1C 31 76 D5 04 CE A2 CC 2E D4 F4 22 2F 10>)
$$ ##END=
$$ 
$$ hash MD5
$$ 4A 46 AC DD DB 87 4E 53 17 5B C7 11 FF 23 12 93
##$RELAX= 
##$RELAX= 
##$RELAX= 
##$RELAX= 
##$RELAX= 
##$RELAX= 
##$RELAX= 
##$RELAX= 
$$ Bruker specific parameters
$$ --------------------------
##$DU= <F:/spectra>
##$EXPNO= 2
##$NAME= <P31>
##$PROCNO= 1
##$TYPE= <nmr>
##$USER= <she>
##$AMP= (0..31)
100 100 100 100 100 100 100 100 100 100 100 100 100 100 100 100 100 100 
100 100 100 100 100 100 100 100 100 100 100 100 100 100 
##$AQSEQ= 0
##$AQ_mod= 1
##$AUNM= <au_zg>
##$AUTOPOS= <>
##$BF1= 81.014009
##$BF2= 200.13
##$BF3= 200.13
##$BF4= 200.13
##$BF5= 200.13
##$BF6= 200.13
##$BF7= 200.13
##$BF8= 200.13
##$BYTORDA= 1
##$CFDGTYP= 0
##$CFRGTYP= 5
##$CHEMSTR= <none>
##$CNST= (0..31)
1 1 145 1 1 1 1 1 1 1 1 1 1 1 1 1 1 1 1 1 1 1 1 1 1 1 1 1 1 1 1 1 
##$CPDPRG= <waltz16>
##$CPDPRG1= <>
##$CPDPRG2= <waltz16>
##$CPDPRG3= <>
##$CPDPRG4= <mlev>
##$CPDPRG5= <mlev>
##$CPDPRG6= <mlev>
##$CPDPRG7= <mlev>
##$CPDPRG8= <mlev>
##$CPDPRGB= <>
##$CPDPRGT= <>
##$D= (0..31)
0 1 0 0 0 0 0 0 0 0.06 0 0.03 2e-05 3e-06 0 0 0.0002 0 0 0 0 0 0 0 0 0 
0 0 0 0 0 0 
##$DATE= 1736505203
##$DBL= (0..7)
120 120 120 11 120 120 24 19 
##$DBP= (0..7)
150 150 150 150 150 150 150 150 
##$DBP07= 0
##$DBPNAM0= <>
##$DBPNAM1= <>
$$ [...]
##$SUBNAM3= <"">
##$SUBNAM4= <"">
##$SUBNAM5= <"">
##$SUBNAM6= <"">
##$SUBNAM7= <"">
##$SUBNAM8= <"">
##$SUBNAM9= <"">
##$SW= 400.765351723535
##$SWIBOX= (0..15)
0 1 3 0 0 0 0 0 0 0 0 0 0 0 0 0 
##$SW_h= 32467.5324675325
##$TD= 32768
##$TD0= 1
##$TE= 0
##$TE2= 300
##$TE3= 300
##$TEG= 300
##$TL= (0..7)
0 120 53 12 22 120 120 120 
##$TP= (0..7)
150 150 150 150 150 150 150 150 
##$TP07= 0
##$TPNAME0= <>
##$TPNAME1= <>
##$TPNAME2= <>
##$TPNAME3= <>
##$TPNAME4= <>
##$TPNAME5= <>
##$TPNAME6= <>
##$TPNAME7= <>
##$TPOAL= (0..7)
0.5 0.5 0.5 0.5 0.5 0.5 0.5 0.5 
##$TPOFFS= (0..7)
0 0 0 0 0 0 0 0 
##$TUNHIN= 0
##$TUNHOUT= 0
##$TUNXOUT= 0
##$USERA1= <user>
##$USERA2= <user>
##$USERA3= <user>
##$USERA4= <user>
##$USERA5= <user>
##$V9= 5
##$VALIST= <valist>
##$VCLIST= <CCCCCCCCCCCCCCC>
##$VD= 0
##$VDLIST= <DDDDDDDDDDDDDDD>
##$VPLIST= <PPPPPPPPPPPPPPP>
##$VTLIST= <TTTTTTTTTTTTTTT>
##$WBST= 1024
##$WBSW= 4
##$XGAIN= (0..3)
0 0 0 0 
##$XL= 0
##$YL= 0
##$YMAX_a= 1978
##$YMIN_a= -2202
##$ZGOPTNS= <>
##$ZL1= 120
##$ZL2= 120
##$ZL3= 120
##$ZL4= 120
##$ABSF1= 198.0616
##$ABSF2= -202.7028
##$ABSG= 5
##$ABSL= 3
##$ALPHA= 0
##$AQORDER= 0
##$ASSFAC= 0
##$ASSFACI= 0
##$ASSFACX= 0
##$ASSWID= 0
##$AUNMP= <proc_1d>
##$AZFE= 0.1
##$AZFW= 0.5
##$BCFW= 0
##$BC_mod= 2
##$BYTORDP= 0
##$COROFFS= 0
##$CY= -3
##$DATMOD= 1
##$DC= 0
##$DFILT= <>
##$DTYPP= 0
##$F1P= 0
##$F2P= 0
##$FCOR= 1
##$FTSIZE= 65536
##$FT_mod= 6
##$GAMMA= 0
##$GB= 0
##$INTBC= 1
##$INTSCL= 9.790993e-09
##$ISEN= 30
##$LB= 1.5
##$LEV0= 0
##$LPBIN= 0
##$MAXI= 10000
##$MC2= 0
##$MEAN= 0
##$ME_mod= 0
##$MI= 50
##$NCOEF= 0
##$NC_proc= -10
##$NLEV= 6
##$NOISF1= 182.463
##$NOISF2= 159.3651
##$NSP= 0
##$NTH_PI= 0
##$NZP= 0
##$OFFSET= 198.0616
##$PC= 4
##$PHC0= 2028.692
##$PHC1= 326.0856
##$PH_mod= 1
##$PKNL= yes
##$PPARMOD= 0
##$PSCAL= 0
##$PSIGN= 0
##$REVERSE= no
##$SF= 81.0140089999434
##$SI= 65536
##$SIGF1= 159.3651
##$SIGF2= -187.1042
##$SINO= 113.3802
##$SIOLD= 16384
##$SREGLST= <1H.CDCl3>
##$SSB= 0
##$STSI= 65536
##$STSR= 0
##$SW_p= 32467.5324675325
##$SYMM= 0
##$S_DEV= 0
##$TDeff= 32768
##$TDoff= 0
##$TI= <>
##$TILT= no
##$TM1= 0
##$TM2= 0
##$TOPLEV= 0
##$USERP1= <user>
##$USERP2= <user>
##$USERP3= <user>
##$USERP4= <user>
##$USERP5= <user>
##$WDW= 1
##$XDIM= 65536
##$YMAX_p= 203607703
##$YMIN_p= -273417613
$$ End of Bruker specific parameters
$$ ---------------------------------
##NTUPLES= NMR SPECTRUM
##VAR_NAME=  FREQUENCY,     SPECTRUM/REAL,   SPECTRUM/IMAG
##SYMBOL=    X,             R,               I
##VAR_TYPE=  INDEPENDENT,   DEPENDENT,       DEPENDENT
##VAR_FORM=  AFFN,          ASDF,            ASDF
##VAR_DIM=   65536,         65536,           65536
##UNITS=     HZ,            ARBITRARY UNITS, ARBITRARY UNITS
##FACTOR=    0.49542278885378, 1,            1
##FIRST=     16045.7642231865, 0,            0
##LAST=      -16421.768244346, 0,            0
##MIN=       -16421.768244346, -273417613,   0
##MAX=       16045.7642231865, 203607703,    0
$$ Real data points
##PAGE= N=1
##DATA TABLE= (X++(R..R)), XYDATA
$$ [...]
##PAGE= N=2
##DATA TABLE= (X++(I..I)), XYDATA
6582H838410M202979J135071l175059o650387o705657n136967n206547m553438
6574a7251595J793735J0865982J2664304M411739m283525n007309j592136j574584
6566B6611l788894k645149N65179J41015l104854k895642J336652L277041N39518
6557f548523j536543Q29478L847208K888107l24532j462737p59912k002480o053333
6548a1123267r093226p447459k078091K713476M559254N428787P292667P160124
6540b587735R57074p476006p925889J883443R896563M501347q866283j4587622
6532b4205108p950100M32678J575226m96886K077432Q381115J0922863O137019
6524c125761j912308o177475k819186M981771Q973703M910059j037899j59049
$$ y = [8838410, 13041389, 14176460, 11001401, 4351014, -2354643, -7491610, -12698157, -17251595, -15457860, -4591878, 8072426, 12484165, 8200640, 3193331, 1601195, 26611, -3762283, -6407432, -5842253, -5701238, -8806092, -11701734, -10365082, -7088041, -6548523, -8085066, -7255588, -3408380, -520273, -844805, -2307542, -3067454, -5069934, -11123267, -20216493, -27663952, -29742043, -27028567, -22469313, -17040526, -9747859, -2587735, -1630661, -9106667, -17032556, -15149113, -5252550, -751203, -9617486, -24205108, -32155208, -31722530, -30147304, -30644190, -28566758, -20185643, -9262780, -3125761, -5038069, -11215544, -14034730, -9052959, -79256, 4830803, 3792904, 3633855]
6516C633855N402856M960831m088353j1338570q827358k129860J46728o04615
6508a2844486J059061K675552j560186q484142r228481l132537J920345K652599
6500b6942275L641867O463193N977373O31375k960081n11304K969355K349382
6492h381115J030622L348184M883939l86673p493967n719980M378669R740229
6484A399908K965665p406112r387066k885796L633821O090427O561627N474038
6476F446512P71121n476491p751390n959061o293620j0423394j1048031l195549
6468d2929903O316276P788436K812987J266781N967269R087253M831779k164746
6460g023868m223908o16903L446808L778275J23807m578838n648926q70082N007926
$$ y = [3633855, 9036711, 13997542, 9909189, -1429381, -10256739, -12386599, -12239871, -12844486, -11785425, -9109873, -10670059, -19154201, -28382682, -31515219, -29594874, -26942275, -23300408, -16837215, -10859842, -10228467, -13188548, -13699852, -10730497, -8381115, -7350493, -4002309, 881630, 494957, -6999010, -12718990, -8340321, 1399908, 4365573, -3040539, -12427605, -15313401, -11679580, -5589153, 972474, 6446512, 7217633, 1741142, -6010248, -11969309, -18262929, -28686323, -39734354, -42929903, -36613627, -28825191, -26012204, -24745423, -18778154, -9690901, -4859122, -7023868, -11247776, -11864679, -8417871, -4639596, -4515789, -9094627, -14743553, -15613635, -10605709]
6451a0605709M369144k539853o364585j619437M848448L897056k299903l976593
6443a4291432J770258Q073118Q986932N747628J844524j472321l192340j801115
6435E665252J284337K152561J74559r74271K15025L56082k470750m167615l53269
6426A881911O326316Q670707L483690n012178r408151n400843M362560J1480377
6418A6384389R143102k68479p356816o678423k271511n54070j894550k511193
6410C992449r65839J584736M655856P224970N839705o55940o472011n066422J050160
6401A1187664L258372o45794m182515l601212l544640p699041j1114563p683451
6393b4025180J33275N624170P760789R601947R850752M534960l610542o056421
$$ y = [-10605709, -6236565, -8776418, -15141003, -16760440, -11911992, -8014936, -10314839, -14291432, -12521174, -4448056, 4538876, 10286504, 12131028, 10658707, 7466367, 5665252, 6949589, 9102150, 9276709, 8302438, 8517463, 8873545, 6402795, 2235180, 1881911, 8208227, 16878934, 20362624, 15350446, 5942295, 541452, 4904012, 16384389, 25527491, 25259012, 17902196, 11223773, 8952262, 8398192, 6503642, 3992449, 3026610, 4611346, 9267202, 16492172, 22331877, 21675937, 15203926, 10137504, 11187664, 14446036, 13800242, 9617727, 6016515, 2471875, -5227166, -16341729, -24025180, -23891905, -18267735, -10506946, -904999, 8945753, 13480713, 9870171, 3813750]
6385C813750l72921O213759P565453N723990L791018o46559q780477j3597719
6377C710294q360626J294139L285093l457864p096847o10211P758796P042645
6369C565419p42002n071386k716574k75482k015102l778434j069187L623216N360723
6360c118809L842769J799925j05119k215818k373106J353042N702793N249048
6352A0134725K67268l451730l191525k365233l418913l502415p20618P10457k814873
6343h352857o297127k081092P613495J1647722M559231o276483j0621774p233020
6335a7041905k385471p30558j699446k572362j527158J210770L166421J975240
6327a9604469r81793j773893K97713J677784P24096L04200J777403J681036j602560
$$ y = [3813750, 3440829, 9654588, 17220041, 22944031, 26735049, 26088490, 17308013, 3710294, -4650332, -3356193, -71100, -3528964, -10625811, -11236022, -3477226, 3565419, 2823417, -2247969, -4964543, -5240025, -7255127, -11033561, -12102748, -8479532, -3118809, 723960, 2523885, 2418766, 202948, -2170158, -817116, 4885677, 10134725, 10401993, 6950263, 3758738, 1393505, -2025408, -5527823, -6248441, -5537984, -8352857, -14649984, -16731076, -9117581, 2530141, 7089372, 812889, -9808885, -17041905, -19427376, -20157934, -21857380, -24429742, -25956900, -24746130, -21579709, -19604469, -20586262, -22360155, -22062442, -20384658, -19660562, -19356362, -17578959, -15897923, -17500483]
6318a7500483l275942J75074L616353O31544n688809p257707l156046J363007
6310c1093009N148739J0070759J1551060K871958j0095436j2205442j351717O119702
6302a8983386l45193q953537m378843P926093J0935158K539968l565605r30000
6294a5755345K137305k78585k147590J554497M800753J187613m485872l933748
6286a6920972J475015L738288N72086l033804l509127j968705M16314M045991
6278a5184914P349143O766232J900534k780474l052869N19469M325642N947787
6270E790550N180421K364989k117698o727989q906782p422840l790616j72417
6262a5802382L270805O807258P567577J582907r016174j5109979j0782439j292121
$$ y = [-17500483, -20776425, -20601351, -16984998, -16353454, -22042263, -29299970, -32456016, -31093009, -25944270, -15873511, -4322451, -1450493, -11545929, -23751371, -25103088, -18983386, -19328579, -28282116, -32660959, -24734866, -13799708, -11259740, -14825345, -15755345, -13618040, -13896625, -16044215, -14489718, -9688965, -8501352, -12987224, -16920972, -15445957, -11707669, -11135583, -14169387, -17678514, -19647219, -19230905, -15184914, -7835771, -1069539, 830995, -1949479, -5002348, -4482879, -157237, 5790550, 10970971, 13335960, 11218262, 4490273, -4416509, -11839349, -15629965, -15802382, -12531577, -5724319, 1843258, 3426165, -5590009, -20699988, -31482427, -32774548]
6254c2774548M026395M263792N845463J0116739J0204414K382094o805922r213932
6246a1955505n536405k068721j035262L79818L721344P023238P754479M428774
6238B711760k980332j0761377j2015344m027671O555098J0518529O709846J283115
6230b006376j887219l942361m923460k273447K727825L635622k381468r209096
6222b0259980r185355k319728N490838J0217457J1712060J0617224P604843M232195
6214A8109554J025968l673550r585289j1556343n548638L936302Q012840M775678
6206E496522P80992M79941M87168l014797p076901o789407l064594k83140J064231
6197a1919985L676954O794800O164275J025133l875673m490674j710879J767948
$$ y = [-32774548, -28748153, -24484361, -18638898, -8522159, 1682255, 4064349, -2741573, -11955505, -17491910, -19560631, -20595893, -20216075, -16494731, -9471493, -1717014, 2711760, -268572, -11029949, -23045293, -27072964, -20517866, -9999337, -3289491, -2006376, -3893595, -7835956, -12759416, -15032863, -12305038, -8669416, -11050884, -20259980, -29445335, -31765063, -26274225, -16056768, -4344708, 6272516, 13877359, 18109554, 19135522, 15461972, 5876683, -5679660, -11228298, -7291996, 720844, 5496522, 6277514, 6757455, 7244623, 4229826, -2847075, -9636482, -12701076, -12984216, -11919985, -8243031, -1448231, 4716044, 5741177, 1865504, -2625170, -4336049, -2568101]
6189b568101M874829O739200N504419J077042l489126n496806n289805l880662
6181b529010q58152L073753M536748J739417j976271k348509j29782R39811N58684
6172C006689J755043M723807N437874J599518l664641n893326m549049k334740
6164H1175j016199J45418K433387N439205O932446M882965l38528o245032j0678913
6155A635924j2711211j1193861n269048K338224N900421L464637J17077Q50687
6147a4867150L276957K445769j1112J383611N444270N007550q20238l762294Q06792
6138a095845N995665L763658l259156o932912n738344m392517m497731l157422
6130a9314604M37915L905771O582264R186834Q948753K012628q213301j1872324
$$ y = [-2568101, 2306728, 9045928, 14550347, 15627389, 12138263, 6641457, 1351652, -2529010, -3387162, -313409, 4223339, 5962756, 3986485, 1637976, 1508194, 2448005, 3006689, 4761732, 9485539, 14923413, 16522931, 12858290, 6964964, 2415915, 81175, -935024, -789606, 1643781, 7082986, 14015432, 18898397, 18559869, 12314837, 1635924, -11075287, -22269148, -27538196, -25199972, -19299551, -15834914, -15717837, -14867150, -11590193, -9144424, -9155536, -7771925, -2327655, 2679895, 1859657, -1902637, -1095845, 4899820, 8663478, 5404322, -1528590, -7266934, -11659451, -16157182, -19314604, -18876689, -14970918, -8388654, 798180, 9746933, 11759561, 3546260, -8326064]
6122h326064m697927N880766R807980N434847j608932o574857q427602p143516
6114a5655305k937982K118361N015356M827284L154650J695830P67380o8328j208997
6105b291751k750652m172315m455920k990543m2547L622227O628379O697405K433837
6096B678120l849640p086529m722562M47926M124347N391611N713656M964842
6088G661771K020990j256081q16393L400635N573195J122284o314374q485043
6080B906984k742788M440713N146030q98303o471265n237562J502129O658893
6072E304831N265828l24876l789744k657712n65576r88992j825028O47897M695775
6063E762403N049262J495417l03265J771026K027505l942591j0853855j0071656
$$ y = [-8326064, -13023991, -7143225, 2664755, 8099602, 6490670, -84187, -8511789, -15655305, -18593287, -16474926, -11459570, -6632286, -3477636, -1781806, -1014426, -1082754, -2291751, -5042403, -9214718, -13670638, -16661181, -16703728, -13081501, -6453122, 244283, 2678120, -1171520, -8258049, -12980611, -12532685, -8408338, -3016727, 2696929, 7661771, 9682761, 8426680, 7610287, 11010922, 16584117, 17706401, 11392027, 2906984, 164196, 4604909, 9750939, 8852636, 2381371, -2856191, -1354062, 5304831, 10570659, 10245783, 6456039, 3798327, 3232751, 2243759, 418731, 1066628, 5762403, 10811665, 12307082, 12003817, 13774843, 15802348, 11859757, 1005902, -9065754]
6055i065754j409005P239278J0256857Q541387M601944l11046m062638m479365
6047A1311658l290374m201306o352252m987818L60286L957502J945913k695875
6039c952266n057254l321594K381669J0409276J5207255J1028185Q01256n215858
6031B2280669k834969Q59997p39451m782954o777825q701095j1897363j0184318
6023b2777309J32120J0125710R420784K335526O01615L920146J798610o692832
6015a135630j0167710m041931J931528K66951k750724O34120O243939N682692
6007c336765K12489j971514J741099N790219M301133k899018j0152875j0104935
5999a6420167j613931O129763L523633n181551o450072K155262P767547L062133
$$ y = [-9065754, -10474759, -3235481, 7021376, 15562763, 20164707, 19853661, 15791023, 11311658, 8021284, 3819978, -2532274, -7520092, -7159806, -3202304, -1256391, -3952266, -9009520, -12331114, -9949445, 459831, 15667086, 26695271, 27496527, 22280669, 19445700, 20305697, 19566246, 14783292, 8005467, -695628, -12592991, -22777309, -22645189, -12519479, -3098695, -763169, -161554, 3758592, 5557202, -1135630, -11303340, -15345271, -13413743, -13146792, -15897516, -15263396, -9019457, -3336765, -3124276, -5095790, -3354691, 2435528, 6736661, 3837643, -6315232, -16420167, -18034098, -11904335, -8380702, -13562253, -20012325, -17857063, -10089516, -7027383]
5991g027383j791973K826776Q370173K273112r402366j0198018M15880O381173
5983h152626M79205o288925m291452O61423m22019n146292n757110j466544L168281
5974b7216059O038720O627514K784528m527503p754488j493704Q271886J0865836
5966f403270M950835j068083j650732J00561J5341o70860O01951K243131J279298
5957f01828j394741k834372l528085o390758j0186402q979728q71850O669422
5949b8118342N213859k587404n501209R13338P898162O148515p19267j816515
5941a8568863M910157R978545O075039k506187o839206m744930j399622j384496
5933a4479563l695134l768897J484174R950473J4851560J0701799j65365q784318
$$ y = [-7027383, -8819356, -5992580, 2377593, 4650705, -4751661, -14949679, -14533799, -8152626, -7673421, -13962346, -18253798, -17592375, -18014394, -23160686, -28917796, -30384340, -27216059, -21177339, -14549825, -11765297, -16292800, -24047288, -25540992, -17269106, -6403270, -1452435, -2520518, -4171250, -4070689, -4055348, -4726208, -4124257, -1881126, -601828, -1996569, -4830941, -8359026, -14749784, -24936186, -33915914, -34787764, -28118342, -22904483, -25491887, -30993096, -30079758, -22181596, -16033081, -16752348, -18568863, -13658706, -3680161, 2394878, -111309, -6950515, -11695445, -13095067, -14479563, -18174697, -21943594, -20459420, -10508947, 4342613, 15044412, 14879047, 6094729]
5925F094729q707573k511992K311690K454285J365650K927308N156546K522667
5917A1613310n647080j1992106r207553j02601M815810P25258n406675n025217
5909b0226854M74310L516531J983133L02839P45288J114920J137553L590415P393413
5900C1548O756889M06927m604839k468392L249062N709790M508838L767715L915295
5891B1272833J678379k985042n727796m149879j104408m21871k008653k624576
5883C928987l46160K899270L606298J327279n62123j69966q04015n600751j0308081
5874f029262p522567J800630Q137697O682242L461388M386779N745493J884635
5866A8547035l960890m681496j009743K95681k382543m383580l541277k275850
$$ y = [6094729, -2612844, -5124836, -2813146, -358861, 1006789, 3934097, 9090643, 11613310, 5966230, -6025876, -15233429, -15336030, -10520220, -9794962, -15201637, -20226854, -19752544, -16236013, -14252880, -13950041, -13204753, -12089833, -10952280, -7361865, 31548, 6788437, 7195364, 2590525, 122133, 3371195, 9080985, 13589823, 17357538, 21272833, 22951212, 19966170, 14238374, 10088495, 8984087, 8562216, 6553563, 3928987, 3582827, 6482097, 10088395, 11415674, 10853551, 10683585, 9879570, 4278819, -6029262, -13551829, -11751199, -3613502, 3068740, 6530128, 10916907, 16662400, 18547035, 14586145, 9904649, 8894906, 9190587, 6808044, 2424464, -1116813, -3392663]
5858c392663j471436K87333J594290l02767k990353j510844K385300K077491j996335
5849e319984j831454M136425O653369L37909o752211n560112M9382R37234j972837
5840i322279p34603M744244O265681J511484j917175J041476N265064M170829
5832A1024721r38900m944464o709040p400139n319477J121722P373241O428870
5824F36534j058717o186858l562022J110190p40059p687620r326175k96539J1968069
5815a5143197J6259294J0631982K351890k790305n598737p975164q168552m338303
5807a4771092J118242M463929N408439N526285M042859n01358n441278n699897
5799e853871r66631L164042K951859J511691L143315N936926M654408l92002k920755
$$ y = [-3392663, -4864099, -4576766, -2982476, -3285243, -6275596, -7786440, -5401140, -3323649, -5319984, -7151438, -3015013, 3638356, 3976265, -2775946, -8336058, -8286676, -7349442, -9322279, -10056882, -5312638, 953043, 2464527, 547352, 1588828, 6853892, 11024721, 10085821, 5141357, -1567683, -8967822, -14287299, -13165577, -5792336, 636534, -422183, -6609041, -10171063, -9060873, -9800932, -17488552, -26814727, -27111266, -15143197, 1116097, 11748079, 14099969, 11309664, 5710927, -2264237, -10432789, -14771092, -13652850, -9188921, -3780482, 1745803, 5788662, 5287304, -153974, -5853871, -6820502, -3656460, -704601, 807090, 3950405, 9887331, 14541739, 14149737, 11228982]
5790A1228982m00839J140759l927517j0870470r991866j169166M389910m69505
5782a0069712q340660p663387J063585O981306M652180j95973j233821L82474
5774a4424008J490447L230248O781037Q214958L882702k240931k821716K573095
5766F685832O865143M867851r57055m342970j860915M024703O540994Q25971r286354
5757A3363200j3610169q019576p37741j021490n449970l492987N302570R815822
5749c850341M465025k313025j472320L367776L363914j089580k384240R06363
5741I93572K113453j781627m882174j839123L692791M640234O93850k317790j659648
5732c46462q80780k792749l949882K68311P491149J0063042N085190j762249m313967
$$ y = [11228982, 10828143, 11968902, 8041385, -2829085, -12820951, -13990117, -9600207, -10069712, -18410372, -26073759, -25010174, -18028868, -13376688, -13572661, -14806482, -14424008, -12933561, -9703313, -2922276, 5292682, 9175384, 6934453, 4112737, 6685832, 13550975, 18418826, 17461771, 13118801, 11257886, 15282589, 21823583, 22649554, 13363200, -246969, -8266545, -9004286, -10025776, -15475746, -18968733, -13666163, -3850341, 614684, -1698341, -3170661, 197115, 3561029, 2471449, 87209, 993572, 3107025, 1325398, -3556776, -5395899, -1703108, 2937126, 3630976, 1313186, -346462, -1227242, -4019991, -7969873, -7701562, -210413, 9852629, 14937819, 13175570, 8861603]
5723H861603l652430m132039n075682k048500M609437Q466267N607803J4080j980295
5714A0670244N74310L444484L034030k10474l225152l822670k884866k658041
5706D921865k589667N70091O414124Q364362K382475n033562m753038J012251
5698A1288901J755326m300522p016816j261935M119224P38623n777456n676768
5690f131423p14049P15554j478032m62901M377307P077977O466360O849351P480432
5681B4180576K531864o628302r769657k287058P343498R062271L085410l896071
5673B3622531p755672p615737l384320K266582L818077o23794o099419p371976
5665c143728n122574k692862q16774J002923J703976Q05536J70490P45997P91697
$$ y = [8861603, 5209173, 1077134, -3998548, -6047048, -1437611, 7028656, 12636459, 12650539, 10670244, 11244554, 14689038, 17723068, 17512594, 14287442, 10464772, 7579906, 4921865, 2332198, 2902289, 9316413, 17680775, 20063250, 15029688, 10276650, 11288901, 13044227, 8743705, 1726889, 464954, 4584178, 5322801, -454655, -6131423, -6845472, -6129918, -7607950, -8070851, -3693544, 3384433, 9850793, 16700144, 24180576, 26712440, 20084138, 10314481, 8027423, 15370921, 24433192, 27518602, 23622531, 15866859, 8251122, 4866802, 7133384, 10951461, 10327667, 4228248, -3143728, -8266302, -10959164, -11775938, -10773015, -9069039, -8263503, -8093013, -7347016, -6555319]
5656f555319l12915l86189J026001Q18032k217587m649210m023097k313534p67842
5647a9381660K765997P288900O129526k798482j0167181o601256L422672P662477
5639a1679007L264106j267503j00478L207813M130800L954862M928988M715766
5631A1155347j36998q130735j3145363j0040783J91746R783591J0407882K331651
5623B416338n011056m593264n35458o12967l851248k964471K806948O020293K931267
5614c393618j022076k05226L462864N126482L985077K082420K78637j243284j624952
5605G446324j001654o86849j60256K656823O761848P924356N105099K550060K822191
5596C3417942K262395k783519q957955r931590n457665j706262k808403n675781
$$ y = [-6555319, -6868234, -7254423, -6228422, -5410390, -7627977, -12277187, -16300284, -18613818, -19381660, -16615663, -9326763, -3197237, -5995719, -16162900, -22764156, -19341484, -11679007, -8414901, -9682404, -9782882, -6575069, -2444269, 1510593, 6439581, 11155347, 11018349, 2887614, -10257749, -20298532, -20106786, -10323195, 84687, 2416338, -2594718, -7187982, -7723440, -8336407, -12187655, -15152126, -12345178, -6324885, -3393618, -4415694, -4620920, -1158056, 3968426, 7953503, 10035923, 10314560, 9071276, 7446324, 6444670, 5757821, 5597565, 8254388, 15016236, 22940592, 28045691, 30595751, 33417942, 35680337, 32896818, 23938863, 14007273, 8549608, 6843346, 4034943, -1640838]
5588a640838m338713K179399P692324N334578l755663j0362588p799847k47295
5580a2938643L304109J414481P37043M652398Q206240O281697P39303l555501
5572H841127m659340k516256K737376P847622P105554M49179l961129n08331N030026
5563B0365828L613637l787439q269377o043289j706394Q85642L339223P058142
5555A5455973R488390Q561167N896124L056932j049500o298664q861194o201850
5547B0047378j783848q87764l347417m377125k059697J25514p38617k341803j364839
5538C271782K46646k029987o599059n452116M402652J4014334J2783372L136853
5530B3774477k384712J273569N076703J35741q861080j1009957n315310j159641
$$ y = [-1640838, -5979551, -3800152, 3892172, 9226750, 5471087, -4891501, -12691348, -12938643, -9634534, -8220053, -7483010, -2830612, 5375628, 11657325, 12396628, 8841127, 4181787, 1665531, 4402907, 12250529, 19356083, 19805262, 15844133, 15335802, 20365828, 23979465, 20192026, 11922649, 5879360, 4172966, 5058608, 8397831, 15455973, 24944363, 33505530, 39401654, 42458586, 41409086, 35110422, 26249228, 20047378, 18263530, 17375766, 14028349, 9651224, 7591527, 7717041, 6978424, 4636621, 3271782, 3518428, 1488441, -5110618, -10562734, -6160082, 7854252, 20637624, 23774477, 21389765, 22663334, 27740037, 27875778, 19014698, 8004741, 2689431, 1529790]
5522A529790l670004o632313k442434O680623J1758227Q481674J241180l537379
5514A3409364m167385k838015j362170o98298k717110q055879j2225527q927846
5506b7582866O77185P063828M500750q36108n86788K773075J097059m448775m523596
5497b1866236K284713O205544K253555j846062N93535L994237J279472k848543
5489i949785K82454Q169975J0712834N622065p6597k363623m359906q106524j0669528
5480a0738635r675776o330862k153416K039676M109553K708725P00727J451062
5472a7888946L125035J987166p65006j630572j753091l865797m695590O22771
5464b4864030P806996P196490j091074n880995j157815N894809O590129J860867
$$ y = [1529790, -2140214, -8772527, -11214961, -4534338, 7223889, 15705563, 16946743, 13409364, 9241979, 6403964, 5041794, 4343496, 1626386, -6429493, -18655020, -27582866, -26905681, -19841853, -15341103, -16177211, -16763999, -13990924, -12893865, -17342640, -21866236, -19581523, -13375979, -11122424, -12968486, -12374951, -8380714, -7101242, -9949785, -9667331, -1497356, 9215478, 14837543, 14760946, 12397323, 8037417, -69107, -10738635, -20414411, -26745273, -28898689, -26859013, -22749460, -20040735, -19340008, -17888946, -14763911, -12776745, -13541751, -15172323, -16925414, -20791211, -25486801, -24864030, -17057034, -9860544, -10951618, -16832613, -17990428, -12095619, -5505490, -3644623]
5456c644623k680655n114203n598261k863192K403045N681262M597548K344322
5448d874757J743871R71180j336308k218568J15879J955266j92501l782541m417021
5439a2035500k072592N86629K392966K962727J810284R28358L501229P335587
5431E409688N448888l164469r757774p593920j090939K509299M045968P609277
5423C416018J0652124Q081471K401338K62685J163068p71843m713622l155409
5415A7335830M357511P235821j682941j4555683j7544741p978274L081013M607796
5407e143668k393268p909865n346387K006238P027991P854566P668376P531603
5399A1295586M840068o50330m714138m572873k198516M01815M050087P763322
$$ y = [-3644623, -6325278, -11439481, -17037742, -19900934, -17497889, -11816627, -7219079, -4874757, -3130886, -2159706, -3496014, -5714582, -5598703, -3643437, -3835938, -7618479, -12035500, -14108092, -13521463, -11128497, -8165770, -6355486, -5427128, -1925899, 5409688, 10858576, 7694107, -2063667, -9657587, -10748526, -8239227, -4193259, 3416018, 14068142, 22149613, 24550951, 24813636, 25976704, 25204861, 20491239, 17335830, 21693341, 28929162, 27246221, 12690538, -4854203, -12832477, -9751464, -5143668, -7536936, -15446801, -20793188, -18786950, -11758959, -3904393, 3763983, 11295586, 16135654, 15485324, 10771186, 6198313, 3999797, 4401612, 8451699, 16215021]
5391A6215021O880496J9055o972940q531618o317206m312456k339203J33413n66036
5382e791474n848709q671702k247728Q382051J2175432P209819J236074j207920
5374E235843k829928m994751m703133j891383j334827m429222n997864k437767
5366b3383032K534234L269546r06316o152862p809119k928482O662777J3561282
5358a5151972J1767827M707850J292682L996593O629217M378718l02671l229168
5350A4089076l795782k758495k05315K073576J095455k454479m330659l066719
5342F46658j617977j778502k115911k369597m188040o148399l886746L036919
5334a8421595R763006J2797117J2439550Q291327k99559q300090q065892p95363
$$ y = [16215021, 23095517, 23114572, 16141632, 7610014, 1292808, -3019648, -5358851, -5225438, -5791474, -11640183, -20311885, -22559613, -14177562, -2002130, 5207689, 6443763, 5235843, 2405915, -2588836, -7291969, -9183352, -10518179, -14947401, -20945265, -23383032, -20848798, -17579252, -18485568, -24638430, -32447549, -35376031, -28713254, -15151972, -3384145, 1323705, 2616387, 6612980, 13242197, 17620915, 17318244, 14089076, 10293294, 7534799, 7329484, 9403060, 10498515, 8044036, 3713377, 646658, -971319, -2749821, -4865732, -7235329, -11423369, -17571768, -21458514, -18421595, -8658589, 4138528, 16578078, 24869405, 24569846, 16269756, 8203864, 7408501]
5326G408501L732240J836871P46131M441150N484793j633570q862863o288299
5318F864954K033653M904030J165546j446459j037900l050780p879539q407295
5310f853790j794309N306011O159783J884317k496492m488452m392121l369654
5302a0044707k974537l612793l155792p945L280852L115796N07833m69445J166023
5293a2194715K995964L950629M737202M448898J568291k236951l875779l598755
5285d205216l518610k777447N08713L780182K598412j922932m420152l628006
5277a3585056k937919k823384k9603M840423O439451L320784M84934J005993K008486
5268a275891J564981K277149M407594K851270m043541r238708o465614O59495
$$ y = [7408501, 11140741, 12977612, 13723743, 18164893, 23649686, 22016116, 13153253, 6864954, 8898607, 13802637, 14968183, 13521724, 12483824, 9433044, 1553505, -6853790, -8648099, -3342088, 2817695, 4702012, 2205520, -2282932, -6675053, -10044707, -13019244, -16632037, -19787829, -19795774, -16514922, -13399126, -12891293, -13360738, -12194715, -9198751, -5248122, -510920, 3937978, 5506269, 3269318, -606461, -4205216, -7723826, -10501273, -9992560, -6212378, -3613966, -5536898, -9957050, -13585056, -16522975, -19346359, -19375962, -14535539, -8096088, -4775304, -4290370, -3284377, -1275891, 289090, 2566239, 6973833, 9825103, 5781562, -3457146, -9922760, -9263265]
5260i263265N082727O662044R167735J1398998R215669L748820j02043j839060
5252C4071625m870650q870086r757842p131931m908947m108171j528713L312578
5244c792137O130071M490616J057903j447796l319167m377146l062231r66552
5236e286439k218393n604716l845716N014203J1847411Q106281j906285p481377
5228a375031o167419l923042l362585j190347K830865L592297m50362l889219
5220a3934843l096396j471832k133759j963914J821977M813655J763102l973277
5212a8175287m455639J202599N911899M936632J194238m42166R02579L328834
5204e596311N565343P325040Q308925P817037M586417j852268q354648r360664
$$ y = [-9263265, -4180538, 2481506, 11649241, 23048239, 32263908, 36012728, 35910685, 34071625, 29200975, 20330889, 10573047, 3441116, -1467831, -5576002, -7104715, -3792137, 2337934, 6828550, 7886453, 6438657, 3119490, -1257656, -4319887, -5286439, -7504832, -13109548, -16955264, -11941061, -93650, 8012631, 6106346, -1375031, -7542450, -11465492, -14828077, -16018424, -13187559, -9595262, -10045624, -13934843, -17031239, -18503071, -20636830, -22600744, -20778767, -15965112, -14202010, -18175287, -22630926, -21428327, -15516428, -10579796, -9385558, -9827724, -8925145, -5596311, -30968, 7294072, 15602997, 23420034, 28006451, 26154183, 17799535, 8438871]
5196H438871l781758K210490L217664K139382M115198O229319J340673r012807
5188A4897032j4616177j0620427l002281K148796N924757R502666Q770236K127503
5180A5132105l797329l371446q21983k318279m663418q16702O987051R250524
5172A5580523L119786m292774o469745l910237L13446M332774N785167K650845
5164A7109785k737700n646657n588561n835166o187705k661689M292626P762838
5156E07771L354800m930100j0426696j0793081p017218n85182N194759N767727
5148a8927220J159791k419905m59198L814268N016538L709991M170442O610436
5140B675143P053808M156595J241290J048831K287498K440141J154876m18174
$$ y = [8438871, 4657113, 6867603, 10085267, 12224649, 16339847, 22569166, 23909839, 14897032, 280855, -10339572, -13341853, -11193057, -5268300, 4234366, 13004602, 15132105, 11334776, 7963330, 7141347, 4823068, 159650, -657052, 6329999, 15580523, 18700309, 14407535, 7937790, 4027553, 4340999, 8673773, 14458940, 17109785, 14372085, 8725428, 3136867, -2698299, -8886004, -11547693, -7255067, 507771, 3862571, -1067529, -11494225, -22287306, -29304524, -29889706, -24694947, -18927220, -17767429, -20187334, -20646532, -16832264, -11815726, -8105735, -3935293, 2675143, 9728951, 13885546, 15126836, 16175667, 18463165, 20903306, 22058182, 21640008]
5132B1640008j702134k881458m167364n628902o839404o310317k629318K778742
5124e740147N226582J372669n417334o834151J001485J1372525J3453522M793027
5116A9228178o270185j1152861r517709n445990n42536M641361O685795L248520
5108H74573j335282j039874K388399J858004l363809n884991j634954M171970
5100c965964N481626L315740J338252o49521l796066n410464k654669K005164
5092d335902L994144K813048O85171k105891n629255o857314l710671o48701l591703
5083a9387074r867531j0276550k288241N688324O059639J881871L30500J355730
5075b6503332m53999n002244n280266J910338J0053437J1221342O033883R43244
$$ y = [21640008, 19937874, 17056416, 12889052, 7260150, 420746, -5889571, -8518889, -5740147, -513565, 859104, -4558230, -11392381, -10390896, 981629, 14435151, 19228178, 12957993, 1805132, -7712577, -13158567, -13701103, -9059742, -2373947, 874573, -460709, -1500583, 887816, 2745820, -617989, -6502980, -8137934, -3965964, 1515662, 4831402, 6169654, 5520133, 1724067, -3686397, -6341066, -4335902, -341758, 2471290, 3156461, 1050570, -4578685, -11435999, -15146670, -15795371, -19387074, -29254605, -39531155, -41819396, -36131072, -30071433, -28189562, -27859062, -26503332, -26957331, -31959575, -37239841, -35329503, -25276066, -14054724, -8020841, -7077597]
5067g077597j420920l563198n917022m802465Q32004O177349P152001N756412
5059b863436N241924M277462Q01614k140657q14124J463537j572182q158549r681653
5050a3446064l835374J539840Q11054r67730K757754Q583788Q143754J232807
5042D819829l562897q46226N182022P403042M243839m82654l104705l108671k054343
5033H489236j489501j854639k345151j461579J691065N848074P656715M754608
5025B1288828r77952n049941n755781n430552n474527m058967j185506j202717
5017g847115n502933p209287j91307R747301J1204565L261548l935861m413572
5009d886661k035876L10912N681174J2879407J2628888J657767q430824n838224
$$ y = [-7077597, -8498517, -12061715, -17978737, -22781202, -21949198, -15771849, -8619848, -2863436, 2378488, 6655950, 7457564, 5316907, 4502783, 5966320, 4394138, -3764411, -13446064, -17281438, -15741598, -14930544, -15898274, -13140520, -4556732, 3587022, 4819829, 1256932, 410706, 5592728, 12995770, 17239609, 16756955, 13652250, 10543579, 8489236, 6999735, 5145096, 2799945, 1338366, 3029431, 8877505, 16534220, 21288828, 20310876, 15260935, 9505154, 4074602, -1399925, -5458892, -6644398, -7847115, -13350048, -20559335, -20750642, -11003341, 201224, 3462772, -473089, -4886661, -6922537, -6611625, -930451, 11948956, 24577844, 26235611, 17804787, 11966563]
5001A1966563M391063P998295J678835m799573m543300j406931j193151l319774
4993A0772027l941570k013871N80823K273147L406016N223343P108281N414783
4985B8822979k104854j0802907j2896782p937663l727934m490501m860569L47782
4977a7650449P175939Q850959N298532P25999k646417k945711K699169J1325430
4969A2833451J2876786L595584o050474n532051N32985J361273k710346l950947
4961A2956261k363549l376725m591827M59029P580790N956534l533828q589522
4953D497163m592720Q16190L079474N606092P368216J541246r197121j1508208
4945b389668j814171O305337K428002o126010q025818l966745j97529K816508
$$ y = [11966563, 16357626, 24355921, 26034756, 21235183, 16691883, 15284952, 14091801, 10772027, 6830457, 4816586, 5397409, 7670556, 11076572, 16299915, 23408196, 28822979, 26718125, 15915218, 3018436, -4919227, -8647161, -13137662, -17998231, -17650449, -10474510, -1623551, 3674981, 4400980, 1754563, -1191148, 1508021, 12833451, 25710237, 29305821, 23255347, 17723296, 18256281, 19617554, 16907208, 12956261, 10592712, 7215987, 2624160, 3083189, 10663979, 16620513, 13086685, 4497163, -95557, 720633, 3800107, 9406199, 16774415, 18315661, 9118540, -2389668, -4203839, 2101498, 4529500, -1596510, -9622328, -13589073, -13786602, -10970094]
4937a0970094O055788O202041L060466L260497Q168537Q136738k086748j2376679
4929I450546j1862938m841668j027926O19382N720565J0398680P422750O20798
4921A6500189n71462L172044L670457M2472j789655j768038n267500j1246036
4913B742471j2552241p917629l486737k484281k234769q50149J178000M627093
4905b0978242R155346R816302L903555k059858p66396M243402M718674J300149
4897I332932N43175K273804J303305j464553j291948k9041k479023n400933k379226
4888D08492L548879M830969L070204M023477L836177l564744j0187211l975125
4880A991118Q791697J2161221Q099567J1119468J8432723J5708649J2572353L3765391
$$ y = [-10970094, -4914306, 1287735, 4348201, 7608698, 15777235, 23913973, 21827225, 9450546, -2412392, -7254060, -8281986, -7662604, -1942039, 8456641, 15879391, 16500189, 15928727, 19100771, 22771228, 22813700, 21024045, 19256007, 13988507, 2742471, -9809770, -17727399, -21214136, -23698417, -25933186, -26783335, -25605335, -20978242, -11822896, -2006594, 1896961, -162897, -929293, 3314109, 8032783, 9332932, 9876107, 12149911, 13453216, 11988663, 10696715, 10667674, 8188651, 2787718, 408492, 3957371, 8788340, 11858544, 15882021, 19718198, 16153454, 5966243, 1991118, 10782815, 22944036, 31043603, 42163071, 60595794, 76304443, 88876796, 122642187]
4872A22642187O5007012N1399537k3782622r6561883r6939533l9604785L131640
4865a4708447R53595j0991991k507168R943276M231091q007527o560374K193207
4857b5454338O45499q614795j0128224k103275M650358O407440P908417R261009
4849a7427909O076015k92206l888201k918453Q50286O952601J2582003J0046742
4841A1980878k534575j3141376r155593M543450J1327510M718983n750432r904800
4833g915955p848073l985944P30396O688688J1657916J2812454R740121L824541
4825B5704144k587550n952861l912291J218318M207308K857665k14652k041528
4817A9278553l006027n252292q906279j0656791o408842L371072J1477933J0670977
$$ y = [122642187, 187649199, 239048736, 215266114, 118704231, 21764698, -17840087, -14708447, -13754852, -24746843, -27254011, -17310735, -13079644, -21087171, -27647545, -25454338, -24808839, -33423634, -43551858, -45655133, -41004775, -34597335, -26688918, -17427909, -11351894, -11644100, -15532301, -18450754, -17600468, -10647867, 1934136, 11980878, 9446303, -3695073, -12850666, -8307216, 3020294, 7739277, 1988845, -7915955, -15764028, -19749972, -19019576, -12330888, -672972, 12139482, 21879603, 25704144, 23116594, 17163733, 13251442, 14469760, 18677068, 21534733, 21320081, 19278553, 16272526, 11020234, 2113955, -8542836, -14951678, -11580606, -102673, 10568304]
4809A0568304L294211o94797K401709M248923k441804j1177403j0347385r09528
4801e057770M558126j96231p888698r816512n872028N28772Q450383J5151382
4793a42576J3572304J420490j2065127j5486446q507668L4994M094090M228546
4785a2851393K132054j333274l320248j027372K831975K445639k182910m302189
4777a7607718j67739N458843O355157L119485Q52151J503045K431918J353560
4769C298702o39023j249678l19940j58770k545504n646061n309820o41081L532211
4760i678964K462728j693161k772595L53799K571642R91791p70898Q69191L515763
4751d150704L000910o9457j898977j049867J134071L432248M856868M044951J506091
$$ y = [10568304, 13862515, 13167718, 15569427, 19818350, 17376546, 6199143, -4148242, -5057770, -499644, -695875, -8584573, -18401085, -24273113, -23744341, -15293958, -142576, 13429728, 14850218, 2785091, -12701355, -21209023, -21174029, -17079939, -12851393, -10719339, -12052613, -15372861, -16400233, -13568258, -11122619, -13305529, -17607718, -17775457, -12316614, -5961457, -2841972, -1989821, -486776, 1945142, 3298702, 2659679, 1410001, 1090061, 931291, -1614213, -7260274, -12570094, -13211175, -9678964, -7216236, -8909397, -11681992, -11328193, -8756551, -7764760, -8535658, -7666467, -4150704, -1149794, -1219251, -3118228, -4168095, -3034024, 398224, 5255092, 9300043, 10806134]
4742A0806134O8872L79458p52022m306461n602233j533830L095916K623004j15358
4733D663480R14021L672672J505573l992359m358207J110800L344593j397085
4725E463488n640851m335877l154722o370292p072294R36185J0158975R776569
4717b38819K734648J09942K616143J179711n451784p570597j120615M941671K622434
4708a77266l668192n317763j325707L920076Q266930J1178500J0444492N336983
4700B8658053l87384l250011m582577o557737p568355n674844k914487j925072
4692d202414j801458j274886j894169l654390k283654L435852O588876J796551
4684c289692m243520j165526Q433616J1154378J908038r140562j1101806m840780
$$ y = [10806134, 10875006, 11254464, 10502442, 6195981, 593748, -940082, 2155834, 4778838, 4663480, 5577501, 9250173, 10755746, 6763387, 2405180, 3515980, 6860573, 5463488, -177363, -4513240, -7667962, -14038254, -21110548, -20174363, -10015388, -238819, 2495829, 2605771, 5221914, 6401625, 949841, -6620756, -7741371, -2799700, -177266, -3845458, -9163221, -10488928, -6568852, 1698078, 12876578, 23321070, 28658053, 28270669, 25020658, 20438081, 13880344, 6311989, 637145, -2277342, -4202414, -6003872, -7278758, -9172927, -12827317, -15110971, -11675119, -5086243, -3289692, -7533212, -8698738, -265122, 10889256, 12797294, 3656732, -7445074, -12285854]
4676a2285854K576647P547589R143568N910781m80202l760159r67080K705600
4668A0390890K018509n32909q32098j350143n496332q601817m141700L933706
4660d611894N535300Q7761l085815p93366o82464o353772r341686l033012M879373
4651a7399575L314164n220607q745186l261066L875490O513762O132459N177624
4643i612935K429783k590010o729734p175928m189587Q27744N605347N732965
4635a5702355q47831p688190n104837O524796J5467638J3373984M793576j364501
4627I452280l012294k745560j073274J705731J870924k359450n486057j860776
4619c508476M706678N758219M87086m195557m400096k312468P41558N952350J0975629
$$ y = [-12285854, -9709207, -2161618, 6981950, 12892731, 12412529, 8652370, 7685290, 10390890, 12409399, 11876490, 11044392, 9694249, 4197917, -4403900, -8545600, -4611894, 923406, 1011167, -2074648, -2868014, -3550478, -9904250, -19245936, -22278948, -17399575, -14085411, -19306018, -28051204, -31312270, -27436780, -20923018, -14790559, -9612935, -7183152, -9773162, -16502896, -23678824, -27868411, -27040667, -21435320, -15702355, -16550186, -24238376, -29343213, -22818417, -7350779, 6023205, 10816781, 9452280, 6439986, 3694426, 2621152, 4326883, 6197807, 3838357, -1647700, -3508476, 1198202, 6956421, 7443507, 3247950, -1152146, -3464614, -2723056, 3229294, 14204923]
4610A4204923J0295956L802360j958422l392379m005512o458131p589254n022918
4602a23377j993780j035321Q35495N264737O946816J719215m504627k845081N234847
4593I498924R580044N259360k235402n657819l700811L79496K443454n99492p506553
4584G461201j1190556n755837M636392R577470N831495P41266N04442J834992
4576A3640865q35546n789062p464233n773899n572019q009468q174519k322269
4568c0300150O384590J1131571Q708691K322005k180707k205239k27162L53552
4560f012849j61174Q49049L311331M126954K104676l47569j524558k694914m344271
4551d693325m116457j217468R40009Q0059m98596K609583O013448L808489k805031
$$ y = [14204923, 24500879, 28303239, 26344817, 22952438, 18946926, 12488795, 4899541, -123377, -2117157, -3152478, -2316983, 2947754, 9894570, 11613785, 7109158, 4264077, 9498924, 19078968, 24338328, 22102926, 16445107, 12744296, 13123792, 15567246, 14967754, 7461201, -3729355, -9485192, -4848800, 4728670, 10560165, 11301431, 11805873, 13640865, 12805319, 7016257, -447976, -6221875, -11793894, -19803362, -27977881, -30300150, -23915560, -12783989, -4075298, -1753293, -3934000, -6139239, -6366401, -6012849, -6174023, -5324974, -2013643, 2113311, 4217987, 3870418, 2345860, -349054, -4693325, -8809782, -10027250, -9087241, -9007182, -9505778, -6896195, -882747, 2925742, 120711]
4542A20711o219059k705818L370197O294020N146643K249383o0446R0961K714938
4533A1001530M010804J84281n793130o497583j018069K332302k052668q071797
4525e904330o480502J677494O977677M787641m46958l647897m943381n552982
4517a3533238l847855J124698O049239O903212M089159J236002L97933R52906
4509C372056K069523L438261L719083R29083m506545q698977p991452l299383
4501a0968351Q57472J869165J669374K656242L179568J83991m753162o383166
4493a1688867l426461o02277q76309n22478L910664P873757M376597m683318r734828
4484a5373520o342616k61846K069806J998433M146509Q175945R661030O674767
$$ y = [120711, -6098348, -8804166, -5433969, 860051, 6006694, 8256077, 8195631, 8286592, 11001530, 15012334, 15196615, 9403485, 2905902, 1887833, 4220135, 2167467, -5904330, -12384832, -10707338, -3729661, 1057980, 611022, -3036875, -7980256, -13533238, -17381093, -16256395, -10207156, -3303944, 785215, 2021217, 2419150, 3372056, 5441579, 8879840, 12598923, 13528006, 9021461, 322484, -7668968, -10968351, -10110879, -8241714, -6572340, -3916098, -736530, -552539, -5305701, -11688867, -15115328, -15717605, -16593914, -17116392, -13205728, -5331971, -955374, -5638692, -15373520, -21716136, -21977982, -19908176, -17909743, -13763234, -5587289, 4073741, 10748508]
4476A0748508J526164k701813m348992l132629m64290J178807J034028P81813
4468D621596J082851k0026k893906l552006R95533O802918P167059J801945l045114
4459A2960850l526334k044785j174767P55762M980111P686962M749828j353140
4451B3034487m214199k317996n57773k415981n052477m353296j422013n05805
4443B194947k196494k719065m3115L011692L284455J972394K244812L898639L521268
4434A5169533k98641m667065n937178l687508m70057R41721m77557l329208m528941
4425g284901k222813J389879J839563j928223n292723l120963L772226R209040
4417c638915Q444780K764944k862001n212101m943709m090183k986303n87617
$$ y = [10748508, 12274672, 9572859, 5223867, 2091238, 1626948, 2805755, 3839783, 4621596, 5704447, 5684421, 2790515, -761491, 234042, 7036960, 14204019, 16005964, 12960850, 9434516, 7389731, 6214964, 6970726, 11950837, 19637799, 24387627, 23034487, 18820288, 16502292, 15944519, 13528538, 8476061, 4122765, 2700752, 2194947, -1547, -2720612, -2763727, 247965, 3532420, 5504814, 7749626, 11648265, 15169533, 14870892, 10203827, 4266649, 579141, 109084, 1050805, 573248, -2755960, -7284901, -9507714, -8117835, -6278272, -8206495, -13499218, -16620181, -12847955, -3638915, 4805865, 7570809, 4708808, -503293, -5447002, -9537185, -12523488, -13111105]
4409a3111105K745864M372632K140692k663818o018640m654468J192343P536648
4401h459852R094650L903275l623045o368940k582015K200432K956640J363048
4393a515807R24489p9373n039972j0994192j1238293n263926R55267M499780P529566
4384b0222461R106298M431482m419801o605954K332007J1451151Q589383k641315
4376B020790r044059o355449j606389L60868K107638N118324N741391K183166
4368E26280j635503k181374r34985m22858J0255K208315O141630J0093665J1419107
4359B5224532P486091q07773p332611o693767j247547K013442M52926k979071
4351A6116222n783024p266012n387872N94797N046015J527283o225386p480279
$$ y = [-13111105, -10365241, -5992609, -3851917, -6515735, -12534375, -17188843, -15996500, -8459852, 634798, 4538073, 915028, -5453912, -8035927, -5835495, -2878855, -1515807, -591318, -670691, -5710663, -16704855, -27943148, -33207074, -32251807, -27752027, -20222461, -11116163, -6684681, -11104482, -17710436, -15378429, -3927278, 4662105, 2020790, -7023269, -13378718, -14985107, -14624239, -12516601, -7398277, -1656886, 526280, -1109223, -3290597, -4225582, -4648440, -4638185, -2429870, 3711760, 13805425, 25224532, 32710623, 31902850, 24570239, 17876472, 16628925, 18642367, 19095293, 16116222, 10333198, 3067186, -2320686, -1725889, 3320126, 4847409, -1377977, -8858256]
4343h858256r3717O117470M395497J87814O35372L554458L301388N62351q76824
4334H925553j657903l939803n230874k185962K546499L720195J358748l34841
4326C201612L90348K294054M655221O446763M751710j057624o298840o970409
4318G412835n702927o608684p519119l326782N506157J3512739J6819804J3985323
4310C4079346M024739r765369j7792899j4133048n760688l236140m901557q28043
4302a8313659Q851173J2165295M262079l915029j684816O243393Q166383K050995
4294A7825814m146877m676550j265411J784513K161094J57736j676324q06059
4286I357936J212159k94999n747984q850768n167502O26331J032231l445469n456825
$$ y = [-8858256, -8951973, -2834503, 1560994, 1748808, 2384180, 5938638, 9240026, 9802377, 8925553, 7267650, 3327847, -1903027, -4088989, -1542490, 2177705, 3536453, 3201612, 3591960, 5886014, 10541235, 16987998, 21739708, 20682084, 14383244, 7412835, 1709908, -4898776, -12417895, -15744677, -10238520, 3274219, 20094023, 34079346, 38104085, 28338716, 10545817, -3587231, -9347919, -12584059, -17485616, -18313659, -9462486, 2702809, 6964888, 3049859, 1365043, 7608436, 15774819, 17825814, 13678937, 9002387, 7736976, 9521489, 11682583, 11840319, 10163995, 9357936, 10570095, 10275096, 4527112, -4323656, -9491158, -8864827, -7832596, -11278065, -16734890]
4277a6734890j669497L188279L806566J155370j83758J268724K364486j0380m231929
4268a1047029m939859O52660Q352092J0979597O773612J110600r16723m47932
4260A0517018j467660m460024o499631n850193l443272q57992O25450k469k085832
4251a3524605l005281j566452j63781q00570q36866L139448Q227610P310802p33570
4242a953265p906126o966293p05644K399140n85940m499002m033913o2514K874408
4233b1439149K211750j142652m718970n965389l402425J446267M118015J677260
4225b7215293k819352k728333M233659J2269626J3543252P021097q43631m171626
4217g10601l851284m217981n774671m752723J24845M529222M535090K503889L004010
$$ y = [-16734890, -18404387, -15216108, -11409542, -10254172, -10437930, -9169206, -6804720, -6815100, -11047029, -15986888, -15334228, -6982136, 3997461, 10771073, 11881673, 10964950, 10517018, 9049358, 4589334, -1910297, -7760490, -11203762, -12061754, -11436304, -11438773, -13524605, -16529886, -18096338, -18260119, -19060689, -19897555, -16758107, -8530497, -1219695, -1953265, -9859391, -16825684, -17531328, -15132188, -15718128, -20217130, -24251043, -24313557, -21439149, -19227399, -20370051, -25089021, -31054410, -34456835, -33010568, -28892553, -27215293, -30034645, -32762978, -28529319, -16259693, -2716441, 4304656, 3461025, -710601, -4561885, -8779866, -14554537, -19307260, -19182415, -14653193, -10118103, -7614214, -4610204]
4208d610204N057533L859253m56488k275653n1655N45325l469963o021281j114242
4199h537375P227468J1051404R770030P391660K782447p185151j7144143j7297793
4191a1941453q240553q90789l45915p37469J790385K952263J130505K159924P419411
4182f703691Q909431L491792K02660M252223N686635l990063j4630950j1745439
4174a4527402m229L967443k478384o040669J40876P909857Q959455M743251m10222
4165B259976m597218n129359k87748M780760L412779j667653k539708L93216K13915
4156c161040k925608k608400O20794L14226k206762M18034O151478N035264k959425
4147a321439p110769m382662k667728m159051k607847J095143r23709n791056
$$ y = [-4610204, 447329, 4306582, 3850094, 1574441, 1522786, 2068111, -1401852, -7423133, -8537375, -1309907, 9741497, 19511527, 26903187, 29685634, 22500483, 5356340, -11941453, -20182006, -21072795, -21418710, -22156179, -20365794, -17413531, -16283026, -14123102, -6703691, 2205740, 5697532, 5900192, 10152415, 15839050, 11848987, -2781963, -14527402, -14531631, -10564188, -13042572, -19083241, -18942365, -11032508, -2073053, 2670198, 2259976, -2337242, -7466601, -7754349, -2973589, 439190, -1228463, -3768171, -3374955, -3161040, -6086648, -8695048, -8074254, -7760028, -9966790, -9548756, -3397278, 1637986, -1321439, -8432208, -12814870, -15482598, -19641649, -22249496, -21154353, -22078062, -27869118]
4139b7869118k442322O082341N735287q98426K747557J3080757P964193r395122
4131d994853p785765J5063671J9432206l147238N734163Q1699142J52824970J16706282
4123C75532578j3401126j14147688j08516648m6889491j3144525j6862672j7668319
4116D4902109m414802K259525j981905k714515N69133k979646q726368l577281
4108B3336250O917213O251212l814832p275364k491792k184501p683437o878549
4100F176200K337258P939811M442891p87506l062087n282778o519924k028256
4092C215609M293229L167507l323829l826401K418621M043298j923403m719005
4084C345626P24469N164666K084100j555750N29155K349902k309591p166594l212729
$$ y = [-27869118, -30311440, -24229099, -18493812, -19392238, -16644681, -3563924, 4400269, -4994853, -12780618, 2283053, 21715259, 18568021, 24302184, 106001326, 258826296, 375532578, 362131452, 247983764, 139467116, 92577625, 79433100, 62570428, 44902109, 40487307, 42746832, 40764927, 38050412, 38619545, 35639899, 26913531, 23336250, 30253463, 36504675, 32689843, 25414479, 22922687, 20738186, 13054749, 6176200, 8513458, 16453269, 20896160, 20108654, 17046567, 11763789, 5243865, 3215609, 7508838, 10676345, 7352516, 3526115, 5944736, 9988034, 8064631, 3345626, 4070095, 9234761, 11318861, 9763111, 10292266, 12642168, 10332577, 3165983, -46746]
4075d6746O450138J1147108O803904j982838r442231j1825934p501470L15065
4067f083004M547201K478380q25649o38353J022193Q47383K44343J006929N01178
4058C100601l023790m937631l99539P185986R878414N265255k075313o994092
4050G999891p114487k117109N383719R779270P721837K368440j068560k076981
4042B0876020l285664m425873k997819K4708M82765k542832n165551m717230l404647
4033e156123m021330n091778l074688K001452N762313M527311m35636m429284
4025i917763m350472j194219K239142M581047N877195N656697L118145p49127
4017E260645l047009j826180J672277M168540L597339J221761K60408J750962
$$ y = [-46746, 6403392, 17550500, 24354404, 22371566, 12929335, 1103401, -6398069, -6083004, -1535803, 942577, 116928, -521425, 500768, 1348151, 1592494, 2599423, 3100601, 76811, -4860820, -5260359, 1925627, 11804041, 17069296, 14993983, 7999891, 885404, -1231705, 4152014, 13931284, 21653121, 24021561, 22953001, 20876020, 17590356, 13164483, 10166664, 10191372, 10674137, 8131305, 2965754, -1751476, -5156123, -9177453, -14269231, -17343919, -15342467, -9580154, -5052843, -5488479, -9917763, -14268235, -15462454, -13223312, -8642265, -2765070, 2891627, 6009772, 5260645, 2213636, 387456, 2059733, 6228273, 9825612, 11047373, 11307781, 13058743]
4009A3058743K529175o34123n449897o334334k751271l99771j887764k110928
4001c980170K456177N794060J103830o967969q373590l412390j466319m224345
3993a9070716k436372P321621J4583121J0428193J194997j894439P89243J096655
3985A2012303j952688j943097K440561N010234K642821j57584R73979M297357
3977B3323886N704877L753790l36861m015285m382570j335167Q36589j172971
3969B2376288m037734k489902J676561J714620l094645n753600k490406J507170
3961I408352N16987l428606m875395l037455j034863k91708j1039P685k10756
3952b956798O88824L283398N343570M756239K906183K445025L204192L003046
$$ y = [13058743, 15587918, 14953795, 9503898, 3169564, 418293, 18522, -1869242, -3980170, -1523993, 4270067, 5373897, -1594072, -9967662, -13380052, -14846371, -19070716, -21507088, -14185467, 397654, 10825847, 12020844, 10126405, 10915648, 12012303, 10059615, 8116518, 10557079, 15567313, 18210134, 18052550, 19026529, 23323886, 29028763, 32782553, 32445692, 28430407, 24047837, 22712670, 23549259, 22376288, 18338554, 15848652, 17525213, 19239833, 16145188, 10391588, 7901182, 9408352, 9925339, 6496733, 1621338, -1416117, -2450980, -2742688, -2753727, -2746042, -2956798, -2267974, 1015424, 6358994, 11115233, 14021416, 16466441, 19670633, 22673679]
3944B2673679J249324p09327j711168j317888K95790J238255j221411o476573
3936A4020681r525285o716989m90818M194326N681190M953557K293921j215441
3928A3195142j754677K315837N714460K494062m311052o119068j564594J631149
3920A1601259j368255o359031q426438q703408q622470m856270L679884R751441
3912a3303288O551714j298420l583918R53142M235548K319168O20130L989493
3904D83569R056478R928595O076042Q93011l344567n427950l710702J157471M250894
3895A9362841J285698n298962q518450n039149J290557M327128K080380k311333
3887G178710m564248l002778J139178N542762P911310O328415P50728n629094
$$ y = [22673679, 23923003, 23213676, 21502508, 20184620, 20480410, 21718665, 20497254, 14020681, 4495396, -2221593, -2712411, 1481915, 7163105, 12116662, 14410583, 13195142, 11440465, 13756302, 19470762, 21964824, 17653772, 11534704, 9970110, 11601259, 10233004, 3873973, -4552465, -13255873, -21878343, -26734613, -23054729, -13303288, -6751574, -8049994, -11633912, -10680770, -6445222, -4126054, -3505924, 483569, 9540047, 19468642, 25544684, 26437695, 23093128, 17665178, 13954476, 15111947, 19362841, 20648539, 15349577, 6831127, 1791978, 3082535, 7409663, 9490043, 7178710, 2614462, -388316, 750862, 6293624, 14204934, 20533349, 21284077, 15654983]
3879A5654983q783497q360085p414720o966683m476452L72622K878917K12519
3871a6882396k930722r14958L836779M828831K034407J002598K700907K430140
3863c894414r33279k854601j530175j98143P58493N311311J2305308J3428154
3855B2392654N535562l042126m262958j129829m35120j803709j334438j88322
3847A5731714j653617m225676m742528m023440l052470Q63579P152348P848038
3839A3897948q36485r363214p620521o63754J63773l896682l123793J966945K142901
3830g332882k055804n26625O798773Q139842J099703j924873M333216Q048304
3822A6579654J332982n133628o90365O256221K383809q367786j2363829p877617
$$ y = [15654983, 6871486, -1488599, -8903319, -15870002, -20346454, -19973832, -17094915, -16882396, -19813118, -20728076, -16891297, -12062466, -10028059, -9025461, -6324554, -3894414, -4827693, -7682294, -9212469, -9410612, -8652119, -3340808, 8964500, 22392654, 27928216, 24886090, 20623132, 19493303, 19058183, 17254474, 15920036, 15731714, 14078097, 9852421, 5109893, 1086453, -1966017, -1102438, 6049910, 13897948, 13061463, 3698249, -3922272, -4586026, -4422253, -8318935, -11442728, -9475783, -7332882, -9388686, -9915311, -3116538, 5023304, 6123007, 4198134, 8531350, 16579654, 17912636, 12779008, 12088643, 18344864, 20728673, 12360887, -2942, -7880559]
3814g880559l541007j369681K876529O599728L558280j977790J93824P996368
3806F455692Q802934M65642m815653r34200K904897p33603n191639k927369Q82675
3797D909376j553789o208699m660051M40102k82749o394616p640052k23835P764153
3788a3850160R111829O241186L789326Q83747l738485n687995j394859L523970
3780a121441P32689p340793r093120k65067R312270R668684M237421K565117M775675
3771A3471435K824830m564971q781491n316889j394254m347670r660457p702119
3763b5471586K028599J0572924J1148133M931036l159993q484549p396355J2413
3755a5819378P335424O914306j396137r882000j1624048o365193J667827P695481
$$ y = [-7880559, -11421566, -12791247, -9914718, -3314990, 243290, -1734500, -1540676, 6455692, 15258626, 15724268, 10908615, 9974415, 12879312, 12145709, 6954070, 4026701, 4909376, 3355587, -2853112, -7513163, -7073061, -7355810, -13750426, -21390478, -21614313, -13850160, -4738331, 1502855, 5292181, 6175928, 2437443, -3250552, -4645411, -1121441, -388752, -7729545, -16822665, -17087732, -7775462, 1893222, 6130643, 8695760, 13471435, 16296265, 11731294, 2949803, -2367086, -3761340, -8109010, -17769467, -25471586, -23442987, -12870063, -1721930, 3209106, 49113, -8435436, -15831791, -15819378, -8483954, -1569648, -2965785, -12847785, -24471833, -30837026, -29169199, -21473718]
3747b1473718Q058466K287423n193001q428342o011493j654486J187747K504406
3739b8722998L637261N018707O331237O538776L998857j069467n138392n363853
3731a4769872l831334m070817m547450n53164P601101J3606232J3371545R375841
3723A6182082N365170J462126l207064p211525q970745r101928q232837n338476
3715a9053197m69515L621877M789885L943043K382436l93268m138081o275512
3707a5592332n650618n032249o581405p206445k363512O738970J3466790J3047232
3699i173569O728567r20153n970276o440367k683416K432938N598300O230995
3691d196981O190764N884411K888768l707889r304856p607412R19668P669213
$$ y = [-21473718, -13415252, -11127829, -16320830, -24749172, -30760665, -32415151, -31227404, -28722998, -25085737, -20067030, -13735793, -7197017, -3198160, -4267627, -9406019, -14769872, -18601206, -22672023, -27219473, -27772637, -20171536, -6565304, 6806241, 16182082, 21547252, 23009378, 19802314, 12590789, 3620044, -5481884, -13714721, -19053197, -19522712, -15900835, -11110950, -7167907, -4785471, -5178739, -9316820, -15592332, -21242950, -26275199, -32856604, -40063049, -42426561, -35687591, -22220801, -9173569, -2445002, -3365155, -9335431, -15775798, -18459214, -16026276, -10427976, -4196981, 1993783, 7878194, 10766962, 7059073, -2245783, -9853195, -8933527, -1264314]
3683a264314N573226j877058n018174o19094M577991L896621o65554k969629j772617
3674a38602n06580m05806Q51217M046608O446991N568537J876311k580194n846118
3665I312364o707066n921335n879448o707094m667526K013322P856982N805450
3657d894351k656242q492329o416037Q526N125583P490257P684840N009217n03319
3648B356145n888618p616382m550792J788713P480363P501189Q83532n802679
3640c848529n032852J586115N360163K878551m74247p74950j401524m813389o034327
3631a2554989o17292O320231O299489k50605m720618k072244L944928P188413
3623C537313N977585K724697n1189j931356l765167n147649l662433J555676O416959
$$ y = [-1264314, 4308912, 2431854, -2586320, -3205414, 1372577, 5269198, 4603644, 1634015, -138602, -645182, -1050988, -199771, 3846837, 10293828, 15862365, 17738676, 15158482, 9312364, 2605298, -3316037, -9195485, -15902579, -20570105, -18556783, -10699801, -4894351, -7550593, -16042922, -22458959, -22450433, -17324850, -9834593, -2149753, 2859464, 2356145, -3532473, -11148855, -15699647, -13910934, -6430571, 1070618, 1954150, -3848529, -8881381, -7295266, -1935103, 943448, 469201, -305749, -1707273, -6520662, -12554989, -13172281, -6852050, -552561, -803166, -5523784, -7596028, -3651100, 3537313, 9514898, 12239595, 12188406, 10257050, 6491883, 1344234, -2318199, -762523, 5654436]
3614E654436N613388r5287m338669l464704q7821K233687K569041j29504o868710
3605A085857j3383268j1976794k405863N666313N756557L471571O395629J1424734
3597F034736J0018618J673014o001273p997735n469891r14518L106948K377013
3589B826912m624886j1744358j1072390l313391L430549M352858J909195J18066
3581a8117445M88596L008155O209269O968491M324396J654994J111023n90324
3573E057155n527855q132215k845767N359474O892642J625377k139898j209675
3565i20762j95528j158021p28740J460821J135251k051039l173584j042284J15501
3556f558385n36370Q11011L378174J425224m395282o118631k423145j878412p058428
$$ y = [5654436, 11267824, 11172537, 6833868, 3369164, 3281343, 5515030, 8084071, 7954567, 1085857, -12297411, -24274205, -26680068, -21013755, -15257198, -11785627, -5389998, 6034736, 16053354, 17726368, 11725095, 3727360, -1742531, -2657049, 449899, 2826912, -1797974, -13542332, -24614722, -27928113, -24497564, -20144706, -18235511, -18117445, -17628849, -14620694, -8411425, -1442934, 2881462, 4536456, 5647479, 5057155, -470700, -8602915, -11448682, -6089208, 803434, 2428811, 288913, -920762, -1116290, -2274311, -3003051, -1542230, -406979, -2458018, -5631602, -6673886, -6558385, -7094755, -6283744, -2905570, -1480346, -5875628, -11994259, -14417404, -16295816, -23354244]
3547b3354244p750594J939267J1274951Q405337j320671m868965j874531j647394
3539a9196844m565184j439847R028022J5740770J0904717j30745q031131j0030226
3531g720468p925022k942713L041697O352585N457697K699851K8725l265385o925880
3522a1198913q095994n608815k197936l5032K480289O741258R872918Q206689
3514A64464L079259l08621N28308K528629J259109l590988p500976n501234K595135
3505f746915J0912034J1987249L709975p843249j3405015r287908q22997L811348
3497g685478K410753n07854j084658m38853m47969J46624J745737J87117o967335
3488a2641916j3060737q939007L206220J0491666N940831k708694m345913J569261
$$ y = [-23354244, -31104838, -29165571, -17890620, -9485283, -10805954, -15674919, -17549450, -19196844, -23762028, -25201875, -16173853, -433083, 10471634, 10340889, 2309758, -7720468, -15645490, -18588203, -15546506, -9193921, -3736224, -1036373, -1007648, -4273033, -11198913, -19294907, -24903722, -27101658, -27136690, -24656401, -17915143, -8042225, 164464, 3243723, 2935102, 3463410, 5992039, 7251148, 3660160, -3840816, -9342050, -6746915, 4165119, 16152368, 19862343, 12019094, -1385921, -10673829, -11496826, -7685478, -5274725, -5782579, -6867237, -7306090, -7754059, -7607435, -5861698, -5674581, -12641916, -25702653, -34641660, -31435440, -20943774, -15002943, -17711637, -22057550, -20488289]
3480b0488289P101041P021436K636061k358212n005028m014219j057213O38440
3472a5525983R78364L148131P262173Q546451M853181Q69884P48549J692004q6916
3463A2485838k194113j104066L37963k113390n496346m370224j272254l012488
3455f739080p746640n968783M208723J2333408R905010J765767j707992J707842
3447G758255N517019M333372n91817m555939m849089k861203j810123k555145
3439C85330k767020j305129j031282m234640p441732n301473J440931O647524
3431a3607491P021056M825718K609371M65322r50733K2129K233588K315769N01089
3422E435818J032837M920005O984922K821566m959532j0027499r093060l612168
$$ y = [-20488289, -13387248, -6365812, -3729751, -6087963, -11092991, -15107210, -16164423, -15525983, -14547619, -11399488, -4137315, 4409136, 9262317, 10132201, 10880750, 12572754, 12485838, 10291725, 9187659, 9525622, 7412232, 1915886, -2454338, -3726592, -6739080, -14485720, -20454503, -16245780, -3912372, 5992638, 7758405, 6050413, 7758255, 13275274, 17608646, 17016829, 12460890, 7611801, 4750598, 2940475, 385330, -2381690, -3686819, -4718101, -8952741, -16394473, -21695946, -20255015, -13607491, -6586435, -1760717, 848654, 1313976, 363243, 385372, 2618960, 4934729, 5435818, 6468655, 11388660, 18373582, 21195148, 16235616, 6208117, -2884943, -6497111]
3414f497111K367795M495163J163594m118161n798337k550535K064266N095091
3406c778235O603882O437302L341350j396599l874389k936559j687389k116316
3398E93047k343469r40371K61465j61209o10251L42500J641975K291243K645218
3389C720148K087766l87913k491621p39901K725184J718717l742826n951559j397412
3380d459417L459297L002459J487374M676381Q895759O367507k941217j2245636
3372H242507j7061872j6545878r840058J130519Q616652O950551R19374j382036
3364a8970241o76505k586093n070964j166094O947322Q998582L254022j5501M510411
3355d775061Q148560K342343p595930j0673149n395846R41042L271054J992400
$$ y = [-6497111, -4129316, 365847, 1529441, -2588720, -8387057, -10937592, -8873326, -3778235, 2825647, 9262949, 12604299, 11207700, 7333311, 4396752, 2709363, 593047, -1750422, -2690793, -2429328, -2590537, -3200788, -2858288, -1216313, 1074930, 3720148, 5807914, 5420001, 2928380, 2188479, 4913663, 6632380, 2889554, -3062005, -4459417, -1000120, 2002339, 3489713, 8166094, 17061853, 23429360, 20488143, 8242507, -8819365, -25365243, -35205301, -34074782, -25458130, -18507579, -17588205, -18970241, -19646746, -22232839, -27303803, -28469897, -21522575, -12523993, -9269971, -9285472, -4775061, 3373499, 5715842, -1880088, -12553237, -17949083, -17008041, -13736987, -11744587]
3347a1744587j032579l207672r08190N733899J0439182Q447192L602952K281971
3339A3612168L409287J189379m355039o966225m014910j6740P96423j43506N20111
3330D030948L172251N583524N066381q2093p933725j2082296p916450J79066L126002
3321f856392n25858k656316J736152O547857M291468j629467j847650M226692
3313C286486O852501J34694r363302j1749489o606311j697977j363697j780062
3305b2287157J650455O722206P312259K102089l009232k001935L924264Q035757
3297B448706O253649J266178k051910k950601m412799p573535r317801o155035
3289b2493148J210484Q228119J0619158P634444K139816j876430k548629j426754
$$ y = [-11744587, -12777166, -15984838, -16893028, -11159129, -719947, 7727245, 11330197, 13612168, 17021455, 18210834, 13855795, 6889570, 2874660, 2857920, 3654343, 3510837, 4030948, 7203199, 12786723, 17853104, 17771011, 9837286, -2245010, -10161460, -9982394, -6856392, -7382250, -10038566, -8302414, -1754557, 2536911, 907444, -940206, 3286486, 10138987, 10273681, 910379, -10839110, -17445421, -19143398, -20507095, -22287157, -20636702, -13914496, -6602237, -4500148, -7509380, -9511315, -5587051, 2448706, 8702355, 9968533, 7916623, 4966022, 553223, -7020312, -16338113, -22493148, -21282664, -13054545, -2435387, 5199057, 7338873, 5462443, 2913814, 1487060]
3281A487060j134344j940168j882077k91212P29636p79531l925440o326068o645745
3272b0707889m620590n42074L502417M029722N26667k336914k45277M293083N042354
3263a1058501R98219k365554j174730K387844N000490O452943O440038K277479
3255H958228n801714j1048554p369503K136206Q952770R649651P140524L075463
3247A5693071l893087j1605172j3456998p267103L76139K618273Q38426K52410
3239a6444041R68770o40269l729659k805292L617550R611145R212982L511010
3231C302196j869907l504910j989614P51454L130578L838734K512491L28513j368610
3222E130925k455306k958767j829347J323811M211883M092571J837977J122483
$$ y = [1487060, 352716, -1587452, -3469529, -3760741, -3031105, -3810636, -7736076, -14062144, -20707889, -25328479, -25870553, -22368136, -18338414, -17811747, -20148661, -20393938, -16100855, -11058501, -10060282, -12425836, -13600566, -11212722, -6212232, 240711, 6680749, 8958228, 3156514, -7892040, -15261543, -13125337, -4172567, 5477084, 12617608, 15693071, 11799984, 194812, -13262186, -20529289, -20153150, -17534877, -16696451, -16444041, -15475271, -16115540, -19845199, -22650491, -19032941, -9421796, -208814, 3302196, 1432289, -2072621, -4062235, -3310781, -180203, 3658531, 6171022, 6499535, 5130925, 2675619, -283148, -2112495, -788684, 3423199, 7515770, 9353747, 10476230]
3214A0476230L003327L993235J038701l780249n818660l905459j340589j203066
3206B463470k994813m369852m225616k980189j063526J359972L441909L729421
3198d639224J821697n74795j189997k3326L66543j579072l426399j384191L941630
3189f687134O953516L731774k620257n486542k421287L023927O422723O750721
3181I667441N424546L570393J331323j411470m422454o682947o792862m676439
3173c992469k255441j118416l77704J293915K419880K94621m268646o661654l774942
3164a8440856K529450P790346Q824071N102617j098004n235105l854236J305424
3156c076293M549215K511785k633522o548174o739423k868833L415391P613638
$$ y = [10476230, 13479557, 17472792, 18511493, 14731244, 8912584, 5007125, 3666536, 2463470, -531343, -4901195, -9126811, -12107000, -13170526, -11810554, -8368645, -4639224, -2817527, -3392322, -4582319, -4605645, -4239102, -5818174, -9244573, -10628764, -6687134, 266382, 3998156, 1377899, -4108643, -6529930, -3506003, 2916720, 9667441, 15091987, 18662380, 19993703, 18582233, 14159779, 7476832, 683970, -3992469, -6247910, -7366326, -7744030, -6450115, -4030235, -3735614, -8004260, -14665914, -18440856, -15911406, -8121060, 703011, 5805628, 4707624, -527481, -4381717, -3076293, 1472922, 3984707, 1351185, -5196989, -11936412, -14805245, -11389854, -3776216]
3148c776216N048146l020683q730605n882527L064862J0466742J1714208P587514
3140A6471441R11162n638221r625831j0075577q545905p086915n492815j886167
3132c0968828M557456J2071202J6451728J3261359K753590p462210q930556k630377
3124h96636J925267m58343m386557l441942M79986K608698L917028O952752P898058
3115A4598311J747673p371662j0462263p153487n542494q337668q842307k947851
3107c4311748L910725N716892M286742M123006N041943M802207M137628M506670
3099B214065M781771L987044L328750K260847k436316r536675j0921120k358479
3091h680113P682251P461010k124542q657662m781805L571845P017174M579220
$$ y = [-3776216, 1271930, -1748753, -10479358, -16361885, -13297023, -2830281, 8883927, 16471441, 17382603, 11744382, 2118551, -7957026, -16502931, -23589846, -29082661, -30968828, -26411372, -14340170, 2111558, 15372917, 18126507, 10664297, 1733741, -896636, 1028631, 570288, -3816269, -7258211, -6778225, -4169527, -252499, 6700253, 14598311, 16345984, 8974322, -1487941, -8641428, -14183922, -22521590, -31363897, -34311748, -30401023, -24684131, -20397389, -16274383, -11232440, -6430233, -2292605, 2214065, 6995836, 10982880, 14311630, 16572477, 14136161, 4599486, -6321634, -8680113, -997862, 6463148, 4338606, -4319056, -9100861, -5529016, 1488158, 6067378]
3083F067378K257657L480832N248491L330451j407327l464411L75210N959266
3075B1847547N875925j226142q397088r006647m698932k008958l378211n256590
3067f249096m065302j81478M136299P368397Q286660N674313L43284m094042m453223
3058F765812j660490L45761k74845p64924K135822O600830P134519K185162l063561
3049A9404086l800734k184097k931505n122022m075517j46874J010724k370008
3041b15947n244820m034142j698969j530988j599316O20125L110942L395013L346670
3032c851432M963423N323258J394617l404662l665407p25200m71548l587846m555050
3023h579847o31794M152157N446989M191304L541808L612350J929594k245175
$$ y = [6067378, 8325035, 11805867, 17054358, 20384809, 18977482, 15513071, 15888281, 21847547, 27723472, 26497330, 18100242, 9093595, 4394663, 2385705, -992506, -6249096, -10314398, -10495876, -6359577, 1008820, 9295480, 14969793, 15313077, 11219035, 6765812, 5105322, 5451083, 5176238, 4411314, 6547136, 13147966, 20282485, 22467647, 19404086, 15603352, 13419255, 10487750, 5365728, 1290211, 1143337, 2154061, -215947, -5460767, -9494909, -11193878, -12724866, -14324182, -13704057, -10593115, -7198102, -3851432, 1111991, 6435249, 7829866, 4425204, 759797, 34597, -436951, -4024797, -8579847, -9211641, -5059484, 387505, 4578809, 8120617, 11732967, 13662561, 11417386]
3015A1417386n939415n228558j19667M141453K774357j814533k668172J725249
3007D288100N066757L121896K99699K083580O041899O124930J914869k436416
2999B6505314m919534n190320j435922M983801N817498m094902j6051432j6860133
2991a1245630p261532L6530O5206P35154O429376R671007M529658l046878n362197
2982e449306m060981l784686l230492l32816J442507K30982J621743Q234309J1013782
2973E685042K178239r425134r131839J306382O637142J814664k493263Q6907J672613
2964a669247l759787q068209k506697O674687P772659K033630J86046M020744
2956D683826M113115l602445j0505150q498609j734565P79982j642651k385873
$$ y = [11417386, 5477971, 249413, 129746, 4271199, 7045556, 5231023, 2562851, 4288100, 9354857, 12476753, 12776452, 14860032, 20901931, 27026861, 28941730, 26505314, 21585780, 16395460, 14959538, 19943339, 25760837, 21665935, 5614503, -11245630, -18507162, -18470632, -18405426, -17670272, -11240896, -1569889, 2959769, -87109, -5449306, -9510287, -13294973, -16525465, -16858281, -15415774, -15184792, -13563049, -5328740, 5685042, 7863281, -1561853, -10693692, -9387310, -2750168, -935504, -3428767, -3341860, -1669247, -5429034, -13497243, -16003940, -9329253, -1556594, 477036, 663082, 4683826, 8796941, 5194496, -5310654, -13809263, -15543828, -14763846, -16406497, -18792370]
2948a8792370J391237N454832N811455L668508J878699P68942k89432k66980J688783
2939A313674L533443K423209r43016k668839p49990K146695J942113j950702n945586
2930h98999o060026j786860L627973O470161O008110M442632L609951K829672
2922A8242614O20784k685509n359539o362296n484017k452587J781459L565272
2914A866181l66657p615129j1060450o944003L50891L893939K602701R35243J392081
2905a4945203J534568n93155k077310N79678M994835N143721Q7482m017632k587371
2896a1880387Q34172N84863j728150K12751O484216R457900N048154r11349j299513
2887F802657K332092L298241l65668m808609o664493n489440j814638K564607
$$ y = [-18792370, -17401133, -11946301, -6134846, -2466338, -587639, 181303, -108129, -375109, 1313674, 4847117, 7270326, 6327310, 3658471, 2908481, 5055176, 6997289, 5046587, -898999, -6959025, -8745885, -5117912, 1352249, 7360359, 11802991, 15412942, 18242614, 18863398, 16177889, 10818350, 4456054, -1027963, -3480550, -1699091, 1866181, 1499524, -6115605, -17176055, -24120058, -23769167, -19875228, -17272527, -16337284, -14945203, -13410635, -14003790, -16081100, -15501422, -10506587, -5362866, -5275384, -9293016, -11880387, -11046215, -10461352, -12189502, -11976751, -5492535, 3965365, 9013519, 8102170, 6802657, 9134749, 12432990, 12067322, 7258713, 594220, -4895220, -6709858, -4145251]
2879d145251M146032J998873K44109J564406J376131n172564j3256233j3576259
2871b6820756o172979j59099M24286J111892N633615R362755P761530L310542
2863e548214j77670k990854n121535l515085J754000N289591M812550M749035
2855g48182O862975N564354j356679o033596k771357J107775l246216j0775401
2847a1396327j0284214k540408K139137J264794J788476N360101N548691J309855
2839f809895M38012N845805R513528N148332k273170m830306j885465K741246
2831G888087O745845P921294L538459m133172p861962n301484k455466l263454
2823C078147l257640R53430L795376l0045n162249l598064J960032K802004j012496
$$ y = [-4145251, 781, 1999654, 2243763, 3808169, 5184300, 11736, -13244497, -26820756, -32993735, -33152834, -32728548, -31616656, -25983041, -16620286, -8858756, -5548214, -5725884, -8716738, -13838273, -17353358, -15599358, -10309767, -5497217, -748182, 6114793, 11679147, 10322468, 4288872, 1517515, 2625290, -620926, -11396327, -21680541, -24220949, -22081812, -20817018, -19028542, -13668441, -8119750, -6809895, -6371883, -526078, 8987450, 14135782, 11862612, 7032306, 5146841, 7888087, 14633932, 22555226, 26093685, 21960513, 14098551, 8797067, 6341601, 3078147, -179493, 773937, 4569313, 4539268, -622981, -4221045, -2261013, 540991, -471505]
2814d71505j237635M223034Q047496N679784J235382j309707m012288q010742
2806D143819q578943k844801L668517M638198K260630J915215J597489m261467
2798B538657j2086559j0866516J015119J0448920O869521l068356o160822j769899
2790a3079935M97242j219004J411603J0130320J4233356P290963j691200k463968
2782A5109377O13165k018024p198364m198431N799981R817413L001738m884899
2774A6041956n656701l243166l412783l902696j345207Q12769j295895m325448
2766f327171l532781q67647p40105k359438k463890j650735k284454l675130m159671
2757b8061022m089869k716805K587874R448243R464830M00899p337756m365920
$$ y = [-471505, -1709140, 2513894, 10561390, 16241174, 17476556, 16166849, 12154561, 4143819, -4435124, -7279925, -3611408, 1026790, 3287420, 5202635, 6800124, 2538657, -9547902, -20414418, -19399299, -8950379, -2080858, -5149214, -11310036, -13079935, -12582693, -13801697, -12390094, -2259774, 11973582, 19264545, 17573345, 15109377, 15722542, 13704518, 6506154, 2307723, 8107704, 17925117, 20926855, 16041956, 10385255, 7142089, 3729306, -173390, -1518597, -705828, -2001723, -6327171, -9859952, -10727599, -11467704, -13827142, -16291032, -17941767, -20226221, -23901351, -28061022, -32150891, -34867696, -32279822, -22831579, -13366749, -12965850, -20303606, -24669526]
2749b4669526L831656O108260K853846K491000N064746K815669m003521n632782
2741a1140652Q38167N971557K888942k841521l253178R23478M588207O225709
2733D200709O157067L205099j733193m182037k571746j067508k287614l094839
2725a374062j453033q21158k954086l212001J027014M024791R82938k530927Q45724
2716e464800P296806P380703J356238j628171J496116M183103K598054J322288
2708A8540337L683937N149401J058052n601758r060104q535434o676714m315373
2700e757656j168271J389975K328874L236626N072615N128933R39794m704322
2692F466568o338558k401432L458710O467656M074245k750390r104747r346818
$$ y = [-24669526, -20837870, -14729610, -11875764, -9384764, -4320018, -1504349, -5507870, -11140652, -10302485, -4330928, -1441986, -4283507, -7536685, -6613207, -2025000, 4200709, 10357776, 13562875, 11829682, 7647645, 5075899, 4008391, 1720777, -1374062, -2827095, -3648253, -6602339, -9814340, -8787326, -4762535, -3779597, -6310524, -5464800, 1832006, 9212709, 10568947, 8940776, 10436892, 14619995, 17218049, 18540337, 22224274, 27373675, 28431727, 22829969, 13769865, 5234431, -1442283, -5757656, -6925927, -5535952, -3207078, 29548, 5102163, 10231096, 11170890, 6466568, 128010, -2273422, 1185288, 7652944, 11727189, 8976799, -127948, -9474766]
2684i474766l638396J018547m30871l982662k618159L118833O473645N020978
2676d512851K960404K548794N49519m300709o984913l701600J452434K365819
2668i623103k58225j220081P82209K527195K317822J345635n8120k488708m188774
2659a0864150k526085J234527L135207K467194J814296J220468k024130o726755
2651a2269428o983991p39076O092868P589279N450974M625441N212603L712157
2643A2690827j15172k682722j976265M04041K085777J851251m10874k986742k693967
2634F166154J315982N240740M778159M56594l664174n158214m462820k622403
2626B050018p84928m13239j130451k73771K395614K337584l132177q673822p190486
$$ y = [-9474766, -13113162, -12094615, -12525486, -16508148, -19126307, -16007474, -9533829, -4512851, -1552447, 996347, 1545866, -2754843, -9739756, -13441356, -11988922, -9623103, -9881328, -11101409, -10319200, -7792005, -5474183, -4128548, -4186668, -6675376, -10864150, -13390235, -12155708, -9020501, -6553307, -4739011, -3518543, -5542673, -12269428, -19253419, -19992495, -13899627, -6310348, -859374, 3766067, 8978670, 12690827, 12575655, 9892933, 7916668, 8320709, 10406486, 12257737, 11846863, 8860121, 6166154, 7482136, 12722876, 17501035, 17957629, 14293455, 9135241, 4672421, 2050018, 1265090, 851851, -278600, -552371, 1843243, 4180827, 1048650, -7625172, -14815658]
2617a4815658m17581L439188J908647O71924K992091M519902J620935j940732
2609b021284j161799K461666M208109L305311J987598M00215k405018m173074
2601B601724j331573M861596Q096463M057462m398713r978048q162570j638720
2593e892379K501316N77792l586211m275315k032685k014382m736854m597801
2585b4056519L85522L777725K54935n254541m277568K651198P157918N283539
2577a4077791J432199j87153j112753l357628m379102j217290L927324O237083
2569a2735111M460825J191625j690776m317459n802753l558685K633347Q120907
2561a1698080P749846K349837j834028r52763J896832J952381N798M74879L625856
$$ y = [-14815658, -15233239, -11794051, -9885404, -9213480, -6221389, -1701487, -80552, -2021284, -3183083, -721417, 3486692, 6792003, 8779601, 9179816, 6774798, 2601724, 1270151, 6131747, 14228210, 18285672, 13886959, 3908911, -4253659, -5892379, -3391063, -2813271, -6399482, -10674797, -12707482, -14721864, -19458718, -24056519, -23670997, -19893272, -19638337, -24892878, -29170446, -26519248, -19361330, -14077791, -12645592, -12832745, -13945498, -17303126, -21682228, -22899518, -18972194, -12735111, -8274286, -7082661, -8773437, -13090896, -18893649, -22452334, -19818987, -11698080, -3948234, -1598397, -3432425, -4385188, -2488356, -535975, -530177, -55298, 3570558]
2552C570558M941539K978801K427014O416506J0180437O769118l400931j2823656
2544B1059386j5160464r813694k66118P971600R291733K811991m843523n889575
2536E161336p03866L225418J733217j494290j991404r92394j879072m196348n264543
2527f401946n200966n846027n814124j427680O483691J0828800O274646k952560
2519d056166o835014j220195P388443J0077781N836421Q57026m96254K39108M41971
2510A2233121O74003K318083M556142O102023P083436O952675L688106k136361
2502D1471228n863637n024671l843625o794891j0613265q826297k556363K33637
2494a817884l448338p300436n067481J416935N979444N285051o881o795911r809408
$$ y = [3570558, 8512097, 11490898, 13917912, 20334418, 30514855, 37283973, 33883042, 21059386, 5898922, -3914772, -4180890, 3790710, 13082443, 15894434, 11050911, 5161336, 4457470, 7682888, 9416105, 7921815, 5930411, 4938017, 3058945, -1137403, -6401946, -11602912, -17448939, -23263063, -24690743, -18207052, -7378252, -1103606, -4056166, -10891180, -12111375, -4722932, 5354849, 11191270, 12048296, 11552042, 11791150, 12233121, 12907124, 15225207, 19781349, 25883372, 32966808, 39919483, 43607589, 41471228, 35607591, 30582920, 26739295, 19944404, 9331139, 504842, -2051521, -1817884, -5266222, -12566658, -17634139, -16217204, -10237760, -4952709, -4959590, -11755501, -21564909]
2485b1564909m878426M880470J0229604O717625P50859Q39908O227112R077307
2477A2279550N593985l58377l761214l634771j572525Q09720K141946K008046
2469A3506360K009835L675469N135161K706635l518188q423269p721633l188041
2461D182329l31461j916163n493998p036052n347797k213327O55092L101872M954143
2452i445362N012930K963816P01967k29506j125739l413178m818212k098041K910588
2443i540737M689943K179102L87861J970454K691296r29914m459755j791186M610698
2434a92238O248292L67902o844200r140443o874237l446482K19734N004938J0022527
2425d634207J2137918Q560043r2361q390866r460869k581281M052473K266450
$$ y = [-21564909, -26443335, -21562865, -11333261, -4615636, -3864777, -3024869, 3202243, 12279550, 17873535, 17515158, 13753944, 10119173, 8546648, 9356368, 11498314, 13506360, 15516195, 19191664, 24326825, 27033460, 23515272, 15092003, 7370370, 4182329, 3850868, 1934705, -3559293, -10595345, -15943142, -18156469, -17501377, -14399505, -9445362, -4432432, -1468616, -766649, -996155, -2121894, -5535072, -10353284, -12451325, -9540737, -4850794, -2671692, -2283831, -313377, 2377919, 1448005, -3011750, -4802936, -192238, 6056054, 6423956, -420244, -9560687, -16434924, -19881406, -19661672, -14656734, -4634207, 7503711, 16063754, 15971393, 7580527, -1880342, -4461623, -409150, 1857300]
2417A857300n107927p189049N48355J0282516J2301844O330443j034424n833834
2409A2155224q716950r796257p020082j02858P355070J0735485Q091953J343630
2401A4045215m864516o405907l538818q06505j519533l491390k338307K104921
2393f814840N459188M545268O31987l298554n704068n916411l069562K299533
2385a1867459O985137P720709M874940J968540J376623J828223O95417k311877
2377A1270253m841292m931788l130968j256137j00477P74843J713275K651907
2369B149616L783662N114345N342158K786107j952050n653654n832823l462558
2361B274803j417860j190856k306086l957805n420949n258688k231333K457682
$$ y = [1857300, -3250627, -10439676, -9891321, 391195, 12693039, 19023482, 17989058, 12155224, 3438274, -6357983, -13378065, -13480923, -6125853, 4609632, 12701585, 14045215, 9180699, 2774792, -764026, -1570531, -3090064, -6581454, -8919761, -6814840, -1355652, 3189616, 3821603, 523049, -5181019, -11097430, -14166992, -11867459, -4882322, 2838387, 7713327, 9681867, 11058490, 12886713, 13582130, 11270253, 6428961, 1497173, -1633795, -2889932, -2990409, -2215566, -502291, 2149616, 5933278, 11047623, 16389781, 19175888, 17223838, 11570184, 5737361, 2274803, 856943, -333913, -2639999, -6597804, -12018753, -17277441, -19508774, -17051092]
2353a7051092N478778N007966L008251K717113M520790N661251L867366p318l107195
2344A0095910l134463L27933N264091P226662K309529p420348j3284938q695554
2336g311178J898233P251709L325047k196914j949197M46986k483430q752094
2328i770838r221739k095376L888962K605052j278152j163833J536168J986423
2320a3513333Q39002J633425K965113O22292m255272o184689l971724j828121
2312b3693307j655346n61008K701760M715835L055201J13702j159161j187649
2304a7669973j006569M97746L712324N901515M676878J522127n06077m42710R86673
2295b328066K901233L677849J593864k123273l687146j846072N15137J258269
$$ y = [-17051092, -11572314, -6564348, -3556097, -838984, 3681806, 9343057, 13210423, 13203105, 10095910, 6961447, 7289380, 12553471, 19780133, 22089662, 14669314, 1384376, -7311178, -5412945, 1838764, 5163811, 2966897, 1017700, 1464686, -1018744, -9770838, -18992577, -21087953, -17198991, -14593939, -15872091, -17035924, -15499756, -13513333, -12674331, -11040906, -8075793, -7453501, -11708773, -17893462, -21865186, -23693307, -25348653, -25909661, -23207901, -18492066, -15436865, -15323163, -16482324, -17669973, -18676542, -18178796, -14466472, -8564957, -3888079, -2365952, -2872029, -3314739, -2328066, 573167, 4251016, 5844880, 3721607, 34461, -1811611, -1296474, -38205]
2287c8205J433029J101500k027032o662767o392453J001886P960864P103972K024477
2278E505271O70929K231698J20837m515190l512507L524058O374052k11612p752359
2269B435177o466020J211538O073337N322772L348560L177863L846371M217908
2261B3167506L912553J741376k469722n866490n998796m594750m553237n181312
2253A57128m013335j527783l90995j335196k759384k957791o10677M324183Q023902
2244a089948N118468l006100o850390p49986Q174908R339452L202227j124605
2236A3014026o6008J287278o48515l350733m484757m949899m383319r82098K820943
2227a743082K000058k056876k140310K715706M261560j867460q407843p480888
$$ y = [-38205, 1394824, 2496324, 469292, -6193475, -12585928, -11584042, -3623178, 3480794, 5505271, 6176200, 8407898, 8528735, 4013545, 501038, 4025096, 10399148, 10187536, 2435177, -4030843, -2819305, 3254032, 8576804, 11925364, 15103227, 18949598, 23167506, 27080059, 28821435, 26351713, 20485223, 14486427, 9891677, 5338440, 157128, -3856207, -5383990, -5774985, -7110181, -9869565, -12827356, -13438033, -9113850, -1089948, 4028520, 1022420, -5827970, -6577956, 1596952, 10936404, 14138631, 13014026, 12948018, 14235296, 13586781, 10236048, 5751291, 801392, -3581927, -4564025, -1743082, 256976, -1799900, -3940210, -1224504, 3037056, 1169596, -7238247, -14719135]
2219a4719135j943216J079817J583875L633964N872727L905322o67646k070838
2211c325130K03768J589493J343825L382699P657287Q288445K586940m272526
2203A7454801o617427n319742m021763k517878J437168N835758N072725k116044
2195I207598q772428o710371L277744J1294460R790446K349057k102021j437356
2187A6897129j262302m394644o500836m397106j782709k285182k764140N49065
2179e940725M144433K557703j956977k891335m21754n33837l827202l831985J948649
2170a0753030P110209N823797J271658M41656M396261P770348O060163N04920
2162B2625982l773742l421137o94786o13711l597332m021371J248617O735701
$$ y = [-14719135, -16662351, -15582534, -13998659, -10364695, -4491968, -586646, -1254292, -3325130, -3121362, -1531869, -188044, 3194655, 10851942, 19140387, 21727327, 17454801, 10837374, 5517632, 1495869, -1022009, 415159, 6250917, 11323642, 9207598, 435170, -6275201, -2997457, 8297003, 18087449, 20436506, 18334485, 16897129, 15634827, 11240183, 4739347, 342241, -1440468, -3725650, -6489790, -5940725, -1796292, 761411, -1195566, -4086901, -4508655, -5042492, -8869694, -12701679, -10753030, -3642821, 2180976, 3452634, 3894290, 8290551, 16060899, 22121062, 22625982, 18852240, 15431103, 14736317, 14122606, 10525274, 6503903, 7752520, 14488221]
2154A4488221N687847K62822k092991o4839J310691L71149P4888l12219n087285
2145A4638284j1792049j0851361K60832J1046987J1601752N091085Q98482J595053
2137B2489065K968920J919919j788205p437188j1619527q947414J72942P030007
2129D788519N496665O79625L89825K897260J092296m849519p894388n615817k697243
2120e712777k036973j015467K182764M790552L878864L31000k723459k584649
2112b890145J398720N997316N598066q79132o743205n431031O93677M132941K376810
2103D254017r74367k766425k359810M90819M077090L740022j577245n342963k983981
2094c442843p16812n365164j0153095l807896Q536957R427789m011159j3498873
$$ y = [14488221, 20176068, 20438890, 18345899, 18281060, 19591751, 19962900, 20037788, 19725569, 14638284, 2846235, -8005126, -7744294, 3302693, 14904445, 19995530, 20894012, 22489065, 25457985, 27377904, 25589699, 18152511, 6532984, -2414430, -2241488, 4788519, 10285184, 10964809, 11354634, 14251894, 15344190, 10494671, 2600283, -3015534, -5712777, -7749750, -8765217, -6582453, -1791901, 2086963, 2417963, -305496, -2890145, -1491425, 4505891, 10103957, 9224825, 2481620, -2949411, -2255734, 1877207, 4254017, 3279650, 513225, -1846585, -1355766, 2721324, 6461346, 4884101, -458862, -3442843, -4159655, -9524819, -19677914, -23485810, -14948853, -5521064, -9532223, -23031096]
2086b3031096o082030P506192J0411920L397879p61087K120081N165733L499893
2078B227485j347855p010378j1023943q867696K87260Q601882Q363260L018738
2070e751247J513785M560763N280277J470608j772787r50760K371540O328032
2062A3050211R493722Q056250J88443p890664q559899m304942l513651o124436
2054C95034m423952J935543M332840Q36396J99376N442931O927988m66436o234628
2045H945092j335473N015757j1049j0015554q497483L338076O908133m134927
2037B12572j2961161n354977Q716951J0573675n10661r062597o336076J141597
2029a3580677M446622K720525m22108k247620l62340O195672J2625128J1209008
$$ y = [-23031096, -29113126, -21606934, -11195014, -7797135, -8558222, -6438141, -1272408, 2227485, 879630, -6130748, -17154691, -26022387, -25735127, -17133245, -8769985, -5751247, -4237462, 323301, 5603578, 7074186, 5301399, 4350639, 6722179, 13050211, 22543933, 30600183, 30788626, 22897962, 14338063, 10033121, 6519470, 395034, -4028918, -2093375, 2239465, 3075861, 3275237, 8718168, 15646156, 15179720, 8945092, 7609619, 12625376, 12614327, 2598773, -5898710, -2560634, 4347499, 212572, -12748589, -18103566, -9386615, 1187060, 676399, -8386198, -14722274, -13580677, -9134055, -6413530, -6835638, -9083258, -9445598, -3249926, 9375202, 20584210]
2021B0584210J767199o087508n053866K91764R72492l342270n319324k181991
2013A630706L56816k311583o271012m924559J351840N802062M411522N45442l14776
2004B76458K226600L674919J204627k431303k644415J017429M874948O286784
1996A4486047N709901L459279j410302o929878p281990m19986O453384M787126
1988A8853581l365580p650174l744503J315604j2034n968404r948714r298071
1980a9818295n241089J372399Q820312J2207849Q246100Q15828l215361k598469
1972E89274j560021k298324k781532j761452r21630j266543j557345j262932j400473
1963a4220978j568130L08209M081749O326626M490314k15469m721791o588972
$$ y = [20584210, 22351409, 16263901, 11210035, 11501799, 12474291, 9132021, 3812697, 1630706, 1987522, -324061, -6595073, -11519632, -10167792, -4365730, 45792, 591234, 276458, 2503058, 6177977, 7382604, 4951301, 2306886, 3324315, 8199263, 14486047, 20195948, 23655227, 22244925, 15315047, 8033057, 7613071, 14066455, 18853581, 15488001, 7837827, 4093324, 5408928, 5396894, -571510, -10520224, -19818295, -25059384, -23686985, -14866673, -2658824, 5587276, 6403104, 3187743, 589274, -970747, -3269071, -6050603, -7812055, -8733685, -10000228, -11557573, -12820505, -14220978, -15789108, -15480899, -11399150, -5072524, -582210, -797679, -5519470, -12108442]
1955a2108442m560400L58840M109968L169497m65370j229860K293538N210411
1947c221818L195701j896211n110634m192645n69170K876414L499157Q54225j898943
1938f463924j253990J395553J539308o50738M09569O246621R976914O080968m48818
1929A6831463j075525L598959N451973J476661l040497m306974n207372q179180
1921E549508r719699o400503j381453K54495p47776k92097J088586p98587m984879
1912a7432405m285717M052117J1877105R273381k392774j1767338j1143991l821937
1904b5641559K652576N330082N478660L961159J373697J85091K046795M093911
1896e19588K181182k749917n606221m172415j089120J078772K139831J227877
$$ y = [-12108442, -16668842, -16310002, -12200034, -9030537, -9495907, -10725767, -8432229, -3221818, -26117, -1922328, -7032962, -11225607, -11794777, -8918363, -5419206, -4564981, -6463924, -7717914, -6322361, -4783053, -5433791, -5024222, 1222399, 11199313, 17280281, 16831463, 15755938, 19354897, 24806870, 26283531, 23243034, 18936060, 13728688, 5549508, -4170191, -10570694, -11952147, -11697652, -12445428, -12737525, -11648939, -12447526, -17432405, -21718122, -17666005, -5788900, 3484481, 1091707, -10675631, -21819622, -25641559, -22988983, -17658901, -12180241, -8219082, -6845385, -6660294, -4613499, -519588, 1661594, -1088323, -6694544, -10866959, -11956079, -10877307, -8737476, -7509599]
1888g509599l304372r244949j0774840o043106j76307K155387K812107N271723
1880b6813956Q021374P717483N594101N231381O129799N059207K418955J599119
1872A4957463K522975J443234k380673n054988m351250k981862l763682n511382
1864e120165n958507n392439m822202l197768O18276M659664N475634K735662
1856a1001845L35780K261587P708225J0860041O588656l102894r876501p929260
1848d156211o99747L611045J991140j220437j743945q29682j710323l722547l010680
1839a1491387J647774O162982N382918n17320n418652m310099K20803J491529
1831f831452j541710k664719J654599N958851L919579j472275k164528K877066
$$ y = [-7509599, -10813971, -20058920, -30833760, -36876866, -37053173, -34897786, -32085679, -26813956, -18792582, -11075099, -5480998, -249617, 5880182, 10939389, 13358344, 14957463, 17480438, 18923672, 16542999, 11488011, 7136761, 4154899, 391217, -5120165, -11078672, -16471111, -21293313, -24491081, -23872805, -19213141, -13737507, -11001845, -10666065, -8404478, -696253, 10163788, 16752444, 13649550, 3773049, -4156211, -4855958, -1244913, 746227, -474210, -2218155, -3047837, -4758160, -8480707, -11491387, -9843613, -3680631, 1702287, 1184967, -4233685, -8543784, -8322981, -6831452, -8373162, -11037881, -9383282, -3424431, 495148, -977127, -3141655, -264589]
1823b64589O732521M960394L64442k941462m047876l020797K3800K547081J716217
1814F069731l39317R71248M611342M915880J142241j681525k311175m419301o314696
1805B644428r60577R084633R428733m674418j6442953r794757O005567R526320
1797D816976j261265q500462l609464J938949j732671p867125p268626l366166
1789b6849854l105743l540886J432945Q366508R060638L343356k263822m737440
1781a8294298m868818j348255O218936J1359976P615152j39845j102630N059246
1773D499464P451200J067101n598926m039515K107095M282215J539484r34127
1765A0373991j094774r78543j256628j036192j189406k441742k039000J997873
$$ y = [-264589, 6467932, 11428326, 11792768, 8851306, 4803430, 1782633, 1806433, 4353514, 6069731, 5730414, 6701662, 11313004, 16228884, 17371125, 15689600, 13378425, 8959124, 2644428, 1683851, 10768484, 20197217, 15522799, -920154, -10714911, -4709344, 4816976, 3555711, -4944751, -8554215, -6615266, -8347937, -16215062, -23483688, -26849854, -29955597, -33496483, -32063538, -23697030, -14636392, -11293036, -13556858, -18294298, -23163116, -24511371, -18292435, -6932459, 682693, 542848, -559782, 4499464, 11950664, 13017765, 7418839, 3379324, 5486419, 9768634, 11308118, 10373991, 9279217, 8300674, 7044046, 6007854, 4818448, 2376706, 337706, 2335579]
1757B335579N078723J355707n664204n638889L536984J0709370N979973n736930
1749A1956313j1889368r043221m979328n353273o154275j611146O426598J1124547
1741i523153R386645M052756o88176k438392l54790M244612O907431L456163m181441
1732A0861655q628349n890895r91728j179879n096847m065968M730168J2154452
1724A892609Q705239j871857p415026m225645p83179l038598m977002M66354Q397529
1715b849576Q731321J814254k801116j851047j903792n809139o336141J494713
1707i510523J0489300J1082256M986696J023710J412363P84230k938085n106422
1699A2223525k513572J691565L114338J350139j640281m596018o600168o384370
$$ y = [2335579, 7414302, 8770009, 3105805, -2533084, 1003900, 11713270, 17693243, 11956313, 66945, -8976276, -13955604, -19308877, -25463152, -27074298, -20647700, -9523153, -136508, 3916248, 3228072, 789680, 434890, 4679502, 11586933, 15043096, 10861655, 2233306, -3657589, -4649317, -5829196, -10926043, -14992011, -10261843, 1892609, 10597848, 8725991, 1310965, -2914680, -3697859, -6736457, -11713459, -11247105, -2849576, 5881745, 7695999, 4894883, 3043836, 1140044, -4669095, -11005236, -9510523, 978777, 12061033, 17047729, 18071439, 19483802, 20268032, 17329947, 12223525, 9709953, 11401518, 14515856, 15865995, 14225714, 9629696, 3029528, -3354842]
1691c354842l654954J32923K698037K030526j988647n804274m660608P17373L157891
1682a0726575j470266p213208n846009J112829N018632L112031J080237K441997
1674a2490332L413957N89310l182851l813378j424194K091304N895372P890677
1666a030135M793543k218934o630789m665804M1500K691732L311292L148583M97377
1657f1635n060517q701241o091982O7901M145392N294833O189769O759943M626909
1648G169372L63088k465481k022595K00590J551357o5878m512943p802434n609365
$$ y = [-3354842, -7009796, -6876873, -4178836, -2148310, -4136957, -9941231, -14601839, -13884466, -10726575, -12196841, -19410049, -25256058, -24143229, -19124597, -16012566, -14932329, -12490332, -9076375, -8487065, -11669916, -15483294, -16907488, -14816184, -8920812, -1030135, 3763408, 1544474, -5086315, -9752119, -9710619, -7018887, -3707595, -559012, -61635, -5122152, -13823393, -19915375, -19847474, -15702082, -10407249, -4217480, 2542463, 7169372, 7532460, 5066979, 3044384, 3244974, 4796331, 4730453, 217510, -7584924, -13194289]
$$ [...]
##END NTUPLES=NMR SPECTRUM
##END=
