##TITLE=31Pdec_LR-788-B-C2-OF1
 CDCl3, 64 sc
 3.12.2024
##JCAMPDX= 6.0         $$ Bruker NMR JCAMP-DX V2.0
##DATA TYPE= NMR SPECTRUM
##DATA CLASS= NTUPLES
##ORIGIN= UXNMR, Bruker Analytische Messtechnik GmbH
##OWNER= root
$$ XWIN-NMR		Version 3.5
$$ Tue Dec  3 16:30:19 2024 Russian Standard Time (UT+4h)  she@DPX200
##.OBSERVE FREQUENCY= 81.013821
##.OBSERVE NUCLEUS= ^31P
##.ACQUISITION MODE= SIMULTANEOUS
##.ACQUISITION SCHEME= undefined
##.AVERAGES= 64
##.DIGITISER RES= 17
##SPECTROMETER/DATA SYSTEM= spect
##.PULSE SEQUENCE= zgpg30
##.SOLVENT NAME= CDCl3
##.SHIFT REFERENCE= (INTERNAL, CDCl3, 0, 198.062)
##AUDIT TRAIL= $$ (NUMBER, WHEN, WHO, WHERE, WHAT)
$$ ##TITLE= Audit trail, XWIN-NMR		Version 3.5
$$ ##JCAMPDX= 5.01
$$ ##ORIGIN= Bruker BioSpin GmbH
$$ ##OWNER= she
$$ F:/spectra/data/she/nmr/P31/2/pdata/1/auditp.txt
$$ ##AUDIT TRAIL=  $$ (NUMBER, WHEN, WHO, WHERE, WHAT)
(   1,<2024-12-03 16:29:00.59 +0400>,<she>,<DPX200>,
      <continue with go, POWCHK disabled, PULCHK disabled
       configuration hash MD5:
       00 E9 B6 7A A2 85 ED C7 34 08 36 98 17 FE 4E 26
       data hash MD5: 32K
       49 E3 C9 8C 7B 53 B9 7A 2A A4 76 13 E7 1D 5C D9>)
(   2,<2024-12-03 16:29:02.04 +0400>,<she>,<DPX200>,
      <Start of raw data processing
       efp BC_mod = 2 LB = 1.5 FT_mod = 6 PKNL = 1 PHC0 = 2254.215 PHC1 = 133.6883 SI = 64K 
       data hash MD5: 64K
       9E 37 AB 2F B1 3F 4A 50 F4 1E B5 2D 59 4D 2F 6E>)
(   3,<2024-12-03 16:29:32.39 +0400>,<she>,<DPX200>,
      <pk PHC0 = 169.3009 PHC1 = 0 
       data hash MD5: 64K
       E8 F1 5A 93 A2 2B 01 19 CD 6A 53 59 C1 4B 9D E0>)
$$ ##END=
$$ 
$$ hash MD5
$$ E1 68 EB 54 DA 7A 21 DA DA 84 CE 08 50 76 83 B0
##$RELAX= 
##$RELAX= 
##$RELAX= 
##$RELAX= 
##$RELAX= 
##$RELAX= 
##$RELAX= 
##$RELAX= 
$$ Bruker specific parameters
$$ --------------------------
##$DU= <F:/spectra>
##$EXPNO= 2
##$NAME= <P31>
##$PROCNO= 1
##$TYPE= <nmr>
##$USER= <she>
##$AMP= (0..31)
100 100 100 100 100 100 100 100 100 100 100 100 100 100 100 100 100 100 
100 100 100 100 100 100 100 100 100 100 100 100 100 100 
##$AQSEQ= 0
##$AQ_mod= 1
##$AUNM= <au_zg>
##$AUTOPOS= <>
##$BF1= 81.014009
##$BF2= 200.13
##$BF3= 200.13
##$BF4= 200.13
##$BF5= 200.13
##$BF6= 200.13
##$BF7= 200.13
##$BF8= 200.13
##$BYTORDA= 1
##$CFDGTYP= 0
##$CFRGTYP= 5
##$CHEMSTR= <none>
##$CNST= (0..31)
1 1 145 1 1 1 1 1 1 1 1 1 1 1 1 1 1 1 1 1 1 1 1 1 1 1 1 1 1 1 1 1 
##$CPDPRG= <waltz16>
##$CPDPRG1= <>
##$CPDPRG2= <waltz16>
##$CPDPRG3= <>
##$CPDPRG4= <mlev>
##$CPDPRG5= <mlev>
##$CPDPRG6= <mlev>
##$CPDPRG7= <mlev>
##$CPDPRG8= <mlev>
##$CPDPRGB= <>
##$CPDPRGT= <>
##$D= (0..31)
0 1 0 0 0 0 0 0 0 0.06 0 0.03 2e-05 3e-06 0 0 0.0002 0 0 0 0 0 0 0 0 0 
0 0 0 0 0 0 
##$DATE= 1733228860
##$DBL= (0..7)
120 120 120 11 120 120 24 19 
##$DBP= (0..7)
150 150 150 150 150 150 150 150 
##$DBP07= 0
##$DBPNAM0= <>
##$DBPNAM1= <>
##$DBPNAM2= <>
##$DBPNAM3= <>
##$DBPNAM4= <>
##$DBPNAM5= <>
##$DBPNAM6= <>
##$DBPNAM7= <>
##$DBPOAL= (0..7)
0.5 0.5 0.5 0.5 0.5 0.5 0.5 0.5 
##$DBPOFFS= (0..7)
$$ [...]
##$SUBNAM2= <"">
##$SUBNAM3= <"">
##$SUBNAM4= <"">
##$SUBNAM5= <"">
##$SUBNAM6= <"">
##$SUBNAM7= <"">
##$SUBNAM8= <"">
##$SUBNAM9= <"">
##$SW= 400.765351723535
##$SWIBOX= (0..15)
0 1 3 0 0 0 0 0 0 0 0 0 0 0 0 0 
##$SW_h= 32467.5324675325
##$TD= 32768
##$TD0= 1
##$TE= 0
##$TE2= 300
##$TE3= 300
##$TEG= 300
##$TL= (0..7)
0 120 53 12 22 120 120 120 
##$TP= (0..7)
150 150 150 150 150 150 150 150 
##$TP07= 0
##$TPNAME0= <>
##$TPNAME1= <>
##$TPNAME2= <>
##$TPNAME3= <>
##$TPNAME4= <>
##$TPNAME5= <>
##$TPNAME6= <>
##$TPNAME7= <>
##$TPOAL= (0..7)
0.5 0.5 0.5 0.5 0.5 0.5 0.5 0.5 
##$TPOFFS= (0..7)
0 0 0 0 0 0 0 0 
##$TUNHIN= 0
##$TUNHOUT= 0
##$TUNXOUT= 0
##$USERA1= <user>
##$USERA2= <user>
##$USERA3= <user>
##$USERA4= <user>
##$USERA5= <user>
##$V9= 5
##$VALIST= <valist>
##$VCLIST= <CCCCCCCCCCCCCCC>
##$VD= 0
##$VDLIST= <DDDDDDDDDDDDDDD>
##$VPLIST= <PPPPPPPPPPPPPPP>
##$VTLIST= <TTTTTTTTTTTTTTT>
##$WBST= 1024
##$WBSW= 4
##$XGAIN= (0..3)
0 0 0 0 
##$XL= 0
##$YL= 0
##$YMAX_a= 5510
##$YMIN_a= -3393
##$ZGOPTNS= <>
##$ZL1= 120
##$ZL2= 120
##$ZL3= 120
##$ZL4= 120
##$ABSF1= 0
##$ABSF2= 0
##$ABSG= 0
##$ABSL= 0
##$ALPHA= 0
##$AQORDER= 0
##$ASSFAC= 0
##$ASSFACI= 0
##$ASSFACX= 0
##$ASSWID= 0
##$AUNMP= <proc_1d>
##$AZFE= 0.1
##$AZFW= 0.5
##$BCFW= 0
##$BC_mod= 2
##$BYTORDP= 0
##$COROFFS= 0
##$CY= -3
##$DATMOD= 1
##$DC= 0
##$DFILT= <>
##$DTYPP= 0
##$F1P= 0
##$F2P= 0
##$FCOR= 1
##$FTSIZE= 65536
##$FT_mod= 6
##$GAMMA= 0
##$GB= 0
##$INTBC= 1
##$INTSCL= 9.790993e-09
##$ISEN= 30
##$LB= 1.5
##$LEV0= 0
##$LPBIN= 0
##$MAXI= 10000
##$MC2= 0
##$MEAN= 0
##$ME_mod= 0
##$MI= 50
##$NCOEF= 0
##$NC_proc= -8
##$NLEV= 6
##$NOISF1= 182.463
##$NOISF2= 159.3651
##$NSP= 0
##$NTH_PI= 0
##$NZP= 0
##$OFFSET= 198.0616
##$PC= 4
##$PHC0= 2423.516
##$PHC1= 133.6883
##$PH_mod= 1
##$PKNL= yes
##$PPARMOD= 0
##$PSCAL= 0
##$PSIGN= 0
##$REVERSE= no
##$SF= 81.0140089999434
##$SI= 65536
##$SIGF1= 159.3651
##$SIGF2= -187.1042
##$SINO= 113.3802
##$SIOLD= 16384
##$SREGLST= <1H.CDCl3>
##$SSB= 0
##$STSI= 65536
##$STSR= 0
##$SW_p= 32467.5324675325
##$SYMM= 0
##$S_DEV= 0
##$TDeff= 32768
##$TDoff= 0
##$TI= <>
##$TILT= no
##$TM1= 0
##$TM2= 0
##$TOPLEV= 0
##$USERP1= <user>
##$USERP2= <user>
##$USERP3= <user>
##$USERP4= <user>
##$USERP5= <user>
##$WDW= 1
##$XDIM= 65536
##$YMAX_p= 264811115
##$YMIN_p= -276644248
$$ End of Bruker specific parameters
$$ ---------------------------------
##NTUPLES= NMR SPECTRUM
##VAR_NAME=  FREQUENCY,     SPECTRUM/REAL,   SPECTRUM/IMAG
##SYMBOL=    X,             R,               I
##VAR_TYPE=  INDEPENDENT,   DEPENDENT,       DEPENDENT
##VAR_FORM=  AFFN,          ASDF,            ASDF
##VAR_DIM=   65536,         65536,           65536
##UNITS=     HZ,            ARBITRARY UNITS, ARBITRARY UNITS
##FACTOR=    0.49542278885378, 1,            1
##FIRST=     16045.7642231865, 0,            0
##LAST=      -16421.768244346, 0,            0
##MIN=       -16421.768244346, -276644248,   0
##MAX=       16045.7642231865, 264811115,    0
$$ Real data points
##PAGE= N=1
##DATA TABLE= (X++(R..R)), XYDATA
$$ [...]
$$ plain form
6726 -11420729 -10997918 -10139319 -10218740 -10769901 -10345149 -8741679 -7155720 -6376176 -5947702
6717 -5947702 -5085556 -3511103 -1429290 557291 1710062 2109360 2984822 5153217 7585629
6708 7585629 8734883 8836679 9323904 10207780 10006840 8560937 7818719 8825163 9674567
6699 9674567 7947461 4029973 423024 -1549037 -2680003 -3716478 -3930698 -2545119
6691 -2545119 -530951 280174 -123492 600957 3913972 7280451 6250782 201942 -5967888
6682 -5967888 -7357897 -4619385 -1951071 -1126531 -586177 364993 340898 -611877 -25175
6673 -25175 2888159 5323287 5180156 4499533 5977502 8298265 8083472 5159913 2790050
6664 2790050 3215382 5595261 8068282 9497079 9254427 7392876 5202155 4039496 3666418
$$ packed form
6726a1420729M22811Q58599p9421n51161M24752J603470J585959P79544M28474
6717e947702Q62146J574453K081813J986581J152771L99298Q75462K168395K432412
6708G585629J149254J01796M87225Q83876k00940j445903p42218J006444Q49404
6699I674567j727106l917488l606949j972061j130966j036475k14220J385579
6691b545119K014168Q11125m03666P24449L313015L366479j029669o048840o169830
6682e967888j390009K738512K668314Q24540N40354R51170k4095r52775N86702
6673b5175K913334K435128j43131o80623J477969K320763k14793k923559k369863
6664B790050M25332K379879K473021J428797k42652j861551k190721j162659l73078
$$ plain form
6655 3666418 3032503 2236825 2252062 3216598 4428939 5353425 5225294 2787286 -1679501
6646 -1679501 -5215862 -5394139 -3689590 -3169184 -3951669 -4076427 -3944508 -5962307 -9806376
6637 -9806376 -12135344 -11766077 -11171669 -11519063 -10179405 -5382427 19386 2141528 880726
6628 880726 -1376211 -3484388 -5287033 -5715965 -4112127 -2010770 -961441 100901 2753986
6619 2753986 5768786 6782492 6252953 6748833 8908990 11017649 12257814 13465038 14582594
6610 14582594 14168118 11976966 9710816 8545652 7858119 6951533 6180429 5703525 4815947
6601 4815947 3344909 2375825 2773088 3904458 4436098 3788524 2586459 2139666 3265485
6592 3265485 5115445 5808524 4897445 4075034 4323889 3919714 1231985 -1946251 -2648011
$$ packed form
6655C666418o33915p95678J5237R64536J212341R24486j28131k438008m466787
6646a679501l536361j78277J704549N20406p82485j24758J31919k017799l844069
6637i806376k328968L69267N94408l47394J339658M796978N401813K122142j260802
6628H80726k256937k108177j802645m28932J603838K101357J049329J062342K653085
6619B753986L014800J013706n29539M95880K160157K108659J240165J207224J117556
6610A4582594m14476k191152k266150j165164o87533r06586p71104m76904q87578
6601D815947j471038r69084L97263J131370N31640o47574j202065m46793J125819
6592C265485J849960O93079r11079q22411K48855m04175k687729l178236p01760
$$ plain form
6583 -2648011 -1408660 -1452423 -3457363 -4634497 -3571593 -2580817 -3923807 -6590594 -8382847
6574 -8382847 -8685876 -7577338 -4631894 -545836 2145935 2055518 1015949 1411917 3168071
6565 3168071 5128752 7370080 9817240 10434134 7668169 3480446 1068949 458667 -678870
6556 -678870 -2383739 -1875932 1966233 6403520 8044392 6351584 3374925 1728445 3160277
6547 3160277 7165141 10437542 9580415 5082701 876177 -686114 -1341038 -3337809 -5562924
6538 -5562924 -5277679 -2311381 837873 2544438 3485392 4457272 4754061 3437464 800981
6529 800981 -2364046 -5923673 -9703564 -12371677 -12536875 -10990962 -10408639 -12103984 -14109031
6520 -14109031 -13480219 -9801881 -5196119 -1371858 1771865 4670925 6954459 8273290
$$ packed form
6583b648011J239351m3763k004940j177134J062904R90776j342990k666787j792253
6574h382847l03029J108538K945444M086058K691771r0417j039569L95968J756154
6565C168071J960681K241328K447160O16894k765965m187723k411497o10282j137537
6556f78870j704869N07807L842165M437287J640872j692808k976659j646480J431832
6547C160277M004864L272401q57127m497714m206524j562291o54924j996771k225115
6538e562924K85245K966298L149254J706565R40954R71880K96789j316597k636483
6529H00981l165027l559627l779891k668113j65198J545913N82323j695345k005047
6520a4109031O28812L678338M605762L824261L143723K899060K283534J318831
$$ plain form
6512 8273290 8811091 8418692 6783572 5104911 5607677 8045946 8712988 5095886 -72377
6503 -72377 -2083445 -431586 1459678 2113429 3724122 7239290 9514332 7635490 3460773
6494 3460773 1146371 1758228 3031719 3516367 4124748 5543044 6536020 5732597 3759002
6485 3759002 2713878 3994062 6919964 9241708 9187704 7329764 5901139 5835166 5444415
6476 5444415 3029424 -227165 -1665217 -945636 -491300 -2000164 -4284753 -5038490 -3247224
6467 -3247224 553585 4738669 6703760 4466962 -581299 -4180608 -3970430 -2246164
6459 -2246164 -2216718 -3239409 -2476976 -97772 738136 -911872 -2242757 -1490733 -897252
6450 -897252 -2868879 -5951017 -7273262 -6913470 -6846875 -7065859 -6012574 -4001788 -2839190
$$ packed form
6512H273290N37801l92399j635120j678661N02766K438269O67042l617102n168263
6503g2377k011068J651859J891264O53751J610693L515168K275042j878842m174717
6494C460773k314402O11857J273491M84648O08381J418296R92976q03423j973595
6485C759002j045124J280184K925902K321744n4004j857940j428625o5973l90751
6476E444415k414991l256589j438052P19581M54336j508864k284589p53737J791266
6467c247224L800809M185084J965091k236798n048261l599309K10178J724266
6459b246164K9446j022691P62433K379204Q35908j650008j330885P52024N93481
6450h97252j971627l082138j322245L59792O6595k18984J053285K010786J162598
$$ plain form
6441 -2839190 -2328393 -549853 2185445 3102420 1448800 -124198 61204 190825 -1375488
6432 -1375488 -3040009 -3096907 -3235607 -5734027 -9092405 -9986972 -8446035 -7478523 -7918013
6423 -7918013 -7221081 -3976067 -525191 222090 -1579213 -3712859 -5057162 -6174311 -7290646
6414 -7290646 -6975559 -3448808 2695536 7708476 8005165 4459245 1563299 1551165 1757637
6405 1757637 -414334 -2563585 -567720 4978353 9448355 10423683 9327819 7384471
6397 7384471 4424541 1975479 2678287 5171341 4155504 -2000992 -7716500 -7298234 -2231959
6388 -2231959 2045735 3724196 4861711 6079205 5630921 3345284 1537880 1441893 1570191
6379 1570191 336485 -1671018 -2497781 -522822 4523946 10789319 14826421 14458759 11048578
$$ packed form
6441b839190N10797J778540K735298R16975j653620j572998J85402J29621j566313
6432a375488j664521n6898j38700k498420l358378q94567J540937R67512m39490
6423g918013O96932L245014L450876P47281j801303k133646j344303j117149j116335
6414g290646L15087L526751O144344N012940K96689l545920k895946j2134K06472
6405A757637k171971k149251J995865N546073M470002R75328j095864j943348
6397G384471k959930k449062P02808K493054j015837o156496n715508M18266N066275
6388b231959M277694J678461J137515J217494m48284k285637j807404r5987J28298
6379A570191j233706k007503q26763J974959N046768O265373M037102l67662l410181
$$ plain form
6370 11048578 7840515 6619140 7133350 8712233 10533755 10952569 8637919 4328257
6362 4328257 48776 -2980126 -4364659 -3541709 -843074 1173560 -49226 -3505384
6354 -3505384 -5451451 -4053356 -1366397 -366394 -1625473 -3312624 -3198826 -400786
6346 -400786 3854424 7151069 8196239 7585893 5650951 1243304 -5516164 -10905250 -10873258
6337 -10873258 -6039357 -821252 1919450 2692767 2442589 1148011 -415355 -768077 -425973
6328 -425973 -1790164 -5475228 -9169173 -10807511 -10392545 -8179967 -4061025 323670 2013867
6319 2013867 757507 -303721 382482 175926 -3100723 -6768409 -6645842 -2903688 525957
6310 525957 1180055 -164511 -2102889 -4095231 -5460828 -5293158 -3808913 -2281469 -1426495
$$ packed form
6370A1048578l208063j221375N14210J578883J821522M18814k314650m309662
6362D328257m279481l028902j384533Q22950K698635K016634j222786l456158
6354c505384j946067J398095K686959J000003j259079j687151J13798K798040
6346d00786M255210L296645J045170o10346j934942m407647o759468n389086L1992
6337a0873258M833901N218105K740702P73317k50178j294578j563366l52722L42104
6328d25973j364191l685064l693945j638338M14966K212578M118942M384695J690197
6319B013867j256360j061228O86203k06556l276649l667686J22567L742154L429645
6310E25957O54098j344566j938378j992342j365597J67670J484245J527444Q54974
$$ plain form
6301 -1426495 -920539 -420188 -2958 447786 1553491 3893892 7037073 8856622 6618252
6292 6618252 186207 -6380701 -8651423 -7313917 -7319806 -11007284 -14912723 -14676317 -10387109
6283 -10387109 -5294000 -1686459 -133740 -607358 -2025377 -2370985 -1250620 -610329 -1253376
6274 -1253376 -1004176 1575875 4285700 4796656 4502460 5676982 7224468 6974948 6044013
6265 6044013 6646233 7246422 4592853 -323148 -3027141 -1991431 36409 948231 1173298
6256 1173298 704458 -1269340 -3452543 -3614456 -3034225 -5030703 -8459889 -8031632 -2636857
6247 -2636857 2058769 1804753 -572238 -896216 -159784 -1057802 -2045595 -13661 3612629
6238 3612629 4529462 2092240 -151197 194053 2225820 4501545 6506433 7425995 6403453
$$ packed form
6301a426495N05956N00351M17230M50744J105705K340401L143181J819549k238370
6292F618252o432045o566908k270722J337506n889l687478l905439K36406M289208
6283a0387109N093109L607541J552719m73618j418019l45608J120365O40291o43047
6274a253376K49200K580051K709825N10956k94196J174522J547486k49520r30935
6265F044013O02220O00189k653569m916001k703993J035710K027840R11822K25067
6256A173298m68840j973798k183203j61913N80231j996478l429186M28257N394775
6247b636857M695626k54016k376991l23978P36432q98018r87793K031934L626290
6238C612629R16833k437222k243437L45250K031767K275725K004888R19562j022542
$$ plain form
6229 6403453 4273043 2872441 2643317 2606529 2192159 1387598 -106940 -2022615 -2776430
6220 -2776430 -1539662 -17351 -130788 -1164536 -1552537 -2122912 -4615133 -7970890 -9404780
6211 -9404780 -8751722 -8532451 -9829250 -11284518 -12221750 -13356221 -13952262 -11836838 -7426186
6202 -7426186 -4466310 -4998011 -6318617 -5001421 -1669874 525785 477007 -267512 -435009
6193 -435009 -317395 -527725 -1299472 -2992335 -5938331 -9582693 -12501773 -13332953 -11504851
6184 -11504851 -7606197 -3412060 -836933 -253262 -317213 197408 1062855 1430109 1167842
6175 1167842 875524 1294669 3055283 6017557 8378952 7695648 3814222 -197425 -1274062
6166 -1274062 169707 1202168 191850 -1844174 -3471862 -4727191 -6245127 -7686673
$$ packed form
6229F403453k130410j400602k29124l6788m14370q04561j494538j915675p53815
6220b776430J236768J522311j13437j033748l88001n70375k492221l355757j433890
6211i404780O53058K19271j296799j455268r37232j134471n96041K115424M410652
6202g426186K959876n31701j320606J317196L331547K195659m8778p44519j67497
6193d35009J17614k10330p71747j692863k945996l644362k919080q31180J828102
6184a1504851L898654M194137K575127N83671o3951N14621Q65447L67254k62267
6175A167842k92318M19145J760614K962274K361395o83304l881426m011647j076637
6166a274062J443769J032461j010318k036024j627688j255329j517936j441546
$$ plain form
6158 -7686673 -7886006 -6132183 -2903296 247801 1343019 -748889 -5080124 -9098357
6150 -9098357 -10964837 -11105960 -10936513 -10586301 -8984864 -6067903 -3498252 -2610728 -2783527
6141 -2783527 -2803115 -2967963 -4611468 -8042076 -12136391 -15522626 -16937143 -15092156 -10141123
6132 -10141123 -5144179 -3844680 -6371473 -8992649 -8782808 -6634467 -4893986 -4232259
6124 -4232259 -4139672 -4321012 -3847850 -997153 3892628 7235588 6308244 2895603 241867
6115 241867 -1712042 -4542040 -6477953 -4151433 943122 2770832 -1064655 -5836183
6107 -5836183 -6612884 -4814090 -4718742 -6453380 -6522211 -3968354 -2005530 -3177314 -5698055
6098 -5698055 -5665398 -1519930 4484703 8697504 9656647 9342989 10572208 13308066 14656178
$$ packed form
6158g686673j99333J753823L228887L151097J095218k091908m331235m018233
6150i098357j866480j41123J69447L50212J601437K916961K569651Q87524j72799
6141b783527j9588j64848j643505l430608m094315l386235j414517J844987M951033
6132a0141123M996944J299499k526793k621176K09841K148341J740481O61727
6124d232259R2587j81340M73162K850697M889781L342960r27344l412641k653736
6115B41867j953909k829998j935913K326520N094555J827710l835487m771528
6107e836183p76701J798794R5348j734638o8831K553857J962824j171784k520741
6098e698055L2657M145468O004633M212801R59143l13658J229219K735858J348112
$$ plain form
6089 14656178 12735514 9040495 6082706 4104341 1596247 -1718258 -3951831 -3087684
6081 -3087684 792366 5212768 7066797 5306964 2100504 541270 1129652 1557291 -38754
6072 -38754 -3081524 -5905051 -7232220 -5912137 -1360263 4808058 9584445 11983871 13569269
6063 13569269 14731340 13400388 9257290 6082815 6898344 9202494 8594895 5332514
6055 5332514 3333465 3770782 3907558 2185681 487338 670849 2104618 3339738 3370117
6046 3370117 820135 -4920756 -10965543 -12558494 -8717281 -3427618 -34448 2452537
6038 2452537 5804061 8568007 8294725 5438020 2262513 -388591 -2543577 -2892290 -176279
6029 -176279 4066903 7039859 8510432 10312056 12213805 11378923 6762601 1464852 -825110
$$ packed form
6089A4656178j920664l695019k957789j978365k508094l314505k233573Q64147
6081c087684L880050M420402J854029j759833l206460j559234N88382M27639j596045
6072c8754l042770k823527j327169J320083M551874O168321M776387K399426J585398
6063A3569269J162071j330952m143098l174475Q15529K304150o07599l262381
6055E332514j999049M37317J36776j721877j698343J83511J433769J235120L0379
6046C370117k549982n740891o044787j592951L841213N289663L393170K486985
6038B452537L351524K763946k73282k856705l175507k651104k154986l48713K716011
6029a76279M243182K972956J470573J801624J901749q34882m616322n297749k289962
$$ plain form
6020 -825110 -47633 1125268 1202461 1067947 1691866 2485675 2534496 2347341 3368237 6099253
6010 6099253 9588093 12653700 14589396 14500086 11389696 6018330 1647097 1249034 4164176
6001 4164176 6859327 6835196 4486927 1514591 -630921 -792475 1125300 2865181 1533116
5992 1533116 -2354337 -4645820 -2767941 901609 2745843 3008008 4442006 7097800
5984 7097800 7851014 5447847 3171039 5024185 10688036 15599835 15549117 10472920 3979753
5975 3979753 -346383 -1955170 -2642073 -3423289 -3250769 -1055315 2362611 5439779 7683087
5966 7683087 9175645 9288932 7433091 4438322 1727112 -323575 -1848004 -2193136 -968109
5957 -968109 304382 -260941 -2036669 -2763213 -2095741 -1754434 -2013208 -985045 1627109
$$ packed form
6020h25110P77477J172901P7193j34514O23919P93809M8821j87155J020896K731016
6010F099253L488840L065607J935696q9310l110390n371366m371233l98063K915142
6001D164176K695151k4131k348269k972336k145512j61554J917775J739881j332065
5992A533116l887453k291483J877879L669550J844234K62165J433998K655794
5984G097800P53214k403167k276808J853146N663851M911799n0718n076197o493167
5975C979753m326136j608787o86903p81216J72520K195454L417926L077168K243308
5966G683087J492558J13287j855841k994769k711210k050687j524429l45132J225027
5957i68109J272491n65323j775728p26544O67472L41307k58774J028163K612154
$$ plain form
5948 1627109 2994051 1345135 -558254 1239820 6247764 9856782 9124300 6060829
5940 6060829 4705892 6486551 9327411 10550608 9608493 7748642 5695974 2944839
5932 2944839 -115459 -879590 2581078 7739973 9340444 5634137 613607 -1200389
5924 -1200389 -43105 714036 -596539 -3127378 -6015639 -8790129 -9987674 -8269400
5916 -8269400 -4883919 -2445696 -1132594 1286131 5204954 7745042 6699660 3515229
5908 3515229 828394 -877942 -2306954 -2839099 -1420868 928722 1878322 998973 430427
5899 430427 2096463 5494015 8469523 9336338 8185757 6746628 6749975 7880449 7883935
5890 7883935 5445378 2227476 975269 2257280 4343017 5658521 5839155 4932806 3464862
$$ packed form
5948A627109J366942j648916j903389J798074N007944L609018p32482l063471
5940F060829j354937J780659K840860J223197r42115j859851k052668k751135
5932B944839l060298p64131L460668N158895J600471l706307n020530j813996
5924a200389J157284P57141j310575k530839k888261k774490j197545J718274
5916h269400L385481K438223J313102K418725L918823K540088j045382l184431
5908C515229k686835j706336j429012n32145J418231K349590R49600q79349n68546
5899D30427J666036L397552K975508Q66815j150581j439129L347J130474L486
5890G883935k438557l217902j252207J282011K085737J315504J80634r06349j467944
$$ plain form
5881 3464862 3026257 4658071 6554878 5691253 2288019 252964 2026922 5234373 6133930
5872 6133930 4442285 2547317 1431781 107606 -1410883 -1227895 1773280 5981159
5864 5981159 8368279 7079001 2894671 -1178853 -2415194 -1331116 -1138558 -3106595
5856 -3106595 -4099793 -906972 4498197 7232870 6238621 4903576 4940927 4095847 1342674
5847 1342674 -90419 2171227 5054584 4362703 1219957 -36375 1098226 909888 -2148063
5838 -2148063 -5012436 -4792288 -2437493 -279723 1246224 2839701 4445012 5650088
5830 5650088 6482457 6883097 6892516 7773137 10808518 14413069 15125026 12630608 10870297
5821 10870297 12310675 14162501 13038989 10475883 9906920 10279751 7629887 2339980
$$ packed form
5881C464862m38605J631814J896807q63625l403234k035055J773958L207451Q99557
5872F133930j691645j894968j115536j324175j518489J82988L001175M207879
5864E981159K387120j289278m184330m073524j236341J084078J92558j968037
5856c106595r93198L192821N405169K734673r94249j335045L7351q45080k753173
5847A342674j433093K261646K883357o91881l142746j256332J134601j88338l057951
5838b148063k864373K20148K354795K157770J525947J593477J605311J205076
5830E650088Q32369M00640R419Q80621L035381L604551P11957k494418j760311
5821A0870297J440378J851826j123512k563106n68963L72831k649864n289907
$$ plain form
5813 2339980 -398041 1803366 5287443 6576285 7300485 9841013 11901520 9810588
5805 9810588 4954418 2216486 2939435 3980849 3697149 4180172 6350330 7226650 4657453
5796 4657453 1416952 1296294 3392635 3931469 2487803 2533808 5866521 9949772 11567504
5787 11567504 10354672 7737238 4908337 3159592 3859500 6261947 7161556 4776790
5779 4776790 1620068 1420041 4273022 7079412 7993475 7953108 8065866 8036625 7579315
5770 7579315 7179461 6765378 5512529 3729923 3116386 4136255 4804607 3346057 726037
5761 726037 -742296 -182427 1595362 3341118 3548310 874589 -3684917 -6207058 -3810652
5752 -3810652 1358473 4537362 4413247 4017399 5399887 6673676 5728752 3916521 3606831
$$ packed form
5813B339980k738021K201407L484077J288842P24200K540528K060507k090932
5805I810588m856170k737932P22949J041414k83700M83023K170158Q76320k569197
5796D657453l240501j20658K096341N38834j443666M6005L332713M083251J617732
5787A1567504j212832k617434k828901j748745O99908K402447Q99609k384766
5779D776790l156722k00027K852981K806390R14063m0367J12758k9241m57310
5770G579315l99854m14083j252849j782606o13537J019869O68352j458550k620020
5761G26037j468333N59869J777789J745756K07192k673721m559506k522141K396406
5752c810652N169125L178889j24115l95848J382488J273789r44924j812231l09690
$$ plain form
5743 3606831 4209788 3581219 2037538 1607835 1708045 -840189 -6659049 -11842702 -12848133
5734 -12848133 -10967788 -9869290 -10614041 -11617532 -12138378 -12741471 -12718035 -10203113 -5563577
5725 -5563577 -2138775 -2356057 -4879353 -6770643 -6883431 -5844213 -4218290 -2455689 -1719474
5716 -1719474 -2965526 -5440895 -7230155 -6906558 -3910355 1548166 7478469 10057671
5708 10057671 6816781 -179900 -6093115 -8251616 -7735399 -6255794 -3791890 -124829
5700 -124829 3258597 4385577 3126827 1176514 75717 -58917 -79321 -502696 -748429
5691 -748429 -22711 920213 64972 -2828066 -4893942 -3886758 -2047702 -3238527 -6668805
5682 -6668805 -7277442 -3150340 1363171 1924074 13937 -499346 432023 263282 -623839
$$ packed form
5743C606831O02957o28569j543681m29703J00210k548234n818860n183653j005431
5734a2848133J880345J098498p44751j003491n20846o03093K3436K514922M639536
5725e563577L424802k17282k523296j891290j12788J039218J625923J762601P36215
5716a719474j246052k475369j789260L23597K996203N458521N930303K579202
5708A0057671l240890o996681n913215k158501N16217J479605K463904L667061
5700a24829L383426J126980j258750j950313j100797j34634k0404m23375k45733
5691g48429P25718R42924q55241k893038k065876J007184J839056j190825l430278
5682f668805o08637M127102M513511N60903j910137n13283R31369j68741q87121
$$ plain form
5673 -623839 800417 4765164 7595148 6616956 2934174 -1284409 -5140706 -7708400 -7528329
5664 -7528329 -5078095 -3275913 -3630557 -3889319 -1545128 2017297 3317630 1750138 196839
5655 196839 708685 1797195 855151 -2129661 -4546938 -4521028 -3199564 -3077128 -4478398
5646 -4478398 -4900080 -2418503 1314701 2813117 967790 -2060167 -3996225 -4650976 -4586616
5637 -4586616 -3523742 -1231001 1341030 3137992 4409184 5969862 7744434 8962221
5629 8962221 9107728 7867906 5093655 1953348 1170922 4416302 9717311 13020562 12499854
5620 12499854 10156077 9003532 9846257 11218788 11423071 9840583 6872609 3534057
5612 3534057 1093481 416343 1227617 2199906 2231057 1779801 2497755 5144770 8326822
$$ packed form
5673f23839J424256L964747K829984r78192l682782m218583l856297k567694J80071
5664g528329K450234J802182l54644k58762K344191L562425J300333j567492j553299
5655A96839N11846J088510r42044k984812k417277K5910J321464J22436j401270
5646d478398m21682K481577L733204J498416j845327l027957j936058o54751O4360
5637d586616J062874K292741K572031J796962J271192J560678J774572J217787
5629H962221J45507j239822k774251l140307p82426L245380N301009L303251n20708
5620A2499854k343777j152545Q42725J372531K04283j582488k967974l338552
5612C534057k440576o77138Q11274R72289L1151m51256P17954K647015L182052
$$ plain form
5603 8326822 10063186 10282944 10579689 11376202 10794209 7273646 2314040 -706547 -148193
5594 -148193 2506787 4793704 5797427 6265699 6879902 7041199 5511038 2124278 -1513296
5585 -1513296 -3438764 -3257383 -2124650 -1072757 -310185 -143189 -1238671 -3375011 -5075112
5576 -5075112 -5336049 -4806221 -4389454 -3702647 -2107465 -363020 337750 492608 1673438
5567 1673438 3694307 4101068 1305645 -2794156 -4388110 -1841045 2317016 3718747
5559 3718747 540239 -4613789 -7594431 -7282196 -6334602 -7219530 -8934087 -8691110 -5698667
5550 -5698667 -1686134 1711419 4375051 6634444 8425570 9867163 11392491 12727326
5542 12727326 12587876 10035784 5900700 2652157 2680179 5964238 9193872 8514859 4228766
$$ packed form
5603H326822J736364K19758K96745P96513n81993l520563m959606l020587N58354
5594a48193K654980K286917J003723M68272O14203J61297j530161l386760l637574
5585a513296j925468J81381J132733J051893P62572J66996j095482k136340j700101
5576e075112k60937N29828M16767O86807J595182J744445P00770J54858J180830
5567A673438K020869M06761k795423m099801j593954K547065M158061J401731
5559C718747l178508n154028k980642L12235R47594q84928j714557K42977K992443
5550e698667M012533L397553K663632K259393J791126J441593J525328J334835
5542A2727326j39450k552092m135084l248543K8022L284059L229634o79013m286093
$$ plain form
5533 4228766 1481494 4517181 11180271 15289708 13868223 9455309 5443052 2262185
5525 2262185 -866781 -3313026 -4137350 -3951855 -3710949 -2889963 -629335 2267927 4117136
5516 4117136 4396132 3589279 1765810 -1167620 -4410956 -7039680 -9448649 -12482272 -15259886
5507 -15259886 -15388648 -11687545 -5738470 -459506 2245486 2447451 1573303 1072586 1351440
5498 1351440 1853547 1993011 1528403 187302 -2067270 -4256150 -5150162 -5244042 -6427967
5489 -6427967 -8843316 -9792115 -7301069 -3286042 -1143650 -1232323 -1033685 780551 2908841
5480 2908841 4035763 4518751 4897658 4674231 3453609 1908955 807246 80662 -564762
5471 -564762 -915478 -433294 1424246 4781927 8338368 9498732 7188744 4059519 3797100
$$ packed form
5533D228766k747272L035687O663090M109437j421485m412914m012257l180867
5525B262185l128966k446245q24324J85495K40906Q20986K260628K897262J849209
5516D117136K78996q06853j823469k933430l243336k628724k408969l033623k777614
5507a5259886j28762L701103N949075N278964K704992K01965q74148n00717K78854
5498A351440N02107J39464m64608j341101k254572k188880q94012r3880j183925
5489f427967k415349r48799K491046M015027K142392q8673J98638J814236K128290
5480B908841J126922M82988L78907k23427j220622j544654j101709p26584o45424
5471e64762l50716M82184J857540L357681L556441J160364k309988l129225k62419
$$ plain form
5462 3797100 6440427 8796893 9498371 10497298 12629960 13131621 9882575 5505185 4213436
5453 4213436 6130721 7741392 7127146 5826494 5689675 6482254 6898510 5971128 3301514
5444 3301514 -313727 -2450975 -1195521 2042390 3695938 2331285 -97960 -1597085
5436 -1597085 -2487132 -3531174 -3963292 -3038641 -1856624 -1639685 -1290143 1190768 5305651
5427 5305651 8144474 8007792 6259940 5159122 5320173 6072784 7101006 8486465 9623069
5418 9623069 9319831 7192863 4249182 1782425 190485 -677015 -403804 1883113 5976370
5409 5976370 9792163 10888518 8773777 5164176 1927528 -537542 -2578165 -3777237
5401 -3777237 -3224946 -1227388 354342 127941 -1068220 -1270484 93745 1983831 4127089
$$ packed form
5462C797100K643327K356466P01478R98927K132662N01661l249046m377390j291749
5453D213436J917285J610671o14246j300652j36819P92579M16256r27382k669614
5444C301514l615241k137248J255454L237911J653548j364653k429245j499125
5436a597085q90047j044042m32118R24651J182017K16939L49542K480911M114883
5427E305651K838823j36682j747852j100818J61051P52611J028222J385459J136604
5418I623069l03238k126968k943681k466757j591940q67500K73211K286917M093257
5409E976370L815793J096355k114741l609601l236648k465070k040623j199072
5401c777237N52291J997558J581730k26401j196161k02264J364229J890086K143258
$$ plain form
5392 4127089 7954245 13855640 18678860 18248854 12560482 6432099 4140019 5098478 5989315
5383 5989315 5336876 3944882 2151507 -505033 -3077325 -3447684 -1477520 376665 639848
5374 639848 930797 3032998 5673123 6235870 4551152 2867231 2628558 3211802 3509860
5365 3509860 2835658 411588 -3907015 -8080283 -9213080 -7381519 -6300016 -8786171
5357 -8786171 -12978726 -14786768 -13183278 -11102024 -11300676 -13210270 -14293640 -13011162
5349 -13011162 -9658475 -5418779 -1716842 46331 -698274 -2995473 -5077129 -5908275
5341 -5908275 -5756822 -5376125 -5096781 -4729691 -3915576 -2458678 -664404 579352 493960
5332 493960 -550497 -993707 519796 3661306 6440799 6773610 4228292 450472 -2305907
$$ packed form
5392D127089L827156N901395M823220m30006n688372o128383k292080R58459Q90837
5383E989315o52439j391994j793375k656540k572292l70359J970164J854185K63183
5374F39848K90949K102201K640125N62747j684718j683921k38673N83244K98058
5365C509860o74202k424070m318603m173268j132797J831561J081503k486155
5357h786171m192555j808042J603490K081254j98652j909594j083370J282478
5349a3011162L352687M239696L701937J763173p44605k297199k081656q31146
5341e908275J51453L80697K79344L67090Q14115J456898J794274J243756q5392
5332D93960j044457m43210J513503L141510K779493L32811k545318l777820k756379
$$ plain form
5323 -2305907 -3381194 -4191619 -5983431 -7515574 -6189640 -1647113 3171730 5369703
5315 5369703 5294086 5219796 5881126 6011930 4833222 3135601 1841555 1195110 1669166
5306 1669166 3986254 7575034 10443099 11367665 10964285 9878873 7421032 3185242 -1224911
5297 -1224911 -3604310 -3571518 -2367115 -972534 318647 1215313 1764556 2785479 4463371
5288 4463371 5043540 2712578 -1356059 -3635309 -2211499 1371421 4577935 6719725
5280 6719725 8615405 10468173 11008114 8652840 3560373 -1322148 -2240999 1204470 4855733
5271 4855733 4783887 2508502 2835395 6687740 9420254 7354646 2809867 452458 1158989
5262 1158989 2323951 2471911 2242628 1602992 -476256 -3240101 -3939255 -1439338 1953477
$$ packed form
5323b305907j075287q10425j791812j532143J325934M542527M818843K197973
5315E369703p5617p4290O61330J30804j178708j697621j294046o46445M74056
5306A669166K317088L588780K868065R24566m03380j085412k457841m235790m410153
5297a224911k379399L2792J204403J394581J291181Q96666N49243J020923J677892
5288D463371N80169k330962m068637k279250J423810L582920L206514K141790
5280F719725J895680J852768N39941k355274n092467m882521r18851L445469L651263
5271D855733p1846k275385L26893L852345K732514k065608m544779k357409P06531
5262A158989J164962J47960k29283o39636k079248k763845o99154K499917L392815
$$ plain form
5253 1953477 3318161 2340160 907540 743807 2140700 3922543 4099338 1663304 -1817931
5244 -1817931 -3623548 -3221009 -2546099 -2405361 -856295 3227314 7031726 6905397 3577551
5235 3577551 1396363 2479708 4434866 4523862 3455063 3563676 5216092 6912216 7661807
5226 7661807 7297566 5276915 1326032 -2842020 -4354253 -2183499 1841785 5205281
5218 5205281 6762055 6644677 5616233 4999501 5939906 7949923 9012747 7685393 4439753
5209 4439753 849886 -1392658 -579622 4050588 10535641 14947750 15144076 12532652 9206744
5200 9206744 5240301 513426 -2805733 -2473035 115808 1354212 202197 -1312675
5192 -1312675 -2260870 -4290490 -8212511 -12044630 -13855136 -14229259 -14375948 -13778191 -11432937
$$ packed form
5253A953477J364684r78001j432620j63733J396893J781843J76795k436034l481235
5244a817931j805617M02539O74910J40738J549066M083609L804412j26329l327846
5235C577551k181188J083345J955158Q8996j068799J08613J652416J696124P49591
5226G661807l64241k020651l950883m168052j512233K170754M025284L363496
5218E205281J556774j17378j028444o16732R40405K010017J062824j327354l245640
5209D439753l589867k242544Q13036M630210O485053M412109J96326k611424l325908
5200I206744l966443m726875l319159L32698K588843J238404j152015j514872
5192a312675r48195k029620l922021l832119j810506l74123j46689N97757K345254
$$ plain form
5183 -11432937 -7854334 -4172496 -494525 3349015 6607208 8562160 9496120 9337162
5175 9337162 6703066 1068321 -5175555 -8740807 -8884100 -7192493 -4719432 -1299824
5167 -1299824 2687681 5986163 8198699 10281431 12719135 14200864 12759315 8025958
5159 8025958 2255286 -1053357 -193286 3020906 5398515 6128030 6917197 8399154 8807247
5150 8807247 7220045 5592561 5615873 5640369 3180000 -967771 -3511836 -2482170 1738857
5141 1738857 7634272 12464574 12808831 8318360 3517891 2542590 3478184 1798180 -1877377
5132 -1877377 -2373717 1920399 6712202 8441288 8329928 8270876 7432160 5285866 3806836
5123 3806836 3965305 3787878 2605522 3292178 6983007 9529617 7537844 4566516 6089404
$$ packed form
5183a1432937L578603L681838L677971L843540L258193J954952R33960j58958
5175I337162k634096n634745o243876l565252j43293J691607K473061L419608
5167a299824L987505L298482K212536K082732K437704J481729j441549m733357
5159H025958n770672l308643Q60071L214192K377609P29515P89167J481957M08093
5150H807247j587202j627484K3312K4496k460369m147771k544065J029666M221027
5141A738857N895415M830302L44257m490471m800469r75301R35594j680004l675557
5132a877377m96340M294116M791803J729086j11360n9052q38716k146294j479030
5123C806836J58469j77427j182356O86656L690829K546610j991773k971328J522888
$$ plain form
5114 6089404 10575783 11286974 5955710 -899020 -5244418 -7645710 -9149206 -8251056 -4266280
5105 -4266280 259375 3159731 5609876 8847792 10710463 8745604 4959513 3784467
5097 3784467 5813152 6947619 4371260 521789 -481046 1461974 2476481 -44198
5089 -44198 -4238690 -6276972 -4601910 -781109 2751648 4493974 4153477 2806340 2642277
5080 2642277 4942509 8140147 9352846 7936864 5792715 3994105 1427531 -2396758
5072 -2396758 -5613653 -6582982 -6046343 -4978492 -2571118 1291619 3798821 2762453 873757
5063 873757 2564332 7248029 9753177 7782490 4904081 4816313 6244433 5696643 2501367
5054 2501367 -1433880 -4833827 -7321180 -7824646 -5503473 -1806712 665500 1266362 1515280
$$ packed form
5114F089404M486379P11191n331264o854730m345398k401292j503496Q98150L984776
5105d266280M525655K900356K450145L237916J862671j964859l786091j175046
5097C784467K028685J134467k576359l849471j002835J943020J014507k520679
5089d4198m194492k038282J675062L820801L532757J742326l40497j347137j64063
5080B642277K300232L197638J212699j415982k144149j798610k566574l824289
5072b396758l216895r69329N36639J067851K407374L862737K507202j036368j888696
5063H73757J690575M683697K505148j970687k878409q7768J428120n47790l195276
5054B501367l935247l399947k487353n03466K321173L696761K472212O00862K48918
$$ plain form
5045 1515280 2484233 3853903 5421430 7315001 8227695 5748380 -83993 -5189383 -5374283
5036 -5374283 -1109738 3432598 5645535 6684508 8316301 9941320 9887538 7866967 4671745
5027 4671745 908200 -2293240 -2822009 -217552 2264630 1030924 -2824500 -4891289
5019 -4891289 -3873611 -3200445 -5258246 -7513116 -6492411 -2878693 -12397 709273 241148
5010 241148 -826777 -2583114 -4169049 -4334648 -3279481 -2032831 -546196 1727848 3886607
5001 3886607 4082252 1738056 -2047533 -5646667 -7272604 -5511220 -1272109 1977292
4993 1977292 1936164 368740 331124 1920096 3231894 4043006 5290269 5906532 3996054
4984 3996054 1035305 1012445 4573485 7487229 6422850 3506170 3293657 7053655 11715027
$$ packed form
5045A515280R68953J369670J567527J893571R12694k479315n832373n105390j84900
5036e374283M264545M542336K212937J038973J631793J625019n3782k020571l195222
5027D671745l763545l201440n28769K604457K482182j233706l855424k066789
5019d891289J017678O73166k057801k254870J020705L613718K866296P21670m68125
5010B41148j067925j756337j585935j65599J055167J246650J486635K274044K158759
5001C886607J95645k344196l785589l599134j625937J761384M239111L249401
4993A977292m1128j567424l7616J588972J311798Q11112J247263O16263j910478
4984C996054k960749k2860L561040K913744j064379k916680k12513L759998M661372
$$ plain form
4975 11715027 13388349 10801771 6042542 2604792 2250347 3772732 5197006 6187096
4967 6187096 7166810 7412117 5998589 3682745 1751678 -33586 -2136023 -3125505 -1610799
4958 -1610799 876029 2090367 3026393 5835595 8625940 6995618 1075928 -3505578
4950 -3505578 -2853981 987200 4370900 6667385 8677884 9868543 9544070 8495927 7793998
4941 7793998 7775210 8877595 11032149 11910619 9032418 4340932 3134945 7219784 12525277
4932 12525277 14888317 14740605 14398833 14094374 12851126 10689045 8133341 5629328 4345551
4923 4345551 5129900 6345812 5773368 4680946 6258377 10035111 12364578 12586403 13425210
4914 13425210 14754986 13056405 8426735 5707858 6466495 6246976 2511080 -1045112
$$ packed form
4975A1715027J673322k586578m759229l437750l54445J522385J424274R90090
4967F187096R79714K45307j413528k315844j931067j785264k102437r89482J514706
4958a610799K486828J214338R36026K809202K790345j630322n919690m581506
4950c505578O51597L841181L383700K296485K010499J190659l24473j048143p01929
4941G793998j8788J102385K154554Q78470k878201m691486j205987M084839N305493
4932A2525277K363040j47712l41772l04459j243248k162081k555704k504013j283777
4923D345551P84349J215912n72444j092422J577431L776734K329467K21825Q38807
4914A3425210J329776j698581m629670k718877P58637k19519l735896l556192
$$ plain form
4906 -1045112 -1188559 120775 884030 2441740 4351863 2856402 -1733568 -3361947 18330
4897 18330 2812137 2202835 3238516 8077419 10053360 5729529 2940592 8020590 14627994
4888 14627994 15128276 13449117 15575653 17065705 12516349 7652687 8263934 7537685 -77255
4879 -77255 -4176184 3547629 9411605 -248585 -11154362 -8513357 -21894341 -96004031
4871 -96004031 -210375671 -276644248 -240280701 -147548659 -81230604 -62116226 -52208898
4864 -52208898 -30218481 -14575700 -17550580 -22499469 -15879953 -8195626 -10371850 -14541303
4856 -14541303 -11325339 -6470361 -7727880 -10825186 -9922721 -9028434 -12521937 -15367828
4848 -15367828 -12410019 -7961091 -7517071 -8439955 -6668215 -4600147 -4898968 -4241629 -543457
$$ packed form
4906a045112j43447J309334P63255J557710J910123j495461m589970j628379L380277
4897A8330K793807o09302J035681M838903J975941m323831k788937N079998O607404
4888A4627994N00282j679159K126536J490052m549356m863662O11247p26249p614940
4879g7255m098929P723813N863976r660190j0905777K641005j3380984p4109690
4871i6004031j14371640o6268577L6363547R2732042O6318055J9114378R907328
4864e2208898K1990417J5642781k974880m948889O619516P684327k176224m169453
4856a4541303L215964M854978j257519l097306R02465Q94287l493503k845891
4848a5367828K957809M448928M44020r22884J771740K068068k98821O57339L698172
$$ plain form
4839 -543457 1085126 -2950515 -7135835 -5639285 -2145182 -2949065 -6249260 -6768920 -5832821
4830 -5832821 -7803753 -10412279 -7953161 -1895078 464649 -2918938 -6816281 -7535398
4822 -7535398 -6685061 -5672530 -2932292 1797128 5508221 6170145 5424407 5595350 6665440
4813 6665440 7238893 6491912 4541216 2294538 1054308 1385523 2920815 5633293 9474478
4804 9474478 12081403 9806513 2892546 -3328218 -4870442 -3790150 -3562564 -3161150 -42362
4795 -42362 3734133 3894425 1262454 1020192 4433867 6570442 3681962 -1579609 -4580741
4786 -4580741 -4935619 -5543312 -7515673 -8876152 -7613322 -4053285 -249227 1898434 1941185
4777 1941185 972425 466794 714901 392956 -2077305 -6482399 -10229885 -10597516 -8086894
$$ packed form
4839e43457J628583m035641m185320J496550L494103q03883l300195n19660R36099
4830e832821j970932k608526K459118O058083K359727l383587l897343p19117
4822g535398Q50337J012531K740238M729420L711093O61924p45738J70943J070090
4813F665440N73453p46981j950696k246678j240230L31215J535292K712478L841185
4804I474478K606925k274890o913967o220764j542224J080292K27586M01414L118788
4795d2362L776495J60292k631971k42262L413675K136575k888480n261571l001132
4786d580741l54878o07693j972361j360479J262830L560037L804058K147661M2751
4777A941185r68760n05631K48107l21945k470261m405094l747486l67631K510622
$$ plain form
4768 -8086894 -6457069 -8071979 -10279964 -8712448 -3531428 775248 1970609 2579128
4760 2579128 4443139 4930329 1801036 -1300788 1291378 9133114 15561275 15732853 11430078
4751 11430078 7411051 5899823 5791093 5285145 3955596 2967637 3753440 6063765 7695857
4742 7695857 6947075 4780666 3542427 4116750 5445987 6207184 5744732 3987008 1769922
4733 1769922 747136 1742792 3617930 4729417 4808548 4479601 3998757 3665121 4264321
4724 4264321 5626190 5969018 4346868 2433421 1883346 1298253 -1588619 -5673150 -7377631
4715 -7377631 -5491050 -2367424 -385886 51097 -1002968 -3401275 -5037195 -2758614
4707 -2758614 3245729 8439918 9253234 7500114 7401010 9713958 11392073 10434328 8357712
$$ packed form
4768h086894J629825j614910k207985J567516N181020M306676J195361O08519
4760B579128J864011M87190l129293l101824K592166P841736O428161J71578m302775
4751A1430078m019027j511228j08730n05948j329549r87959P85803K310325J632092
4742G695857p48782k166409j238239N74323J329237P61197m62452j757724k217086
4733A769922j022786R95656J875138J111487P9131l28947m80844l33636N99200
4724D264321J361869L42828j622150j913447n50075n85093k886872m084531j704481
4715g377631J886581L123626J981538M36983j054065k398307j635920K278581
4707b758614O004343N194189Q13316j753120r9104K312948J678115r57745k076616
$$ plain form
4698 8357712 7282214 6718227 4759298 1371300 -1332822 -2045724 -1811763 -1905484 -1600352
4689 -1600352 505289 3871938 6626057 8371840 10185212 11652452 10387998 5533378
4681 5533378 -293768 -3845550 -4413653 -3140540 -1213544 -184187 -1846074 -5556421
4673 -5556421 -7387840 -4449565 1081461 4488362 3970512 1419178 -893527 -1725107 -39079
4664 -39079 4122372 8154667 8879006 6063572 2153518 -782096 -1799535 -76727 3887606
4655 3887606 6904117 6078382 2649348 -179253 -2292482 -5645241 -8806257 -7439093
4647 -7439093 -1088252 5081697 6944117 5731536 3860047 666674 -4732273 -9713027
4639 -9713027 -10900549 -8841915 -7117819 -8083761 -11367466 -14912184 -15837784 -12246450 -5871817
$$ packed form
4698H357712j075498n63987j958929l387998k704122p12902K33961r3721L05132
4689a600352K105641L366649K754119J745783J813372J467240j264454m854620
4681E533378n827146l551782n68103J273113J926996J029357j661887l710347
4673e556421j831419K938275N531026L406901n17850k551334k312705q31580J686028
4664c9079M161451M032295P24339k815434l910054k935614j017439J722808L964333
4655C887606L016511q25735l429034k828601k113229l352759l161016J367164
4647g439093O350841O169949J862420j212581j871489l193373n398947m980754
4639i713027j187522K058634J724096r65942l283705l544718r25600L591334O374633
$$ plain form
4630 -5871817 -879428 1332236 3353511 6277701 6921968 3517799 209346 1290746
4622 1290746 3940702 2173301 -3766884 -7791260 -7005107 -4350588 -1959882 1802695
4614 1802695 6780205 8423133 4336689 -955687 -1932601 366182 939373 -1360718 -3303205
4605 -3303205 -3453800 -4056308 -6316734 -7983905 -7249315 -5964131 -6704266 -8526776 -8075305
4596 -8075305 -4180986 687954 3590022 4182443 4119453 4367262 4058474 2042502 -1002042
4587 -1002042 -2732074 -1806672 140586 236117 -1901921 -3512279 -2487392 -451702 -515111
4578 -515111 -2912327 -5067048 -5724567 -6372035 -7864833 -8409044 -6745082 -5083666 -6177007
4569 -6177007 -8852561 -9477008 -7202297 -4572916 -2946029 -742633 2766060 5109502
$$ packed form
4630e871817M992389K211664K021275K924190O44267l404169l308453J081400
4622A290746K649956j767401n940185m024376P86153K654519K390706L762577
4614A802695M977510J642928m086444n292376r76914K298783N73191k300091j942487
4605c303205j50595o02508k260426j667171P34590J285184p40135j822510M51471
4596h075305L894319M868940K902068N92421o2990K47809l08788k015972l044544
4587a002042j730032R25402J947258R5531k138038j610358J024887K035690o3409
4578e15111k397216k154721o57519o47468j492798n44211J663962J661416j093341
4569f177007k675554o24447K274711K629381J626887K203396L508693K343442
$$ plain form
4561 5109502 3995721 773485 -1609485 -2481741 -3161208 -3967769 -3668872 -1429131 2205683
4552 2205683 5811955 7614164 6608151 4411576 4647242 8726057 13405694 14550046
4544 14550046 12262827 9920719 8931773 7355610 3723973 -592850 -3529340 -4554940
4536 -4554940 -3957424 -1954042 479138 1645680 1079284 44658 -729744 -2199750 -4809053
4527 -4809053 -6697551 -5545448 -1225860 4407604 9200985 11192261 9122646 4294403
4519 4294403 688931 1004402 3169756 2963164 -277853 -3029281 -2866113 -1675714 -2275917
4510 -2275917 -3998682 -3880989 -1253686 1243962 1339841 -132885 -959526 -579333 -127160
4501 -127160 -215704 -200536 334878 696000 188452 -881416 -1954893 -2990166 -3535546 -2063843
$$ packed form
4561E109502j113781l222236k382970q72256o79467q06561K98897K239741L634814
4552B205683L606272J802209j006013k196575K35666M078815M679637J144352
4544A4550046k287219k342108r88946j576163l631637m316823k936490j025600
4536d554940N97516K003382K433180J166542n66396j034626p74402j470006k609303
4527d809053j888498J152103M319588N633464M793381J991276k069615m828243
4519D294403l605472L15471K165354k06592l241017k751428J63168J190399o00203
4510b275917j722765J17693K627303K497648R5879j472726q26641L80193M52173
4501a27160q8544J5168N35414L61122n07548j069868j073477j035273n45380J471703
$$ plain form
4491 -2063843 2059664 6358199 7120488 4049444 1205586 2220323 6011782 8597301
4483 8597301 7912531 5148647 2304665 574150 787360 3084892 5676915 5888764 3295938
4474 3295938 323351 -1035198 -1513516 -2573118 -3758884 -3726581 -2785648 -2438665 -2827429
4465 -2827429 -2496939 -740802 1390179 2691604 3114362 3122128 2903051 2721090 3132618
4456 3132618 4281568 5510610 5904206 4699926 1332760 -3834361 -8629734 -10149759
4448 -10149759 -7461277 -2600853 1485484 3248276 2632128 263596 -2502701 -3786292
4440 -3786292 -2824338 -1078591 -600880 -1420385 -1478017 815226 4675968 7715239 8178103
4431 8178103 6459953 4737267 4912480 6539307 7022762 4378519 -340044 -3895836 -4195865
$$ packed form
4491b063843M123507M298535P62289l071044k843858J014737L791459K585519
4483H597301o84770k763884k843982j730515K13210K297532K592023K11849k592826
4474C295938k972587j358549m78318j059602j185766L2303R40933L46983l88764
4465b827429L30490J756137K130981J301425M22758P766k19077j81961M11528
4456C132618J148950J229042L93596j204280l367166n167121m795373j520025
4448a0149759K688482M860424M086337J762792o16148k368532k766297j283591
4440c786292R61954J745747M77711q19505n7632K293243L860742L039271M62864
4431H178103j718150j722686J75213J626827M83455k644243m718563l555792l00029
$$ plain form
4422 -4195865 -2338371 -1127890 -1855308 -3125033 -3159891 -2622083 -3883985 -7304209 -9836091
4413 -9836091 -8581829 -4527856 -1033147 455914 1057887 1641556 2240533 4114242 8944956
4404 8944956 15060058 17801500 15408356 11588064 10129250 9868349 7766378 4278068
4396 4278068 2071720 1408858 819921 1065965 4017862 7956156 8463881 4769762 1366692
4387 1366692 1983995 5126849 7179538 7262396 7162810 8375000 10920635 13815267 15433541
4378 15433541 14349623 10579415 5323698 -354875 -5425661 -8177449 -7722334 -5818192
4370 -5818192 -4818403 -4242763 -2293456 -344883 -1895119 -6329232 -7990929 -3497531 3506513
4361 3506513 7268483 6562928 3890075 1011810 -1447181 -2079598 99228 3488077 5618274
$$ packed form
4422d195865J857494J210481p27418j269725l4858N37808j261902l420224k531882
4413i836091J254262M053973L494709J489061O01973N83669N98977J873709M830714
4404H944956O115102K741442k393144l820292j458814k60901k101971l488310
4396D278068k206348o62862n88937K46044K951897L938294N07725l694119l403070
4387A366692O17303L142854K052689Q2858r9586J212190K545635K894632J618274
4378A5433541j083918l770208n255717n678573n070786k751788M55115J904142
4370e818192R99789N75640J949307J948573j550236m434113j661697M493398P004044
4361C506513L761970p05555k672853k878265k458991o32417K178826L388849K130197
$$ plain form
4352 5618274 6204934 6385964 6123131 4635966 2435957 846138 401417 1379520 4469486
4343 4469486 8984468 12072505 12048739 10983130 11485534 12558837 11636274 9275861 8201294
4334 8201294 8421432 7200700 4118484 2539587 4846218 8789688 10003491 6716323
4326 6716323 1233121 -2252561 -1308664 2190339 3668140 1244060 -1598696 -715094 2636096
4317 2636096 3470470 307755 -2715583 -1518907 3083561 7217022 8236883 6164890
4309 6164890 2914458 1140618 2164858 4229728 4379054 2484976 1394233 2498545
4301 2498545 3618510 2663992 1185757 2125970 5255421 7052273 4950941 269438 -3227408
4292 -3227408 -2926282 461145 3781984 4334241 1924123 -1751537 -4983156 -6740340 -6395338
$$ packed form
4352E618274N86660J81030k62833j487165k200009j589819m44721R78103L089966
4343D469486M514982L088037k3766j065609N02404J073303r22563k360413j074567
4334H201294K20138j220732l082216j578897K306631L943470J213803l287168
4326F716323n483202l485682R43897L499003J477801k424080k842756Q83602L351190
4317B636096Q34374l162715l023338J196676M602468M133461J019861k071993
4309F164890l250432j773840J024240K064870J49326j894078j090743J104312
4301B498545J119965r54518j478235R40213L129451J796852k101332m681503l496846
4292c227408L01126L387427L320839N52257k410118l675660l231619j757184L45002
$$ plain form
4283 -6395338 -4117490 -1266471 922869 3050666 6847720 12735747 18925669 22647480
4275 22647480 21474397 14462937 3925537 -4340143 -5067137 1329442 8990592 12588628
4267 12588628 11869527 9897511 8446840 6482162 2590871 -2393552 -5769328 -5847262 -3827931
4258 -3827931 -2036724 -733705 1634780 4818962 5836019 3131083 -471699 -1168468
4250 -1168468 1168082 4149711 6903872 9646331 10484753 6844521 323627 -3670202
4242 -3670202 -2282830 1699232 4256703 4910548 5626375 7316070 9352513 11141303 12508224
4233 12508224 13216942 13031710 11741003 8972354 4936937 1251358 -376103 -322699 -490127
4224 -490127 -1609053 -2701555 -3171999 -3515956 -3647859 -2441115 297889 2792011 3047435
$$ packed form
4283f395338K277848K851019K189340K127797L797054N888027O189922L721811
4275B2647480j173083p011460j0537400q265680p26994O396579P661150L598036
4267A2588628p19101j972016j450671j964678l891291m984423l375776p7934K019331
4258c827931J791207J303019K368485L184182J017057k704936l602782o96769
4250a168468K336550K981629K754161K742459Q38422l640232o520894l993829
4242c670202J387372L982062K557471O53845P15827J689695K036443J788790J366921
4233A2508224P08718j85232j290707k768649m035417l685579j627461N3404j67428
4224d90127j118926j092502m70444l43957j31903J206744K739004K494122K55424
$$ plain form
4215 3047435 975652 -1428282 -1598456 1307733 4898355 5427098 2347051 -361167 1074403
4206 1074403 5752921 10253493 13232353 15098036 14996700 11858285 7512272 5080664
4198 5080664 4648942 3719979 1323538 -1547420 -4587417 -7535658 -7894965 -3621370 2466682
4189 2466682 5463791 5279368 6166674 9544689 12267635 12287175 10910180 8794581 4936672
4180 4936672 759277 104308 3638983 7924592 11355639 16201545 23217974 29020511
4172 29020511 30705053 28971291 25410861 20918337 17509133 16936790 16901326 13817237 9702670
4163 9702670 10321052 15880145 20181937 20021692 18529828 18001823 16762114 14671455 14314592
4154 14314592 15369879 15485340 17199364 24750030 33697073 34873015 29545633 27855528
$$ packed form
4215C047435k071783k403934j70174K906189L590622N28743l080047k708218J435570
4206A074403M678518M500572K978860J865683j01336l138415m346013k431608
4198E080664m31722r28963k396441k870958l039997k948241l59307M273595O088052
4189B466682K997109j84423Q87306L378015K722946J9540j376995k115599l857909
4180D936672m177395o54969L534675M285609L431047M845906P016429N802537
4172B9020511J684542j733762l560430m492524l409204n72343l5464l084089m114567
4163I702670O18382N559093M301792j60245j491864n28005j239709k090659l56863
4154A4314592J055287J15461J714024P550666Q947043J175942n327382j690105
$$ plain form
4146 27855528 31002260 30466781 27345278 33637106 48925949 57144352 55480495 62842733
4138 62842733 86792930 109564560 126531404 165715788 232906738 264811115 190845962
4131 190845962 35996389 -90967106 -121181244 -91319620 -70988277 -73109409 -68269871
4124 -68269871 -49834642 -39257837 -42803807 -43917566 -35726125 -29777429 -31329037 -31146887
4116 -31146887 -25025567 -20974235 -22983779 -24359979 -21127076 -18033775 -17688120 -15912368
4108 -15912368 -11201242 -8187368 -8780142 -9153043 -7830929 -8221421 -11197287 -13067546 -12468502
4099 -12468502 -11951942 -11789290 -9494397 -6222459 -6315279 -9707243 -11895762 -12004429 -13515057
4090 -13515057 -16301570 -15711240 -11152439 -8230173 -10083103 -13091586 -13506989 -12474824
$$ packed form
4146B7855528L146732n35479l121503O291828J5288843Q218403j663857P362238
4138F2842733K3950197K2771630J6966844L9184384O7190950L1904377p3965153
4131A90845962j54849573j26963495l0214138K9861624K0331343k121132M839538
4124f8269871J8435229J0576805l545970j113759Q191441N948696j551608J82150
4116c1146887O121320M051332k009544j376200L232903L093301L45655J775752
4108a5912368M711126L013874n92774l72901J322114l90492k975866j870259N99044
4099a2468502N16560J62652K294893L271938r2820l391964k188519j08667j510628
4090a3515057k786513N90330M558801K922266j852930l008483m15403J032165
$$ plain form
4082 -12474824 -12211137 -12466320 -12784406 -13473955 -12925946 -8893477 -3619089 -2504745 -6330181
4073 -6330181 -9914765 -9825042 -8062067 -6517105 -3450928 1868907 5932936 5577314 2318413
4064 2318413 -352245 -1079784 -431140 456155 -162272 -3044349 -5731611 -5253500 -3262043
4055 -3262043 -4387635 -9019922 -12268870 -11152191 -8356752 -7472426 -8714561 -10860160
4047 -10860160 -13365157 -15032411 -14423219 -12900715 -13397225 -15191524 -14339102 -10455726 -8126485
4038 -8126485 -9756760 -12040452 -11934393 -11143353 -11508954 -10567587 -5617397 1409277 6937295
4029 6937295 10486509 12773680 12160941 7285677 1176921 -1492030 -356245 750505
4021 750505 -768500 -3652229 -5162802 -3908747 -480078 3269314 5635674 6201455 5105364
$$ packed form
4082a2474824K63687k55183l18086o89549N48009M032469N274388J114344l825436
4073f330181l584584Q9723J762975J544962L066177N319835M064029l55622l258901
4064B318413k670658p27539O48644Q87295o18427k882077k687262M78111J991457
4055c262043j125592m632287l248948J116679K795439Q84326j242135k145599
4047a0860160k504997j667254O09192J522504m96510j794299Q52422L883376K329241
4038h126485j630275k283692J06059P91040l65601R41367M950190P026674N528018
4029F937295L549214K287171o12739m875264o108756k668951J135785J106750
4021G50505j519005k883729j510573J254055L428669L749392K366360N65781j096091
$$ plain form
4012 5105364 1841242 -3391342 -7786222 -8317710 -6077102 -5018311 -6076956 -6220401 -4087249
4003 -4087249 -2361862 -2854784 -3332013 -1751047 -88537 -1016687 -3665557 -5620993 -6676741
3994 -6676741 -7747731 -8172634 -6866026 -4526983 -2519389 -1239315 -1249386 -3699441 -7683818
3985 -7683818 -9723432 -8156952 -5585734 -4594187 -3752375 -817098 2640768 3435050 1824982
3976 1824982 652607 497974 -610271 -2932872 -3893278 -1894578 1183235 2411686 1420019
3967 1420019 475428 1161893 1769626 -895113 -6724086 -11091785 -10252251 -6359374 -4227669
3958 -4227669 -4370437 -3174390 512312 3514074 3546078 1953040 461128 -428391 904747
3949 904747 6029310 11611365 11316420 4813476 -625242 -236097 2274816 2281504 1642814
$$ packed form
4012E105364l264122n232584m394880n31488K240608J058791j058645j43445K133152
4003d087249J725387m92922m77229J580966J662510r28150k648870j955436j055748
3994f676741j070990m24903J306608K339043K007594J280074j0071k450055l984377
3985g683818k039614J566480K571218R91547Q41812K935277L457866P94282j610068
3976A824982j172375j54633j108245k322601r60406J998700L077813J228451r91667
3967A420019r44591O86465O07733k664739n828973m367699Q39534L892877K131705
3958d227669j42768J196047L686702L001762L2004j593038j491912q89519J333138
3949I04747N124563N582055k94945o502944n438718L89145K510913O688o38690
$$ plain form
3940 1642814 3767382 6776577 7328975 6781264 7645592 7858159 4600033 228354 -1710569
3931 -1710569 -2804894 -5614074 -6895769 -2671405 2852447 2017541 -4154975 -7289788
3923 -7289788 -4714580 -2445223 -4325923 -6726551 -6195936 -4610320 -3581739 -562314
3915 -562314 5602085 10696020 10634448 6734309 2281429 -2197150 -7082227 -10616512 -10887379
3906 -10887379 -8311986 -4036866 1361931 5948859 6593202 3214854 -91776 -122854 2043310
3897 2043310 4210314 6273738 8367584 9138918 8223767 7652808 8616840 9398135 8376780
3888 8376780 6351401 4040642 291461 -4991159 -8968833 -9440120 -7937533 -6983633 -6571421
3879 -6571421 -5664496 -4935360 -5476892 -6523012 -6691535 -6034971 -5069350 -3282370 -140530
$$ packed form
3940A642814K124568L009195N52398n47711Q64328K12567l258126m371679j938923
3931a710569j094325k809180j281695M224364N523852q34906o172516l134813
3923g289788K575208K269357j880700k400628N30615J585616J028581L019425
3915e62314O164399N093935o1572l900139m452880m478579m885077l534285k70867
3906a0887379K575393M275120N398797M586928O44343l378348l306630l1078K166164
3897B043310K167004K063424K093846P71334r15151n70959R64032P81295j021355
3888H376780k025379k310759l749181n282620l977674m71287J502587R53900M12212
3879f571421R06925P29136n41532j046120j68523O56564R65621J786980L141840
$$ plain form
3870 -140530 3882428 8269073 12629357 15370961 14791897 12126436 10305884 8953685 4772217
3861 4772217 -1576154 -3941390 791444 7113833 8078108 4478761 2094797 2687257 3183707
3852 3183707 2142231 1509518 2259449 2926637 2653078 1907409 268395 -2781627 -4966054
3843 -4966054 -3125388 1495061 3727556 1376328 -1728482 -1099235 2769212 5941352
3835 5941352 6115250 4163307 1820464 -295438 -2449075 -4497044 -5262764 -3613873 -252355
3826 -252355 2610124 4032846 5459648 7842668 9247389 7462859 3904157 2322129
3818 2322129 4010068 6740515 8311769 8592850 7815325 5523521 2267993 231103 734385
3809 734385 2425001 3143828 2656609 2486596 3708695 5864598 7756385 8601635 8406510
$$ packed form
3870a40530M022958M386645M360284K741604n79064k665461j820552j352199m181468
3861D772217o348371k365236M732834O322389R64275l599347k383964N92460M96450
3852C183707j041476o32713P49931O67188k73559p45669j639014l050022k184427
3843d966054J840666M620449K232495k351228l104810O29247L868447L172140
3835E941352J73898j951943k342843k115902k153637k047969p65720J648891L361518
3826b52355K862479J422722J426802K383020J404721j784530l558702j582028
3818B322129J687939K730447J571254K81081p77525k291804l255528k036890N03282
3809G34385J690616P18827m87219j70013J222099K155903J891787Q45250j95125
$$ plain form
3800 8406510 7554031 6242679 4518694 2789930 1774981 1693730 1944360 1705676 295222
3791 295222 -2888160 -7484992 -11024003 -10403081 -5599873 -614808 473619 -2567745 -6897768
3782 -6897768 -9748060 -9658169 -6422932 -1793627 1039783 729250 -396681 386998 2270909
3773 2270909 2477418 685997 -737993 -356843 1063101 2438051 2875094 702677 -4877073
3764 -4877073 -10967903 -13030173 -10633271 -8276789 -9338450 -12032898 -12919492 -11553497
3756 -11553497 -9313435 -6109893 -1564132 1932605 1091641 -3221745 -6049512 -4541593
3748 -4541593 -1531451 -1189926 -3097205 -3187270 297960 4728439 7331017 8684750 10319653
3739 10319653 11042885 8453681 3278388 -675850 -1077325 766603 2586031 3530036 3268184
$$ packed form
3800H406510q52479j311352j723985j728764j014949q1251K50630k38684j410454
3791B95222l183382m596832l539011O20922M803208M985065J088427l041364m330023
3782f897768k850292Q9891L235237M629305K833410l10533j125931P83679J883911
3773B270909K06509j791421j423990L81150J419944J374950M37043k172417n579750
3764d877073o090830k062270K396902K356482j061661k694448q86594J365995
3756a1553497K240062L203542M545761L496737q40964m313386k827767J507919
3748d541593L010142L41525j907279r0065L485230M430479K602578J353733J634903
3739A0319653P23232k589204n175293l954238m01475J843928J819428R44005k61852
$$ plain form
3730 3268184 1414806 -814921 -816909 1770943 3787535 2835090 723798 275315 741355
3721 741355 -462708 -2824143 -3098598 -319692 2737768 3420733 1931811 -228829 -2269886
3712 -2269886 -3924988 -5018847 -5713358 -5926363 -4661249 -1433613 1995361 3132709 1768345
3703 1768345 -230424 -1549304 -1775492 74404 4415486 8564723 8492798 3833850 -1420645
3694 -1420645 -3882526 -3903545 -3191274 -2223209 -1211442 -876798 -676479 1303714 5019496
3685 5019496 7457567 6957942 6166760 8019068 10712323 10066861 6057122 3429336 5291994
3676 5291994 9044857 10202416 8263142 6578587 7137935 7959905 6494463 3690514 2565836
3667 2565836 3480911 3542186 1197733 -1329125 -1693092 -942821 -1050685 -1227768 94565
$$ packed form
3730C268184j853378k229727j988K587852K016592r52445k111292m48483M66040
3721G41355j204063k361435k74455K778906L057460O82965j488922k160640k041057
3712b269886j655102j093859o94511k13005J265114L227636L428974J137348j364364
3703A768345j998769j318880k26188J849896M341082M149237p1925m658948n254495
3694a420645k461881k1019P12271R68065J011767L34644K00319J980193L715782
3685E019496K438071m99625p91182J852308K693255o45462m009739k627786J862658
3676E291994L752863J157559j939274j684555N59348Q21970j465442k803949j124678
3667B565836R15075O1275k344453k526858l63967P50271j07864j77083J322333
$$ plain form
3658 94565 1324460 -376865 -4095762 -6071832 -5275879 -3978225 -2778656 259052 4619343
3649 4619343 6283498 3680697 545931 439706 2148297 3123022 3831464 5567268 7174921
3640 7174921 7352373 7405664 8365327 8235580 5814852 4331900 6808308 10314720 10079211
3631 10079211 7595723 8758965 14314670 18044843 15457370 9194632 4152575 1706493
3623 1706493 978837 1888878 3917429 4475790 1526285 -3515197 -7585827 -9567971 -10483769
3614 -10483769 -11181645 -11309458 -9985372 -6727121 -2461891 208940 -821771 -4328188
3606 -4328188 -6610458 -5584886 -2301961 1853357 6901817 12030833 14266698 11820921
3598 11820921 7316302 5253682 6924472 9809376 11375829 11196553 9358103 5250027
$$ packed form
3658I4565J229895j701325l718897j976070P95953J297654J199569L037708M360291
3649D619343J664155k602801l134766j06225J708591R74725P08442J735804J607653
3640G174921J77452N3291R59663j29747k420728j482952K476408L506412k35509
3631A0079211k483488J163242N555705L730173k587473o262738n042057k446082
3623A706493p27656R10041K028551N58361k949505n041482m070630j982144r15798
3614a0483769o97876j27813J324086L258251M265230K670831j030711l506417
3606d328188k282270J025572L282925M155318N048460N129016K235865k445777
3598A1820921m504619k062620J670790K884904J566453j79276j838450m108076
$$ plain form
3590 5250027 -772128 -5877791 -6670085 -2745360 2562985 5464833 5312232 4399448 4571229
3581 4571229 5143039 4435107 2102673 -964082 -3963504 -6051951 -5819338 -2860055 371641
3572 371641 370408 -3211632 -6725034 -6584056 -3031374 659229 1668854 -134133 -2456389
3563 -2456389 -2694895 -652823 824775 -946344 -4799381 -6870537 -5535408 -3167253
3555 -3167253 -2385056 -2726136 -2289179 -750295 1012621 2919049 5413403 7957912 9318591
3546 9318591 8748916 5837185 356356 -6221256 -10306566 -9509023 -5874425 -3736406 -4567953
3537 -4567953 -6006108 -5839040 -4471262 -2823866 -325650 3292884 5916112 5039458 1332071
3528 1332071 -1815869 -2477194 -2204224 -3208559 -5080887 -5767907 -4924370 -4298748 -4662168
$$ packed form
3590E250027o022155n105663p92294L924725N308345K901848j52601r12784J71781
3581D571229N71810p07932k332434l066755k999422k088447K32613K959283L231696
3572C71641j233l582040l513402J40978L552682L690603J009625j802987k322256
3563b456389k38506K042072J477598j771119l853037k071156J335129K368155
3555c167253P82197l41080M36957J538884J762916J906428K494354K544509J360679
3546I318591n69675k911731n480829o577612m085310P97543L634598K138019q31547
3537d567953j438155J67068J367778J647396K498216L618534K623228q76654l707387
3528A332071l147940o61325K72970j004335j872328o87020Q43537O25622l63420
$$ plain form
3519 -4662168 -4336860 -1819215 1668694 3773257 4025268 3440781 2015502 -1020665 -4770796
3510 -4770796 -7107094 -7776351 -8353169 -8487396 -5421225 1074876 6443933 6882343 4747914
3501 4747914 4920515 7420396 7820303 4464623 803174 -320520 -611520 -2523028 -4740126
3492 -4740126 -4291994 -1199289 1840511 3308998 3734529 3269966 1208359 -1586600 -2085277
3483 -2085277 1587022 7261889 10602664 9759837 7145839 6281038 7748123 9229805 9145046
3474 9145046 8603590 9041181 9443024 7618644 3502380 -664190 -3116552 -3691887 -2555739
3465 -2555739 -276310 706009 -2281236 -7797609 -10349787 -6741700 -75425 4730563
3457 4730563 6973008 8681569 9294650 6265506 567157 -2811991 -996212 3400030
$$ packed form
3519d662168L25308K517645L487909K104563K52011n84487j425279l036167l750131
3510d770796k336298o69257n76818j34227L066171O496101N369057M38410k134429
3501D747914J72601K499881L99907l355680l661449j123694k91000j911508k217098
3492d740126M48132L092705L039800J468487M25531m64563k061607k794959m98677
3483b085277L672299N674867L340775q42827k613998q64801J467085J481682q4759
3474I145046n41456M37591M01843j824380m116264m166570k452362n75335J136148
3465b555739K279429R82319k987245n516373k552178L608087O666275M805988
3457D730563K242445J708561O13081l029144n698349l379148J815779M396242
$$ plain form
3449 3400030 6249282 6353885 4506177 1109265 -2884062 -4789900 -2770492 1252328
3441 1252328 3387321 1987623 -1429003 -4679402 -6638461 -7000711 -6035393 -4583182 -3257524
3432 -3257524 -1876046 -396792 317952 -350259 -1660474 -2637263 -3448716 -4433913 -4723763
3423 -4723763 -3405275 -1306156 57678 719501 1775330 3274032 4433250 5424774 6882915
3414 6882915 7949368 7021028 4488919 2674867 2887112 4380252 6069735 7088199 5902775
3405 5902775 1770263 -2625740 -3169939 74322 2352501 717746 -2143657 -2609449 -1436534
3396 -1436534 -1331221 -1740145 135983 4427057 8286086 9904658 9662128 7749582 3989006
3387 3989006 59862 -1427789 -793375 -1307541 -4362559 -7309357 -7498780 -6080297 -5878492
$$ packed form
3449C400030K849252J04603j847708l396912l993327j905838K019408M022820
3441A252328K134993j399698l416626l250399j959059l62250R65318J452211J325658
3432c257524J381478J479254P14744o68211j310215r76789q11453r85197k89850
3423d723763J318488K099119J363834O61823J055829J498702J159218R91524J458141
3414F882915J066453r28340k532109j814052K12245J493140J689483J018464j185424
3405E902775m132512m396003n44199L244261K278179j634755k861403m65792J172915
3396a436534J05313m08924J876128M291074L859029J618572k42530j912546l760576
3387C989006l929144j487651O34414n14166l055018k946798j89423J418483K01805
$$ plain form
3378 -5878492 -7250900 -8221261 -7787974 -7075707 -7411670 -8763661 -10183192 -10731608 -9728092
3369 -9728092 -6850807 -2543675 1768698 4298620 4281997 2957084 2600867 4020239 5432633
3360 5432633 4571649 1579008 -1004771 -915207 1854747 5313582 6846705 4877799 404010
3351 404010 -3312691 -3648543 -975355 2703726 6474633 10159780 12188220 10593246 6358742
3342 6358742 3115522 2600159 2722733 1294092 -671857 -1185510 -864751 -1859872 -4166399
3333 -4166399 -5363836 -3913475 -973294 1283597 2094476 2746547 5279608 10092626 14452649
3324 14452649 14541610 9997125 5191865 4420219 6817483 8096654 6651559 5254145 6355424
3315 6355424 8421475 8492858 6472484 4638049 3736312 2023131 -1380177 -4142411 -3142062
$$ packed form
3378e878492j372408r70361M33287P12267l35963j351991j419531n48416J003516
3369i728092K877285M307132M312373K529922j6623j324913l56217J419372J412394
3360E432633q60984k992641k583779Q9564K769954L458835J533123j968906m473789
3351D04010l716701l35852K673188L679081L770907L685147K028440j594974m234504
3342F358742l243220n15363J22574j428641j965949n13653L20759r95121k306527
3333d166399j197437J450361K940181K256891Q10879O52071K533061M813018M360023
3324A4452649Q8961m544485m805260p71646K397264J279171j445095j397414J101279
3315F355424K066051P1383k020374j834435r01737j713181l403308k762234J000349
$$ plain form
3306 -3142062 1619874 6961697 10121826 10930987 10122772 7215111 1586983 -5123327 -9587242
3297 -9587242 -10125443 -8320135 -6890088 -6954248 -7898389 -8890200 -9420094 -8719545 -5886154
3288 -5886154 -1294901 2362863 1392130 -5460914 -14660739 -20035129 -18225351 -11607158
3280 -11607158 -5303194 -2240556 -2029349 -3266586 -4811003 -5358470 -4108882 -2035068
3272 -2035068 -639417 483624 2721343 5128822 4718540 694681 -4148214 -7122075
3264 -7122075 -8180909 -7828003 -5572070 -2237529 -798160 -2308829 -3445621 -1021848
3256 -1021848 3056017 4482826 2527508 -83722 -1947612 -3872217 -5551184 -5144868
3248 -5144868 -2486819 430226 2609527 4959535 7743373 9835473 10908421 11698735
$$ packed form
3306c142062M761936N341823L160129Q09161q08215k907661n628128o710310m463915
3297i587242n38201J805308J430047o4160r44141r91811n29894P00549K833391
3288e886154M591253L657764r70733o853044r199825n374390J809778O618193
3280a1607158O303964L062638K11207j237237j544417n47467J249588K073814
3272b035068J395651J123041K237719K407479m10282m023859m842895k973861
3264g122075j058834L52906K255933L334541J439369j510669j136792K423773
3256a021848M077865J426809j955318k611230j863890j924605j678967M06316
3248e144868K658049K917045K179301K350008K783838K092100J072948P90314
$$ plain form
3240 11698735 11682449 9265056 4963042 1710814 1142006 2028473 3064830 4378388 5339272
3231 5339272 4000855 407062 -2289847 -2009712 -682149 -970605 -2325375 -2606816 -1619630
3222 -1619630 -503267 661781 1962632 1910566 -418927 -2616133 -1549854 1734351 2969705
3213 2969705 634720 -2160416 -2476288 -1340836 -1318702 -2611174 -3568008 -3640749 -3667561
3204 -3667561 -3745770 -2791675 -510748 1627403 2145504 1441797 953043 865223 -77916 -2286694
3194 -2286694 -4216348 -4467414 -3850221 -3899144 -4234246 -3457111 -2227189 -2782038 -4902157
3185 -4902157 -5115412 -1444730 3258191 4767122 2744742 480288 547422 2886864 6346033
3176 6346033 9752565 11653380 11070015 8842932 6967285 6586113 7478900 8840755 9411878
$$ packed form
3240A1698735j6286k417393m302014l252228n68808Q86467J036357J313558R60884
3231E339272j338417l593793k696909K80135J327563k88456j354770k81441R87186
3222a619630J116363J165048J300851n2066k329493k197206J066279L284205J235354
3213B969705k334985k795136l15872J135452K2134j292472r56834p2741k6812
3204c667561p8209R54095K280927K138151N18101p03707m88754q7820r43139k208778
3194b286694j929654k51066O17193m8923l35102P77135J229922n54849k120119
3185d902157k13255L670682M702921J508931k022380k264454O7134K339442L459169
3176F346033L406532J900815n83365k227083j875647l81172Q92787J361855N71123
$$ plain form
3167 9411878 7828980 4442550 1807674 1562588 1999484 1045202 306370 2785677 7268401
3158 7268401 9086591 6898409 4503611 4548546 4648929 2281157 -321552 135980 2237196
3149 2237196 2116586 -170797 -1112711 30127 82267 -2374441 -4406749 -3377037 -753146
3140 -753146 734372 920098 917050 408290 -1141953 -2436911 -2326336 -2354270 -4240298 -5981795
3130 -5981795 -4181417 88014 1905708 -182518 -1665193 940673 4313134 3092474
3122 3092474 -2026026 -5179712 -3315627 828746 3668413 4652808 4245862 1795301 -2409524
3113 -2409524 -5601609 -5604641 -3907186 -3493318 -4662177 -4882229 -2035646 3639571 9900486
3104 9900486 13453224 11810831 5918133 -58118 -3075828 -4060399 -4789290 -4050629 -70881
$$ packed form
3167I411878j582898l386430k634876k45086M36896r54282p38832K479307M482724
3158G268401J818190k188182k394798M4935J00383k367772k602709M57532K101216
3149B237196j20610k287383r41914J142838N2140k456708k032308J029712K623891
3140g53146J487518J85726l048n08760j550243j294958J10575k7934j886028j741497
3130e981795J800378M269431J817694k088226j482675K605866L372461j220660
3122C092474n118500l153686J864085M144373K839667R84395m06946k450561m204825
3113b409524l192085l032J697455M13868j168859k20052K846583N675217O260915
3104I900486L552738j642393n892698n976251l017710r84571p28891P38661L979748
$$ plain form
3095 -70881 4576305 4687879 -523685 -5693872 -5849627 -1888936 1827624 2830357 1734208
3086 1734208 21782 -1398350 -2335979 -3180133 -3927507 -3285331 -383687 2668558 2602974
3077 2602974 6737 -610426 2769921 6470383 6680200 5047201 5344481 7159957 7130232
3068 7130232 4856391 3050364 2483717 1400745 35895 1011004 4161399 5358956 2431509
3059 2431509 -1449731 -2533731 -1281702 160697 2026864 5100047 7461551 7134458
3051 7134458 6401809 9242336 14999226 18625392 17436034 13905099 11062492 8767364
3043 8767364 6027255 3726341 2769097 1960083 216253 -1022598 -289859 483875 -1812471
3034 -1812471 -6435301 -9163411 -7959790 -5281372 -3795703 -2571584 576071 4959408
$$ packed form
3095g0881M647186J11574n211564n170187j55755L960691L716560J002733j096149
3086A734208j712426j420132r37629q44154p47374O42176K901644L052245o5584
3077B602974k596237o17163L380347L700462K09817j632999K97280J815476k9725
3068G130232k273841j806027n66647j082972j364850R75109L150395J197557k927447
3059B431509l881240j084000J252029J442399J866167L073183K361504l27093
3051G134458p32649K840527N756890L626166j189358l530935k842607k295128
3043H767364k740109k300914r57244q09014j743830j238851P32739P73734k296346
3034a812471m622830k728110J203621K678418J485669J224119L147655M383337
$$ plain form
3026 4959408 7709151 7655680 6112629 3975373 363020 -5097304 -10253388 -11905010 -8739957
3017 -8739957 -2239338 4671516 9285975 10144457 7495178 2992670 -1323986 -3943757
3009 -3943757 -4208877 -2460397 -21825 1609130 1987924 1924818 2451685 3983954 6233027
3000 6233027 8038649 7473845 3595557 -1531943 -4143501 -2898858 -104872 2187019
2992 2187019 5128270 9918445 13646971 11978545 5735435 1104121 2211085 6463452
2984 6463452 8780142 7766846 5590636 4019444 3401349 4157826 6186312 7198037 4559101
2975 4559101 -812021 -4714726 -4551827 -2055161 -289476 285773 1378421 3679453 5847264
2966 5847264 6506063 5960825 5483499 5520876 5240667 3892683 2135744 1459641 2357656
$$ packed form
3026D959408K749743n3471j543051k137256l612353n460324n156084j651622L165053
3017h739957O500619O910854M614459Q58482k649279m502508m316656k619771
3009c943757k65120J748480K438572J630955L78794o3106N26867J532269K249073
3000F233027J805622n64804l878288n127500k611558J244643K793986K291891
2992B187019K941251M790175L728526j668426o243110m631314J106964M252367
2984F463452K316690j013296k176210j571192o18095P56477K028486J011725k638936
2975D559101n371122l902705J62899K496666J765685N75249J092648K301032K167811
2966E847264O58799n45238m77326L7377k80209j347984j756939o76103Q98015
$$ plain form
2957 2357656 3759491 4461299 4313427 3565352 1993866 -429059 -2754470 -4050939 -4688963
2948 -4688963 -5545925 -6374725 -6127931 -4543909 -2246633 297778 2609363 3504819 2296918
2939 2296918 429880 20135 764452 343475 -1827480 -3494916 -3002339 -1712574 -1736688
2930 -1736688 -2916210 -3425065 -2108431 878748 4494678 6931301 6800400 5222803 5096850
2921 5096850 7173839 8799659 7991070 6482488 6539072 6974486 5440244 3100349 3331650
2912 3331650 6285351 8312272 7078081 4165572 1990750 831619 -311234 -2188439
2904 -2188439 -5227102 -8779795 -10091067 -6575480 205935 5420913 6681587 6334866
2896 6334866 7154187 8673839 9295770 9146670 8744067 7327327 4902443 3793427 5593382
$$ packed form
2957B357656J401835P01808j47872p48075j571486k422925k325411j296469o38024
2948d688963q56962q28800K46794J584022K297276K544411K311585Q95456j207901
2939B296918j867038m09745P44317m20977k170955j667436M92577J289765k4114
2930a736688j179522n08855J316634K987179L615930K436623j30901j577597j25953
2921E096850K076989J625820q08589j508582N6584M35414j534242k339895K31301
2912C331650K953701K026921j234191k912509k174822j159131j142853j877205
2904b188439l038663l552693j311272L515587O781415N214978J260674l46721
2896F334866Q19321J519652O21931j49100m02603j416740k424884j109016J799955
$$ plain form
2887 5593382 8355117 9311028 8641323 7961901 7029639 5213092 4581355 7510310 11876100
2878 11876100 12713613 8941000 4834992 4128947 5847165 6870755 5675590 2532534
2870 2532534 -1179694 -2816479 -543086 3134662 2945974 -2281882 -7367878 -7708340 -5441767
2861 -5441767 -5373623 -7229389 -6474903 -2036468 1407780 -247872 -5509094 -10208421 -12703440
2852 -12703440 -13944554 -14197178 -12508342 -9287557 -7188841 -8291442 -11180940 -12036708
2844 -12036708 -8935861 -4338284 -2393153 -3977940 -5632606 -3817243 1011600 5435891
2836 5435891 7044480 6117139 4326884 3429715 4645449 7468653 9301074 8137753 5558911
2827 5558911 4966936 6680403 7320826 5009563 2535192 3374842 6587921 8248008 6723500
$$ packed form
2887E593382K761735R55911o69705o79422r32262j816547o31737K928955M365790
2878A1876100Q37513l772613m106008p06045J718218J023590j195165l143056
2870B532534l712228j636785K273393L677748j88688n227856n085996l40462K266573
2861e441767O8144j855766P54486M438435L444248j655652n261222m699327k495019
2852a2703440j241114k52624J688836L220785K098716j102601k889498q55768
2844a2036708L100847M597577J945131j584787j654666J815363M828843M424291
2836E435891J608589r27341j790255q97169J215734K823204J832421j163321k578842
2827E558911n91975J713467O40423k311263k474371Q39650L213079J660087j524508
$$ plain form
2818 6723500 3766790 1002476 -1593614 -3472805 -2859363 267805 2758692 1700264
2810 1700264 -2105036 -5709742 -7895908 -9554753 -10930576 -10776698 -8564671 -5734041
2802 -5734041 -3874946 -2786975 -1347393 255820 207462 -2798156 -7505263 -10585007 -9475523
2793 -9475523 -4825960 94170 2442588 1874260 -346744 -3235796 -6390552 -9324633
2785 -9324633 -11670709 -13511454 -14327298 -12298877 -6476371 570457 4474428 3999768 2228743
2776 2228743 1947790 2041500 153702 -2990778 -4454430 -3302098 -1351656 -46194 852299
2767 852299 1241385 -69139 -3090303 -5679335 -6164070 -5447212 -5173670 -5119668 -3962905
2758 -3962905 -1698868 385845 1614206 2173524 1715226 -662274 -4752929 -8745866 -10715776
$$ packed form
2818F723500k956710k764314k596090j879191O13442L127168K490887j058428
2810A700264l805300l604706k186166j658845j375823J53878K212027K830630
2802e734041J859095J087971J439582J603213m8358l005618m707107l079744J109484
2793i475523M649563M920130K348418n68328k221004k889052l154756k934081
2785i324633k346076j840745q15844K028421N822506P046828L903971m74660j771025
2776B228743k80953R3710j887798l144480j463652J152332J950442J305462Q98493
2767H52299L89086j310524l021164k589032m84735P16858K73542N4002J156763
2758c962905K264037K084713J228361N59318m58298k377500m090655l992937j969910
$$ plain form
2749 -10715776 -9823622 -6188622 -892865 3671428 5034466 3258936 1408397 2382566
2741 2382566 5845785 9107075 10310000 9625085 7927244 5925158 4587408 4713545 5360108
2732 5360108 4001397 -572104 -6098957 -8567355 -5942650 174312 5979522 8068194
2724 8068194 5638118 1345800 -547153 1760540 5508647 6504954 4184793 2082550
2716 2082550 3034044 5455251 5287012 727305 -5853071 -10284536 -10401691 -7835526 -6185007
2707 -6185007 -7064813 -8355821 -7230481 -4217502 -2466048 -3254673 -4705930 -5414425 -6420234
2698 -6420234 -8001141 -7345398 -2292197 4353415 7438931 5622030 2005101 -849270
2690 -849270 -3362479 -6242688 -8518411 -9378641 -9607117 -9909376 -9591154 -8001536 -5719471
$$ packed form
2749a0715776Q92154L635000N295757M564293J363038j775530j850539R74169
2741B382566L463219L261290J202925o84915j697841k002086j337750J26137O46563
2732E360108j358711m573501n526853k468398K624705O116962N805210K088672
2724H068194k430076m292318j892953K307693L748107R96307k320161k102243
2716B082550R51494K421207j68239m559707o580376m431465j17155K566165J650519
2707f185007q79806j291008J125340L012979J751454p88625j451257p08495j005809
2698f420234j580907O55743N053201O645612L085516j816901l616929k854371
2690h49270k513209k880209k275723q60230k28476l02259L18222J589618K282065
$$ plain form
2681 -5719471 -3332752 -646568 1799377 2117854 -335793 -2830670 -1617964 3656356
2673 3656356 9125803 10535512 7332088 2756935 169967 -194549 -268088 -483128 973963
2664 973963 4402946 6411073 3972966 -808961 -3126669 -1881363 -227358 -21684 223332
2655 223332 1236446 1098470 -857693 -2124297 -1285387 -712378 -2346936 -4160298 -4029517
2646 -4029517 -3989853 -6679067 -10113180 -10499804 -8505190 -8031607 -9754034 -10576161 -9214374
2637 -9214374 -7775937 -7509748 -7251837 -6715956 -7208946 -8053886 -6279091 -1464942 2514099
2628 2514099 2373248 -729974 -3595893 -4396387 -2462354 2089823 6759864 7782289 4890941
2619 4890941 2121442 1906684 1665536 -1088712 -3667433 -2070051 2587158 5822951 6404653
$$ packed form
2681e719471K386719K686184K445945L18477k453647k494877J212706N274320
2673C656356N469447J409709l203424m575153k586968l64516p3539k15040J457091
2664I73963L428983K008127k438107m781927k317708J245306J654005K05674K45016
2655B23332J013114j37976j956163j266604Q38910N73009j634558j813362J30781
2646d029517L9664k689214l434113l86624J994614M73583j722427q22127J361787
2637i214374J438437K66189K57911N35881m92990q44940J774795M814149L979041
2628B514099j40851l103222k865919q00494J934033M552177M670041J022425k891348
2619D890941k769499k14758k41148k754248k578721J597382M657209L235793N81702
$$ plain form
2610 6404653 6800471 7822907 7366499 4819310 2710057 2835972 3842621 3794844 2538277
2601 2538277 469134 -2513319 -5587934 -6847949 -5951614 -4900677 -4762483 -3690783 -46951
2592 -46951 4326299 6239681 5336818 3712964 2100421 -874193 -5465167 -9291727 -10060146
2583 -10060146 -8204318 -5744591 -3722916 -1975548 -618634 -355750 -1431793 -3220261
2575 -3220261 -4842290 -5648007 -5463514 -5121834 -6207219 -9014592 -11092130 -9579314 -5303920
2566 -5303920 -2651942 -4347777 -8030875 -9477437 -7737140 -5108110 -3202661 -1641353
2558 -1641353 -282099 -1876 -731679 -920950 301300 2253540 4482142 7265263 9559470
2549 9559470 8919539 5090815 1601100 1640503 3807372 4136848 1275787 -2604299 -5265794
$$ packed form
2610F404653L95818J022436m56408k547189k109253J25915J006649m7777j256567
2601B538277k069143k982453l074615j260015Q96335J050937J38194J071700L643832
2592d6951M373250J913382r02863j623854j612543k974614m590974l826560p68419
2583a0060146J855828K459727K021675J747368J356914K62884j076043j788468
2575c220261j622029q05717J84493L41680j085385k807373k077538J512816M275394
2566e303920K651978j695835l683098j446562J740297K629030J905449J561308
2558a641353J359254K80223p29803j89271J222250J952240K228602K783121K294207
2549I559470o39931l828724l489715L9403K166869L29476k861061l880086k661495
$$ plain form
2540 -5265794 -6381747 -6345751 -5476578 -4769613 -5548098 -7685513 -9427027 -9495630 -8451517
2531 -8451517 -7668995 -7775880 -8300453 -8234710 -6953471 -5069440 -4036653 -4341262 -4709311
2522 -4709311 -3858285 -2187496 -722827 540446 1736250 1622543 -927364 -4495116 -6423267
2513 -6423267 -6337337 -6085037 -6212471 -5112938 -2256583 272690 664376 -178421 -373799
2504 -373799 323653 736106 -336918 -3728448 -9137853 -13804278 -14056126 -9722074 -5089709
2495 -5089709 -3713420 -4230766 -3552711 -2136753 -2733827 -5030834 -5514598 -2979357 -535392
2486 -535392 -773197 -1909169 -888313 1745039 2669900 543182 -2552852 -4420317 -5356483
2477 -5356483 -6538806 -7180402 -4936819 734144 6755849 9006958 6652348 3000574
$$ packed form
2540e265794j115953L5996Q69173P06965p78485k137415j741514o8603J044113
2531h451517P82522j06885n24573O5743J281239J884031J032787l04609l68049
2522d709311Q51026J670789J464669J263273J195804j13707k549907l567752j928151
2513f423267Q5930K52300j27434J099533K856355K529273L91686q42797j95378
2504c73799O97452M12453j073024l391530n409405m666425k51848M334052M632365
2495e089709J376289n17346O78055J415958n97074k297007m83764K535241K443965
2486e35392k37805j135972J020856K633352R24861k126718l096034j867465r36166
2477e356483j182323o41596K243583N670963O021705K251109k354610l651774
$$ plain form
2469 3000574 1672894 2844123 4147578 4365645 4452577 5023585 4962784 3534373 2202299
2460 2202299 2628461 3796105 3168035 599011 -917036 867366 4299276 5698391 3563816
2451 3563816 -150665 -2431361 -1862449 720449 3110265 3278681 948755 -2257956 -4722421
2442 -4722421 -6411131 -7671469 -7274290 -3719362 1431264 3992197 2186863 -752386
2434 -752386 -844094 1400439 2366689 816823 -1040932 -1801828 -2986325 -5857349 -8693902
2425 -8693902 -9017095 -6914317 -4408786 -2626590 -1238801 36347 983617 1646523 2306962
2416 2306962 2852620 2968202 2641079 1903229 743403 -80025 814922 3368546 5199918
2407 5199918 4397713 2540246 3108072 7022316 11427067 13044846 11315508 8061703 5481789
$$ packed form
2469C000574j327680J171229J303455K18067Q6932N71008o0801j428411j332074
2460B202299M26162J167644o28070k569024j516047J784402L431910J399115k134575
2451C563816l714481k280696N68912K582898K389816J68416k329926l206711k464465
2442d722421j688710j260338L97179L554928N150626K560933j805334k939249
2434g52386r1708K244533R66250j549866j857755p60896j184497k871024k836553
2425h693902l23193K102778K505531J782196J387789J275148R47270O62906O60439
2416B306962N45658J15582l27123p37850j159826q23428Q94947K553624J831372
2407E199918q02205j857467N67826L914244M404751J617779j729338l253805k579914
$$ plain form
2398 5481789 4816335 5707459 6379416 5370907 3263064 1758594 1291594 1086321 1489673
2389 1489673 4044475 8472048 11682186 11281336 8575759 6532162 6042881 5953926 5630940
2380 5630940 5230862 3907968 161849 -5552625 -10275048 -11323176 -8693021 -4507339
2372 -4507339 -1132144 93462 -479190 -1127698 -814807 -904018 -3316369 -6908447 -7878738
2363 -7878738 -4763430 -876540 75216 -877666 226104 4167309 7110719 5590931 552367
2354 552367 -4400595 -6814999 -6390716 -4010650 -1450305 -943462 -3270144 -6653011 -8729610
2345 -8729610 -9045893 -8438945 -6886384 -3906129 -690832 513543 -330298 -533883 1450795
2336 1450795 3423559 2347158 -1347377 -4306070 -4495067 -2875840 -930549 1273177
$$ packed form
2398E481789o65454Q91124O71957j008509k107843j504470m67000k05273M03352
2389A489673K554802M427573L210138m00850k705577k043597m89281q8955l22986
2380E630940m00078j322894l746119n714474m722423j048128K630155M185682
2372d507339L375195J225606n72652o48508L12891q9211k412351l592078r70291
2363g878738L115308L886890R51756r52882J103770L941205K943410j519788n038564
2354E52367m952962k414404M24283K380066K560345N06843k326682l382867k076599
2345h729610l16283O06948J552561K980255L215297J204375q43841k03585J984678
2336A450795J972764j076401l694535k958693j88997J619227J945291K203726
$$ plain form
2328 1273177 3664414 4604212 2533053 -1332631 -3568218 -2214274 949134 2284592
2320 2284592 34926 -4241269 -7681794 -8927756 -8712163 -8177438 -7408440 -5891272 -3852903
2311 -3852903 -2431435 -2475990 -3642352 -4857991 -5413473 -5448921 -5585511 -6252798 -7249454
2302 -7249454 -7803003 -7092112 -4841080 -1576441 1511934 3067229 2467066 618480 -494871
2293 -494871 376917 2492508 4098214 4414095 4017185 3537721 3051623 2912209 3960232
2284 3960232 6146389 7782055 7123303 4307891 1020096 -1270727 -2003844 -1204154 249440
2275 249440 435801 -1916451 -5350183 -6783504 -5239847 -3109972 -2863302 -3828967 -3586690
2266 -3586690 -1569245 521204 1575031 2423985 3822772 4667141 3417806 553795 -1640278
$$ packed form
2328A273177K391237R39798k071159l865684k235587J353944L163408J335458
2320B284592k249666m276195l440525j245962K15593N34725P68998J517168K038369
2311c852903J421468m4555j166362j215639n55482l5448j36590o67287r96656
2302g249454n53549P10891K251032L264639L088375J555295o00163j848586j113351
2293d94871Q71788K115591J605706L15881l96910m79464m86098j39414J048023
2284C960232K186157J635666o58752k815412l287795k290823p33117P99690J453594
2275B49440J86361k352252l433732j433321J543657K129875K46670r65665K42277
2266c586690K017445K090449J053827Q48954J398787Q44369j249335k864011k194073
$$ plain form
2257 -1640278 -1737127 -787733 -936562 -2785428 -4641893 -4633085 -3270402 -3061757 -5085813
2248 -5085813 -6870856 -5181300 -774519 1636344 -732001 -4578139 -4446905 -133345
2240 -133345 2643735 -233205 -5591265 -6908844 -2455652 3290368 6036805 6401534 7163969
2231 7163969 8544406 8702868 7420140 6287352 5538976 3615536 418623 -1773096 -1946220
2222 -1946220 -2370171 -4838605 -6944032 -5086982 -160562 3113162 2630113 1501277 3063050
2213 3063050 5897720 5823875 1413058 -4454575 -8038093 -8322262 -7277550 -7398796 -9045791
2204 -9045791 -10124106 -8702726 -5505248 -2705014 -710325 1859208 4869050 5905477
2196 5905477 3977752 1661375 1727652 3458653 4274456 3370278 1604794 -561974 -2442388
$$ packed form
2257a640278r6849R49394j48829j848866j856465Q808J362683K08645k024056
2248e085813j785043J689556M406781K410863k368345l846138J31234M313560
2240a33345K777080k876940n358060j317579M453192N746020K746437L64729P62435
2231G163969J380437J58462j282728j132788p48376j923440l196913k191719j73124
2222a946220m23951k468434k105427J857050M926420L273724m83049j128836J561773
2213C063050K834670p3845m410817n867633l583518k84169J044712j21246j646995
2204i045791j078315J421380L197478K800234J994689K569533L009842J036427
2196E905477j927725k316377O6277J731001Q15803r04178j765484k166768j880414
$$ plain form
2187 -2442388 -1935070 1884495 5866209 5762852 1744416 -2201335 -4014776 -5121201 -6194557
2178 -6194557 -5544689 -3027728 -1808182 -4070107 -7772149 -9753196 -9650169 -8737741 -7238821
2169 -7238821 -5048543 -3187993 -2383438 -1872882 -1348949 -2004402 -3831432 -4436276 -2920182
2160 -2920182 -2231585 -4606048 -7360548 -7128459 -5883129 -7784075 -11457014 -11128491 -5583924
2151 -5583924 -458828 -166844 -2380369 -2798725 -1318390 -521720 -992832 -1129844 288178
2142 288178 3633258 8691738 13353203 13994207 9559025 3835836 1455367 2704480 4119023
2133 4119023 2986607 -564497 -4685398 -7025386 -5873671 -2023360 1274250 1755384
2125 1755384 547399 -222072 -611155 -1695637 -2821283 -2652393 -1976427 -2791125 -5140032
$$ packed form
2187b442388N07318L819565L981714j03357m018436l945751j813441j106425j073356
2178f194557O49868K516961J219546k261925l702042j981047J03027R12428J498920
2169g238821K190278J860550Q04555N10556N23933o55453j827030o04844J516094
2160b920182O88597k374463k754500K32089J245330j900946l672939L28523N544567
2151e583924N125096K91984k213525m18356J480335P96670m71112j37012J418022
2142B88178L345080N058480M661465O41004m435182n723189k380469J249113J414543
2133D119023j132416l551104m120901k339988J151715L850311L297610M81134
2125A755384j207985p69471l89083j084482j125646J68890O75966q14698k348907
$$ plain form
2116 -5140032 -7282207 -8471655 -9125999 -8829733 -6959856 -5015457 -5345915 -7379936 -7994757
2107 -7994757 -6057526 -3725325 -2556087 -1352573 798034 2058657 331450 -3616418
2099 -3616418 -7174887 -8687437 -8163292 -6789033 -6644378 -8994120 -11803776 -11079217 -5990566
2090 -5990566 -413952 2173155 2794805 3851865 4555467 2643082 -1216281 -4211269 -5417004
2081 -5417004 -5685930 -4576368 -1209386 2274594 2247008 -945796 -2857322 -1236392 1144357
2072 1144357 1326096 343272 557308 1846524 2874969 3642260 4156674 2728207 -1496140
2063 -1496140 -5883942 -7174767 -5906167 -5145450 -5662166 -5396530 -3445062 -1563602 -1233193
2054 -1233193 -1651719 -1437843 -626973 -316523 -1454615 -4053130 -6494319 -6087377 -1924927
$$ packed form
2116e140032k142175j189448o54344K96266J869877J944399l30458k034021o14821
2107g994757J937231K332201J169238J203514K150607J260623j727207l947868
2099c616418l558469j512550N24145J374259J44655k349742k809656P24559N088651
2090e990566N576614K587107O21650J057060P03602j912385l859363k994988j205735
2081e417004k68926J109562L366982L483980k7586l192804j911526J620930K380749
2072A144357J81739r82824K14036J289216J028445P67291N14414j428467m224347
2063a496140m387802j290825J268600P60717n16716K65636J951468J881460L30409
2054a233193m18526K13876Q10870L10450j138092k598515k441189M06942M162450
$$ plain form
2045 -1924927 3236884 5783706 5512750 5031045 5387505 5019863 3089530 866365 -943519
2036 -943519 -3434142 -6924913 -9678211 -10437364 -9828136 -8027657 -3837837 2178293 6535793
2027 6535793 7268270 6975617 8549273 10211003 8390769 3791909 471726 -300138 -1088003
2018 -1088003 -3221031 -4739656 -4201756 -2935446 -2180716 -1073160 932825 2290336 1807489
2009 1807489 701088 469077 671894 612447 1343435 3859568 6681698 7437544 5955660
2000 5955660 3852454 1861708 -381646 -2387234 -2720349 -978751 1639630 3793151
1992 3793151 4779171 4090732 1810945 -336340 78034 3398013 7014653 8114009 6687382
1983 6687382 5061949 4915511 5770746 6519379 7347495 9147448 11376977 11906366 9630619
$$ packed form
2045a924927N161811K546822k70956m81705L56460l67642j930333k223165j809884
2036i43519k490623l490771k753298p59153O09228J800479M189820O016130M357500
2027F535793P32477k92653J573656J661730j820234m598860l320183p71864p87865
2018a088003k133028j518625N37900J266310P54730J107556K005985J357511m82847
2009A807489j106401k32011K02817n9447P30988K516133K822130P55846j481884
2000E955660k103206j990746k243354k005588l33115J741598K618381K153521
1992C793151R86020o88439k279787k147285M14374L319979L616640J099356j426627
1983F687382j625433j46438Q55235P48633Q28116J799953K229529N29389k275747
$$ plain form
1974 9630619 6191237 4022784 3410965 2818008 1593810 669680 692675 1356205 2899549
1965 2899549 6348281 11458890 16072642 18459289 18831633 17699274 14561817 9598881
1957 9598881 4873384 1962695 -230971 -3294756 -6214815 -6894269 -5825182 -5395837 -5799879
1948 -5799879 -4659548 -1279279 1607685 1753673 745434 1401311 3306606 3363808 445799
1939 445799 -2708403 -2947701 -678544 767921 -789385 -4117002 -6468090 -6578328 -5024344
1930 -5024344 -2637454 -114989 1192987 136033 -2107081 -2649711 -711222 843331
1922 843331 -790371 -4498936 -6747610 -5749801 -2410523 1609739 4539060 4300164 571819
1913 571819 -3225243 -2913798 1067679 3850236 2311173 -1426656 -3580191 -3282147 -2033526
$$ packed form
1974I630619l439382k168453o11819n92957j224198r24130K2995O63530J543344
1965B899549L448732N110609M613752K386647L72344j132359l137457m962936
1957I598881m725497k910689k193666l063785k920059o79454J069087M29345m04042
1948e799879J140331L380269K886964J45988j008239O55877J905295N7202k918009
1939D45799l154202k39298K269157J446465j557306l327617k351088j10238J553984
1930e024344K386890K522465J307976j056954k243114n42630J938489J554553
1922H43331j633702l708565k248674R97809L339278M020262K929321k38896l728345
1913E71819l797062L11445L981477K782557j539063l737829k153535K98044J248621
$$ plain form
1904 -2033526 -654793 1116159 2976162 3733276 2397628 -993579 -4908319 -6513976
1896 -6513976 -3921504 1057925 4044455 3006808 488516 -227059 549715 109964 -2482701
1887 -2482701 -5350232 -6094413 -3471560 2320832 9143768 13351505 12815032 9531765 7661168
1878 7661168 8928507 11246715 11740535 9724309 6553275 3722308 1549351 -683361
1870 -683361 -3280695 -4975972 -4351162 -2651689 -3145755 -6362191 -8202998 -5312177 -565382
1861 -565382 219816 -3799668 -7689828 -7887563 -6118029 -5120326 -4447830 -2838014 -1585892
1852 -1585892 -2483522 -4434795 -5175130 -5030768 -6042300 -8250221 -9807720 -10413249 -11707012
1843 -11707012 -13965832 -14991894 -13143634 -9588182 -6652597 -5279626 -4731245 -3656713
$$ packed form
1904b033526J378733J770952J860003P57114j335648l391207l914740j605657
1896f513976K592472M979429K986530j037647k518292p15575P76774m39751k592665
1887b482701k867531p44181K622853N792392O822936M207737n36473l283267j870597
1878G661168J267339K318208M93820k016226l171034k830967k172957k232712
1870f83361k597334j695277O24810J699473m94066l216436j840807K890821M746795
1861e65382P85198m019484l890160j97735J769534R97703O72496J609816J252122
1852a585892q97630j951273p40335J44362j011532k207921j557499o05529j293763
1843a1707012k258820j026062J848260L555452K935585J372971N48381J074532
$$ plain form
1835 -3656713 -1100515 2375708 4454550 3381315 622676 -566304 484109 1070382
1827 1070382 -538865 -2362408 -1838183 496515 2604750 4366275 6619065 8089567
1819 8089567 6657645 3402894 1970894 3286009 4076980 1998507 -702862 -772724 1145202
1810 1145202 2020957 1471363 2126043 5172228 8375720 9243798 8048775 6697221 6184979
1801 6184979 6368666 7087549 8073700 8303343 6862113 4530672 3388717 4338792 5762184
1792 5762184 5432619 3444973 2218476 3383522 5753697 7130662 7031565 6207654 4365225
1783 4365225 713336 -3220529 -4047216 -905142 2928784 4338687 3983105 3569696 2023264
1774 2023264 -2283817 -7171538 -8721638 -7324020 -7450335 -10809067 -13751512 -12887896 -9566502
$$ packed form
1835c656713K556198L476223K078842j073235k758639j188980J050413N86273
1827A070382j609247j823543N24225K334698K108235J761525K252790J470502
1819H089567j431922l254751j432000J315115P90971k078473k701369o9862J917926
1810A145202Q75755n49594O54680L046185L203492Q68078j195023j351554n12242
1801F184979J83687P18883R86151K29643j441230k331441j141955R50075J423392
1792E762184l29565j987646j226497J165046K370175J376965r9097q23911j842429
1783D365225l651889l933865q26687L142074L833926J409903l55582m13409j546432
1774B023264m307081m887721j550100J397618j26315l358732k942445Q63616L321394
$$ plain form
1765 -9566502 -6670147 -4265368 -1225958 1382554 1685218 123080 -1592873 -3272241
1757 -3272241 -5353456 -6590791 -5531175 -3351636 -2416676 -2781936 -2845674 -2521646 -2564484
1748 -2564484 -1490035 2936534 8952267 11469390 8626286 4276159 2470845 2632897
1740 2632897 2155047 876087 286750 298701 -406583 -1966155 -3584720 -5210688 -6837067
1731 -6837067 -7096880 -4908066 -2003536 -1515033 -4019939 -6820225 -7188066 -4771505 -955919
1722 -955919 2337395 3077583 218056 -4915011 -9518903 -12087264 -13303342 -14045572 -13940786
1713 -13940786 -12494889 -10394691 -8771184 -7923874 -7416022 -6701014 -5158748 -2460884 391026
1704 391026 1375868 -169679 -2249679 -2476103 -1073306 -259795 -947196 -1632302 -761961
$$ packed form
1765i566502K896355K404779L039410K608512L02664j562138j715953j679368
1757c272241k081215j237335J059616K179539R34960l65260o3738L24028m2838
1748b564484J074449M426569O015733K517123k843104m350127j805314J62052
1740B632897m77850j278960n89337J1951p05284j559572j618565j625968j626379
1731f837067k59813K188814K904530M88503k504906k800286l67841K416561L815586
1722i55919L293314P40188k859527n133067m603892k568361j216078p42230J04786
1713a3940786J445897K100198J623507Q47310N07852P15008J542266K697864K851910
1704C91026R84842j545547k080000k26424J402797Q13511o87401o85106Q70341
$$ plain form
1695 -761961 1305143 3318166 4870401 6240232 7425241 8252536 8690584 8178328 5584759
1686 5584759 1139327 -2379858 -2181938 937710 3178241 2025093 -1535389 -5038975
1678 -5038975 -6799004 -5850199 -2113956 2173077 3483602 1317799 -375726 1768235
1670 1768235 5881514 7959813 8010144 9454483 13036364 15398652 14267840 11176346 7731501
1661 7731501 3001576 -3055023 -6931118 -5752344 -1960590 -196871 -743092 269735
1653 269735 4536042 9073299 10531491 8836171 5439726 764706 -4656671 -8396185
1645 -8396185 -7983287 -4201434 -772804 -415442 -2147299 -2940581 -1517086 268924 49263
1636 49263 -1830084 -2823979 -1716353 60824 1141306 2144807 3307612 2287819 -2696076
$$ packed form
1695g61961K067104K013023J552235J369831J185009Q27295M38048n12256k593569
1686E584759m445432l519185J97920L119648K240531j153148l560482l503586
1678e038975j760029R48805L736243M287033J310525k165803j693525K143961
1670A768235M113279K078299N0331J444339L581881K362288j130812l091494l444845
1661G731501m729925o056599l876095J178774L791754J763719n46221J012827
1653B69735M266307M537257J458192j695320l396445m675020n421377l739514
1645h396185M12898L781853L428630L57362j731857p93282J423495J786010k19661
1636D9263j879347r93895J107626J777177J080482J003501J162805j019793m983895
$$ plain form
1627 -2696076 -8551109 -9711343 -5203223 -94040 1125237 -385188 -930449 360678
1619 360678 1722521 2177268 1862350 142258 -3676155 -8113879 -10504097 -10206372 -8807487
1610 -8807487 -7255862 -5001602 -2180638 -419554 -685133 -2008149 -3131432 -4073852 -5396761
1601 -5396761 -7146118 -9083262 -10801977 -11261945 -9622663 -6988574 -5724557 -6398455 -7128366
1592 -7128366 -6772827 -6713066 -8069772 -9254506 -8472900 -6994726 -7196061 -8395564 -7754670
1583 -7754670 -5094273 -3632254 -5230392 -7642863 -7764662 -5549828 -3404787 -3428286 -6449839
1574 -6449839 -11926415 -17147396 -18206267 -13911760 -7780164 -4162537 -3175803 -1574921
1566 -1574921 1942575 4870768 4637226 1954484 -522267 -1313307 -870293 -380564 -821906
$$ packed form
1627b696076n855033j160234M508120N109183J219277j510425n45261J291127
1619C60678J361843M54747l14918j720092l818413m437724k390218K97725J398885
1610h807487J551625K254260K820964J761084k65579j323016j123283r42420j322909
1601e396761j749357j937144j718715m59968J639282K634089J264017o73898p29911
1592g128366L55539N9761j356706j184734P81606J478174k01335j199503O40894
1583g754670K660397J462019j598138k412471j21799K214834K145041k3499l021553
1574f449839n476576n220981j058871M294507O131596L617627R86734J600882
1566a574921L517496K928193k33542k682742k476751p91040M43014M89729m41342
$$ plain form
1557 -821906 -2347706 -3701255 -3002591 -126473 2254842 1157729 -3231351 -7432681 -8198339
1548 -8198339 -5569533 -2211495 -233937 750568 2374622 4871875 6407990 5282642
1540 5282642 2178392 -543761 -1611386 -2014148 -3176887 -4804793 -5307818 -4064290 -2416715
1531 -2416715 -2097684 -3081218 -3536648 -1971018 1060743 3751052 5149838 5774025 6300533
1522 6300533 6703002 6935526 7297859 7395970 5854468 2260438 -1421670 -2843117 -2224333
1513 -2224333 -1812837 -2706295 -3957161 -4852545 -6109792 -8116276 -9637101 -9319338 -7314525
$$ packed form
1557h21906j525800j353549O98664K876118K381315j097113m389080m201330p65658
1548h198339K628806L358038J977558R84505J624054K497253J536115j125348
1540E282642l104250k722153j067625m02762j162739j627906n03025J243528J647575
1531b416715L19031r83534m55430J565630L031761K690309J398786O24187N26508
1522F300533M02469K32524L62333R8111j541502l594030l682108j421447O18784
1513b224333M11496q93458j250866q95384j257247k006484j520825L17763K004813
$$ [...]
##END NTUPLES=NMR SPECTRUM
##END=
