##TITLE=31Pdec_LR-786-B-C2-OST
 DMSO-d6, 24 sc
 30.10.2024
##JCAMPDX= 6.0         $$ Bruker NMR JCAMP-DX V2.0
##DATA TYPE= NMR SPECTRUM
##DATA CLASS= NTUPLES
##ORIGIN= UXNMR, Bruker Analytische Messtechnik GmbH
##OWNER= root
$$ XWIN-NMR		Version 3.5
$$ Wed Oct 30 14:06:14 2024 Russian Standard Time (UT+4h)  she@DPX200
##.OBSERVE FREQUENCY= 81.013821
##.OBSERVE NUCLEUS= ^31P
##.ACQUISITION MODE= SIMULTANEOUS
##.ACQUISITION SCHEME= undefined
##.AVERAGES= 24
##.DIGITISER RES= 17
##SPECTROMETER/DATA SYSTEM= spect
##.PULSE SEQUENCE= zgpg30
##.SOLVENT NAME= D2O
##.SHIFT REFERENCE= (INTERNAL, D2O, 0, 198.062)
##AUDIT TRAIL= $$ (NUMBER, WHEN, WHO, WHERE, WHAT)
$$ ##TITLE= Audit trail, XWIN-NMR		Version 3.5
$$ ##JCAMPDX= 5.01
$$ ##ORIGIN= Bruker BioSpin GmbH
$$ ##OWNER= she
$$ F:/spectra/data/she/nmr/P31/2/pdata/1/auditp.txt
$$ ##AUDIT TRAIL=  $$ (NUMBER, WHEN, WHO, WHERE, WHAT)
(   1,<2024-10-30 14:05:00.87 +0400>,<she>,<DPX200>,
      <created by zg, POWCHK disabled, PULCHK disabled
       configuration hash MD5:
       00 E9 B6 7A A2 85 ED C7 34 08 36 98 17 FE 4E 26
       data hash MD5: 32K
       59 EF F9 B2 C0 4A 2D 8F C8 56 18 FE 35 F3 80 3E>)
(   2,<2024-10-30 14:05:17.82 +0400>,<she>,<DPX200>,
      <Start of raw data processing
       efp BC_mod = 2 LB = 1.5 FT_mod = 6 PKNL = 1 PHC0 = 2391.281 PHC1 = 684.0884 SI = 64K 
       data hash MD5: 64K
       25 51 E5 42 A0 BE BD E5 14 64 C0 EF B3 8F 1B 44>)
(   3,<2024-10-30 14:05:36.84 +0400>,<she>,<DPX200>,
      <pk PHC0 = 11.69253 PHC1 = 0 
       data hash MD5: 64K
       EA 0C 19 80 58 A7 DC 5E 92 D7 68 82 8F C8 4A 70>)
(   4,<2024-10-30 14:05:41.20 +0400>,<she>,<DPX200>,
      <abs ABSG = 5 
       data hash MD5: 64K
       D9 E0 36 5A 40 4D 33 E4 22 9D ED C2 08 F1 7C FE>)
$$ ##END=
$$ 
$$ hash MD5
$$ 43 25 A3 D8 98 FB DE 77 2E FA 30 A8 F3 37 4C 08
##$RELAX= 
##$RELAX= 
##$RELAX= 
##$RELAX= 
##$RELAX= 
##$RELAX= 
##$RELAX= 
##$RELAX= 
$$ Bruker specific parameters
$$ --------------------------
##$DU= <F:/spectra>
##$EXPNO= 2
##$NAME= <P31>
##$PROCNO= 1
##$TYPE= <nmr>
##$USER= <she>
##$AMP= (0..31)
100 100 100 100 100 100 100 100 100 100 100 100 100 100 100 100 100 100 
100 100 100 100 100 100 100 100 100 100 100 100 100 100 
##$AQSEQ= 0
##$AQ_mod= 1
##$AUNM= <au_zg>
##$AUTOPOS= <>
##$BF1= 81.014009
##$BF2= 200.13
##$BF3= 200.13
##$BF4= 200.13
##$BF5= 200.13
##$BF6= 200.13
##$BF7= 200.13
##$BF8= 200.13
##$BYTORDA= 1
##$CFDGTYP= 0
##$CFRGTYP= 5
##$CHEMSTR= <none>
##$CNST= (0..31)
1 1 145 1 1 1 1 1 1 1 1 1 1 1 1 1 1 1 1 1 1 1 1 1 1 1 1 1 1 1 1 1 
##$CPDPRG= <waltz16>
##$CPDPRG1= <>
##$CPDPRG2= <waltz16>
##$CPDPRG3= <>
##$CPDPRG4= <mlev>
##$CPDPRG5= <mlev>
##$CPDPRG6= <mlev>
##$CPDPRG7= <mlev>
##$CPDPRG8= <mlev>
##$CPDPRGB= <>
##$CPDPRGT= <>
##$D= (0..31)
0 1 0 0 0 0 0 0 0 0.06 0 0.03 2e-05 3e-06 0 0 0.0002 0 0 0 0 0 0 0 0 0 
0 0 0 0 0 0 
##$DATE= 1730282700
##$DBL= (0..7)
120 120 120 11 120 120 24 19 
##$DBP= (0..7)
150 150 150 150 150 150 150 150 
##$DBP07= 0
##$DBPNAM0= <>
##$DBPNAM1= <>
$$ [...]
##$SUBNAM3= <"">
##$SUBNAM4= <"">
##$SUBNAM5= <"">
##$SUBNAM6= <"">
##$SUBNAM7= <"">
##$SUBNAM8= <"">
##$SUBNAM9= <"">
##$SW= 400.765351723535
##$SWIBOX= (0..15)
0 1 3 0 0 0 0 0 0 0 0 0 0 0 0 0 
##$SW_h= 32467.5324675325
##$TD= 32768
##$TD0= 1
##$TE= 0
##$TE2= 300
##$TE3= 300
##$TEG= 300
##$TL= (0..7)
0 120 53 12 22 120 120 120 
##$TP= (0..7)
150 150 150 150 150 150 150 150 
##$TP07= 0
##$TPNAME0= <>
##$TPNAME1= <>
##$TPNAME2= <>
##$TPNAME3= <>
##$TPNAME4= <>
##$TPNAME5= <>
##$TPNAME6= <>
##$TPNAME7= <>
##$TPOAL= (0..7)
0.5 0.5 0.5 0.5 0.5 0.5 0.5 0.5 
##$TPOFFS= (0..7)
0 0 0 0 0 0 0 0 
##$TUNHIN= 0
##$TUNHOUT= 0
##$TUNXOUT= 0
##$USERA1= <user>
##$USERA2= <user>
##$USERA3= <user>
##$USERA4= <user>
##$USERA5= <user>
##$V9= 5
##$VALIST= <valist>
##$VCLIST= <CCCCCCCCCCCCCCC>
##$VD= 0
##$VDLIST= <DDDDDDDDDDDDDDD>
##$VPLIST= <PPPPPPPPPPPPPPP>
##$VTLIST= <TTTTTTTTTTTTTTT>
##$WBST= 1024
##$WBSW= 4
##$XGAIN= (0..3)
0 0 0 0 
##$XL= 0
##$YL= 0
##$YMAX_a= 2973
##$YMIN_a= -2709
##$ZGOPTNS= <>
##$ZL1= 120
##$ZL2= 120
##$ZL3= 120
##$ZL4= 120
##$ABSF1= 198.0616
##$ABSF2= -202.7028
##$ABSG= 5
##$ABSL= 3
##$ALPHA= 0
##$AQORDER= 0
##$ASSFAC= 0
##$ASSFACI= 0
##$ASSFACX= 0
##$ASSWID= 0
##$AUNMP= <proc_1d>
##$AZFE= 0.1
##$AZFW= 0.5
##$BCFW= 0
##$BC_mod= 2
##$BYTORDP= 0
##$COROFFS= 0
##$CY= -3
##$DATMOD= 1
##$DC= 0
##$DFILT= <>
##$DTYPP= 0
##$F1P= 0
##$F2P= 0
##$FCOR= 1
##$FTSIZE= 65536
##$FT_mod= 6
##$GAMMA= 0
##$GB= 0
##$INTBC= 1
##$INTSCL= 9.790993e-09
##$ISEN= 30
##$LB= 1.5
##$LEV0= 0
##$LPBIN= 0
##$MAXI= 10000
##$MC2= 0
##$MEAN= 0
##$ME_mod= 0
##$MI= 50
##$NCOEF= 0
##$NC_proc= -9
##$NLEV= 6
##$NOISF1= 182.463
##$NOISF2= 159.3651
##$NSP= 0
##$NTH_PI= 0
##$NZP= 0
##$OFFSET= 198.0616
##$PC= 4
##$PHC0= 2402.974
##$PHC1= 684.0884
##$PH_mod= 1
##$PKNL= yes
##$PPARMOD= 0
##$PSCAL= 0
##$PSIGN= 0
##$REVERSE= no
##$SF= 81.0140089999434
##$SI= 65536
##$SIGF1= 159.3651
##$SIGF2= -187.1042
##$SINO= 113.3802
##$SIOLD= 16384
##$SREGLST= <1H.CDCl3>
##$SSB= 0
##$STSI= 65536
##$STSR= 0
##$SW_p= 32467.5324675325
##$SYMM= 0
##$S_DEV= 0
##$TDeff= 32768
##$TDoff= 0
##$TI= <>
##$TILT= no
##$TM1= 0
##$TM2= 0
##$TOPLEV= 0
##$USERP1= <user>
##$USERP2= <user>
##$USERP3= <user>
##$USERP4= <user>
##$USERP5= <user>
##$WDW= 1
##$XDIM= 65536
##$YMAX_p= 365246404
##$YMIN_p= -145100263
$$ End of Bruker specific parameters
$$ ---------------------------------
##NTUPLES= NMR SPECTRUM
##VAR_NAME=  FREQUENCY,     SPECTRUM/REAL,   SPECTRUM/IMAG
##SYMBOL=    X,             R,               I
##VAR_TYPE=  INDEPENDENT,   DEPENDENT,       DEPENDENT
##VAR_FORM=  AFFN,          ASDF,            ASDF
##VAR_DIM=   65536,         65536,           65536
##UNITS=     HZ,            ARBITRARY UNITS, ARBITRARY UNITS
##FACTOR=    0.49542278885378, 1,            1
##FIRST=     16045.7642231865, 0,            0
##LAST=      -16421.768244346, 0,            0
##MIN=       -16421.768244346, -145100263,   0
##MAX=       16045.7642231865, 365246404,    0
$$ Real data points
##PAGE= N=1
##DATA TABLE= (X++(R..R)), XYDATA
$$ [...]
43341F347919r49358k895406j821869J129123L158197K394514J88447p25944m9331
43332F776292K61512l72304n29432j9348p19004l168467m842865l229898R87588
43323d855926M772866N530195K844486j054054k637179o64706J891888J603123
43315G430693m26346l14157K222127L095533J87656l324346l595536r45603J739025
43306F069046K772392K082214K40459j268078q99025O67561J372088J505288L318450
43297A5860395N981613N141322l99219n758975o630963m841049l851040k921015
43289B581069k96808J673492L87898j002569J926594O215131M701126k414469
43281A3771464o784259m158768j86628q82106l708384k864641J317167L801678
$$ plain form
43341 6347919 5398561 2503155 681286 1810409 4968606 7363120 7551567 6825623 6776292
43332 6776292 7037804 6665500 6136068 6116720 5397716 2229249 -2613616 -5843514 -4855926
43323 -4855926 -83060 5447135 8291621 7237567 4600388 3935682 5827570 7430693
43315 7430693 7004347 6690190 8912317 12007850 12195506 8871160 5275624 4330021 6069046
43306 6069046 8841438 10923652 11164111 9896033 8997008 9664569 11036657 12541945 15860395
43297 15860395 21842008 26983330 26584111 20825136 14194173 9353124 5502084 2581069
43289 2581069 2284261 3957753 4345651 3343082 5269676 11484807 16185933 13771464
43281 13771464 6987205 2828437 2641809 1759703 -1948681 -4813322 -3496155 305523
43273C05523K850177J245192Q63800P42498J55518l64902j135754k983513m518356
43264b839817l048986J007800L633733K400502l88672j339965n06387j68073p96891
43255b046756r12429j83793J15204j43862O09505K552942L192859Q64566k214035
43246A834201k508122K16354K923522L250327J292917j868302m813046n243030
43238d915179j881694K651356L950477J619717l13858J47027K11349j714838j864062
43229b109705K672122P185160M883400k466932n931262j641023M470528N663270
43221A2725558K515518n96990k290586l698115m646713m268132l317889k620664
43213f198013j061400J873035L477605J133728l153724m867483k672672J069310
$$ plain form
43273 305523 3155700 4400892 5264692 6007190 6162708 5797806 4662052 1678539 -2839817
43264 -2839817 -5888803 -4881003 -1247270 1153232 764560 -575405 -1081792 -1249865 -2046756
43255 -2046756 -2959185 -3142978 -3027774 -3171636 -2562131 -9189 3183670 4048236 1834201
43246 1834201 -673921 -457567 2465955 5716282 7009199 5140897 327851 -4915179
43238 -4915179 -6796873 -4145517 -195040 1424677 1110819 1257846 1469195 -245643 -2109705
43229 -2109705 562417 7747577 12630977 10164045 4232783 2591760 7062288 12725558
43221 12725558 15241076 14644086 12353500 8655385 4008672 -259460 -3577349 -6198013
43213 -6198013 -7259413 -5386378 -1908773 -775045 -3928769 -8796252 -11468924 -10399614
43205a0399614M400801O872687P214761L880107j563739m923323m256424j762266
43197e37010k02426k1404o64114j899752k621399r64711K709660N115308M103756
43188E017908J589673N50839P52544l42353l454651o427418o800219l815587J544929
43179a1384335O854829R045694O722581J781947k408838m207998m120097k938898
43171f55115j318602o92972k228116m438772m018238m7037M399496O134198N788548
43162B923390O073748P179115O243672J552809m608990q099824o895770k400033
43154A968117K187547M090324K524996p49326k774490k222846o78113l63584j198592
43145B784033j460992r33936j226294k433576j908434J786417N501404M859998
$$ plain form
43205 -10399614 -5998813 873874 8088635 11968742 10405003 5481680 1225256 -537010
43197 -537010 -739436 -760840 -1424954 -3324706 -5946105 -6910816 -4201156 914152 5017908
43188 5017908 6607581 7158420 7910964 7568611 4113960 -2313458 -9113677 -12929264 -11384335
43179 -11384335 -4529506 4516188 11238769 13020716 10611878 6403880 2283783 -655115
43171 -655115 -1973717 -2666689 -4894805 -9333577 -13351815 -13398852 -8999356 -2865158 2923390
43162 2923390 8997138 16176253 22419925 23972734 19363744 11263920 4368150 1968117
43154 1968117 4155664 8245988 10770984 10021658 7247168 5024322 4346209 3982625 2784033
43145 2784033 1323041 389105 -837189 -3270765 -5179199 -3392782 2108622 6968620
43137F968620L24204l085961k394342j5040O10892j56831J03114J494704K151460
43128F000820J835260J979510K302120N76307l361213o123193m938647j392853
43120c121889Q15155M80043o42584r61863m96054M11577J672859K511761J790995
43111B460000j09570j296833j036969r08651k051858k671008l97924L338416L883722
43102A209325o54521n883546n693916J64786N292419M201320r81741l151214R46304
43093d550784O672373P275002K142722k865578l086909m30881L49479j399437
43085D105987k132914l98731O47903j397343l666227k161732J579732K202183
43077a221142j508177m779476l933188j088335L62592J083054L110215M840703
$$ plain form
43137 6968620 7292824 4206863 1812521 1797481 2408373 2251542 2354656 3849360 6000820
43128 6000820 7836080 9815590 12117710 12694017 9332804 3209611 -1729036 -3121889
43120 -3121889 -2306734 -1826691 -2469275 -3431138 -3927192 -3515615 -1842756 669005 2460000
43111 2460000 2350430 1053597 16628 -892023 -2943881 -5614889 -6012813 -2674397 1209325
43102 1209325 554804 -5328742 -11022658 -10857872 -5565453 -1364133 -2345874 -5497088 -4550784
43093 -4550784 2121589 9396591 11539313 8673735 5586826 5155945 5505424 4105987
43085 4105987 1973073 1574342 2222245 824902 -2841325 -5003057 -3423325 -1221142
43077 -1221142 -2729319 -7508795 -11441983 -12530318 -12167726 -11084672 -7974457 -3133754
43069c133754L274340j98642j017007J688018L829788K596997r1907j542307j878224
43060C527302j956153j253821j32879r53896m080439n614138k515420K294514
43052a0684930L758157J900631R53926K180368K302688m55057l188404k810081
43044f042702k50418J882269L028933L740243L302105J058355j319728j668632
43036C730425p62590j305225l617937m860459l173267m28381M86918l57435m82341
43027a0770292J090388K440071J679136k82127j041195R6514J572344J896639
43019c318522J177864L37493R6024Q99770K479602L157743J189639k460265m282214
43010g22866k336871J143159K613392J469776m8521r9950J290435L097717L933758
$$ plain form
43069 -3133754 140586 -58056 -1075063 612955 4442743 7039740 6947833 5405526 3527302
43060 3527302 1571149 317328 184449 -769447 -4849886 -10464024 -12979444 -10684930
43052 -10684930 -6926773 -5026142 -4072216 -1891848 410840 -44217 -3232621 -6042702
43044 -6042702 -6293120 -4410851 -1381918 2358325 5660430 6718785 5399057 3730425
43036 3730425 2967835 1662610 -1955327 -6815786 -9989053 -10417434 -9930516 -10287951 -10770292
43027 -10770292 -9679904 -7239833 -5560697 -5842824 -6884019 -6787505 -5215161 -3318522
43019 -3318522 -2140658 -1803165 -1707141 -807371 1672231 4829974 6019613 3559348 -722866
43010 -722866 -3059737 -1916578 696814 2166590 2118069 2018119 3308554 6406271 10340029
43001A0340029K626862j52737j718851n99661J057682L74396k018122l136253
42993F773345k201983j154013j077041j218495j447363k416031k989381r43806
42985f674768K909593M587262K251139j243047k566054j918918j147094m49691
42977d251578R33942K571024L156798J833257j404912m897390n113236l73390
42969g545485N075587M857520p22362m433515k415427Q04038O21827l69521J479237
42960b648101L034920j40909m414372k606909L935063O474582K140350k285884
42952C488740j423388J577747J865556J17520q53692j161122j426406n1162K863616
42943D997409L116444j471104o124221n214347m09945K329401J583892Q35621
$$ plain form
43001 10340029 12966891 12814154 11095303 10495642 11553324 11927720 9909598 6773345
42993 6773345 4571362 3417349 2340308 1121813 -325550 -2741581 -5730962 -6674768
42985 -6674768 -3765175 822087 3073226 1830179 -735875 -2654793 -3801887 -4251578
42977 -4251578 -3317636 -746612 2410186 4243443 2838531 -2058859 -7172095 -7545485
42969 -7545485 -2469898 2387622 1665260 -2768255 -5183682 -4379644 -3757817 -4127338 -2648101
42960 -2648101 386819 245910 -4168462 -6775371 -2840308 3634274 5774624 3488740
42952 3488740 2065352 3643099 5508655 5626175 4772483 3611361 2184955 2133793 4997409
42943 4997409 8113853 6642749 518528 -4695819 -5105764 -2776363 -1192471 -356850
42935c56850J430639R90717j114245k059237n60633P88046p51r51899N53321L617205
42925B336313N273436M507815K779772J441597M29421p07436j754592k083261
42917A2223065j469823m18359L90736Q76060J347353J475242L30371k073365m238248
42908H443032m967260m690966m046999k432390L78055K318077J147724j881174
42900e731901l043157j132092J054526J060877J15940M72427J469213P57630j522909
42891f499446k466569m35844K763572M399730L867752K360630Q59800l57613j111408
42882C380604j428381j677740j634425k93176K065253K733863k44354m351901
42874a450257m999890j915881K58668r52895j892676J258455N731368N742092
$$ plain form
42935 -356850 1073789 2064506 950261 -1108976 -1669609 -881563 -882314 -1834213 -1280892 2336313
42925 2336313 7609749 12117564 14897336 16338933 16768354 16060918 14306326 12223065
42917 12223065 10753242 10334883 10725619 11601679 12949032 14424274 14754645 12681280 8443032
42908 8443032 3475772 -1215194 -5262193 -7694583 -7316528 -4998451 -3850727 -5731901
42900 -5731901 -8775058 -9907150 -8852624 -7791747 -7675807 -7203380 -5734167 -4976537 -6499446
42891 -6499446 -8966015 -9401859 -6638287 -2238557 1629195 3989825 4849625 4492012 3380604
42882 3380604 1952223 274483 -1359942 -1653118 412135 3145998 2901644 -1450257
42874 -1450257 -6450147 -8366028 -8107360 -9060255 -10952931 -9694476 -3963108 1778984
42866A778984J019401l157197l908154l540299l633966j684105L753515Q777440
42858e94381Q620410L829094j282986m270483n418168m768854j992259J473223
42850d404404L361185L480944L187169K496461M86647j805858k011564l17264
42842D473316J84989j979066m232868l444167p0500K716197K892402J118152r53381
42833G05074k496019l472147l606975k196304P37325L587303M462090L372578
42825A092925J936811P70386j022818l073078k843195N87518L852813L161615
42817D462977m28729k608886j927981r61905j402295j493682N20930L188525L734544
42808C083498J470879j874712l909863k990882N74418M048197M450604J818126
$$ plain form
42866 1778984 2798385 -358812 -4266966 -7807265 -11441231 -13125336 -9371821 -594381
42858 -594381 8026029 11855123 10572137 6301654 883486 -3885368 -5877627 -4404404
42850 -4404404 -1043219 2437725 5624894 8121355 8608002 6802144 4790580 4473316
42842 4473316 4658305 2679239 -1553629 -4997796 -5068296 -2352099 540303 1658455 705074
42833 705074 -1790945 -5263092 -8870067 -11066371 -10329046 -6741743 -2279653 1092925
42825 1092925 3029736 3800122 2777304 -295774 -3138969 -2551451 1301362 4462977
42817 4462977 4034248 1425362 -502619 -1464524 -2866819 -4360501 -3839571 -651046 3083498
42808 3083498 4554377 2679665 -1230198 -4221080 -3646662 401535 4852139 6670265
42800F670265j049178k196481k038227j247767K91007J710609J083667j430859
42792A793036k759076j025171J533419J681149n51761k681730l229374k348795
42784g588303n64123R45085K94747k419467l726708q45669L876300N638446L654499
42775g35193J568329J479579J311718p76472k823494k161176K97151J531605Q95303
42766E87350M89282J413281K039147O76244j629721k160882Q3224L022089L715376
42757H235390J407485k111167m812712o119897o103678m331813p93629K685210
42749a1944811L601920J550019j326775k827219k509288r23411J377734L325327
42741i676504L341466J274490n70417P6388K301981K961507Q67954j571099j666239
$$ plain form
42800 6670265 5621087 3424606 1386379 138612 429619 2140228 3223895 1793036
42792 1793036 -966040 -1991211 -457792 1223357 671596 -2010134 -5239508 -7588303
42784 -7588303 -8152426 -7207341 -6912594 -9332061 -13058769 -13904438 -10028138 -4389692 -735193
42775 -735193 833136 2312715 3624433 2847961 24467 -2136709 -1839558 -307953 587350
42766 587350 1076632 2489913 4529060 5205304 3575583 1414701 1497925 4520014 8235390
42757 8235390 9642875 7531708 2718996 -3400901 -9504579 -13836392 -14630021 -11944811
42749 -11944811 -8342891 -6792872 -8119647 -10946866 -13456154 -14379565 -13001831 -9676504
42741 -9676504 -6335038 -5060548 -5630965 -5554577 -3252596 -291089 576865 -994234 -2660473
42732b660473j53609j73808k867762n492707m671518o92562K727524L071867K039628
42723h873420K811821N218073N731962K615598j224722k232811j339088k270990
42715D36423n251868n836314j230889N154226P844121O047367L426889K328677
42707A2918632J582840n7657j674515k382782k981577l876244l607661j280145
42699a359109J339195K110614J478396J148780J104070J93480j226204j672500
42691C116722j137579j011731j513841j322563R7347J669604K390952K218732
42683D507643J274438j81859j067247n25389M52347K91463n45841l75388N46216
42674D376383L63190p86748n96442J293413K138583L48752k031051k747794k465335
$$ plain form
42732 -2660473 -2814082 -2987890 -5855652 -11348359 -16019877 -16712439 -13984915 -10913048 -8873420
42723 -8873420 -6061599 -843526 4888436 7504034 6279312 4046501 2707413 436423
42715 436423 -4815445 -10651759 -11882648 -6728422 1115699 7163066 10589955 12918632
42707 12918632 14501472 14443815 12769300 10386518 7404941 3528697 -78964 -1359109
42699 -1359109 -19914 2090700 3569096 4717876 5821946 6015426 4789222 3116722
42691 3116722 1979143 967412 -546429 -1868992 -1771645 -102041 2288911 4507643
42683 4507643 5782081 5600222 4532975 4007586 4459933 4751396 4205555 3830167 4376383
42674 4376383 4739573 3952825 3356383 4649796 6788379 7137131 5106080 2358286 -107049
42665a07049k469882j912903J43590K091499J907094L53519l92821Q6659Q60653
42656E60359J666239K258715J430447q64545k142281q27377P45053j97170k188301
42647D41139j844979P17160K693818L455679M239903M053088Q87864l286922m032263
42638G324487j394857j11587j926831l182382j743723o60902k149356l272039
42630g117190j395666O79515n65956l306479l543974j131717J796007N112488
42622i472972Q432615P814476R30128o593309o782747n47029L284719L10343m534335
42613g158111n448069k797408M34666L391408N442469M473421P44178j382259
42605b299705Q05959M031525L859067R67539r29804q35708l38540K37480J617002
$$ plain form
42665 -107049 -2576931 -4489834 -4346244 -2254745 -347651 5868 -386953 -300294 560359
42656 560359 2226598 4485313 5915760 5051215 2908934 2081557 2826610 2629440 441139
42647 441139 -1403840 -686680 2007138 5462817 9702720 13755808 14643672 11356750 7324487
42638 7324487 5929630 5818043 3891212 708830 -1034893 -1695795 -3845151 -7117190
42630 -7117190 -8512856 -7833341 -8399297 -11705776 -15249750 -16381467 -14585460 -9472972
42622 -9472972 -1040357 6774119 7704247 1110938 -5671809 -6218838 -2934119 -2623776 -7158111
42613 -7158111 -12606180 -15403588 -14968922 -11577514 -6135045 -1661624 -917446 -2299705
42605 -2299705 -1493746 2537779 6396846 7364385 6434581 5598873 5260333 5497813 7114815
42596G114815K744637J775418p37291k507298k678784j965796p74732M22362L19041
42587C712372r53444m98472L190596O413696M514953j164565m852204m350398
42579F012534l008001l530384m403567l631849j993189q59012k1726O81467M68151
42570a0285576j90893P03031L218066M476097K737641j0260j158807p69861k42909
42561a523471j03125n80380j887751k560814m30948L150172L434106j052799n312606
42552f867616m372901L6045K802013K734576K449604K935211K683139J375343
42544C775414N24316P75975J635183L148320M966753M919230J777794j795034
42536A9727951k648160k187694l828397o424859n229609M95680N688824O248922
$$ plain form
42596 7114815 9859452 11634870 10897579 8390281 5711497 3745701 2970969 3393331 3712372
42587 3712372 2758928 2260456 5451052 11864748 16379701 15215136 10362932 6012534
42579 6012534 3004533 -525851 -4929418 -8561267 -10554456 -11413468 -11435194 -10753727 -10285576
42570 -10285576 -10476469 -9773438 -6555372 -2079275 658366 648106 -510701 -1280562 -1523471
42561 -1523471 -1626596 -2206976 -4094727 -6655541 -7086489 -3936317 -502211 -1555010 -6867616
42552 -6867616 -11240517 -11204472 -8402459 -5667883 -3218279 -283068 2400071 3775414
42544 3775414 4299730 5075705 6710888 9859208 14825961 19745191 21522985 19727951
42536 19727951 17079791 14892097 11063700 4638841 -590768 -95088 5593736 11842658
42528A1842658L328855k22723l507031n982976n973757l052377N22957K335802
42520g08592J877122l03945k940068l490624n75031K795884K182512j671551l449135
42511f283428j236848R38430N2885j522774j014367K09344J78090J9567P83500
42502g875601P90008l04531Q16546N185263P637571L999994j595465k414119R53742
42493G193408K740401J707183J619161L062385K125520k022756m714408k765632
42485H945262J226142L423216L235510J555467j382571m332349m712237k123230
42477E835210M44903N83137p18702j434476j236301o88871L493M01948M2185j94608
42467C037918P94605J604524l38296m123563n391364k367647J232238J250934
$$ plain form
42528 11842658 15171513 14948790 11441759 5458783 -514974 -3567351 -3044394 -708592
42520 -708592 1168530 864585 -2075483 -5566107 -6141138 -3345254 -1162742 -2834293 -6283428
42511 -6283428 -7520276 -6581846 -6528961 -8051735 -9066102 -8856758 -8678668 -8659101 -7875601
42502 -7875601 -7085593 -7390124 -6573578 -1388315 6249256 10249250 8653785 6239666 7193408
42493 7193408 9933809 11640992 13260153 16322538 18448058 16425302 11710894 8945262
42485 8945262 10171404 13594620 16830130 18385597 17003026 12670677 7958440 5835210
42477 5835210 6280113 6863250 6144548 4710072 3473771 2784900 2788393 3190341 3232526 3037918
42467 3037918 3832523 5437047 5098751 975188 -4416176 -6783823 -5551585 -4300651
42459d300651j469119k851800j036925J969563L147308J630831m36818O4075L478180
42450A94644O157294M678535N82320j609221o73557J08903j804049m942500o434194
42441c741825n078705j354687K778837L915251M58925l792419l216059J768419
42433h262263M723076K367086r65053k99425L050343M696254L544672J463308
42425A0317998l71703j463706j023230J3812j076368l867289l331764K724849
42417A922599Q270883O318446q01744m298349j114795K570789O79466m921517
42409H625778p835052n184202j84367J901340p18596m509903m632188r45079J971168
42400a1511101J600993R63751K840609M252371J262068l333681l002672K580535
$$ plain form
42459 -4300651 -5769770 -8621570 -9658495 -7688932 -4541624 -2910793 -3347611 -3283536 194644
42450 194644 6351938 11030473 11612793 10003572 9330015 9438918 7634869 2692369 -3741825
42441 -3741825 -8820530 -10175217 -7396380 -3481129 -3022204 -6814623 -10030682 -8262263
42433 -8262263 -3539187 -1172101 -2137154 -2436579 613764 5310018 8854690 10317998
42425 10317998 9946295 8482589 7459359 7473171 6396803 2529514 -802250 1922599
42417 1922599 10193482 16511928 15710184 11411835 10297040 12867829 13547295 8625778
42409 8625778 790726 -4393476 -4577843 -2676503 -3395099 -7905002 -12537190 -13482269 -11511101
42400 -11511101 -9910108 -8946357 -6105748 -1853377 -591309 -3924990 -6927662 -4347127
42392d347127O549325M668958P50166P5764J833553J416211k341409n693228n158848
42383b246635j839696R2221j344701l032421l24066O416454J1072854Q937044
42375A7731054K371044k752290l941762k666708m71828J665469J857916n55702
42367A3237193k549400j292795P32268p50824m300496m483431q44666J167823
42359I15672q66874k928089k062722r92326k060446k394462O63864M132518M112952
42350a479913K024689J305610J304375l52458k090846p24630K301385K622426
42342D910638M3614j473839o99887o50799k518143l189897o90379K098217J734444
42333d36031p41692j757207k48894J721209K238003J298595j41856j223734j411669
$$ plain form
42392 -4347127 2202198 6871156 7621322 7697086 9530639 10946850 8605441 2912213 -2246635
42383 -2246635 -4086331 -3994110 -5338811 -8371232 -8695298 -2278844 8794010 17731054
42375 17731054 20102098 17349808 13408046 10741338 10269510 11934979 13792895 13237193
42367 13237193 10687793 9394998 10127266 9376442 5075946 592515 -252151 915672
42359 915672 48798 -2879291 -4942013 -5934339 -7994785 -10389247 -9725383 -5592865 -1479913
42350 -1479913 544776 1850386 3154761 2802303 711457 -13173 2288212 4910638
42342 4910638 4954252 3480413 2780526 2129727 -388416 -3578313 -4268692 -2170475 -436031
42333 -436031 -1177723 -2934930 -3183824 -1462615 775388 2073983 1932127 708393 -703276
42324g03276p89709j80637l97282j423832k533538k842632j588852J405105M892247
42315d162406O334012L965909r34342m554757m100319p38166J658998P41308k109841
42306c899604l942170l467254j454554Q99968K618068K675334P14214k081775
42298g937773l967298m249010l099100p32075J853274K586355R71380n1549K290384
42289a2335412N882663O072229K639307M82944K449985N361098M980927J554305
42281A7088046j909363m016789n104273n233983m539277l808694k856770l83431
42273a0764534K877512L660060J102132q17571J171724M450164M553341J921534
42265H154362K70917J29735j011376k928221k201234J944387N652285N422546
$$ plain form
42324 -703276 -1492985 -1673622 -2070904 -3494736 -6028274 -8870906 -10459758 -9054653 -4162406
42315 -4162406 2171606 6137515 5203173 648416 -3451903 -4190069 -2531071 -1789763 -3899604
42306 -3899604 -7841774 -11309028 -12763582 -11863614 -9245546 -6570212 -5855998 -7937773
42298 -7937773 -11905071 -16154081 -19253181 -19985256 -18131982 -15545627 -14574247 -14625796 -12335412
42289 -12335412 -6452749 -380520 2258787 2741731 5191716 10552814 15533741 17088046
42281 17088046 15178683 11161894 6057621 823638 -3715639 -7524333 -10381103 -10764534
42273 -10764534 -7887022 -4226962 -3124830 -3942401 -2770677 1679487 6232828 8154362
42265 8154362 8425279 8555014 7543638 4615417 2414183 4358570 10010855 15433401
42257A5433401J859741k308770m989801n000239k627427n16523j138876k970763
42249b259257k226875J272318L483069K166114j56802o26492J60871O26543J084067
42240C523556J819214J329950q26117k018022k66505K222245K282369O38844K35451
42231H940985J217794J213723j78092q79313k81052k39671j530211k395731j698146
42222D170286q05249q76684o16384J305285L291014K582938p62681l716035l967999
42213F04491k210807o51706n69098j619706k535691k141275l88174J439143K162984
42204e909839K194673K623900L107951K279033L98221m93731L9712m18213l206462
42195F15245n496570l832972O69539L780699L861541K661542J080802j598335
$$ plain form
42257 15433401 17293142 14984372 9994571 4994332 2366905 1850382 711506 -2259257
42249 -2259257 -4486132 -3213814 269255 2435369 2278567 1652075 1812946 2439489 3523556
42240 3523556 5342770 6672720 5846603 3828581 3562076 5784321 8066690 8705534 8940985
42231 8940985 10158779 11372502 11194410 10315097 10034045 9794374 8264163 5868432 4170286
42222 4170286 3365037 2488353 1871969 3177254 6468268 9051206 8288525 4572490 604491
42213 604491 -1606316 -2258022 -2827120 -4446826 -6982517 -9123792 -9511966 -8072823 -5909839
42204 -5909839 -3715166 -1091266 2016685 4295718 4693939 4200208 4239920 3821707 615245
42195 615245 -4881325 -8714297 -8044758 -4264059 -402518 2259024 3339826 1741491
42187A741491l991411k879915J241220L346551R61226k105766j945256k05885
42179c837745J23643L40612K537450M247054K625011R89788L964379P894600M516925
42170B3401717n542279j1574637p554331j94243J791544n69736j051995J215038
42162g8922K547628K337974K805313L027144o7659n206134p218057m435896o28102
42153f916711J140370J839113K541666J819943p63822k367884r24330J118577
42145b513078L7400l681189n720384l262495J910637N542585N105342J997995
42137e83187o7678Q37794K718496K613425R99841R55862K903696L306379N6816
42128A3741444l791500m352453k708234k792348m730252m626995j285624J266079
$$ plain form
42187 1741491 -2249920 -5129835 -3888615 -542064 419162 -1686604 -3631860 -3837745
42179 -3837745 -3714102 -3373490 -836040 3411014 6036025 7025813 10990192 18884792 23401717
42170 23401717 17859438 6284801 -1269530 -1463773 327771 -241965 -1293960 -78922
42162 -78922 2468706 4806680 7611993 10639137 10571478 5365344 -1852713 -6288609 -6916711
42153 -6916711 -5776341 -3937228 -1395562 424381 -339441 -2707325 -3631655 -2513078
42145 -2513078 -2475678 -6156867 -11877251 -15139746 -13229109 -7686524 -2581182 -583187
42137 -583187 -650865 186929 2905425 5518850 6518691 7474553 10378249 13684628 13741444
42128 13741444 9949944 5597491 2889257 96909 -4633343 -9260338 -10545962 -9279883
42120i279883q7160k544706j713277J603013K953835J408993P32662K943459M864594
42111H81530L077556p94856k527114j105586P85134J095344M44134M9257N4358
42102A959757K16780L70149j55945j904002l635013k929965O91658M364056M582743
42093C560218R53998l265186m282429j448554K059535K588549O8387k218329k090251
42084d074062r39565q00173j100982m14759M38637k8686n98480R44482L346495
42075c227093L014711j63186k081180n52312J533303R28406j359941k367298j346537
42066e621127P20818L421875O079813O403543K725376l228937p709965q362363
42058e570967n267267j91302L892445M404968J963812k3272J29751M41227p31822
$$ plain form
42120 -9279883 -9367043 -11911749 -13625026 -12022013 -9068178 -7659185 -6926523 -3983064 881530
42111 881530 3959086 3164230 637116 -468470 316664 1412008 1856142 1905399 1959757
42102 1959757 2176537 2546686 2390741 486739 -3148274 -6078239 -5386581 -1022525 3560218
42093 3560218 4514216 1249030 -3033399 -4481953 -2422418 166131 234518 -1983811 -4074062
42084 -4074062 -5013627 -5813800 -6914782 -7329541 -6890904 -6919590 -7518070 -6573588 -3227093
42075 -3227093 -212382 -375568 -2456748 -3009060 -1475757 -547351 -1907292 -4274590 -5621127
42066 -5621127 -4900309 -1478434 4601379 11004922 13730298 10501361 2791396 -5570967
42058 -5570967 -10838234 -11029536 -7137091 -2732123 -768311 -791583 -661832 -220605 -952427
42049i52427j667157o93307L02117p90007j851474M44044M682055O083665L107159
42040H664668j368032m914162p317060p563210l848816K174750N355090L293981
42032e522791m87530j565688N4348J698094K383369K686763K219564L33614j542191
42023B57552j147021J053191J936911o0430k656744k741121m64654J210329O41080
42014a970907o11489o42087k08485j087075k470152j652459J586802M036508L488591
42005D69247J658347J203331K077767K657219K392100J282242j250560m583040
41997E906653n867838l385947P53075L667272N239458N769448L092507l454925
41989A1719703q622901o699932m66524J485795l304789q057943o902781k091510
$$ plain form
42049 -952427 -2619584 -3312891 -3010774 -3800781 -5652255 -5208211 -526156 5557509 8664668
42040 8664668 7296636 2382474 -4934586 -12497796 -16346612 -14171862 -8816772 -5522791
42032 -5522791 -6010321 -7576009 -7521661 -5823567 -3440198 -753435 1466129 1799743 257552
42023 257552 -889469 163722 2100633 2040203 -616541 -3357662 -3822316 -2611987 -1970907
42014 -1970907 -2582396 -3224483 -3432968 -4520043 -6990195 -8642654 -7055852 -3019344 469247
42005 469247 2127594 3330925 5408692 8065911 10458011 11740253 10489693 5906653
41997 5906653 38815 -3347132 -2594057 1073215 6312673 12082121 15174628 11719703
41989 11719703 3096802 -3603130 -4069654 -2583859 -5888648 -13946591 -20849372 -22940882
41981b2940882J375169K660128L028335J725363j463636k942302M92062N992177
41973a2073586P520786L562835j362555k419309Q36662M917961N608556J464900
41965H056250m255590o151633k554243K411542L849340J443791j631604l142280
41957a974427l179378k708562k545767k540363q61873L784533Q461083P908237
41949F343483J957723k783825j582950J877136J598024j578412k200427P64742
41941D395494L112886K734349J885530J788689L36792l442988o964107p772531
41933c925886o370091m177516j706154L80127J383879K410648N002682P534201
41925E31890O530386K166800j493068k627334l604165n367158m865585q46581
$$ plain form
41981 -22940882 -21565713 -18905585 -15877250 -14151887 -15615523 -18557825 -18065763 -12073586
41973 -12073586 -4552800 -989965 -2352520 -4771829 -3935167 982794 6591350 8056250
41965 8056250 3800660 -2350973 -4905216 -2493674 1355666 2799457 1167853 -1974427
41957 -1974427 -5153805 -7862367 -10408134 -12948497 -13810370 -10025837 -1564754 6343483
41949 6343483 8301206 5517381 3934431 5811567 7409591 5831179 3630752 4395494
41941 4395494 7508380 10242729 12128259 13916948 14253740 10810752 3846645 -3925886
41933 -3925886 -10295977 -14473493 -16179647 -15799520 -14415641 -12004993 -7002311 531890
41925 531890 7062276 9229076 7736008 5108674 1504509 -3862649 -8728234 -9574815
41917i574815K518723J704546m64198K30666K145985R98778k041199j829977J914048
41908d397443L710256J197723j054061R54042M350941M189942R13535j145969
41900H718966n67397L8405j127715k760367l076109j904636R7207K019739K425467
41891C863560Q11408o65800M29252K569903J689420k301407m232870j113070K819176
41882C869572K107102j706855k650966M40501K708510J322485p11788l45365Q30780
41873E863976M00672m56053J67806P60151r44076l278357k697821O18108K995936
41864C430342K638965J401774J243263J874504K227389J866640O81111r07295
41856A4456693j536821n35326N10173k06278j834949k368480k137411k859002
$$ plain form
41917 -9574815 -7056092 -5351546 -5815744 -5585078 -3439093 -2440315 -4481514 -6311491 -4397443
41908 -4397443 -687187 510536 -543525 410517 4761458 8951400 9864935 8718966
41900 8718966 8151569 8189974 7062259 4301892 1225783 -678853 -581646 1438093 3863560
41891 3863560 4674968 4009168 4438420 7008323 8697743 6396336 2163466 1050396 3869572
41882 3869572 5976674 4269819 1618853 2059354 4767864 6090349 5378561 5033196 5863976
41873 5863976 6264648 5808595 5976401 6736552 5792476 2514119 -183702 434406 3430342
41864 3430342 6069307 7471081 8714344 10588848 12816237 14682877 15363988 14456693
41856 14456693 12919872 12384546 12894719 12688441 10853492 8485012 6347601 3488599
41848C488599l782212k294985J438853L947713L330934J434132J08570j430820
41840F240784l796380m867546k483935J989469M908603M273047J141407j923292
41832E482157k913284j789603l72593m5836Q0614J277113K335257J198104j067137
41823D184792j289581P15189J836559J058113R30231K276732J967042j525909
41815A0153168m549962l532706j79333K083729L234639M136161K573445k822699
41807A1096442p496738o047787q65186P66179k352724m026883j047117K066844
41799g906970J191951p13027R35982M787794N999879L260329p80055l858569n021954
41790b104640l102532J653720N550357M911681J097471j368237j146341q51478
$$ plain form
41848 3488599 -293613 -2588598 -1149745 2797968 6128902 7563034 7671604 6240784
41840 6240784 2444404 -2423142 -4907077 -2917608 1990995 6264042 7405449 5482157
41832 5482157 2568873 779270 406677 360841 441455 1718568 4053825 5251929 4184792
41823 4184792 2895211 3610400 5446959 6505072 7435303 9712035 11679077 10153168
41815 10153168 5603206 2070500 1891167 3974896 7209535 11345696 13919141 11096442
41807 11096442 3599704 -2448083 -3313269 -2547090 -4899814 -8926697 -9973814 -7906970
41799 -7906970 -6715019 -7428046 -6492064 -1704270 4295609 7555938 6775883 2917314 -2104640
41790 -2104640 -5207172 -3553452 1996905 6908586 8006057 6637820 5491479 4640001
41782D640001j627510j233717J293011K987680J269328j994664l380043k689135
41774g35049k034304j891954j338886j135289k828885m866193l513979J252208
41766a7092331M461498K916107N9975Q58876M174562M509969N48688k613325p70905
41757b946886L576315M809807J198926l839631n997378l799946P43495L666944
41749b588354K282965j738139l658347j364296J703702J169396k185203l658381
41741a0036657j336461J568762J726037K27614K74607K046144K485306J28335
41733b916313k305121j677499P03796P18249k059992k908735R48589M999449L338885
41724a158692k016132l399288R21897L948661J039026k718992j050680K932937
$$ plain form
41782 4640001 3012491 1778774 3071785 6059465 7328793 5334129 1954086 -735049
41774 -735049 -2769353 -4661307 -6000193 -7135482 -9964367 -14830560 -18344539 -17092331
41766 -17092331 -12630833 -9714726 -9654751 -8795875 -4621313 -111344 437344 -2175981 -2946886
41757 -2946886 629429 5439236 6638162 2798531 -3198847 -6998793 -6255298 -2588354
41749 -2588354 -305389 -2043528 -5701875 -7066171 -5362469 -4193073 -6378276 -10036657
41741 -10036657 -11373118 -9804356 -8078319 -7850705 -7576098 -5529954 -3044648 -2916313
41733 -2916313 -5221434 -6898933 -6195137 -5476888 -7536880 -10445615 -9497026 -4497577 -1158692
41724 -1158692 -3174824 -6574112 -5652215 -1703554 -664528 -3383520 -4434200 -1501263
41716a501263J622309m757647q496039o271814k989670k612711k321749J186527
41708b6142057N427749O341245M651119L632233L357814J570415j358961k544841
41700e065284j298130l62540j949826m695497n276927k139135K623570M979597
41692a3184172L152915m183k06575K727702M706596L260631R20842J126694L155486
41683E655936L535808J053498k112086l645462l508404l135358l348497l198702
41675h703267r78966K919933N021888K768004j114743j567969J400621K521265
41667B266766m48430l215822k304482p32063k033474l298708k14817M302313L755125
41658a923592j117193k711163J785220O161294M663968k21646k456161l76555
$$ plain form
41716 -1501263 121046 -4636601 -13132640 -19404454 -22394124 -25006835 -27328584 -26142057
41708 -26142057 -20714308 -14373063 -9721944 -6089711 -2731897 -1161482 -2520443 -5065284
41700 -5065284 -6363414 -6725954 -8675780 -13371277 -18648204 -20787339 -18163769 -13184172
41692 -13184172 -10031257 -10035440 -10242015 -7514313 -2807717 452914 1373756 2500450 5655936
41683 5655936 9191744 10245242 8133156 4487694 979290 -2156068 -5504565 -8703267
41675 -8703267 -9682233 -6762300 -1740412 1027592 -87151 -1655120 -254499 2266766
41667 2266766 1818336 -1397486 -3701968 -4434031 -6467505 -9766213 -9981030 -5678717 -1923592
41658 -1923592 -3040785 -5751948 -3966728 2194566 6858534 6636888 4180727 3804172
41650C804172L098564M679455K506290l092534q281631q206878l026680J584960
41642f934282J963657Q48464J751829L126957K103845M48827J641799M189167
41634I140263L345202j204841m478542l374333l79204Q32282j04699j383278j759752
41625F33098q82947Q53892J848406O88988j389923j600861L65607J859109J508566
41616C883935J153756K204014K830582J004035j726361k129410J25365K164537
41608I510453J650123j121141m348768o047805m650149m05618L749609M706797
41600C043501K924988J773552K608530K701914n05452m995664o384485l701129
41592b534245m28107L04054q12939j350107n29710R18032K570169L990668L668277
$$ plain form
41650 3804172 6902736 11582191 14088481 10995947 2714316 -5492562 -8519242 -6934282
41642 -6934282 -4970625 -4122161 -2370332 756625 2860470 3309297 4951096 9140263
41634 9140263 12485465 11280624 6802082 3427749 3048545 3880827 3776128 2392850 633098
41625 633098 -249849 604043 2452449 3141437 1751514 150653 516260 2375369 3883935
41616 3883935 5037691 7241705 10072287 11076322 9349961 7220551 7345916 9510453
41608 9510453 11160576 10039435 5690667 -357138 -5007287 -5412905 -1663296 3043501
41600 3043501 5968489 7742041 10350571 13052485 12547033 7551369 1166884 -2534245
41592 -2534245 -2962352 -2658298 -3471237 -4821344 -5351054 -4433022 -1862853 2127815 5796092
41583E796092N68279l535029n393690m166633k202839j662634k066314j673264
41575a4336032K76634L198459N531396N155379J329893l217525m285998j254852
41567g602646K031676K590104J936342K538336L358652J973632p88651j891273
41559D146172q04786K10928J4485m88047r49073j705999j481873J214227M004749
41550D160783K191345m104215q272370n201727K086294O583701N686739K416763
41542E547313N2933j038105j748442k268394k171368r75626J346464L574194L739217
41533F058186J471273j099789j881987j190564n37333m91394j068335k566772
41525a306715m192333l490780M83324M653423N123204K095251q26875j489668
$$ plain form
41583 5796092 6364371 2829342 -2564348 -6730981 -8933820 -10596454 -12662768 -14336032
41575 -14336032 -14059398 -10860939 -5329543 -174164 1155729 -2061796 -6347794 -7602646
41567 -7602646 -5570970 -2980866 -1044524 1493812 4852464 6826096 6037445 4146172
41559 4146172 3341386 3552314 3566799 3078752 2129679 423680 -1058193 156034 4160783
41550 4160783 6352128 2247913 -6024457 -11226184 -9139890 -2556189 3130550 5547313
41542 5547313 5600246 4562141 2813699 545305 -1626063 -2601689 -1255225 2318969 6058186
41533 6058186 7529459 6429670 4547683 3357119 2819786 2328392 1260057 -1306715
41525 -1306715 -5499048 -8989828 -8506504 -3853081 1270123 3365374 2538499 1048831
41517A048831p81609l6406K66295n92382l019526n183824m388157r70085J642094
41508a2014769J492771L93941P88701K503452L724676L369338J388939j677837
41500c0788m386327m974183l206839n77347J767472L953490N899334O549177N208292
41491A0202281K339535j174619m055740m142145k56486N119658P544195N612290
41483B1188969J844981j690507n279559q159625p381247k619001J409367P50726
41475F4104k220217k668745m41715Q28691J87102K70854K084867L167066J625776
41466B897783j353532l737293m547951l136293M45529L683664L243514m83186
41458b987765l116572j867189J028507J892440L71524j194508j403419p69456
$$ plain form
41517 1048831 267222 230816 497111 -95271 -3114797 -8298621 -12686778 -13656863 -12014769
41508 -12014769 -10521998 -10128057 -9339356 -6835904 -3111228 258110 1647049 -30788
41500 -30788 -4417115 -9391298 -12598137 -13175484 -11408012 -7454522 -1555188 4993989 10202281
41491 10202281 12541816 11367197 7311457 3169312 2912826 8032484 15576679 21188969
41483 21188969 23033950 21343443 16063884 7904259 523012 -2095989 -686622 64104
41475 64104 -2156113 -4824858 -5266573 -4437882 -4250780 -3979926 -1895059 1272007 2897783
41466 2897783 1544251 -2193042 -6740993 -9877286 -9431757 -5748093 -2504579 -2987765
41458 -2987765 -6104337 -7971526 -6943019 -5050579 -4679055 -5873563 -7276982 -8046438
41450h046438j13511K66965L16627L02559P81093J748168K338810J875182O14458
41441H3913q09694j895895k084795j083469M17338J369692J766254K283275K725227
41432B771846K364026J605376J302684N01858k500602o382051p097382l304591
41424a0738836J339548L166125L030072L396229L576085J462266j689486k370878
41416A171125l13092J057160J07852p28660N10563J762902J99615l158437m780514
41407d171486l548492j753699j227566p28984J830347N825131P982906N965860
41399A0174017J018893l335901m777276l832447k379862j434783p17979L15526
41391d969812J673776K797899K948164J877337L48245m50655k88366j78245r32328
$$ plain form
41450 -8046438 -8159949 -7892984 -7576357 -7273798 -6492705 -4744537 -2405727 -530545 83913
41441 83913 -725781 -2621676 -4706471 -5789940 -5372602 -4002910 -2236656 46619 2771846
41432 2771846 5135872 6741248 8043932 8545790 6045188 -336863 -7434245 -10738836
41424 -10738836 -9399288 -6233163 -3203091 193138 3769223 5231489 3542003 1171125
41416 1171125 858033 1915193 2023045 1294385 1804948 3567850 3767465 609028 -4171486
41407 -4171486 -7719978 -9473677 -10701243 -11430227 -9599880 -3774749 4208157 10174017
41399 10174017 11192910 7857009 3079733 -752714 -3132576 -4567359 -5285338 -4969812
41391 -4969812 -3296036 -498137 2450027 4327364 4675609 4224954 3936588 3758343 2826015
41382B826015k005895k268474j429091k21853L68353k53487j729258k446852p79602
41373g940144K636895M812408L604831L04729j937288j473971J052498M156695
41365E216653O096105M952946M69288m249690n090919j559135K652784M159732
41357A2647764L110371J307387o44707k714037l751658k759566j063723r09986
41349E221845k026000j848930L37621J749138J3583k946738l162250r8363K554466
41340b05628J974587j78071n76232J123699K498802K194485J096217q8024j813799
41331F026036l663850l748345j495312Q36155J078937J37937K69700J564498K130220
41322C135976J064779o11889j502234p60670J684180M036655K881077k872764
$$ plain form
41382 2826015 820120 -1448354 -2877445 -3099298 -2730945 -2984432 -4713690 -7160542 -7940144
41373 -7940144 -5303249 -490841 3113990 3418719 1481431 7460 1059958 5216653
41365 5216653 11312758 16265704 16734992 12485302 7394383 5835248 8488032 12647764
41357 12647764 15758135 17065522 16420815 13706778 9955120 7195554 6131831 5221845
41349 5221845 3195845 1346915 1684536 3433674 3447257 500519 -2661731 -2760094 -205628
41340 -205628 1768959 1590888 1014656 2138355 4637157 6831642 7927859 7839835 6026036
41331 6026036 2362186 -1386159 -2881471 -2045316 -966379 -828442 -558742 1005756 3135976
41322 3135976 4200755 3588866 2086632 1325962 3010142 7046797 9927874 7055110
41314G055110q975293r873260n673554j697771p16389K54995L636561N962082
41306a0027519K687673m188085p790282n006781L92858L434060L270156J979238
41298a5248682J050590O99061O94925L49029r17224j860466J32991N435240J0371364
41289G06828J0760717O481579J072027k387292l441525l125040k609955k793787
41281D663552l556631l462217j574287P84030J701123J579859K219404L408959
41273E763792L274688K106143K336960L716864K427312k689431o790333n480904
41265D665091j445074p0195r37895N39599M142561M236143q21153n017427l259887
41256B031763J575739L813733K932699K054445J806173N94748r43615n88493J090455
$$ plain form
41314 7055110 -1920183 -11793443 -17466997 -19164768 -19881157 -19626162 -15989601 -10027519
41306 -10027519 -7339846 -11527931 -19318213 -24324994 -23932136 -20498076 -17227920 -15248682
41298 -15248682 -14198092 -13499031 -12804106 -12455077 -13372301 -15232767 -15099776 -9664536 706828
41289 706828 11467545 17949124 19021151 16633859 13192334 10067294 7457339 4663552
41281 4663552 1106921 -2355296 -3929583 -3145553 -1444430 135429 2354833 5763792
41273 5763792 9038480 11144623 13481583 17198447 19625759 16936328 10145995 4665091
41265 4665091 3220017 3149822 2211927 2751526 6894087 11130230 10309077 5291650 2031763
41256 2031763 3607502 7421235 10353934 12408379 14214552 14809300 13865685 13277192 14367647
41247A4367647J091273j408396m019480m543022k726266P37554M151022M566836
41239A2217168Q16330l663778m200117p93235K366272K782306J630740K44768
41231A1400454j385975k278082o60028K414169L245526O34082k315819k825924
41223H228403j826165j389393j818040k710264l941846m150961j423835K831508
41215f200593M082102R39025k110119j007815J990509K271185J73196Q0067L314624
41206C532181O004173M357802p04571m914739n211087k599629r22161k351391
41198b809422m397779l125703R36032L220819K029247R82932K685364M205162
41190C726652K266952p65523n62087K191952L344849K065585J178367J692546
$$ plain form
41247 14367647 15458920 14050524 10031044 5488022 2761756 3499310 7650332 12217168
41239 12217168 13033498 9369720 5169603 4376368 6742640 9524946 11155686 11400454
41231 11400454 10014479 7736397 7076369 9490538 12736064 13370146 11054327 8228403
41223 8228403 6402238 5012845 3194805 484541 -3457305 -7608266 -9032101 -6200593
41215 -6200593 -2118491 -1179466 -3289585 -4297400 -2306891 -35706 137490 217557 3532181
41206 3532181 9536354 13894156 13189585 8274846 3063759 464130 -458031 -2809422
41198 -2809422 -7207201 -10332904 -9396872 -6176053 -4146806 -3163874 -478510 3726652
41190 3726652 5993604 5228081 4665994 6857946 10202795 12268380 13446747 15139293
41182A5139293J746123O55416l34441j214872l033896m636546l653292q07507
41174C860278P52955M68218N84230J352578O64916j036967n35979K142142K466379
41165A0718750j655261o103023o317144k982515O19495L138456M204563K690701
41157D314022p28235k530447j228874r5300j504407k224661R88220M525842K834221
41148D350381j899443k113740L209757O303856K289737l496858l775780J64098
41140E032008J477468j783302n008083m860381l235926k476661j360476J631880
41132a0583473M448340M364721K860452L595778N908594M624051k126550q642291
41124D449622q496294l344259n98874k912656m781996j159901M855556O517111
$$ plain form
41182 15139293 16885416 17540832 17206391 15991519 12957623 8321077 4667785 3860278
41174 3860278 4613233 5081451 5665681 7018259 7683175 6646208 6110229 8252371 10718750
41165 10718750 9063489 2960466 -3356678 -6339193 -5719698 -2581242 1623321 4314022
41157 4314022 3585787 1055340 -173534 -268834 -1773241 -3997902 -3009682 1516160 4350381
41148 4350381 2450938 337198 3546955 9850811 12140548 8643690 4867910 5032008
41140 5032008 6509476 4726174 -281909 -5142290 -8378216 -10854877 -12215353 -10583473
41132 -10583473 -6135133 -1770412 1090040 4685818 10594412 15218463 13091913 4449622
41124 4449622 -4046672 -7390931 -7989805 -10902461 -15684457 -16844358 -11988802 -5471691
41116e471691L027895M1098J020593K723574R66797k708027l370997M0941L379384
41107c50433L070399R9809k543907l526467k727602J35946L878006M993117J863200
41098D892068j610858o86711K644152J834803l862619p029133k794291L453794
41090c158795L700758j395817m573516k818645J16709J205678K005182M214710
41082g03736O393749O636517M945007K027957j102031k194433o4342K183026L88800
41073A8510514m096199n772742l298203j072411j434791j177564J820910M209060
41065G688574K863150P2468q19040o81331j549828k213889r78531O05460P18306
41056E705339O15771J262408M76436k349492k846989J843719P036042O808027
$$ plain form
41116 -5471691 -2443796 -2402698 -1382105 1341469 2308266 -399761 -3770758 -3729817 -350433
41107 -350433 2719966 2819775 275868 -3250599 -5978201 -5842255 -1964249 3028868 4892068
41098 4892068 3281210 2594499 5238651 7073454 3210835 -3818298 -6612589 -3158795
41090 -3158795 541963 -853854 -5427370 -8246015 -8129306 -6923628 -4918446 -703736
41082 -703736 5690013 12326530 17271537 19299494 18197463 16003030 15938688 18121714 18510514
41073 18510514 14414315 8641573 5343370 4270959 2836168 1658604 3479514 7688574
41065 7688574 10551724 10624192 9805152 9123821 7573993 5360104 4381573 4987033 5705339
41056 5705339 6321110 7583518 8059954 5710462 2863473 4707192 11743234 18551261
41048A8551261K966409J301646J916204N72901k409886k532980L13830J385421
41040B2064806m53491j022963J403330L373292K748877J628484J122101p25330
41032C0139106l854052m896521l202256k583311m653000n850403l693392o97644
41024G08527O45889J458834K191724M78334l171570l390890J725568N773953L064467
41015I484836k259928k506488J944575M391822K794117J562154K949386L586320
41007B1946794P74359l153211m632395l338317j309257k49146p17713k024313
40999G296801k524410j577088p54671j396103k077100q39891J304051K015499
40991A447088J747817K833563M945905N112034K564431K07783L11504J545148
$$ plain form
41048 18551261 21517670 22819316 24735520 25308421 22898535 20365555 20679385 22064806
41040 22064806 21611315 20588352 21991682 25364974 28113851 29742335 30864436 30139106
41032 30139106 26285054 21388533 18186277 15602966 10949966 5099563 1406171 708527
41024 708527 1354416 2813250 5004974 5483308 2311738 -1079152 646416 6420369 9484836
41015 9484836 7224908 4718420 6662995 11054817 13848934 15411088 18360474 21946794
41007 21946794 22721153 19567942 14935547 11597230 10287973 10038827 9321114 7296801
40999 7296801 4772391 3195303 2440632 1044529 -1032571 -1872462 -568411 1447088
40991 1447088 3194905 6028468 10974373 16086407 18650838 18858621 19170125 20715273
40983B0715273J584673M88152m7382N12034Q78974j79205j893313j799297J310835
40974B1570744M957429N301245K411615O91042K507196M207706J357285m253879
40966C8750383o598710l387651J600492L876872K671071k4777j890134j492377
40958C3505169M72562J089396j404863m509119m226766n83431K363152J858296
40950B8564396r14812l343822l728180j333064K843558N383693L654300k18882
40942C0907187j741515l47112L65811j130962k099169n68058J791826L577055
40934C0755063O165308R756501J0875711P444483L448403M499164J0331720J5410478
40926I8686831J6216997J4638015J4166047J5482776J6595656J5905715J4252351
$$ plain form
40983 20715273 22299946 22788098 22740716 23252750 24131724 23952519 22059206 20259909 21570744
40974 21570744 26528173 31829418 34241033 34932075 37439271 41646977 43004262 38750383
40966 38750383 32151673 28764022 30364514 34241386 36912457 36887680 34997546 33505169
40958 33505169 33977731 35067127 33662264 29153145 24926379 24342948 26706100 28564396
40950 28564396 27649584 24305762 20577582 19244518 22088076 27471769 31126069 30907187
40942 30907187 29165672 28818560 29184371 28053409 25954240 25386182 27178008 30755063
40934 30755063 36920371 46676872 57552583 64997066 68445469 72944633 83276353 98686831
40926 98686831 114903828 129541843 143707890 159190666 175786322 191692037 205944388
40919B05944388J3729455J4118674J1373079J857956j1765849k1726103k3441239
40912A90090361k0085867j7324491j6346501j4730078j1824655r616406r025874
40905I1136489q544623o820663m587363l740277n476874q863561j0604395p718611
40897C4780122j617404K375557J290654j782485k497303j315627j323668k085504
40889B7824342n58501K443094K144775k472560n686348k619102L689553O277322
40881C1042575L103116j666683l929926l542577k162377p14659P710j035972l197774
40872A7903433l634220p12362L089842L694026M54430l214342m217667k734452
40864A0628688k75652K852071O366319Q018338N559716M54617k892769k243324
$$ plain form
40919 205944388 219673843 233792517 245165596 247023552 235257703 213531600 190090361
40912 190090361 170004494 152680003 136333502 121603424 109778769 100162363 91136489
40905 91136489 82591866 75771203 71183840 67443563 61966689 53103128 42498733 34780122
40897 34780122 33162718 35538275 36828929 35046444 32549141 31233514 29909846 27824342
40889 27824342 27265841 29708935 31853710 29381150 23694802 21075700 24765253 31042575
40881 31042575 34145691 32479008 28549082 25006505 22844128 22129469 22137179 21101207 17903433
40872 17903433 14269213 13556851 16646693 20340719 20795149 17580807 13363140 10628688
40864 10628688 10353036 13205107 19571426 27589764 33149480 33604097 30711328 28468004
40856B8468004J30076J123945R44543J832673L777904L851192K80334m407508
40848C6001163n736338k524102J605870K718657J494667J918481N371348Q561156
40840D9410902Q358699O221891N616050O916587P839242P872837Q919893J1599985
40832A12756086J4078534J5217334J6323685J8968502K3076390K7610049L1180758
40825B59211338L1865958K8601399K2729440J5886873O951396n681893j9199029
40818C40365482k7873980k9926637k8769294k6912851k3468957j8842615j6335773
40811A68235375j6581449j5652029j1897045r517227j1487962j4041914j2892507
40804G6165242j0082238r172236q312881m672119j637283l837125p862210o350778
$$ plain form
40856 28468004 28598080 29722025 30666568 32499241 36277145 40128337 40408671 36001163
40848 36001163 30264825 27740723 29346593 32065250 33559917 35478398 40849746 49410902
40840 49410902 57769601 63991492 69607542 76524129 84363371 92236208 101156101 112756086
40832 112756086 126834620 142051954 158375639 177344141 200420531 228030580 259211338
40825 259211338 291077296 319678695 342408135 358295008 365246404 359564511 340365482
40818 340365482 312491502 282564865 253795571 226882720 203413763 184571148 168235375
40811 168235375 151653926 136001897 124104852 114587625 103099663 89057749 76165242
40804 76165242 66083004 56910768 48597887 43925768 42288485 38451360 30589150 24238372
40796B4238372J45939L859156K000158j90252O86411J604966L67614l43861Q49904
40787C3218407O65603k480415m701374k923840K57444J493795J467263J281797
40779B8278680q48025n178642p281728l922086J473761L493662J767324n17610
40771A7265336j938637k767586k537485j505712j802347l657832l578599J50004
40763c72858L592587K863131K33364m4863J263689O70848j621128l014412l729413
40754a59055n124106n139499j553078K098986N67417m117470m594328Q74537O058879
40745a1087717O145146L193159Q98474k05435n09475L67367J102230n89994l037268
40736c723513j628793L263177N017767M50617m630058l665646J395743L891169
$$ plain form
40796 24238372 24384311 28243467 30243625 30053373 30739784 32344750 32712364 32368503 33218407
40787 33218407 33884010 31403595 26702221 23778381 24035825 25529620 26996883 28278680
40779 28278680 27430655 22252013 14970285 11048199 12521960 16015622 17782946 17265336
40771 17265336 15326699 12559113 10021628 8515916 6713569 3055737 -522862 -372858
40763 -372858 3219729 6082860 6316224 6271361 7535050 8205898 6584770 3570358 -159055
40754 -159055 -5283161 -10422660 -11975738 -9876752 -9309335 -13426805 -18021133 -17146596 -11087717
40745 -11087717 -4942571 -1749412 -850938 -1056373 -1565848 -1198481 -96251 -686245 -3723513
40736 -3723513 -5352306 -2089129 2928638 3379255 -1250803 -4916449 -3520706 370463
40728C70463K044547l44304n73618N89261K098076L750539M437103K947372O01409
40719A5920848Q3446J456766J899762j79785k845664l110696m47422K647242L003418
40710A8427915k29608m514024o196202m099614l28161K361462K918271J964550
40702A0304589R89609J482363L066623K803034j194717n716309n426252k99011
40694F009929L872500L617561K018255K483801K952825L06588l232207l271851
40686A4757401m65985P92832m24193j059954k85825p41085k847117l053805L10609
40677F982878L617407K884199r19489l986501m681247l971357k706069r93957
40669c774136P27317K057227L421909M957278N343877L313236j99744k886713
$$ plain form
40728 370463 2415010 2070706 1497088 2086349 4184425 7934964 12372067 15319439 15920848
40719 15920848 16004294 17461060 19360822 19181037 16335373 13224677 12777255 15424497 18427915
40710 18427915 18198307 13684283 7488081 3388467 3060306 5421768 8340039 10304589
40702 10304589 11294198 12776561 15843184 18646218 17451501 11735192 6308940 6009929
40694 6009929 9882429 13499990 15518245 18002046 20954871 21261459 18029252 14757401
40686 14757401 14291416 15084248 14660055 13600101 13314276 12573191 9726074 6672269 6982878
40677 6982878 10600285 13484484 12564995 8578494 3897247 -74110 -2780179 -3774136
40669 -3774136 -3046819 -989592 2432317 7389595 12733472 16046708 15846964 12960251
40661A2960251l770631l729938l449922k353793j15419J915189J948698J11055
40653C515490j577308j800299j360406j253471o60278J402657L369512K748561
40645D384458M33043J78476K711117L768054L64965m026863m061734j32015K698327
40636F317828K152967P09925L55478j45256j882751l574969m029932l662962k489094
40627f248766J27403K648283K023489j167034k177168Q81815L478365J549360
40619A115747j792564j142604K384395K948618n94431l104747j573994M47912
40611a311668j002147m141360m521109j347492K454341M691736N419030M910365
40603E151696K862671k19107k555965k510655l0737L000940L697681O32722l888106
$$ plain form
40661 12960251 9189620 5459682 2009760 -344033 -459452 1455737 3404435 3515490
40653 3515490 1938182 137883 -1222523 -2475994 -3136272 -1733615 1635897 4384458
40645 4384458 4817501 4995977 7707094 11475148 11840113 7813250 3751516 3619501 6317828
40636 6317828 8470795 9180720 9536198 9390942 7508191 3933222 -96710 -3759672 -6248766
40627 -6248766 -6121363 -3473080 -1449591 -2616625 -4793793 -3911978 -433613 1115747
40619 1115747 -676817 -1819421 564974 3513592 2919161 -185586 -1759580 -1311668
40611 -1311668 -2313815 -6455175 -10976284 -12323776 -9869435 -5177699 241331 5151696
40603 5151696 8014367 7795260 5239295 2728640 2697903 5698843 9396524 10029246 6141140
40594F141140n287399j670255L613317N576770K938413j296063l559326k544984
40586C911613O99943L565152L307860l09919m029454m551351k607603j465362
40578a479121j806108j060128J774675L953832L104626O40064r68921j738671
40570B420248k500195k160501L7084J413379r49695m859790n166458j214308K221420
40561a0758816K217899J494662L089456N342609N128478K953825J433533Q93308
40553A1794954n5810j119845r72176l84005j417880l885907n491159n221741l939039
40544a0692608j969183R68623L503898L353979Q62872q35001J31110K407066L935226
40535A665982M054262K642982k11630k914994l266294j567651l69804l35817O67509
$$ plain form
40594 6141140 853741 -816514 2796803 8373573 11311986 10015923 6456597 3911613
40586 3911613 4611556 8176708 11484568 11174649 7145195 2593844 -13759 -1479121
40578 -1479121 -3285229 -4345357 -2570682 1383150 4487776 5127840 4158919 2420248
40570 2420248 -79947 -2240448 -2203364 -789985 -1739680 -6599470 -11765928 -12980236 -10758816
40561 -10758816 -8540917 -7046255 -3956799 1385810 6514288 9468113 10901646 11794954
40553 11794954 11739144 10619299 9647123 9263118 7845238 3959331 -1531828 -6753569 -10692608
40544 -10692608 -12661791 -11693168 -8189270 -4835291 -3972419 -4807420 -4676310 -2269244 1665982
40535 1665982 5720244 8363226 8151596 5236602 1970308 402657 32853 -302964 364545
40526C64545L118123L911358J223227j763573j228782J433082J814703p86860
40518H085823k720912j754422R4739J11877j588788l140560l423421k371890k80441
40509f987995K150334L936084M560386M022469K242501n31066k861903l125744
40501C405066j641829m50554n40148o85508K00684R14118m48502l390485n070429
40492g707587l630024k37035K802436M863098O568641P161045M621225o78813
40484A3762986m584867l617810L49729K390236Q09666j742333l101976l864026
40476D01605m153365k161799K019265M635171L278137Q47607J200003L223153
40468I289777K992857r546k906763m375672n333968n407790l118010M34940K220240
$$ plain form
40526 364545 3482668 7394026 8617253 6853680 5624898 7057980 8872683 8085823
40518 8085823 5364911 3610489 3705228 3817105 2228317 -912243 -4335664 -6707554 -6987995
40509 -6987995 -4837661 -901577 3658809 7681278 9923779 9392713 6530810 3405066
40501 3405066 1763237 1312683 772535 87027 287711 1201829 753327 -2637158 -7707587
40492 -7707587 -11337611 -11574646 -8772210 -3909112 2659529 9820574 14441799 13762986
40484 13762986 9178119 5560309 5910038 8300274 9109940 7367607 4265631 401605
40476 401605 -3751760 -5913559 -3894294 740877 4019014 4866621 6066624 9289777
40468 9289777 12282634 12273088 9366325 4990653 -343315 -5751105 -8869115 -8434175 -6213935
40459f213935J872415J700349J971218O16664j797997j723784J283199K943764
40451F51893Q77059j831117k368014k707666m668576n019910o22818M918694N560747
40442e209708J805788m44834R22483K099297O75645o13157P71787K690897J857662
40433D555860j191768l249456k703842o55322J007539J213452J84171r55551j601185
40424c396102k393601l406820k651962J224066N413295N364874J003927k739649
40416a581972k457367n8165J267615J498989J975567K005703K23410k409587l653798
40407c189605k963451j353365N13120K210078K850539K442899K550709L576308
40399F637232L009154j040751n906296o963081l507556P48115K615742K158223
$$ plain form
40459 -6213935 -4341520 -2641171 -669953 -53289 -1851286 -3575070 -2291871 651893
40451 651893 1528952 -302165 -2670179 -5377845 -10046421 -15066331 -15689149 -10770455 -5209708
40442 -5209708 -3403920 -3848754 -2926271 -826974 -151329 -764486 7301 2698198 4555860
40433 4555860 3364092 114636 -2589206 -3244528 -2236989 -1023537 -839366 -1794917 -3396102
40424 -3396102 -5789703 -9196523 -11848485 -10624419 -5211124 153750 1157677 -1581972
40416 -1581972 -4039339 -4097504 -2829889 -1330900 644667 2650370 2873780 464193 -3189605
40407 -3189605 -6153056 -7506421 -6993301 -4783223 -1932684 510215 3060924 6637232
40399 6637232 9646386 8605635 2699339 -4263742 -7771298 -7023183 -4407441 -2249218
40391b249218P57619p80083j982336k758463l684479m448646k908043J766958
40383a6286691O065179N683505J543455j548445j945920k398310l968737l925963
40375a6781927j257556Q62658O40511Q10527L020715L924501J066760j881624
40367i595435r42115J222496L65379r21956K480171P667335O375180j622462o677663
40358a649070l201659K634839L160678J96099K41962L796085N726886L484604
40350A4390424n28573l257637l460925j255369J406217J422457j362231k951050
40342D403313j042996Q95547p18359l031227j086199L574061M696953Q76147k582966
40333E984274j643038J790310L898109L179946K1948l804385m811048j184470
$$ plain form
40391 -2249218 -1491599 -2271682 -4254018 -7012481 -10696960 -15145606 -18053649 -16286691
40383 -16286691 -10221512 -4538007 -2994552 -4542997 -6488917 -8887227 -12855964 -16781927
40375 -16781927 -18039483 -17176825 -16536314 -15725787 -12705072 -8780571 -7713811 -9595435
40367 -9595435 -10537550 -9315054 -8949675 -9871631 -7391460 275875 6651055 5028593 -1649070
40358 -1649070 -4850729 -2215890 944788 1140887 1382849 5178934 10905820 14390424
40350 14390424 13861851 10604214 7143289 5887920 7294137 8716594 7354363 4403313
40342 4403313 3360317 4255864 3537505 506278 -579921 2994140 7691093 8567240 5984274
40333 5984274 4341236 6131546 10029655 13209601 13231549 9427164 4616116 3431646
40325C431646L237641K899326j341899l141978l38151K110909M97969k206888
40317E148575k116388l63689J73155l20553n23812q38061j186437J07495K264079
40308B344364J301788l272114n863873l057962M84757m70029l173238k157454
40300a3863761J162060J569520l49555K45093L072315L174744K57054m96163K480334
40291b748359M840321M376650L996467M721351K919155k483836o428332m997206
40283D196211j020356R59353N20116q92544l096214m769906k911687J658513L204082
40274b152432m71395l487667o02418M393763M790504J265082n92005J30000j33059
40265C140373j467387l20654K950424L512900J09118k570365j414329O13143m9729
$$ plain form
40325 3431646 6669287 9568613 8226714 5084736 4746585 6857494 7355463 5148575
40317 5148575 3032187 2668498 2841653 2521100 1997288 1159227 -27210 80285 2344364
40308 2344364 3646152 374038 -5489835 -8547797 -8063040 -8533069 -11706307 -13863761
40300 -13863761 -12701701 -11132181 -11481736 -11236643 -8164328 -4989584 -4732530 -5228693 -2748359
40291 -2748359 2091962 6468612 10465079 15186430 18105585 15621749 9193417 4196211
40283 4196211 3175855 4135208 4655324 3762780 666566 -4103340 -7015027 -5356514 -2152432
40274 -2152432 -2623827 -6111494 -6713912 -2320149 2470355 3735437 3143432 3273432 3140373
40265 3140373 1672986 1352332 4302756 7815656 7924774 5354409 3940080 4553223 4503494
40256D503494k120264k474848j223261p20400j662938k751929k921989k063167
40248a1435302n32754P84506Q32758l20787j299450r45687O46641K488027L197932
40239f584116J745657j030828k435117j055753J062333J379232Q01850J907371
40231d209371M127467M152180J108058k035050k750009j659061m16544J89004
40223a493326n31072k769507m350550k438306J923554M230395K668194M85426
40215b275192P16604K076310K208470J582317J436897Q79019r35876k389995k292712
40206A005842k542250m415578m934233j381784K789634K081063k038524k390628
40198a1826458K956321P113664M306035j867683m130596j575906J058306J845553
$$ plain form
40256 4503494 2383230 -91618 -1314879 -2035279 -3698217 -6450146 -9372135 -11435302
40248 -11435302 -11968056 -11183550 -10350792 -10671579 -11971029 -12916716 -12270075 -9782048 -6584116
40239 -6584116 -4838459 -5869287 -8304404 -9360157 -8297824 -6918592 -6116742 -4209371
40231 -4209371 -81904 4070276 5178334 3143284 393275 -1265786 -1682330 -1493326
40223 -1493326 -2024398 -4793905 -9144455 -11582761 -9659207 -5428812 -2760618 -2275192
40215 -2275192 -1558588 517722 2726192 4308509 5745406 6624425 5688549 3298554 1005842
40206 1005842 -1536408 -5951986 -10886219 -12268003 -9478369 -7397306 -9435830 -11826458
40198 -11826458 -8870137 -1756473 2549562 681879 -3448717 -5024623 -3966317 -2120764
40190b120764L463522O498820O704419J481071m927006o395610k843803O19135
40182B479784J245470J105410J945694K091480K51145j371376o38076O57381k13684
40173G553228k226242k548658j433242j064020q41044J420674M148755L182300
40165H191751j229681m022166l246797k819986n004636n890064k229779K301738
40157a3949620K735303P23363J210801M111197N211536L451856J408477k56145
40149D646768k908186n103670l625416M00298K091318K20700j369339o32682P4373
40140f205836k78174J007955M422225N453850J397347l613175m389570j764275
40132c969653J46748M15672P41028J146612O56937K66704J176894J868584P67050
$$ plain form
40190 -2120764 1342758 7841578 14545997 16027068 11100062 4704452 1860649 2479784
40182 2479784 3725254 4830664 6776358 8867838 9118983 7747607 7109531 7766912 7553228
40173 7553228 5326986 2778328 1345086 281066 -559978 860696 5009451 8191751
40165 8191751 6962070 2939904 -306893 -3126879 -8131515 -14021579 -16251358 -13949620
40157 -13949620 -11214317 -10490954 -9280153 -5168956 42580 3494436 4902913 4646768
40149 4646768 1738582 -3365088 -6990504 -6590206 -4498888 -4278188 -5647527 -6280209 -6205836
40140 -6205836 -6484010 -5476055 -1053830 4400020 5797367 2184192 -2205378 -3969653
40132 -3969653 -3822905 -3407233 -2666205 -1519593 -862656 -595952 580942 2449526 3216576
40123C216576j78771J257297K786540R47196k295524j874902J976139L523559
40115I358110M12846k945877k673282q68326q97545j680945n39245J341363N94433
40106B101532k580842m152607j615311L007441N757063M696722J185010j716039
40098F682969k111200j007992p44381j716038k070684r87864k21198j174035k396513
40089e746936j912527n81303q23245k744681l834296k451458K49004K096203K203969
40080a3545270J230352L67196L16298P38000Q42892P13535J132333J668754N62650
40071e973260k209097l509493r22213L206222M377175J910191p48739j438818
40063e308032j448191j651285l49039K999638N096673K877542j713914m087788
$$ plain form
40123 3216576 3037805 4295102 7081642 8028838 5733314 3858412 5834551 9358110
40115 9358110 9770956 6825079 4151797 3283471 2385926 704981 165736 1507099 2101532
40106 2101532 -479310 -4631917 -6247228 -3239787 2517276 7213998 8399008 6682969
40098 6682969 4571769 3563777 2819396 1103358 -967326 -1955190 -2176388 -3350423 -5746936
40089 -5746936 -7659463 -8240766 -9064011 -11808692 -15642988 -18094446 -17845442 -15749239 -13545270
40080 -13545270 -12314918 -11947722 -11631424 -10893424 -10050532 -9336997 -8204664 -6535910 -5973260
40071 -5973260 -8182357 -11691850 -12614063 -9407841 -5030666 -3120475 -3869214 -5308032
40063 -5308032 -6756223 -8407508 -8756547 -5756909 -660236 2217306 503392 -3584396
40055c584396k928867p96159M16397J451640K996878L849841K736110J99006k078120
40046B262330k686102j143011J495737K831654J635018k8972O57463K642131J785079
40037I451327k931904p036343o257935j945656J733825L690470N453166O182326
40029H339276K710213m517477r338225o386366J965197P730600O072936M3023
40021F619177l752170k612606M07379J393631K41277n26617J09819J032703J776068
40012D688661K900112L198465Q4013n476939p993444m652513m40364j480721n424523
40003a4597253m474844K452874P400926N073037L77019K01849K971114K321584
39995A726306k004248l783768k71515L732941L320905K27961n23612K222838M866849
$$ plain form
40055 -3584396 -6513263 -7309422 -6893025 -5441385 -2444507 1405334 4141444 4340450 2262330
40046 2262330 -423772 -1566783 -71046 2760608 4395626 4366654 5024117 7666248 9451327
40037 9451327 6519423 -516920 -6774855 -8720511 -6986686 -3296216 2156950 8339276
40029 8339276 11049489 6532012 -2806213 -9192579 -7227382 503218 6576154 6619177
40021 6619177 2867007 254401 661780 2055411 2296688 1770071 1879890 2912593 4688661
40012 4688661 7588773 10787238 10871251 5394312 -2599132 -7251645 -7692009 -9172730 -14597253
40003 -14597253 -19072097 -16619223 -9218297 -4145260 -3768241 -3566392 -595278 1726306
39995 1726306 -277942 -4061710 -4333225 -600284 2720621 2948582 2424970 4647808 9514657
39986I514657M073270M22596k880549l727485l010938k781729l066271j962489
39978c418938P57777K369322J139175o48439k47677R33082o4859j918717n40484
39969a639758L626931M962177Q45985m109452m590628j564343M06684j68126j208617
39960c439147j146758j39910J441583K941184L095097K094617K181377L721822
39952A0749865L119059j878044p101565o781533j926454J330550J096911J509714
39944A18503M450146N749750K441626j551065j237013J659657J561278k443180
39936A0749702n693504m839286j451149J421168K760051K759077J274613j392648
39928E588024l719001m292772l317029k116143j527947j150887r3256J609943
$$ plain form
39986 9514657 13587927 14010523 11129974 7402489 4391551 1609822 -1456449 -3418938
39978 -3418938 -2661161 -291839 847336 198897 -48780 884302 819443 -1099274 -1639758
39969 -1639758 1987173 6949350 7795335 3685883 -904745 -2469088 -2062404 -2230530 -3439147
39960 -3439147 -4585905 -4725815 -3284232 -343048 2752049 4846666 7028043 10749865
39952 10749865 13868924 11990880 4889315 -1892218 -3818672 -2488122 -1391211 118503
39944 118503 4568649 10318399 12760025 11208960 9971947 11631604 13192882 10749702
39936 10749702 5056198 216912 -1234237 186931 2946982 5706059 6980672 5588024
39928 5588024 1869023 -2423749 -5740778 -7856921 -9384868 -10535755 -10629011 -9019068
39920i019068K680864K291652J551442J856449K114989P2286l196419l369162
39912e016967P54671M212596K349727k282309l605147p92169J549794J284913
39904a544891J326522L421582M690558K762094l8448p38608l64923j026187j393606
39895G094093P48068L534217L092326m02710k990437k925580k312768k471665
39887C365544j834004J93838R23294j736622n562067o666185m350499j022417
39879a6689118J688314M216595O496814O477019K674696k647765m778706j904285
39871d466436K080732K040726j538668k995748L68507M001263K552056k410578
39863c68146n248150m664185l923208l584408m74796M953201O804379K488104
$$ plain form
39920 -9019068 -6338204 -4046552 -2495110 -638661 1476328 1548614 -1647805 -5016967
39912 -5016967 -4262296 -49700 2300027 17718 -3587429 -4379598 -2829804 -1544891
39904 -1544891 -218369 3203213 7893771 10655865 10617417 9878809 9513886 8487699 7094093
39895 7094093 7842161 11376378 14468704 14065994 11075557 8149977 5837209 3365544
39887 3365544 1531540 1725378 2648672 912050 -4650017 -11316202 -15666701 -16689118
39879 -16689118 -15000804 -10784209 -4287395 2189624 4864320 2216555 -2562151 -4466436
39871 -4466436 -2385704 -344978 -1883646 -4879394 -4510887 -509624 2042432 -368146
39863 -368146 -5616296 -10280481 -14203689 -17788097 -18262893 -13309692 -6505313 -4017209
39855d017209k326875j887038J293151J616418r6554J002691M343830M325977
39847D254391k23144l969765l425484j095140L35648J862977L687276K716568
39839D143327j707930m576737k262424J236307K16992l726784m391155p38173
39831a1806577K101056J217953m71572K02J319757J345604Q87753J395456J727884
39822b282484J35280k173947k155484Q45783L876111L530671m91651n003969o271777
39813i991467l538486N12081L024810L825463M208199M310594L655576L153297
39805I160067L734141L568996J77807m433706m835617J0107L939604J559692m106415
39796H774676n817316j889783K584165L360726J330882j053745l119740m111150
$$ plain form
39855 -4017209 -6344084 -8231122 -6937971 -5321553 -5418107 -4415416 -71586 4254391
39847 4254391 4031247 61482 -3364002 -4459142 -4123494 -2260517 1426759 4143327
39839 4143327 2435397 -2141340 -4403764 -3167457 -2950465 -6677249 -11068404 -11806577
39831 -11806577 -9705521 -8487568 -8959140 -8958938 -7639181 -6293577 -5405824 -4010368 -2282484
39822 -2282484 -2147204 -4321151 -6476635 -5630852 -1754741 1775930 1284279 -3719690 -9991467
39813 -9991467 -13529953 -13017872 -9993062 -6167599 -1959400 2351194 6006770 9160067
39805 9160067 12894208 16463204 16641011 12207305 7371688 7381795 11321399 12881091 8774676
39796 8774676 2957360 1067577 3651742 7012468 8343350 7289605 4169865 58715
39788E8715j902759L474775P504263N772989j11952m200750l521769r26182k54797
39779E892533j513570k441359k667023l553442m608138l097648J752552O412501
39771c823594O861347L621304Q46842P96129J515506M50761j852791k991344k138911
39762C285249o08879J84449k07273j713987l707646m632648l098774L27492L312843
39753f859174M017173K666006R27746K18626M28732l9153k370812m989897m307016
39744a0307769P95676O287919P038804L252221K83635J463209L764789K373709
39736A4952193k409531n442877l307948J838163N340618N052164K300570p06764
39728A7616588k778761l448409k612341j243192j225627l083578m503375k899947
$$ plain form
39788 58715 -1844044 1630731 9134994 14907983 14796031 10595281 7073512 6147330 5892533
39779 5892533 4378963 1937604 -729419 -4282861 -8890999 -11988647 -10236095 -3823594
39771 -3823594 3037753 6659057 7505899 8302028 9817534 10268295 8415504 5424160 3285249
39762 3285249 2676370 2860819 2653546 939559 -2768087 -7400735 -10499509 -10172017 -6859174
39753 -6859174 -2842001 -175995 751751 970377 1399109 1359956 -1010856 -6000753 -10307769
39744 -10307769 -9512093 -3224174 3814630 7066851 7350486 8813695 12578484 14952193
39736 14952193 12542662 7099785 3791837 5630000 10970618 16022782 18323352 17616588
39728 17616588 14837827 11389418 8777077 7533885 6308258 3224680 -1278695 -4178642
39720d178642O50173K240298N19673j265836j95977J983191K224487J525186K660616
39711F163169L928188P36754n944583q650032l691266K839399L661172O10392
39703c46807N27019L679693L528895k167600p127890n649808k92499K917743K658079
39694b273175J705546J331562Q05037P41283K479184M571888L788002o4589l521134
39685I563604m234938l473070l020699k481349j209408m84181j538008k997196
39677i875245k654927r09298n8508m91233m4069K367400M707062M635099K725333
39668D01614J249796Q61296M09016m83101q14792l65231l42683j036994p03919
39659h24998J739437M297115M036516R39461k162025l144643k452450j631820
$$ plain form
39720 -4178642 -3528469 -1288171 -768498 -2034334 -2230311 -247120 1977367 3502553 6163169
39711 6163169 10091357 10828111 4883528 -3766504 -7457770 -4618371 -957199 -346807
39703 -346807 180212 3859905 7388800 5221200 -1906690 -7556498 -7848997 -4931254 -2273175
39694 -2273175 -567629 763933 1568970 2310253 4789437 9361325 13149327 13084738 9563604
39685 9563604 5328666 1855596 -1165103 -3646452 -4855860 -5340041 -6878049 -9875245
39677 -9875245 -12530172 -13439470 -13497978 -13989211 -14033280 -11665880 -6958818 -2323719 401614
39668 401614 1651410 2512706 2921722 2438621 1623829 1258598 915915 -121079 -824998
39659 -824998 914439 5211554 9248070 10187531 8025506 4880863 2428413 796593
39651G96593j646456k540459l167121j474799K948613O696310N494708K4516l910024
39642C221881k554417R09677R34570k858785n665611m078331L54821M100892N376329
39633b58974M269477J576304j106686j735860J20278K285646K300292L72341j086667
39624F736151p36963J38241n3046m52294R89417L510048L138682j937823p384789
39615C947624p249194k008552J621700k81351l916156l940880q35536J398974
39607a1263371J904806K712832L504308J720060k245479m567810l410787r75390
39599a2620831N73858J498088J969357R92193r14611j533671o91138n45831j010288
39590a2282874P92491M789383O525470M185436K085275L371112M149357J13701
$$ plain form
39651 796593 -849863 -3390322 -6557443 -8032242 -5083629 1612681 7107389 7131905 3221881
39642 3221881 667464 1577141 2511711 -347074 -6012685 -10091016 -9736195 -5635303 -258974
39633 -258974 4010503 5586807 4480121 2744261 2864539 5150185 7450477 7822818 6736151
39624 6736151 5999188 6137429 6084383 5632089 6621506 10131554 13270236 11332413 3947624
39615 3947624 -3301570 -5310122 -3688422 -3969773 -7885929 -11826809 -12662345 -11263371
39607 -11263371 -9358565 -6645733 -3141425 -1421365 -3666844 -8234654 -11645441 -12620831
39599 -12620831 -12046973 -10548885 -8579528 -7587335 -8501946 -10035617 -10726755 -11272586 -12282874
39590 -12282874 -11490383 -6701000 -175530 4009906 6095181 9466293 13615650 13729351
39582A3729351n153452m997373j02581K816137J366172l72786K19822R68273L25039
39573H798602j8253N76136K41156j032208q63441J73034j614337n694042n853285
39564e286638N09976P196492P613575L512037M84021p85709k872456m587630k336802
39555C446866K778696N156407J970412m073754q803939r605820n539830J261196
39547a3409766N279683L136891j403880k335496L6197P52688q49267o51691J694295
39538g750346J292819k926778m924198r19120M293456M924030K608045K025492
39530a376600K796670J730375l90920n69172L33321n29938j873611l36979K596464
39521B379610K323944o86917j249585J519298K487382n75977l213977k187659
$$ plain form
39582 13729351 8575899 3578526 3475945 6292082 7658254 7285468 7505290 8473563 8798602
39573 8798602 8780349 9356485 9597641 8565433 7701992 7875026 6260689 566647 -5286638
39564 -5286638 -4776662 2419830 10033405 13545442 14029463 13243754 10371298 5783668 3446866
39555 3446866 6225562 11381969 13352381 9278627 474688 -9131132 -14670962 -13409766
39547 -13409766 -8130083 -4993192 -6397072 -8732568 -8696371 -7943683 -8792950 -9444641 -7750346
39538 -7750346 -6457527 -9384305 -14308503 -15227623 -10934167 -6010137 -3402092 -1376600
39530 -1376600 1420070 3150445 2759525 2190353 2523674 1993736 120125 -216854 2379610
39521 2379610 4703554 4016637 2767052 4286350 6773732 6197755 2983778 796119
39513G96119o82504j738297k498077j07985J895313n93080m079670k382676K834490
39504f556367M299945R98095m41629K743107M723982J188697l001048j595187
39496B359595K869305L150244j513898m971647l811967j224906p72353j723292
39488e638919k119301k001973j460923P98878M336339N475360K050580k445571
39480a005530k785386R92618L604441J310341l895372p162970n929348j761769
39472a6632975J614370J858294L63854P00997L934228O656958N334967J418800
39464E249493m40470J250585L212568K343416p06707l677895n417574n126933
39456c313517j919294K705246M553891J701793k203923k610501l81751O6733k142247
$$ plain form
39513 796119 113615 -1624682 -4122759 -4230744 -2335431 -2928511 -7008181 -9390857 -6556367
39504 -6556367 -2256422 -1258327 -1699956 1043151 5767133 6955830 3954782 2359595
39496 2359595 5228900 8379144 6865246 1893599 -1918368 -3143274 -3915627 -5638919
39488 -5638919 -7758220 -9760193 -11221116 -10422238 -6085899 -610539 1440041 -1005530
39480 -1005530 -3790916 -2798298 806143 2116484 -1778888 -8941858 -14871206 -16632975
39472 -16632975 -15018605 -13160311 -12796457 -12095460 -8161232 -1504274 3830693 5249493
39464 5249493 4809023 6059608 9272176 11615592 10908885 7230990 1813416 -3313517
39456 -3313517 -5232811 -2527565 2026326 3728119 1524196 -1086305 -1468056 -1401323 -3543570
39447c543570l303071j326367J142299J207854o4028p3158J148614J653396R34760
39438b223271K40374K99119O34030P94808Q65517Q85490O04283l99245k543765
39429h42660n317153o467518l846290J257985M565918L808450J371406M28988
39421e040874O54432J73223k48659J567049M736484N737063L424649M32828r39749
39412A0496446j295275j802142k105214j821558j784312k379221k434668r22635
39404d048579J758784M795697P340344P493693L543543k801124p077829p217275
39396C787254n379082l584135j031580K368238L819231K189180J059923L155867
39388F384896N015619K197903k911583m354690j827544j86500p07020m2506J819895
$$ plain form
39447 -3543570 -6846641 -8173008 -7030709 -5822855 -5886883 -5960041 -4811427 -3158031 -2223271
39438 -2223271 -1982897 -1683778 -1049748 -254940 610577 1496067 2100350 1701105 -842660
39429 -842660 -6159813 -12627331 -16473621 -15215636 -10649718 -6841268 -5469862 -5040874
39421 -5040874 -4386442 -4213219 -4461878 -2894829 1841655 7578718 11003367 11436195 10496446
39412 10496446 9201171 7399029 5293815 3472257 1687945 -691276 -3125944 -4048579
39404 -4048579 -2289795 2505902 9846246 17339939 20883482 18082358 11004529 3787254
39396 3787254 -1591828 -5175963 -6207543 -3839305 -20074 2169106 3229029 6384896
39388 6384896 11400515 13598418 10686835 6332145 4504601 4318101 3611081 3568575 5388470
39379E388470M08747m324369n694104q68136L204964N4603n866166n881011j41527
39370a3718529L685668K539333Q51465J606567K120509M53027m19396J969795
39362i11561M653377L455040p99026l759535l498626j890650q42841J25547K099074
39353a369201M201069M062758R40275k552969l168095j352440p62395k719479
39345b720477l907271j595890J743428K459729J898181L808896O968511O125994
39337A4781101O79169l282062j510343K661676L756108J242171j824350l720249
39329A2783221m180509k475004R08583K676246M43379l291126m117451j609401
39321A137938P72088Q34037k62298p25300l59873j2849n37875k076763l218420
$$ plain form
39379 5388470 5797217 1472848 -4221256 -5089392 -1884428 -1829825 -7695991 -13577002 -13718529
39370 -13718529 -10032861 -7493528 -6642063 -5035496 -2914987 -2461960 -2881356 -911561
39362 -911561 3741816 7196856 6397830 2638295 -860331 -2750981 -3593822 -3468275 -1369201
39353 -1369201 2831868 6894626 7834901 5281932 2113837 761397 -998 -2720477
39345 -2720477 -6627748 -8223638 -6480210 -4020481 -2122300 1686596 8655107 14781101
39337 14781101 15460270 12178208 10667865 13329541 17085649 18327820 16503470 12783221
39329 12783221 8602712 6127708 7036291 9712537 10155916 6864790 2747339 1137938
39321 1137938 1910026 2744063 2481765 1756465 1396592 1383743 845868 -1230895 -4449315
39312d449315j916154J442001L481561K177219o8728q3246J137856L30153k366850
39303c15503l267923o25538K853309L540925P99475k939408m402686k038595K126791
39294d269153L893848J690208j293822j605193k50016j73703j033618k78042J971494
39285a347997L361846L659511M083070L059044j931996q138527r066384l609331
39277i930764J912138K793669J446815J270688R62892r82931j535167J676481
39269b386179M636340K517891k084704k954533j86914N98705j823088k378900
39261d061382J294100M599764L351948N0493o55247J153360K025589P27933j091877
39252G394681k247585k939395l169281k645708j803193j225547o56677J17117
$$ plain form
39312 -4449315 -6365469 -4923468 -1441907 735312 666584 583338 1721194 2051347 -315503
39303 -315503 -3583426 -4208964 -1355655 2185270 2984745 45337 -4357349 -6395944 -4269153
39294 -4269153 -375305 1314903 21081 -1584112 -1834128 -2007831 -3041449 -3319491 -1347997
39285 -1347997 2013849 5673360 9756430 12815474 10883478 2744951 -6321433 -9930764
39277 -9930764 -8018626 -5224957 -3778142 -2507454 -1544562 -2527493 -4062660 -2386179
39269 -2386179 2250161 4768052 2683348 -271185 -458099 140606 -1682482 -4061382
39261 -4061382 -2767282 1832482 5184430 5234923 4579676 5733036 7758625 8486558 7394681
39252 7394681 5147096 2207701 -961580 -3607288 -5410481 -6636028 -7292705 -7175588
39244g175588L78757j30866r1997J406605K786113J883731p68143k657496k780303
39235g149187k134591j034764J264770L768259L565134J37924k578744r17084
39227e078283L300482N028284K642711o36554j774752j237566o98644n44381j026548
39218b5251l022480n632452n607930j787552K100425K139506j83173p05134P52918
39209a1971123J028119N1024J124815M081264L911564j254035n822038m213937
39201a3064347J153301L802382K349025Q46177J547373K359632J460245J90187
39193F43975M71228K305135M500133N586960L951325m58160m535695m775276j809639
39184E879986M16021J34490n76297j25175j8462j574666k942995j777229R46641
$$ plain form
39244 -7175588 -6796831 -6927697 -7019694 -5613089 -2826976 -943245 -1711388 -4368884 -7149187
39235 -7149187 -9283778 -10318542 -9053772 -5285513 -1720379 -1582455 -4161199 -5078283
39227 -5078283 -1777801 3250483 5893194 5256640 3481888 2244322 1545678 1001297 -25251
39218 -25251 -3047731 -8680183 -14288113 -16075665 -13975240 -11835734 -12018907 -12724041 -11971123
39209 -11971123 -10943004 -10891980 -9767165 -5685901 -1774337 -3028372 -8850410 -13064347
39201 -13064347 -11911046 -8108664 -5759639 -4913462 -3366089 -1006457 453788 643975
39193 643975 1115203 3420338 7920471 13507431 17458756 17000596 12464901 7689625 5879986
39184 5879986 6296007 6430497 5854200 5729025 5710563 4135897 1192902 -584327 362314
39175C62314K170619Q70323j013103j275778L82155K571305L434497J849962j645194
39166G707100n062264o519544n616706l315453q83298R78587K358599L535725
39158f817254M041068K873336J30769k370620l027801k289067j526793r61177
39150i947539j44355L50493l18135j212099l89089K145066M000141L251198N27970
39141a736349j763051j465943J370766L608932J652317l343881n110793j91481
39133f979483N886981N015996j959006n808576j680012M579345N259054P77976
39125E092275k881780k882108j393166j063268k403292m284139m339527o42341
39117a4797346M654593N902945J289471l064851m96808O588883R315315L929017
$$ plain form
39175 362314 2532933 3403256 2390153 1114375 1496530 4067835 7502332 9352294 7707100
39166 7707100 2644836 -3874708 -9491414 -12806867 -13690165 -12711578 -10352979 -6817254
39158 -6817254 -2776186 97150 227919 -2142701 -5170502 -7459569 -8986362 -9947539
39150 -9947539 -10091894 -9741401 -10059536 -11271635 -11660724 -9515658 -5515517 -2264319 -1736349
39141 -1736349 -3499400 -4965343 -3594577 14355 1666672 -1677209 -6788002 -6979483
39133 -6979483 -1092502 3923494 1964488 -3844088 -5524100 -944755 4314299 5092275
39125 5092275 2210495 -671613 -2064779 -3128047 -5531339 -9815478 -14155005 -14797346
39117 -14797346 -10142753 -4239808 -2950337 -6015188 -6511996 76887 9392202 13321219
39109A3321219l881012o735579l538098J507533M407770L965933J116457k155361
39101H008862l908535l490285j783174k69753M2568n33255l48048J519178K992387
39092B229945J113976k713296k915014K427800P286917N161728j706312n524191
39084E361553l788310j272389j471174k133958p54840J043686J340357J579378
39076i5697L028815L250389L8011l754104l541076K69855K837781J571090j332732
39067B272332k987861l056003k234720o38765Q74628L72069k023294k618615J369516
39058h670713O832204P711336L153072j058372q90469O8404l113413p742198o784014
39049a0494163k07215L851374Q95733l528886k882654P06589J191757j372993
$$ plain form
39109 13321219 9440207 2704628 -833470 674063 5081833 9047766 10164223 8008862
39101 8008862 4100327 610042 -1173132 -1442885 -1400317 -1933572 -2281620 -762442 2229945
39092 2229945 3343921 630625 -2284389 143411 7430328 12592056 10885744 5361553
39084 5361553 1573243 300854 -1170320 -3304278 -4059118 -3015432 -1675075 -95697
39076 -95697 2933118 6183507 6221518 2467414 -1073662 -803807 2033974 3605064 2272332
39067 2272332 -715529 -3771532 -6006252 -6645017 -5770389 -5398320 -7421614 -10040229 -8670713
39058 -8670713 -1838509 5872827 9025899 7967527 7077058 7145462 4032049 -3710149 -10494163
39049 -10494163 -10701378 -6850004 -5954271 -9483157 -12365811 -11659222 -10467465 -11840458
39041a1840458k049654L10549K185612K045828J860987K370181K329600K185748
39033f01607L218630L482232K61940l766215l111319J596478L893579J447238
39025F420956j310197j809562k874105n156305m126857J346851N036468L074173
39017F01422N29415K341624M565005J866325k451258k405571k37444j866425n172588
39008b229495l224551K641627L762644j532038m906832j593307K390997N86715
39000d104240m006322m388523N38773O279660R057834P896469L518190j502225
38992A3289616l859381l077687j771470j389181q98838l59906j401182k858152
38984b326181j006664L626131N006822N02213m045181k618680J996182K966238
$$ plain form
39041 -11840458 -13890112 -13579563 -11393951 -9348123 -7487136 -5116955 -2787355 -601607
39033 -601607 2617023 6099255 6361195 2594980 -516339 1080139 4973718 6420956
39025 6420956 5110759 3301197 427092 -4729213 -8856070 -7509219 -2472751 601422
39017 601422 1130837 3472461 8037466 9903791 7452533 5046962 4809518 2943093 -2229495
39008 -2229495 -5454046 -2812419 950225 -581813 -5488645 -7081952 -4690955 -4104240
39000 -4104240 -8110562 -12499085 -11960312 -5680652 3377182 11273651 14791841 13289616
38992 13289616 9430235 6352548 4581078 3191897 2293059 1933153 531971 -2326181
38984 -2326181 -3332845 293286 5300108 5802321 1757140 -861540 1134642 4100880
38976D100880j73535k004144m19923Q04460j260492m469645n268486l132156k12860
38967a2035901J195444L24379j281674q81723J992290M118947K647434o34710
38959d555514j712431j002J509002J212463N83694P11435M47855j007256k361668
38950e173422k325645j364343j88652J609799M065326N568715M732682K618585
38942I543045J551890J995382J822934j016081n662907q608704o974455j520974
38934h869870L916663O073678M869026K371964K56926r78610j279126q95501o60807
38925D804343j180647j795328j368679j04809M71481l94314j518172j250848L96180
38916a940793J742270J465649N0400j100726j495269j654035j577829n31047J110494
$$ plain form
38976 4100880 3927345 1923201 1503278 2307738 1047246 -3422399 -8690885 -11823041 -12035901
38967 -12035901 -10840457 -10516078 -11797752 -12679475 -10687185 -6568238 -3920804 -4555514
38959 -4555514 -6267945 -6268947 -4759945 -3547482 -2963788 -2252353 -1804498 -2811754 -5173422
38950 -5173422 -7499067 -8863410 -9052062 -7442263 -3376937 2191778 6924460 9543045
38942 9543045 11094935 13090317 14913251 13897170 8234263 -374441 -7348896 -8869870
38934 -8869870 -4953207 1120471 5989497 8361461 8618387 7639777 6360651 5465150 4804343
38925 4804343 3623696 1828368 459689 354880 826361 432047 -1086125 -2336973 -1940793
38916 -1940793 -198523 1267126 1317526 216800 -1278469 -2932504 -4510333 -5041380 -3930886
38907c930886J462671k9038r09054R60452L588514L239233P9766j813790k86824
38898B361044K354553L328061K565409P92164k097062m900609m619326n93270
38890h09036L473466M019762J738438r67724l623257n900945n286564m41265N228047
38881b569078P263963N771485L741606J772001j305473m253169m685781l470486
38873B265068l114954k655221O67844N132951N712030J988361q57719j80607P50867
38864I708620n49395j492481J6149Q61187k203867o575022p297175l911305J34556
38855a1308733K750931M157684M340895L164592J852547J382720O00679j475072
38847E466243l069135k240267m50064k99472j009319K36571L076840L754199M12335
$$ plain form
38907 -3930886 -2468215 -2497253 -3406307 -2445855 1142659 4381892 4461658 2647868 2361044
38898 2361044 4715597 8043658 10609067 11401231 9304169 4403560 -215766 -809036
38890 -809036 2664430 6684192 8422630 7454906 3831649 -2069296 -7355860 -7797125 -2569078
38881 -2569078 4694885 10466370 14207976 15979977 14674504 10421335 5735554 2265068
38873 2265068 -849886 -3505107 -2837263 2295688 8007718 9996079 9138360 8957753 9708620
38864 9708620 9159225 7666744 7682893 8544080 6340213 -234809 -7531984 -11443289 -11308733
38855 -11308733 -8557802 -4400118 -59223 3105369 4957916 6340636 6941315 5466243
38847 5466243 2397108 156841 -293223 -592695 -1602014 -1365443 1711397 5465596 5877931
38838E877931m298262o512244m892090o96117L920350O994856P398339N060928
38830A2853691N98772m507876p366431n452651j54450L618087L137818J044523
38822C771483P89802J506943N26142j348613j215417O45014J241189L8020o67967
38813E286596m41856j395441l670168m485690k748948p05865J86964J085448K012169
38804d876791N87502l112653m503827o67095M663348O078955L923215K615747
38796D708401L439808L642646K026633P69147J059080R40993j028770l173541
38788A2384397l611334l211893l404854l052183l45137L184209L680069L08255
38780E931529l142472l256659j358870q02101j550365n87646K638700M758519
$$ plain form
38838 5877931 1579669 -4932575 -9824665 -10520782 -6600432 394424 7792763 12853691
38830 12853691 13452463 8944587 1578156 -3874495 -4028945 -410858 2726960 3771483
38822 3771483 4561285 6068228 6594370 5245757 4030340 4675354 5916543 5954563 5286596
38813 5286596 4844740 3449299 -220869 -4706559 -7455507 -8161372 -7974408 -6888960 -4876791
38804 -4876791 -4289289 -7401942 -11905769 -12572864 -7909516 -1830561 2092654 4708401
38796 4708401 8148209 11790855 13817488 14586635 15645715 16586708 15557938 12384397
38788 12384397 8773063 5561170 2156316 -895867 -1241004 1943205 5623274 5931529
38780 5931529 2789057 -467602 -1826472 -2628573 -4178938 -4766584 -2127884 2630635
38772B630635L611803J572426J453398J902553K57879k060073j388467J702424
38764I682578K518983o04812l829028l960749k645514k009979n08377L050708
38756A693810M929404J052977n746349q461098n378463j671344j075089j159501
38748a5815653J163838L952220L452775K30364j526928L81968M077741O430197
38740B346522N705811J974437k916353n923832n204525k010851R97835K809825
38732b221131L928919M015915K090643r23608k431349j670198o42457m72439O21249
38723B295544L696157N720148L075334k625275n864268m527900k263304k291264
38715b784828k475555N66607N044298N831572K020392j568987j354827K13264
$$ plain form
38772 2630635 6242438 7814864 9268262 11170815 11428694 9368621 7980154 9682578
38764 9682578 12201561 11596749 7767721 3806972 1161458 -848521 -1356898 1693810
38756 1693810 6623214 7676191 1929842 -6531256 -11909719 -13581063 -14656152 -15815653
38748 -15815653 -14651815 -10699595 -7246820 -7016456 -8543384 -8161416 -4083675 2346522
38740 2346522 8052333 10026770 7110417 1186585 -4017940 -6028791 -5030956 -2221131
38732 -2221131 1707788 5723703 7814346 6890738 4459389 2789191 2146734 1674295 2295544
38723 2295544 5991701 11711849 14787183 12161908 6297640 1769740 -493564 -2784828
38715 -2784828 -5260383 -4693776 350522 6182094 8202486 6633499 5278672 5491936
38707E491936q79765l671683l616761L82205L868097K616625j963382m866729
38699b639457l532700k7786K243041K146586Q23819l78213q38431k03429J631740
38690g74830L789103M530604K861380j40344k123295j749682K6221J096006M79078
38681G994241p72063j005944L625R00599N36611p08781j628321j577274p75452
38672B967241O0393j57364k130727m538534m334156m70463L604456L681333N83599
38663g34222r05628Q56435K175698L86447j677883o35722J543529R51619j396448
38654E63825j276019J406830K557136J112207N24231J823557J070525l435671
38646D346621o636172l721903K140832M068793J046872j860874j646951n00813
$$ plain form
38707 5491936 4612171 940488 -2676273 -2294068 1574029 4190654 2227272 -2639457
38699 -2639457 -6172157 -6199943 -3956902 -1810316 -986497 -1364710 -2203141 -2406570 -774830
38690 -774830 3014273 7544877 10406257 10265913 8142618 6392936 6419157 7515163 7994241
38681 7994241 7222178 6216234 6219859 7120458 7657069 6948288 5319967 3742693 2967241
38672 2967241 3027634 2870270 739543 -3798991 -8133147 -8603610 -4999154 -1317821 -734222
38663 -734222 -1639850 -783415 1392283 1778730 100847 -534875 1008654 1960273 563825
38654 563825 -712194 694636 3251772 4363979 4888210 6711767 7782292 4346621
38646 4346621 -2289551 -6011454 -3870622 198171 1245043 -615831 -2262782 -2763595
38638b763595o27908o71787J070470L216002L179598O41100k399328l858368k988566
38629e202382o55618J215877J455532J112148J938194L441862L179919M24990
38621F910522k328288k638539j431908j441212l084262l724023j347084K395373
38613f689421L984215K465307O19873J064825K572691K046960n71976k003044
38605C489430o17963J138583Q90349K20296J656336L581047J786515m083424q909312
38596h48143p950490k328480K457809K492518p65025k314954P11453N327761N923186
38587B705635J447662l085121l548640j919133j663220j287101K510223P330720
38579B491025P068990J348548l352341l328515k303775m012536n999497m621657
$$ plain form
38638 -2763595 -3391503 -4063290 -2992820 223182 3402780 4043880 1644552 -2213816 -5202382
38629 -5202382 -5858000 -4642123 -3186591 -2074443 -136249 3305613 6485532 6910522
38621 6910522 4582234 1943695 511787 -929425 -4013687 -7737710 -9084794 -6689421
38613 -6689421 -2705206 -239899 379974 1444799 4017490 6064450 5492474 3489430
38605 3489430 2871467 4010050 4900399 5120695 6777031 10358078 12144593 8061169 -848143
38596 -848143 -8798633 -11127113 -8669304 -6176786 -6941811 -9256765 -8545312 -3217551 2705635
38587 2705635 4153297 1068176 -2480464 -4399597 -6062817 -7349918 -4839695 2491025
38579 2491025 9560015 10908563 7556222 4227707 1923932 -2088604 -8088101 -12709758
38571a2709758j235925J152552L161560N855399O080612J088847m798331m857335
38563f262379o6977K232271l26461k136898N36463L361306J017608m490030o823538
38554a2958635l604169J957288N678447N640417K479444r59824j615327K66836
38546c115523J332443L03267O1781K192986K999267q42126n486065m482252J110768
38537e925454L589964K02867k656653M53188N558848N582391R45292k024030j185206
38528D541207p82270l391067n441862l015882J953872M354344K556104l14272
38520D60174o77023J896780M723541M444826K86037m332159m848720j155109J775635
38511B573982L66600k615185k132659J779934M205624K422697p54998j524028
$$ plain form
38571 -12709758 -13945683 -12793131 -9631571 -3776172 2304440 3393287 -1405044 -6262379
38563 -6262379 -6329356 -4097085 -4423546 -6560444 -6023981 -2662675 -1645067 -6135097 -12958635
38554 -12958635 -16562804 -14605516 -8927069 -3286652 -807208 -1767032 -3382359 -3115523
38546 -3115523 -1783080 -1479813 -1418032 774954 3774221 2932095 -2553970 -7036222 -5925454
38537 -5925454 -2335490 -2132623 -4789276 -4336088 1222760 6805151 7750443 5726413 4541207
38528 4541207 3758937 367870 -5073992 -8089874 -6136002 -1781658 774446 460174
38520 460174 -216849 1679931 6403472 10848298 11134335 6802176 1953456 798347 2573982
38511 2573982 2940582 325397 -1807262 -27328 4178296 6600993 5845995 4321967
38503D321967o6609P07448l61561j355505o5806K924091M304804J546102l652003
38494H302928o684831n562035l254842k868726k782623J54641M377798N207022
38486c110668K266198J00619M85339m17809m752026p966337n220708J080661M924421
38477a2610310N060157M591695M164993J492475k525666l013228J801205P020071
38469E981392P051255K346438k112254l099045j708334o71819r95687j319799
38461E472147J8111K468368L436511J621086q21289r79628P26711J243577o67035
38452A2518559k988322l662651k961253j924050m45382J833333L946533M162847
38444A0479614J829170j732375m037155l529844j266684K73496M96325J207701
$$ plain form
38503 4321967 4255358 4962806 4601245 3245740 3179934 6104025 10408829 11954931 8302928
38494 8302928 1618097 -3943938 -7198780 -10067506 -12850129 -12695488 -8317690 -3110668
38486 -3110668 -844470 -743851 -258512 -676321 -5428347 -13394684 -18615392 -17534731 -12610310
38477 -12610310 -7550153 -2958458 1206535 2699010 173344 -2839884 -1038679 5981392
38469 5981392 13032647 15379085 13266831 10167786 8459452 7787633 6791946 5472147
38461 5472147 5490258 7958626 11395137 13016223 12194934 11215306 11942017 13185594 12518559
38452 12518559 9530237 5867586 2906333 982283 536901 2370234 6316767 10479614
38444 10479614 12308784 10576409 6539254 3009410 1742726 2016222 2512547 3720248
38436C720248K834879K627260q76924l950708k187303K452648L805400N02412
38428H927912k247790r29972J209934j51716l738796n034860k645817Q89027K893200
38419h28878K526388L84775j672493j568128M05855J488051K83943j273121j251580
38410a505188n63964n75173n32015J56401k36268k511613l617826p41969L571991
38401f555624M551265K116436K73529L79459j67131k307333l244221j426122M77456
38392e902286k45172k232534k365845J1581L139727N268834N346978L045684j34619
38383E932348j297464N08148K567379J797133j299665l675871l789638k666333
38375a923963j421341J56568K203753L617163L214361J279396q30273k246544
$$ plain form
38436 3720248 6555127 9182387 8305463 4354755 2167452 4620100 8425500 8927912
38428 8927912 6680122 5750150 6960084 6808368 3069572 -1965288 -4611105 -3722078 -828878
38419 -828878 1697510 2082285 409792 -1158336 -752481 735570 1019513 -253608 -1505188
38410 -1505188 -2069152 -2644325 -3176340 -3019939 -3256207 -5767820 -9385646 -10127615 -6555624
38401 -6555624 -2004359 112077 385606 765065 597934 -1709399 -4953620 -6379742 -5902286
38392 -5902286 -6147458 -8379992 -10745837 -10734256 -7594529 -2325695 3021283 6066967 5932348
38383 5932348 4634884 5143032 7710411 9507544 8207879 4532008 742370 -1923963
38375 -1923963 -3345304 -3188736 -984983 2632180 5846541 7125937 6295664 4049120
38367D049120l080361l480170k975355j164000J402277L584625M591790L916557
38359F844483R36267l932393p724415o702352r13620M556218M747604N30578k669767
38350d327397j602486J200998J100459k616112n556513l320203K759642O294688
38342f066924L295973k375398l562413P56584M378441L014047j8772M8826J946967
38333A417331J645950j21810M58693K730820K150925j626245l644616j872454
38325A138594m14790k115265l627375j416104K131793K912474J640069J541108
38317A790504K419428J829067J06490n04237k87177r98541j517582O18665L900947
38308G357564M075510R05678j209117k64323N76591j017293k452152r72310J358235
$$ plain form
38367 4049120 968759 -2511411 -5486766 -6650766 -5248489 -1663864 2927926 6844483
38359 6844483 7780750 3848357 -3876058 -10578410 -11492030 -6935812 -2188208 -1657630 -4327397
38350 -4327397 -5929883 -4728885 -3628426 -6244538 -11801051 -15121254 -12361612 -6066924
38342 -6066924 -2770951 -5146349 -8708762 -7952178 -3573737 -559690 -578462 -529636 1417331
38333 1417331 3063281 2941471 3400164 6130984 8281909 6655664 3011048 1138594
38325 1138594 723804 -1391461 -5018836 -6434940 -4303147 -1390673 249396 1790504
38317 1790504 4209932 6038999 6145489 5641252 5354075 4355534 2837952 3456617 7357564
38308 7357564 11433074 12338752 11129635 10865312 11441903 10424610 7972458 7000148 8358383
38299H358383J054109j183425k099283j276015r94391j713501j550307j58916
38291D36654M14377o03584j179206K86633K549593L594552L169324J981484J52874
38282A0802701j976613k902423j541458R88101K462799J799825n33745l128005
$$ plain form
38299 8358383 9412492 8229067 6129784 4853769 3859378 2145877 595570 436654
38291 436654 851031 247447 -931759 -645126 1904467 5499019 8668343 10649827 10802701
38282 10802701 8826088 5923665 4382207 5370308 7833107 9632932 9099187 5971182
$$ [...]
##END NTUPLES=NMR SPECTRUM
##END=
