##TITLE=31P Pdec_LR-785-R3-C2-1 
 CDCl3, 32 sc
 17.2.2025
##JCAMPDX= 6.0         $$ Bruker NMR JCAMP-DX V2.0
##DATA TYPE= NMR SPECTRUM
##DATA CLASS= NTUPLES
##ORIGIN= UXNMR, Bruker Analytische Messtechnik GmbH
##OWNER= root
$$ XWIN-NMR		Version 3.5
$$ Mon Feb 17 15:17:26 2025 Russian Standard Time (UT+4h)  new_Human@DPX200
##.OBSERVE FREQUENCY= 81.013821
##.OBSERVE NUCLEUS= ^31P
##.ACQUISITION MODE= SIMULTANEOUS
##.ACQUISITION SCHEME= undefined
##.AVERAGES= 32
##.DIGITISER RES= 17
##SPECTROMETER/DATA SYSTEM= spect
##.PULSE SEQUENCE= zgpg30
##.SOLVENT NAME= CDCl3
##.SHIFT REFERENCE= (INTERNAL, CDCl3, 0, 198.062)
##AUDIT TRAIL= $$ (NUMBER, WHEN, WHO, WHERE, WHAT)
$$ ##TITLE= Audit trail, XWIN-NMR		Version 3.5
$$ ##JCAMPDX= 5.01
$$ ##ORIGIN= Bruker BioSpin GmbH
$$ ##OWNER= new_Human
$$ C:/Bruker/XWIN-NMR/data/yarkov/nmr/P31/2/pdata/1/auditp.txt
$$ ##AUDIT TRAIL=  $$ (NUMBER, WHEN, WHO, WHERE, WHAT)
(   1,<2025-02-17 15:06:10.65 +0400>,<new_Human>,<DPX200>,
      <created by zg, POWCHK disabled, PULCHK disabled
       configuration hash MD5:
       00 E9 B6 7A A2 85 ED C7 34 08 36 98 17 FE 4E 26
       data hash MD5: 32K
       91 D8 9F 23 BE 26 53 A1 77 5F 08 D4 80 B8 FB 47>)
(   2,<2025-02-17 15:06:18.42 +0400>,<new_Human>,<DPX200>,
      <Start of raw data processing
       efp BC_mod = 2 LB = 1.5 FT_mod = 6 PKNL = 1 PHC0 = 1719.217 PHC1 = 150.6954 SI = 64K 
       data hash MD5: 64K
       BC 39 6C B9 E7 83 99 BD C1 66 50 C8 2B C0 99 5D>)
(   3,<2025-02-17 15:09:18.06 +0400>,<new_Human>,<DPX200>,
      <pk PHC0 = 33.6522 PHC1 = 0 
       data hash MD5: 64K
       EF B3 91 50 BC 55 C2 9B 12 67 EB C9 E4 7E 26 7C>)
$$ ##END=
$$ 
$$ hash MD5
$$ 3B F9 77 92 ED 9D 8D DC E9 98 6A D2 BD AF 45 78
##$RELAX= 
##$RELAX= 
##$RELAX= 
##$RELAX= 
##$RELAX= 
##$RELAX= 
##$RELAX= 
##$RELAX= 
$$ Bruker specific parameters
$$ --------------------------
##$DU= <C:/Bruker/XWIN-NMR>
##$EXPNO= 2
##$NAME= <P31>
##$PROCNO= 1
##$TYPE= <nmr>
##$USER= <yarkov>
##$AMP= (0..31)
100 100 100 100 100 100 100 100 100 100 100 100 100 100 100 100 100 100 
100 100 100 100 100 100 100 100 100 100 100 100 100 100 
##$AQSEQ= 0
##$AQ_mod= 1
##$AUNM= <au_zg>
##$AUTOPOS= <>
##$BF1= 81.014009
##$BF2= 200.13
##$BF3= 200.13
##$BF4= 200.13
##$BF5= 200.13
##$BF6= 200.13
##$BF7= 200.13
##$BF8= 200.13
##$BYTORDA= 1
##$CFDGTYP= 0
##$CFRGTYP= 5
##$CHEMSTR= <none>
##$CNST= (0..31)
1 1 145 1 1 1 1 1 1 1 1 1 1 1 1 1 1 1 1 1 1 1 1 1 1 1 1 1 1 1 1 1 
##$CPDPRG= <waltz16>
##$CPDPRG1= <>
##$CPDPRG2= <waltz16>
##$CPDPRG3= <>
##$CPDPRG4= <mlev>
##$CPDPRG5= <mlev>
##$CPDPRG6= <mlev>
##$CPDPRG7= <mlev>
##$CPDPRG8= <mlev>
##$CPDPRGB= <>
##$CPDPRGT= <>
##$D= (0..31)
0 1 0 0 0 0 0 0 0 0.06 0 0.03 2e-05 3e-06 0 0 0.0002 0 0 0 0 0 0 0 0 0 
0 0 0 0 0 0 
##$DATE= 1739790370
##$DBL= (0..7)
120 120 120 11 120 120 24 19 
##$DBP= (0..7)
150 150 150 150 150 150 150 150 
##$DBP07= 0
##$DBPNAM0= <>
##$DBPNAM1= <>
##$DBPNAM2= <>
##$DBPNAM3= <>
##$DBPNAM4= <>
##$DBPNAM5= <>
##$DBPNAM6= <>
##$DBPNAM7= <>
##$DBPOAL= (0..7)
$$ [...]
##$SUBNAM2= <"">
##$SUBNAM3= <"">
##$SUBNAM4= <"">
##$SUBNAM5= <"">
##$SUBNAM6= <"">
##$SUBNAM7= <"">
##$SUBNAM8= <"">
##$SUBNAM9= <"">
##$SW= 400.765351723535
##$SWIBOX= (0..15)
0 1 3 0 0 0 0 0 0 0 0 0 0 0 0 0 
##$SW_h= 32467.5324675325
##$TD= 32768
##$TD0= 1
##$TE= 0
##$TE2= 300
##$TE3= 300
##$TEG= 300
##$TL= (0..7)
0 120 53 12 22 120 120 120 
##$TP= (0..7)
150 150 150 150 150 150 150 150 
##$TP07= 0
##$TPNAME0= <>
##$TPNAME1= <>
##$TPNAME2= <>
##$TPNAME3= <>
##$TPNAME4= <>
##$TPNAME5= <>
##$TPNAME6= <>
##$TPNAME7= <>
##$TPOAL= (0..7)
0.5 0.5 0.5 0.5 0.5 0.5 0.5 0.5 
##$TPOFFS= (0..7)
0 0 0 0 0 0 0 0 
##$TUNHIN= 0
##$TUNHOUT= 0
##$TUNXOUT= 0
##$USERA1= <user>
##$USERA2= <user>
##$USERA3= <user>
##$USERA4= <user>
##$USERA5= <user>
##$V9= 5
##$VALIST= <valist>
##$VCLIST= <CCCCCCCCCCCCCCC>
##$VD= 0
##$VDLIST= <DDDDDDDDDDDDDDD>
##$VPLIST= <PPPPPPPPPPPPPPP>
##$VTLIST= <TTTTTTTTTTTTTTT>
##$WBST= 1024
##$WBSW= 4
##$XGAIN= (0..3)
0 0 0 0 
##$XL= 0
##$YL= 0
##$YMAX_a= 4443
##$YMIN_a= -5151
##$ZGOPTNS= <>
##$ZL1= 120
##$ZL2= 120
##$ZL3= 120
##$ZL4= 120
##$ABSF1= 0
##$ABSF2= 0
##$ABSG= 0
##$ABSL= 0
##$ALPHA= 0
##$AQORDER= 0
##$ASSFAC= 0
##$ASSFACI= 0
##$ASSFACX= 0
##$ASSWID= 0
##$AUNMP= <proc_1d>
##$AZFE= 0.1
##$AZFW= 0.5
##$BCFW= 0
##$BC_mod= 2
##$BYTORDP= 0
##$COROFFS= 0
##$CY= -3
##$DATMOD= 1
##$DC= 0
##$DFILT= <>
##$DTYPP= 0
##$F1P= 0
##$F2P= 0
##$FCOR= 1
##$FTSIZE= 65536
##$FT_mod= 6
##$GAMMA= 0
##$GB= 0
##$INTBC= 1
##$INTSCL= 9.790993e-09
##$ISEN= 30
##$LB= 1.5
##$LEV0= 0
##$LPBIN= 0
##$MAXI= 10000
##$MC2= 0
##$MEAN= 0
##$ME_mod= 0
##$MI= 50
##$NCOEF= 0
##$NC_proc= -8
##$NLEV= 6
##$NOISF1= 182.463
##$NOISF2= 159.3651
##$NSP= 0
##$NTH_PI= 0
##$NZP= 0
##$OFFSET= 198.0616
##$PC= 4
##$PHC0= 1752.869
##$PHC1= 150.6954
##$PH_mod= 1
##$PKNL= yes
##$PPARMOD= 0
##$PSCAL= 0
##$PSIGN= 0
##$REVERSE= no
##$SF= 81.0140089999434
##$SI= 65536
##$SIGF1= 159.3651
##$SIGF2= -187.1042
##$SINO= 113.3802
##$SIOLD= 16384
##$SREGLST= <1H.CDCl3>
##$SSB= 0
##$STSI= 65536
##$STSR= 0
##$SW_p= 32467.5324675325
##$SYMM= 0
##$S_DEV= 0
##$TDeff= 32768
##$TDoff= 0
##$TI= <>
##$TILT= no
##$TM1= 0
##$TM2= 0
##$TOPLEV= 0
##$USERP1= <user>
##$USERP2= <user>
##$USERP3= <user>
##$USERP4= <user>
##$USERP5= <user>
##$WDW= 1
##$XDIM= 65536
##$YMAX_p= 524625749
##$YMIN_p= -136458414
$$ End of Bruker specific parameters
$$ ---------------------------------
##NTUPLES= NMR SPECTRUM
##VAR_NAME=  FREQUENCY,     SPECTRUM/REAL,   SPECTRUM/IMAG
##SYMBOL=    X,             R,               I
##VAR_TYPE=  INDEPENDENT,   DEPENDENT,       DEPENDENT
##VAR_FORM=  AFFN,          ASDF,            ASDF
##VAR_DIM=   65536,         65536,           65536
##UNITS=     HZ,            ARBITRARY UNITS, ARBITRARY UNITS
##FACTOR=    0.49542278885378, 1,            1
##FIRST=     16045.7642231865, 0,            0
##LAST=      -16421.768244346, 0,            0
##MIN=       -16421.768244346, -136458414,   0
##MAX=       16045.7642231865, 524625749,    0
$$ Real data points
##PAGE= N=1
##DATA TABLE= (X++(R..R)), XYDATA
$$ [...]
44547b124064k26400J053669J141779k87294j250216o71157r2669p75972j258066
44538d490390J42675K078492K008923L29958j30921J394044K368344Q90502j444330
44529C147297j960288n58072O40238L79237n67794r89602o41076M6283O71753
44520A67976R58595P35927J45415m42133q34697j018271p35426L42476J707255
44511A027117J942270L82581j491861j478990L93526J654665P78207o39892m64046
44502B103577N03000j05845j965323k107632K29409J813002J93100k245989j629909
44493c212610J651600L585211K246090j57987j045388m86176K11504N58654M57076
44484C807974l90986j451191j252123M85837J862913J133556r71449k358717k142330
$$ y = [-2124064, -2350464, -1296795, -155016, -442310, -1692526, -2363683, -2456352, -3232324, -4490390, -4347715, -2269223, -260300, 69658, -61263, 1332781, 3701125, 4591627, 3147297, 1187009, 628937, 1269175, 1648412, 1080618, 91016, -550060, -503777, 167976, 1126571, 1862498, 2007913, 1565780, 731083, -287188, -1022614, -680138, 1027117, 2969387, 3351968, 1860107, 381117, 774643, 2429308, 3207515, 2567623, 2103577, 2606577, 2500732, 535409, -1572223, -1342814, 470188, 663288, -1582701, -3212610, -1561010, 2024201, 4270291, 4112304, 3066916, 2580740, 2792244, 3350898, 3807974, 3416988, 1965797, 713674, 1199511, 3062424, 4195980, 3224531, 865814, -1276516]
44475a276516j049413l1374M33622J72683n79346j192256j330138j210152q41046
44466f903936K03485J726514K503487J703535O7403r81776p97383L66130J840786
44457b71755K630518J956464L39695p85893j010728j246699j571537o03879J783822
44448A220008L080948J466970j028310j207770M93877Q17235j055583k204215
44440A583160o19998J651425J550921p54332k487356k038671m57154M16143M799
44431a151063q36814r49781k0930J113837J325391M04554p10895q73898K21523
44422a478076J666873J884528J43110k115868k352629j18042J808099P84080j978276
44413a756201k853943o26715K157055K893816J957775J157462Q40367j0722j615074
$$ y = [-1276516, -2325929, -2357303, -1923681, -1750998, -2330344, -3522600, -4852738, -6062890, -6903936, -6700451, -4973937, -2470450, -766915, -699512, -1681288, -2478671, -2112541, -271755, 2358763, 4315227, 4654922, 3869029, 2858301, 1611602, 40065, -563814, 1220008, 4300956, 5767926, 4739616, 3531846, 4025723, 4842958, 3787375, 1583160, 963162, 2614587, 4165508, 3411176, 923820, -1114851, -1572005, -1155862, -1151063, -1987877, -2937658, -2958588, -1844751, -519360, -114806, -825701, -1699599, -1478076, 188797, 2073325, 2216435, 100567, -2252062, -2370104, -562005, 222075, -1756201, -4610144, -5236859, -3079804, -185988, 1771787, 2929249, 3769616, 3758894, 2143820]
44404B143820k736731k217990m63723Q79928P24603j32243k2891J136528J532039
44395H43340L27862o13088M52764J935304J099584j217041j320306J557286L533472
44386F599177J558970k244692l830067k583657r83280m73987l48572L9405M04249
44377a862454O95302J168987J260824o977k306280l887145l372927r76622J851533
44368g435759L353855K575445L52282j309057j472319j098530j024958m91701
44360f550742J072300K226131J429438j76392j39141J582539K535498J429253
44352C408884k85709r24117p43766q67410j492395j994884j840074q66408N35231
44343e070648J370329J096000O49294J198562K009482J244662r13305j918999
$$ y = [2143820, -592911, -2810901, -3274624, -2394696, -1670093, -1802336, -1825227, -688699, 843340, 1171202, 558114, 1010878, 2946182, 4045766, 2828725, 1508419, 3065705, 6599177, 8158147, 5913455, 2083388, -500269, -1483549, -1957536, -2306108, -2266703, -1862454, -1167152, 1835, 1262659, 1255682, -1050598, -4937743, -8310670, -9287292, -7435759, -4081904, -1506459, -1154177, -2463234, -3935553, -5034083, -6059041, -6550742, -5478442, -3252311, -1822873, -1999265, -2138406, -555867, 1979631, 3408884, 3123175, 2199058, 1455292, 587882, -904513, -2899397, -4739471, -5605879, -5070648, -3700319, -2604319, -1955025, -756463, 1253019, 2497681, 1584376, -334623]
44335c34623m51587J514105J555964K11713k01130P96317J363249K52067j524596
44326C181479k260345j539396j68994R40640J223848M59144r03836j682772r83814
44317a734046O08927J426169N61617j109678k090378j939197j219446k94352Q11297
44308d979087J561282J188684L7374n95862l38154j77808n17416l39105P31724
44299c428368J155148j90753j761289j365194N25557J594140J172321O89148R51928
44290f57362J288108J410275J817732K016447O49331j886723l068973j505365
44282F3470J157230K516234K012125M39130j348295k197021r63312J519453K378982
44273E577996K20541k633361l085783j234350M30487P50965P09513J086771J476143
$$ y = [-334623, -786210, 727895, 2283859, 2495572, 2294442, 3090759, 4454008, 4706075, 3181479, 921134, -618262, -787256, 153384, 1377232, 1836376, 932540, -750232, -1734046, -1125119, 301050, 862667, -247011, -2337389, -4276586, -5496032, -5790384, -4979087, -3417805, -2229121, -2191747, -2787609, -3125763, -3303571, -3820987, -4160092, -3428368, -2273220, -2463973, -4225262, -5590456, -5064899, -3470759, -2298438, -1609290, -657362, 630746, 2041021, 3858753, 5875200, 6524531, 4637808, 1568835, 63470, 1220700, 3736934, 5749059, 6188189, 4839894, 2642873, 1679561, 3199014, 5577996, 5798537, 3165176, 79393, -1154957, -724470, 26495, 736008, 1822779, 3298922]
44264C298922J607876J770919J657194M25992j584486k588531j542204L32849
44256C378531R94467J7226j119221j008565q741L10630p68155k126241k275039
44247b605108j341019o89341p29349l58392J028605K245026J916581M66954n53886
44238f19929n65497l66324p28915j437063j674044q88206O33719J893662K177258
44229a575339J838746J499542Q11961p40460k037844j262826R55722J590901m52868
44220F27535k294769j197863J250552J571474m12043j696482p05646J141847K341397
44211F26002K925029K753821Q82984k258833m114438k845071K53510K228648J564174
44202B015826p80533k600526k323664m22059R21202L08632j015883r50816L44699
$$ y = [3298922, 4906798, 6677717, 8334911, 8760903, 7176417, 4587886, 3045682, 3378531, 4372998, 4390224, 3271003, 2262438, 2253697, 2564327, 1796172, -330069, -2605108, -3946127, -4635468, -5364817, -5723209, -4694604, -2449578, -532997, -66043, -619929, -1185426, -1551750, -2280665, -3717728, -5391772, -6279978, -5646259, -3752597, -1575339, 263407, 1762949, 2574910, 1834450, -203394, -1466220, -510498, 1080403, 627535, -1667234, -2865097, -1614545, -43071, -455114, -2151596, -2857242, -1715395, 626002, 3551031, 6304852, 7187836, 4929003, 814565, -2030506, -1776996, 451652, 2015826, 1235293, -1365233, -3688897, -4110956, -3189754, -2881122, -3897005, -4847821, -4503122]
44193d503122Q99021K37606r192Q87209J503808Q81194J72086M12470O24104k92548
44183H12636j461924j592184j220798j484293j766458o80353J252435J980308
44175d160631Q26559p06413j066686j92039J080411J908602J772588R95631P77480
44166A235502J621622K092335N49395k116480l193472j764141J17475L92171n40869
44157a606462j237598j509358j858093j752942l47119J480518J700674O3336j172435
44148f239479k61532J563972J942121Q61997N50569J893233K802286J129748k064767
44139B178148l658566k364030J7961J206241Q64490N9257l86779k22001N98091
44130a707188J665935K075921J415662L64148l29397q51684j502284j539764r3186
$$ y = [-4503122, -3604101, -3366495, -3375687, -2488478, -984670, -103476, 68610, 481080, 1105184, 812636, -649288, -2241472, -3462270, -4946563, -6713021, -7393374, -6140939, -4160631, -3334072, -4040485, -5107171, -5299210, -4218799, -2310197, -537609, 458022, 1235502, 2857124, 4949459, 5498854, 3382374, 188902, -1575239, -1457764, -1065593, -1606462, -2844060, -4353418, -6211511, -7964453, -8311572, -6831054, -5130380, -5067044, -6239479, -6501011, -4937039, -2994918, -2132921, -1582352, 310881, 3113167, 4242915, 2178148, -1480418, -3844448, -3826487, -2620246, -1755756, -1696499, -2083278, -2305279, -1707188, -41253, 2034668, 3450330, 3814478, 3485081, 2633397, 1131113, -408651, -501837]
44121e01837K042560K875448J671890j93557j185800j313198j302683j125596
44113I67227l97227L52331N1181j279921k295999k037182j085039n45527n10350
44104f780506k32503N00915J011638Q38059M94574O93911J173200Q36934q41297
44095b305075k824295l224904j260393J542726K585545J024902j058377j022158
44087f542029J066828K516857J440722r96098k218857j183393R69515K395553
44079b550902K004030J95897j178010m47099J565085J951157n28001l363773l500817
44070e852433j381803L36347J108169K638082M855470N040034K056566j305292
44062G495140k022712q29057m79201j529656k111907j151146L17155R45588N95680
$$ y = [-501837, 1540723, 4416171, 6088061, 5894504, 4708704, 3395506, 2092823, 967227, 570000, 922331, 973512, -306409, -2602408, -4639590, -5724629, -6270156, -6780506, -7013009, -6512094, -5500456, -4662397, -4167823, -3473912, -2300712, -1463778, -2305075, -5129370, -8354274, -9614667, -8071941, -5486396, -4461494, -5519871, -6542029, -5475201, -2958344, -1517622, -2513720, -4732577, -5915970, -4946455, -2550902, -546872, -350975, -1528985, -1976084, -410999, 1540158, 1012157, -2351616, -5852433, -7234236, -6897889, -5789720, -3151638, 1703832, 6743866, 8800432, 7495140, 5472428, 4643371, 4164170, 2634514, 522607, -628539, -311384, 634204, 1229884]
44053A229884o2909l82644r5697M20115L49536n34137j395787j401749p13842
44044b587230J33818J109433K146526K446951J324095o61751k202224k502476
44036g92858j547457J64922J541647J446191J32534p62198m22832P7084j89961
44027c52928l80692L26223Q68649J84864m26677O79200K140374J232389j496141
44018B775261k448529k73452K129223J974116K23847p36333p43019j094062j728145
44009G8907j383686J47080J672931K146854J359976l71641k103988k438299r82608
44000a874474P67883J069080P0850o81211m98038j60431l95293q13991o14727
43991c130352L00203J155280J022567k07690j434348j289745K53143J665371J602132
$$ y = [1229884, 1166975, 784331, 688634, 1108749, 1458285, 924148, -471639, -1873388, -2587230, -2453412, -1343979, 802547, 3249498, 4573593, 3911842, 1709618, -792858, -2340315, -2175393, -633746, 812445, 944979, 182781, -240051, -162967, -352928, -733620, -407397, 461252, 646116, 219439, 898639, 3039013, 4271402, 2775261, 326732, 53280, 2182503, 4156619, 4380466, 3644133, 2901114, 1807052, 78907, -1304779, -1157699, 515232, 2662086, 4022062, 3650421, 1546433, -891866, -1874474, -1106591, -37511, 33339, -647872, -1145910, -1306341, -1701634, -2515625, -3130352, -2830149, -1674869, -652302, -859992, -2294340, -3584085, -3330942, -1665571, -63439]
43982f3439L77174o77707p56215m929R60160J323986M73812j044362j481006J93913
43972f98613K594554L228095J506207n87215j073293k20406L67843Q6490k57980
43963D945682j14984j34911r73443j924635j672063j91303J088959J206231P55978
43954B985511N65506K85769p44026j997147k337095j611740m26213J191197L315530
43945A227292M588134L142695n39345l524211l900710k741089j813917j140583
43937d701734r7946P06664M49782j36095J57003R16622Q85048K60333L48798J178170
43927c3355J320268J97218j083642j488490j246881r66682q06795q17093r31665
43918e857117m37217J247414L022428K860618O83407j036503m82881J050858J163906
$$ y = [-63439, 313735, -363972, -1120187, -1125116, -164956, 1159030, 1632842, 588480, -892526, -698613, 1895941, 5124036, 6630243, 6043028, 4969735, 4749329, 5117172, 5203662, 4945682, 4830698, 4695787, 3722344, 1797709, 125646, -65657, 1023302, 2229533, 2985511, 3551017, 3836786, 3092760, 1095613, -1241482, -2853222, -3279435, -2088238, 1227292, 5815426, 8958121, 8418776, 4894565, 993855, -1747234, -3561151, -4701734, -4799680, -4093016, -3643234, -3779329, -3622326, -2705704, -1820656, -1560323, -1211525, -33355, 1286913, 1484131, 400489, -1088001, -2334882, -3301564, -4108359, -4925452, -5857117, -6294334, -5046920, -2024492, 836126, 1519533, 483030, 149, 1051007, 2214913]
43909B214913k99911j458053j286339o12635l42056l01044k08397m41069j100765
43900c835356j299764l14398J136245J742143J433215J332762J905203K275228
43892D375278J800749J238405J412151J494896k0601k808827m575935l817572
43884i01456j583840J05794O38576P78281J008130R49723K08058r42196j642072
43875a381002r39532J319941L738926M247376K344438k87381k023253l036072
43867C983441l772836l149139l40360K529547K286828n58970j811768O31996L582539
43858C381278L012622l26969k325942j396454k3348n30021k074654k746912k417368
43849e447768j956646j162421N75830K267466K043354J6334j372059n78745R17545
$$ y = [2214913, 1915002, 456949, -829390, -1442025, -1784081, -2085125, -2293522, -2734591, -3835356, -5135120, -5449518, -4313273, -2571130, -1137915, 194847, 2100050, 4375278, 6176027, 7414432, 8826583, 10321479, 10300878, 7492051, 2916116, -901456, -2485296, -2379502, -1740926, -962645, 45485, 995208, 1203266, 261070, -1381002, -2320534, -1000593, 2738333, 6985709, 9330147, 9042766, 7019513, 3983441, 210605, -2938534, -3278894, -749347, 1537481, 978511, -833257, -201261, 3381278, 6393900, 6066931, 3740989, 2344535, 2321187, 1791166, -283488, -3030400, -5447768, -7404414, -8566835, -7991005, -5723539, -3680185, -3663851, -5035910, -5614655, -4697110]
43840d697110Q95726k95249m12311J074001J997626O84129j452796j676118N70220
43831c311882L083607L427468J176224j938363l335453j583892J957439L991530
43823C466678K774128J71366r21314l78024k64058j113402j329423m30239n4571
43814A921141p19773l72227J948145L495838J627141j591478j972562M81935J580436
43805F398596n97142k990342k586947p91267m59515j150960l96770J746035K682367
43796A854055J472253M7217j62283j75970j067125j881951j472039o95521r38155
43787c019519j571476r21408P90778J595752R07086M40159J313502K049318Q22732
43778B406924j507702k364679j034116M29013J57009j081791j205848L04919J933973
$$ y = [-4697110, -3801384, -4096633, -4508944, -3434943, -1437317, -753188, -2205984, -3882102, -3311882, -228275, 3199193, 4375417, 2437054, -898399, -2482291, -524852, 3466678, 6240806, 6412172, 5490858, 5112834, 4848776, 3735374, 2405951, 1975712, 1921141, 1201368, 829141, 2777286, 6273124, 7900265, 6308787, 4336225, 4818160, 6398596, 5801454, 2811112, 224165, -567102, -1026617, -2177577, -2574347, -828312, 1854055, 3326308, 3373525, 3211242, 3035272, 1968147, 86196, -1385843, -2081364, -3019519, -4590995, -5512403, -4721625, -3125873, -2218787, -1778628, -465126, 1584192, 2406924, 899222, -1465457, -2499573, -2070560, -1913551, -2995342, -4201190, -3896271, -1962298]
43769a962298K213135J243888J4637q70091j243681q68105K00524J004312N45949
43760B78270n62097m96454J055173J779791k38623l180375l243519J81657L314762
43751a111415K955295O46171K4310J446126J845717l61180k889398k919186q23188
43742a186748Q03011N90662o00345j495502j794148j751937j404521o08296M58621
43733f989203J071217M60229j096562j918233n52507K093630L353742K062166
43725a515521O8250l99325L02866L43271m64787o86960j01076j85470j259102
43716c897854j362138O72483K787658K294089j03380j079231O68911K646288K039448
43707D666274o71756k680045k402823p85972N19254J006911J104144R95204L60203
$$ y = [-1962298, 250837, 1494725, 1509362, 639271, -604410, -1472515, -1271991, -267679, 278270, -283827, -780281, 274892, 2054683, 1816060, -1364315, -4607834, -4426177, -1111415, 1843880, 2490051, 2514361, 3960487, 5806204, 5445024, 2555626, -363560, -1186748, -383737, 206925, -393420, -1888922, -3683070, -5435007, -6839528, -7447824, -6989203, -5917986, -5457757, -6554319, -8472552, -9025059, -6931429, -3577687, -1515521, -1447271, -1846596, -1543730, -1200459, -1665246, -2352206, -2453282, -2638752, -3897854, -5259992, -4587509, -1799851, 494238, 390858, -688373, -19462, 2626826, 4666274, 3994518, 1314473, -1088350, -1874322, -1355068, -348157, 755987, 1751191, 2111394]
43698B111394q51686j934238k033554j100894J16779R98217J443086J268250R2361
43689A09715j561834j987480l75991J427576R47126j317277k319440q49737P94144
43680e133198N75060k12770L88592J313138L22776j697344j682604O05099J946847
43671c574404P11523o78852K00722J987103J879495j79708j940890k180431j449224
43662e224666l34900J002490J969518J901337J123543M77090J46381o8039M8234
43653A040988O00291R68647P23174L08500r5622j118292k417745k030630O57052
43644a363637K912708K041695n94123j733363j202634j395536k513497k231609
43636f079996k18378J005672N73548P48303K420597K899984M61210k185683j789204
$$ y = [2111394, 1259708, -674530, -2708084, -3808978, -3692199, -2693982, -1250896, 17354, 109715, -1452119, -3439599, -3815590, -2388014, -1440888, -2758165, -5077605, -5927342, -5133198, -4558138, -4770908, -4382316, -3069178, -2746402, -4443746, -6126350, -5521251, -3574404, -2862881, -3541733, -3341011, -1353908, 525587, 345879, -1595011, -3775442, -5224666, -5559566, -4557076, -2587558, -686221, 437322, 914412, 1060793, 992754, 1040988, 1641279, 2609926, 3333100, 3641600, 3545978, 2427686, 9941, -2020689, -1363637, 1549071, 3590766, 2996643, 1263280, 60646, -1334890, -3848387, -6079996, -6298374, -5292702, -4719154, -3970851, -1550254, 1349730, 1810940, -374743, -2163947]
43627b163947O70345K078303J930637J816406J792821O37516j181491j913931
43619C666659j482656j311419j531474r43246M35496J278228J348125J609668
43611C069381J957415J258557j79911o48945M7573J33119j025254j701683o95764
43602B214488P36369J068503O82373M37270j80878j744090l055489k525503n75478
43593b942435J018163J598277J847602J972764J370351J05806p97628q84570q94182
43584B394148j432968k007532j905813j239564n17610J43930O93392O13071l37382
43575c596328j137701l92870J630036K904489K106125K79439o97227m79403k2015
43566E94545L18163R16094J349422M94109j453459k606100j784768k7115J084132
$$ y = [-2163947, -1493602, 584701, 2515338, 4331744, 6124565, 6762081, 5580590, 3666659, 2184003, 872584, -658890, -1602136, -1166640, 111588, 1459713, 3069381, 5026796, 6285353, 6105442, 5456497, 5504070, 5637189, 4611935, 2910252, 2214488, 2950857, 4019360, 4701733, 5139003, 4958125, 3214035, 158546, -2366957, -2942435, -1924272, -325995, 1521607, 3494371, 4864722, 4970528, 4172900, 3288330, 2394148, 961180, -1046352, -2952165, -4191729, -4709339, -4565409, -3872017, -3258946, -3596328, -4734029, -5126899, -3496863, -592374, 1513751, 1793190, 1095963, 616560, 594545, 912708, 1828802, 3178224, 3672333, 2218874, -387226, -2171994, -2199109, -1114977]
43557a114977J362283J350143R57955L9111o28517k90457N47459J024913J283647
43548D531560J634071J278095m49913k232706k102925l72744O97605J87536m53424
43539B717155j8995O62142L52513o05322r10023l6844J380937K284448J903408
43530G729419L97971r61006r63140J4752L94339n82593j999314k499905j602124
43521g1601J66818J568532J252707q46529k816632k673696q85890L37228J72884
43512c796179n9774N57053J101388N69908n65241j384516j662219j188775M96749
43503e931606K647155L079245Q11232k185976l286439k361760j245374q65643
43495i339166n47753J84774P09610M27804k44119l22326P76538K698347M220165
$$ y = [-1114977, 247306, 1597449, 2555404, 2594515, 1965998, 1675541, 2223000, 3247913, 4531560, 6165631, 7443726, 6993813, 4761107, 2658182, 2285438, 2983043, 3170579, 2717155, 2698160, 3360302, 3712815, 3107493, 2197470, 2160626, 3541563, 5826011, 7729419, 8127390, 7166384, 6203244, 6217996, 6612335, 6029742, 4030428, 1530523, -71601, 95217, 1663749, 2916456, 2069927, -746705, -3420401, -4306291, -3969063, -3796179, -3855953, -3298900, -2197512, -1627604, -2192845, -3577361, -5239580, -6428355, -5931606, -3284451, -205206, 606026, -1579950, -4866389, -7228149, -8473523, -9339166, -9886919, -9702145, -8992535, -8564731, -8808850, -9131176, -8354638, -5656291, -1436126]
43486a436126M078477K155747k88435j769161j733239o23960O08725J004252L36675
43477B332955m63135l31081M44252O35360n2714p08525r18149j311923k025302
43468b398262k116933j169074n4661N82346J129325J541779Q13233r62155j737597
43459d371999k75398J711121J895007N42670m46563n70930p59873j193783j142036
43450d611784m90363L49026J482575K758434K738018N39545j929749j942217J93069
43441i13446J666518J338475O64347L71561o68449k381622k419168R0091K304501
43432E2808J520954o84257q39294J199750K349548J111383o97888j315727j296318
43423A400959j327516l66068K037080L443242J326210k651897m165978k158079
$$ y = [-1436126, 2642351, 4798098, 4509663, 2740502, 1007263, 383303, 992028, 1996280, 2332955, 1869820, 1538739, 1982991, 2618351, 2565637, 1857112, 938963, -372960, -2398262, -4515195, -5684269, -5738930, -5156584, -4027259, -2485480, -1672247, -2634402, -4371999, -4647397, -2936276, -1041269, -498599, -945162, -1516092, -2275965, -3469748, -4611784, -5102147, -4753121, -3270546, -512112, 2225906, 2765451, 835702, -1106515, -913446, 753072, 2091547, 2755894, 3127455, 2459006, 77384, -2341784, -2251693, 52808, 1573762, 889505, 50211, 1249961, 3599509, 4710892, 4013004, 2697277, 1400959, 73443, -292625, 1744455, 5187697, 6513907, 3862010, -303968, -2462047]
43415b462047j59501o49922j314120O67709L336631K739031m94531j840180p6269
43406b53199Q78181j384034l725889k706319r4521M60628n33683M7378K098013
43397e213445K517153P51846k52351R23428K066971J348022J25035J76042P75845
43388C218546L47057q88993j598578j303162l38787R71987K054427K130344J427424
43379F020265J193675J733335J696738J68894j831016k885037k955826k602328
43371E38700j694595k24744O62018J8158j120285q52049Q36494J840711P73730
43362G78138j029212j106999R17789K631787J752469q56686k150309q31404J091425
43353A196998J264688k5628j071609j485421j809780j482900L50414K420123K302782
$$ y = [-2462047, -2621548, -3271470, -4585590, -3917881, -581250, 2157781, 1663250, -176930, -253199, 624982, -759052, -4484941, -7191260, -7285781, -6825153, -7358836, -7311458, -5213445, -2696292, -1944446, -2196797, -1273369, 793602, 2141624, 2266659, 2442701, 3218546, 3565603, 2676610, 1078032, -225130, -563917, 408070, 2462497, 4592841, 6020265, 7213940, 8947275, 10644013, 10812907, 8981891, 6096854, 3141028, 538700, -1155895, -1380639, -718621, -700463, -1820748, -2672797, -1836303, 4408, 778138, -251074, -1358073, -440284, 2191503, 3943972, 3087286, 936977, 105573, 1196998, 2461686, 2436058, 1364449, -120972, -1930752, -3413652, -3063238, -643115, 1659667]
43344A659667J8354j676331j078947M98141J174029Q55151L07140k77956p85816
43335F93432p45023k54889q8042l52094m19173m43405j208570k151601j584843
43326f554208N41157K213783K391113K217501K386147J813835K35180m27388Q81790
43317E698910K112157R92813j612010l246937l185675k260856r27549M28994O14504
43308a385649q06543k104556j439237O42254K338207K975925K666661J095252
43300C982314j434480l165115l073763k487854k582652k025436M65176K970929
43292g350881K803618Q00053j2323Q54579J256900N22410K37825R18636J100707
43283A131524K13303m20366m1924M67563M62285L09158l8131j073213k046849
$$ y = [1659667, 1678021, 1690, -1077257, -579116, 594913, 1450064, 1757204, 1479248, 693432, -51591, -306480, -394522, -746616, -1165789, -1609194, -2817764, -4969365, -6554208, -6013051, -3799268, -1408155, 809346, 3195493, 5009328, 5244508, 4817120, 5698910, 7811067, 8803880, 7191870, 3944933, 759258, -1501598, -2429147, -2000153, -1385649, -2192192, -4296748, -5735985, -5093731, -2755524, 220401, 2887062, 3982314, 2547834, -617281, -3691044, -6178898, -8761550, -10786986, -10321810, -7350881, -4547263, -3747210, -3759533, -2904954, -1648054, -1125644, -887819, 30817, 1131524, 1344827, 924461, 882537, 1350100, 1812385, 2121543, 2083412, 1010199, -1036650]
43274a036650j453361L63768J188300M0751j540260j784175o32579Q40657J461886
43265b551663N08364j254415j590162L66927K152620J187432j029722r80238J334312
43256a856545K540303J411485K77821M67084M33741m73367m21666J052791J456724
43247D888371k31898j181815N55398K219972N21202k963071m107456k174845k0031
43238b494173M78369N9775j74538K3555P10878J534913J346831k44662j712836
43229d71888j633082q27057p83025j149078p34955J74901N98619Q34280J500235
43220b491050J724653O40886l93194L11843J593474J069288o69347p29050J277887
43211B335390K423106J087651o98839p42176J88333L43292j01054q6541m0736
$$ y = [-1036650, -2490011, -2126243, -937943, -897192, -2437452, -4221627, -4854206, -4013549, -2551663, -2043299, -3297714, -4887876, -4520949, -2368329, -1180897, -2210619, -3190857, -1856545, 683758, 2095243, 2373064, 2840148, 3273889, 2800522, 2378856, 3431647, 4888371, 4656473, 3474658, 4030056, 6250028, 6771230, 3808159, -299297, -2474142, -2494173, -2015804, -1956029, -2130567, -2107012, -1396134, 138779, 1485610, 1240948, -471888, -2104970, -2932027, -3715052, -4864130, -5599085, -5424184, -4825565, -3991285, -2491050, -766397, -125511, -518705, -206862, 1386612, 2455900, 1786553, 1057503, 2335390, 4758496, 5846147, 5147308, 4405132, 4593465, 4936757, 4835703, 4749162, 4708426]
43202D708426j065577k598452k870916j494401J6589M29345J92974K62584O15669
43193a803759P17579P50269J246727J650772N54813k055939l908458k875724M06270
43184e317450L525397N169882N485555M286888J215759k301723l722319k703785
43176E638204j592914j799763j952211p60408O60111R20421O38718P39765N03101
43167B995024o13822j120562J84181J726959J481936K14960k13843k23877j190562
43158C240394k109526j012904J105883J307754o84109k254542k130399j492584
43150d030033q50056O72211K507698K606691J017060K02874Q38771O31885j379260
43141B217841k719915j515262L95989O05888j84726o5635O46589M80730k25537
$$ y = [4708426, 3642849, 1044397, -1826519, -3320920, -3304331, -2874986, -2682012, -2419428, -1803759, -1086180, -335911, 910816, 2561588, 3116401, 1060462, -2847996, -5723720, -5317450, -1792053, 3377829, 8863384, 13150272, 14366031, 12064308, 8341989, 5638204, 4045290, 2245527, 293316, -467092, 193019, 1113440, 1752158, 2491923, 2995024, 2381202, 1260640, 1444821, 3171780, 4653716, 4868676, 4654833, 4430956, 3240394, 1130868, 117964, 1223847, 2531601, 1847492, -407050, -2537449, -4030033, -4880089, -4207878, -1700180, 906511, 1923571, 2126445, 2965216, 3597101, 2217841, -502074, -2017336, -1621347, -1015459, -1200185, -1265820, -619231, -138501, -364038]
43132c64038M0716J317702K231942K016052Q94568p15312k033969j941329m94290
43123I52042N91551J98242n86895l06738P14861J330137J280134N88223j180023
43114C581534l392021l724523j188656J576723J424984q80386j874374l58413
43106d835132J463746J655166Q25240L72646N46205Q96144J112514Q59172o9309
43097B826392j118817j475186j210619r70474p55744j49167N73886Q67751J113374
43088b98604J913177K478089J425102q56371k366410k158353j169848k72718O20470
43079f85466J163013L94159j199196j430713M98231K370520J963259K14965m80627
43070B808145K7546m0496r37757q48056P61954J625179j03113k727105l037483
$$ y = [-364038, -323322, 994380, 3226322, 5242374, 6136942, 5421630, 3387661, 1446332, 952042, 1543593, 1741835, 1154940, 848202, 1563063, 2893200, 4173334, 4761557, 3581534, 189513, -3535010, -4723666, -3146943, -1721959, -2602345, -4476719, -4835132, -3371386, -1716220, -890980, -518334, 27871, 924015, 2036529, 2895701, 2826392, 1707575, 232389, -978230, -1948704, -2704448, -2853615, -2279729, -1411978, -298604, 1614573, 4092662, 5517764, 4661393, 2294983, 136630, -1033218, -1305936, -685466, 477547, 871706, -327490, -1758203, -1259972, 1110548, 3073807, 3288772, 2808145, 2835691, 2795195, 1857438, 1009382, 1771336, 3396515, 3293402, 566297, -2471186]
43061b471186p74994R57799k4289k075973k101540L30317K695867K873795J306811
43052G16607k77156r11928n93174M39863J686605K289285J851032J007542N24996
43043F733672K78236j47998l97399K3889L41347q84821l429233m871222l250344
43034e603873L48472K760084K173601p6788j258653k34424J647637K353500J300329
43025C409885m17310j455738j400290o51514L06672J212410J769936J478341J00219
43016D352611j580020j974856m20669J494911J458187m78042j707385p21785O18400
43007A041352m6741j851427k071452l40709J131241J248656J084766J046703N1400
42998A293789j609045j653520M23703J838748P59108o36170J49668J637436R18845
$$ y = [-2471186, -3246180, -2288381, -2312670, -4388643, -6490183, -6159866, -3463999, -590204, 716607, 439451, -472477, -1065651, -625788, 1060817, 3350102, 5201134, 6208676, 6733672, 7011908, 6863910, 6466511, 6490400, 6831747, 5946926, 2517693, -2353529, -5603873, -5255401, -2495317, -321716, -398504, -1657157, -1891581, -243944, 2109556, 3409885, 2992575, 1536837, 136547, -514967, -208295, 1004115, 2774051, 4252392, 4352611, 2772591, 797735, 377066, 1871977, 3330164, 2852122, 1144737, 422952, 1041352, 994611, -856816, -2928268, -3268977, -2137736, -889080, 195686, 1242389, 1293789, -315256, -1968776, -1545073, 293675, 1052783, 416613, 566281, 2203717, 3122562]
42989C122562j414426k456657j837457j593049j845159o27426J803060K461537
42981b387015N00162r89854K18927J900561R27188j794009k642420m48252K151063
42972b563649K385808N70098q15996l47275O93535M3652k335809l715363k052138
42963h137137J005075K219831J249062P47801J982696K956960J841373r3126n96714
42954C175821K50504P11462K07893m00038o84562j088208j715967k057666j931675
42945c532436j730264j657195j375211m93281Q62938J887501J613433J29836q87347
42936e182026J55573K497238L603892K354703L81066l61346r7607m01335j824788
42927A125370l343089l583611j973547P35334K708478K605927J208802M68879
$$ y = [3122562, 1708136, -748521, -2585978, -4179027, -6024186, -6651612, -4848552, -2387015, -1886853, -2876707, -2657780, -757219, 169969, -1624040, -4266460, -4714712, -2563649, -177841, 392257, -423739, -771014, -77479, -33827, -2369636, -6084999, -8137137, -7132062, -4912231, -3663169, -2915368, -932672, 2024288, 3865661, 3772535, 3175821, 3426325, 4137787, 4345680, 3945642, 3261080, 2172872, 456905, -1600761, -3532436, -5262700, -6919895, -8295106, -8788387, -7925449, -6037948, -4424515, -4294679, -5182026, -5026453, -2529215, 1074677, 3429380, 3810446, 3449100, 3351493, 2950158, 1125370, -2217719, -5801330, -7774877, -7039543, -4331065, -1725138, -516336, -47457]
42919d7457P76418O37242n52175j289056n06286M72255l0029j498138k282476
42910d319702j975151j160736M5990J530587K280704J694586Q59142Q13463O07335
42901C76218r07237k422140j831163J07618N97221p55251j225457O54010K718973
42892b687208K521814Q99647L70487J317650J734540L45845j615142k036687n11224
42883C39722J190829J146565m91715j692152j038886O29451J531304J148817K95450
42874C059385l78936q31479r23650l94240N75118J581977K460435K763233J540475
42865I452318j147144l228621k771448p01920L84184j08900k54635J122062K646525
42856E392421K507397P95275r98239j662149r86991J33783J36865j514459l102929
$$ y = [-47457, 728961, 1366203, 814028, -475028, -981314, -509059, -539088, -2037226, -4319702, -6294853, -7455589, -7409599, -5879012, -3598308, -1903722, -1044580, -231117, 376218, -531019, -2953159, -4784322, -4676704, -4079483, -4834734, -6060191, -5406181, -2687208, -165394, 734253, 1104740, 2422390, 4156930, 4502775, 2887633, 850946, 339722, 1530551, 2677116, 2185401, 493249, -545637, 83814, 1615118, 2763935, 3059385, 2680449, 1848970, 925320, 531080, 1106198, 2688175, 5148610, 7911843, 9452318, 8305174, 5076553, 2305105, 1603185, 1987369, 1878469, 1623834, 2745896, 5392421, 7899818, 8695093, 7696854, 6034705, 5047714, 5181497, 5318362, 3803903, 700974]
42847G00974k558633m52126P46205L61147J71128J028780J477285P38599L84628
42838B597987J340433J701569j19421k074426j190524J608036K436735j19165
42830F181224l276457m039896k579823r33863j97244k9726J98190P27578J351656
42821b598361J555177J085998M72235M57994R27791R89488J88656q73423j225572
42812I79983n32502N28247P76678k13343j255954o89656J277642K338068R39090
42803D148253j603211k892345k420130j348243j42284J612132L208376K803706
42795C366254J48542k315971k273046m28553O62749R8503m54104N27060K061864
42786A393298K007784K20353j059719m43798L72131q86820l148338k899056O48443
$$ y = [700974, -1857659, -2309785, -1563580, -1202433, -1031305, -2525, 1474760, 2213359, 2597987, 3938420, 5639989, 5520568, 3446142, 2255618, 3863654, 6300389, 6181224, 2904767, -1135129, -3714952, -4648815, -4846059, -4875785, -4677595, -3950017, -2598361, -1043184, 42814, 515049, 973043, 1900834, 2890322, 3078978, 2205555, 979983, 447481, 975728, 1752406, 1539063, 283109, -406547, 871095, 3209163, 4148253, 2545042, -347303, -2767433, -4115676, -4257960, -2645828, 562548, 3366254, 3514796, 1198825, -1074221, -1502774, -840025, -741522, -1195626, -668566, 1393298, 3401082, 3621435, 2561716, 2117918, 2490049, 1603229, -1545109, -4444165, -3795722]
42777c795722L716755K754835p89911k577282j084119J160955J589882M55031
42769A430424n80006p07178j59172M49804L57391p03785j765351j591662n14681
42760c784216N427k01251L00925J905180K802750J652198q3775j27451J203261
42751C673048J436316m27416k499400k679252j392331o68179j166097j344105
42743e067416K34552K722799L899479K857137Q35466n85383j039028q35037j13110
42734B909459O72939N43099o09346j337222o37858L04599m7055r49537o75393
42725A73685K52225k13605j771961j652741Q52813K676658J364607j314450k204141
42716a836910j158869k04608R4121O60586J240536O15633o87042n67969J348587
$$ y = [-3795722, -78967, 2675868, 1885957, -691325, -1775444, -614489, 975393, 1430424, 850418, 143240, -15932, 433872, 791263, 87478, -1677873, -3269535, -3784216, -3778789, -3980040, -3679115, -1773935, 1028815, 2681013, 2597238, 2469787, 3673048, 5109364, 4681948, 2182548, -496704, -1889035, -2557214, -3723311, -5067416, -4832864, -2110065, 1789414, 4646551, 5482017, 4896634, 3857606, 3022569, 2909459, 3582398, 4125497, 3516151, 2178929, 1541071, 1845670, 1798615, 849078, 173685, 425910, 212305, -1559656, -3212397, -2359584, 317074, 1681681, 367231, -1836910, -2995779, -3200387, -3106266, -2445680, -1205144, -589511, -1276553, -1844522, -495935]
42707d95935K827792K147662K81562q62151q02680j34814Q00611J674172J583053
42698G019272P9434j673575k016913r74834k27386p03948j235599l22812J452277
42689A395916K007318P55480l92978J49212J086452J58082k102399k822683j161871
42680i27471L13735k55894r58163P25374L488060L768211R57321j868542k419629
42671B823002j635907j066547m27268Q66698J779191J120009k66989n65351L97497
42662C024335J145748Q16593l2854q33380j796365k843174k874610j088117J399917
42653c081907K305788Q29099j202525j501966j50209P62441J81749o08167k15323
42644b681020P57285R77834N94536N67612N49914n97350k316401k394653k0463
$$ y = [-495935, 2331857, 4479519, 4761081, 3898930, 3096250, 2961436, 3762047, 5436219, 7019272, 7098706, 5425131, 3408218, 2433384, 2205998, 1502050, 266451, -56361, 1395916, 3403234, 4158714, 3765736, 3914948, 5001400, 5159482, 3057083, 234400, -927471, -613736, -869630, -1827793, -1102419, 2385641, 6153852, 7111173, 5242631, 2823002, 1187095, 120548, -306720, 559978, 2339169, 3459178, 3192189, 2626838, 3024335, 4170083, 4986676, 4953822, 4120442, 2324077, -519097, -3393707, -4481824, -3081907, -776119, 52980, -1149545, -2651511, -2801720, -2039279, -1857530, -2465697, -2681020, -1923735, -945901, -351365, 216247, 766161, 168811, -2147590, -4542243, -4562706]
42635d562706K776513L494692J849543n11546j950500j870542o96779N13333R69915
42626A1923R22680R99993R83513K55319p54284r78733n45505n73375j045365p93236
42616a517070O1625j20040j486862j813561M4641K080774K276747J634627J800857
42607B961738J659364p19065m008100m820304k591761j93635M87846P05905J902303
42598d615709L110213K548675K01102k270767l227186k201547k61755P26411J75379
42589e815184k67673Q46445K122547J173546j407160k586813j429790j85198k90884
42580g840164l50387P12768J473340Q14752K80805J329011K429536J476644o30398
42571c04093j488434r17085m76960l58868L93599J278661Q86626k19494j686J606959
$$ y = [-4562706, -1786193, 1708499, 3558042, 3046496, 1095996, -774546, -1471325, -957992, 11923, 934603, 1934596, 2918109, 3173428, 2419144, 1440411, 894906, 321531, -723834, -1517070, -1455445, -1575485, -3062347, -4875908, -4831267, -2750493, -473746, 1160881, 2961738, 4621102, 3902037, -106063, -4926367, -7518128, -7711763, -7223917, -6518012, -4615709, -1505496, 1043179, 1244281, -1026486, -4253672, -6455219, -6716974, -5990563, -5815184, -6082857, -5236412, -3113865, -1940319, -3347479, -5934292, -7364082, -7549280, -7840164, -8190551, -7477783, -6004443, -5189691, -4908886, -3579875, -1150339, 326305, -304093, -1792527, -2709612, -3186572, -3545440, -3151841, -1873180, -986554, -1206048, -1207734, 399225]
42561C99225K425236J491594K47812k42576p33352j644740j861504q24095K18689
42552e23711K48512n0717J5503j07842n00859K06737K347749L596882K018395
42543G250649p15856j588100o15789k45015j003376q51760Q85884J980917Q59312
42534E956866p62708n52588Q72323J063800n74300k197349k242963j044419K66828
42525G85490J024049R44996j98j158437j482582p52053O1578J8405o73855j064182
42515b296789n71773N20625J340525J173383L95252M54887K045711L457901K229003
42506H748725j165776l050556j197182J872872K196268j75298j619257m68666
42498E141130Q61341k2637j965781k435518j230969q5140J31264j14498m75080
$$ y = [399225, 2824461, 4316055, 4563867, 4321291, 3587939, 1943199, 81695, -742400, -523711, -275199, -325916, -310413, -418255, -919114, -712377, 1635372, 5232254, 7250649, 6534793, 4946693, 4330904, 4085889, 3082513, 2230753, 3116637, 5097554, 5956866, 5194158, 4641570, 5513893, 6577693, 6003393, 3806044, 1563081, 518662, 785490, 1809539, 2754535, 2754337, 1595900, 113318, -638735, -577157, -558752, -1232607, -2296789, -2868562, -2347937, -1007412, 165971, 561223, 1016110, 3061821, 6519722, 8748725, 7582949, 4532393, 3335211, 5208083, 7404351, 7229053, 5609796, 5141130, 6002471, 5979834, 4014053, 1578535, 347566, 262426, 393690, 279192, -195888]
42489a95888q63180p36916J16996O25849j35501j110161o40165P48492R54154
42480a236320m00649j362100o40739P40022J371424J271514J015245O19790J53961
42471A532148J01194K93548k28263j496563k086490j192685P2787M38638K36351
42462b329335L18802N07324L63205K79582M29555j62296j910754l169316k291583
42453g964816k64626P61456Q35503J747001L516913L895602J784783j014577k225020
42444A072219j540588K1484J549262K200877J291768n61422j603712j153391n02384
42435G74113q04819j417444j420777j399358k128559k522512q52992K283879M045665
42426c442804K720800k42237k052366j561467L2122Q99985N00858j54233P586
$$ y = [-195888, -1059068, -1795984, -1678988, -1053139, -1188640, -2298801, -2938966, -2190474, -1236320, -1636969, -2999069, -3639808, -2899786, -1528362, -256848, 758397, 1378187, 1532148, 1633342, 1926890, 1698627, 202064, -1884426, -3077111, -3004324, -2565686, -2329335, -2010533, -1503209, -1140004, -860422, -430867, -593163, -2503917, -5673233, -7964816, -8229442, -7467986, -6632483, -4885482, -1368569, 2527033, 4311816, 3297239, 1072219, -468369, -446885, 1102377, 3303254, 4595022, 4033600, 2429888, 1276497, 774113, -30706, -1448150, -2868927, -4268285, -6396844, -8919356, -9772348, -7488469, -3442804, -722004, -964241, -3016607, -4578074, -4545952, -3645967, -3145109, -3299342, -3291756]
42417c291756O49030N92218j90102k73349Q84558J511776j22287k628424k716785
42408e585121L77922L539307L617306J169603p74097n85118P48900J633900J485981
42399E628583L95057j300393k620045k335672n69794Q41222N08748o20988o67840
42390g41122L17906M04058j123174k319088j214749J320653K800857K489544J814455
42381C749340J631234J064434l87355j486819j236074p29553j348662k185647
42373i29102j371370N47272R87118o64810j888130r13402N00286J2781j373498
42364e092855r31610J183690J952185K52913j317639n20052J134063R68181o99120
42355c070244j391999m89429J78197l89189q55253J34622J979087L223895L212513
$$ y = [-3291756, -2642726, -2050508, -2240610, -2513959, -1629401, -117625, -239912, -2868336, -5585121, -5207199, -1667892, 1949414, 3119017, 2344920, 1759802, 2508702, 4142602, 5628583, 6023640, 4723247, 2103202, -232470, -802264, 38958, 547706, -73282, -741122, -423216, -19158, -1142332, -3461420, -4676169, -3355516, -554659, 1934885, 3749340, 5380574, 6445008, 6057653, 4570834, 3334760, 2605207, 1256545, -929102, -2300472, -1753200, -766082, -1430892, -3319022, -4232424, -3732138, -3719357, -5092855, -6024465, -4840775, -2888590, -2635677, -3953316, -4473368, -3339305, -2371124, -3070244, -4462243, -4951672, -4773475, -5162664, -6017917, -5883295, -3904208, -680313, 2532200]
42346B532200J978407j05371j815442j630927K11482J467117P50452n89596o79265
42337B119057J07930K20392l56262m83382k51285p23482j536174j069642P04027
42328a268821J702206P22119r16673j513605j040609j39839J197420K677806K931553
42319D351557J269805q02231j330841m09735M17247M69239J73417l44519j258906
42310B535033j943595j488480l09643J87645l17243o44104m9248O19972K17903
42301a191760j095399k046562j583429J68821J908433K233263J192203M19567
42293E137J054245K058237J668148M7546r67603o24913j15644m39902j045893
42284A639358j177788j076756j036120o22499K08921M85549k01565o85275q2239
$$ y = [2532200, 4510607, 4405236, 2589794, 958867, 1170349, 2637466, 3387918, 2798322, 2119057, 2226987, 2447379, 2091117, 1607735, 1356450, 632968, -903206, -1972848, -1268821, 433385, 1155504, 238831, -1274774, -2315383, -2455222, -1257802, 1420004, 4351557, 5621362, 4819131, 3488290, 3078555, 3495802, 3965041, 4138458, 3793939, 2535033, 591438, -897042, -1206685, -1019040, -1336283, -1980387, -2029635, -1409663, -1191760, -2287159, -4333721, -5917150, -5748329, -3839896, -1606633, -414430, 5137, 1059382, 3117619, 4785767, 4833313, 3865710, 3240797, 3125153, 2685251, 1639358, 461570, -615186, -1651306, -2273805, -2064884, -1579335, -1780900, -2466175, -2548414]
42275b548414M66351m57463j921566j701761L69226K029015J664745O5176j183722
42266c218413j435644o61401R83612K471036K231193K50786j337026r43450K46660
42257a412647J56856r30480q16376J192897L155824L153187J581390J08600n28702
42248E660549q09887j192467j439491j009302K20449J423940J156707j064206
42240B946292l539808l823497j671721N95387J178046Q89408J249543J891854
42232b84496J423691o5891j138749j180241p74680k38466N41313J031741N80073
42223a05705j02646J74738Q22672K29983j165104j118708N95078J449485L80331
42214A160124k65769J085377K038687R2576k704880k635915l21875K92966j529657
$$ y = [-2548414, -2082063, -2539526, -4461092, -6162853, -5793627, -3764612, -2099867, -2034691, -3218413, -4654057, -5315458, -4331846, -1860810, 370383, 621169, -715857, -1659307, -1412647, -1255791, -2186271, -3002647, -1809750, 1346074, 4499261, 6080651, 6189251, 5660549, 4850662, 3658195, 2218704, 1209402, 1429851, 2853791, 4010498, 2946292, -593516, -4417013, -6088734, -5493347, -4315301, -3425893, -2176350, -284496, 1139195, 1073304, -65445, -1245686, -2020366, -2258832, -1717519, -685778, -105705, -208351, -33613, 789059, 1019042, -146062, -1264770, -669692, 779793, 1160124, 894355, 1979732, 4018419, 4110995, 1406115, -1229800, -1551675, -1258709, -2788366]
42205b788366k141164M02825L029261K285580p02987k277994j277638L63152R03141
42196b204190M94959k6293l79763p17270j111774j283893p05561O44451J714260
42187c575074J406955J72238m98328k15434k1568l97618m79929K48913J011481
42178b348364J128562R06104M95944n21601j661912j457625P1308P48614n27342
42169c166312j741443p95262J114285J424789J79181n15987j30298m9925o08380
42160d289352n31691M18893P85200M9619k93399P19952J783217J352462j4918
42151b0017o91010l54601J140j23809j84316K45632P62516Q78980Q45625J162865
42141B523005J481543P89324r18894j981716j127497M06544M33537p46617o95514
$$ y = [-2788366, -4929530, -4526705, -1497444, 788136, 85149, -2192845, -3470483, -3107331, -2204190, -1709231, -1735524, -2115287, -2832557, -3944331, -5228224, -5933785, -5289334, -3575074, -2168119, -1995881, -2494209, -2709643, -2731211, -3128829, -3608758, -3359845, -2348364, -1219802, -313698, 182246, -339355, -2001267, -3458892, -3387584, -2638970, -3166312, -4907755, -5703017, -4588732, -3163943, -2984762, -3500749, -3631047, -3680972, -4289352, -4821043, -4402150, -3616950, -3567331, -3860730, -3140778, -1357561, -5099, -20017, -711027, -1065628, -1064488, -1188297, -1372613, -1126981, -364465, 514515, 1360140, 2523005, 4004548, 4793872, 3874978, 1893262, 765765, 1172309, 1605846, 859229, 163715]
42132A63715R79049J508671n21177k257287p12781K357400L016587J171073K39644
42123E944894J296720J552614p07258l294728l654423k351729j340315r92067
42115c546292n62857J01220Q33466J745516K434750J999561P45976K87103J054933
42106E093376J479366O31821k47013j02817o203j188775k845781l498998l035854
42097c720878j951804k33996J500871J640725J32774n42300R73894K310772R78507
42088A088565j332410j237503R68225J964037O70975p36225q96548q16662j026798
42079a354344m98432Q17557J294422M15870l34448k41376m16909j129831q11387
42070b258878R06434J781261L57391j535743j661044o68633k89992j20194J107734
$$ y = [163715, 1142764, 2651435, 2130258, -127029, -839810, 1517590, 4534177, 5705250, 5944894, 7241614, 8794228, 8086970, 4792242, 1137819, -1213910, -2554225, -3546292, -4109149, -4007929, -3174463, -1428947, 1005803, 3005364, 3751340, 4038443, 5093376, 6572742, 7204563, 6957550, 6854733, 6848530, 5659755, 2813974, -685024, -3720878, -5672682, -5906678, -4405807, -2765082, -2632308, -3174608, -2200714, 110058, 1088565, -243845, -1481348, -513123, 1450914, 2121889, 1385664, 489116, -327546, -1354344, -1852776, -1035219, 259203, 675073, 340625, 99249, -317660, -1447491, -2258878, -1352444, 428817, 786208, -749535, -2410579, -3079212, -3369204, -3489398, -2381664]
42061b381664K358996J426585j197405k402863p61583J525437J752409J10044
42053D29956j029495k38594J477932J991757L91390j945928k711311j208733R21299
42044a921727J848376J657313J527015J578973Q87007o33449j802906j875401
42036A265201j400433r28997n2696J426704K331384J384089p06664j750829q34853
42027G32906N94010R32203N95180R15887J691736J475241J74515m74438L88263
42018G025503J272146O67240o32654j032396o85488o66620o54326K25862R35937
42009F455204k82214k314449j903618J251449L235756J383512j781115k414371
42001C630154q82015m06275j635436j978803p9321K180045K745022K022345J443144
$$ y = [-2381664, -22668, 1403917, 206512, -2196351, -2957934, -1432497, 319912, 429956, -599539, -838133, 639799, 2631556, 3022946, 1077018, -1634293, -2843026, -1921727, -73351, 1583962, 3110977, 4689950, 5576957, 4943508, 3140602, 1265201, -135232, -1064229, -1116925, 309779, 2641163, 4025252, 3318588, 1567759, 732906, 1326916, 2259119, 2854299, 3770186, 5461922, 6937163, 7111678, 6637240, 7025503, 8297649, 8964889, 8332235, 7299839, 6614351, 5947731, 5293405, 5519267, 6455204, 6172990, 3858541, 1954923, 3206372, 6442128, 7825640, 6044525, 3630154, 2748139, 2341864, 706428, -1272375, -1351696, 828349, 3573371, 5595716, 7038860]
41992G038860J177188M46009r46579k339843k926729k313002q56265M46728R11253
41983F37620Q22594O01264n1314j165846j478708p0185J489084P82323j646023
41974g9191k485675k84287K435767K847397J483497N69497M96626J31762n23594
41965D591799l66073N42545Q84679K96576j31640K08980N76991L17464j77785
41956F743536m06512n18464o72020o11928l48811l91606q60095j110860n93817
41947A229423N84297K049343L234321L079409R77879j662446k279649k67539K164108
41938I109146L015042K773703K563635J909592K92712p02194N31713K401369K036465
41929B3931183M0952o9421K470149M187167K872380J101827J977489M323942N221546
$$ y = [7038860, 8216048, 8662057, 7715478, 5375635, 2448906, 135904, -720361, -273633, 637620, 1460214, 2061478, 2010164, 844318, -634390, -704575, 784509, 1566832, -79191, -2564866, -2849153, -413386, 2434011, 3917508, 4487005, 4983631, 5115393, 4591799, 4225726, 4768271, 5652950, 5949526, 5817886, 6026866, 6603857, 6921321, 6743536, 6337024, 5818560, 5146540, 4534612, 4185801, 3794195, 2934100, 1823240, 1229423, 1813720, 3863063, 7097384, 10176793, 11154672, 9492226, 7212577, 6945038, 9109146, 12124188, 14897891, 17461526, 19371118, 19663830, 18961636, 19493349, 21894718, 23931183, 23972135, 23902714, 26372863, 30560030, 33432410, 34534237, 36511726, 40835668, 46057214]
41920D6057214N118036O797438J0527111J3959198J6387443J9457927K3500264
41913A41804631K6738599K9045303L3261749M1235502N0830483N7956608N9125097
41906D39997972N1053176L1293517K281084k7185715m7702350n6215492n5916351
41899C37605841n0990962m3944315l6663914l0585767k5399128j9887258j4417393
41892A15717104j0759199r323576q558035p422202o550768o385988n991868m686547
41884E6038921l395983l237867l774068l807410l256115l114025l753249m194966
41876B7505238l343685j541567m33535j083143k533280k873009j665908l47052
41868A3684059L2233J65178Q48504J346397P14030l55394o32383m32810p86967
$$ y = [46057214, 51175250, 57972688, 68499799, 82458997, 98846440, 118304367, 141804631, 168543230, 197588533, 230850282, 272085784, 322916267, 380872875, 439997972, 491051148, 522344665, 524625749, 497440034, 449737684, 393522192, 337605841, 286614879, 242670564, 206006650, 175420883, 150021755, 130134497, 115717104, 104957905, 95634329, 87076294, 79654092, 73103324, 66717336, 60725468, 56038921, 52642938, 49405071, 45631003, 41823593, 38567478, 35453453, 31700204, 27505238, 24161553, 22619986, 22186451, 21103308, 18570028, 15697019, 14031111, 13684059, 13716292, 13881470, 14729974, 16076371, 16790401, 16435007, 15802624, 15369814, 14582847]
41859A4582847j248154o45427L83167k4240j735473k336896o52289J506720J939454
41850A1769709O67192r23803j995419k370849k022123j329361q80133n31887K64607
41841B647933J063857Q25120r7347j58657P80233J027114j25420j185609r22350
41832C854874m8475M62467O68191L71821j029271k278455p06098L305970N331764
41823I932788K869543o20899q49882Q82767N12915j714313k018149N4622Q84525
41814I933917p99751j868206m95670P27732m07739j802759p68866J442393J998045
41805G959096J084111Q96290J565135J304744j07998q87843j71217Q81700J025189
41796A3549207K16336j059018k196569k217237o28318J285414J428828m38606
$$ y = [14582847, 13334693, 12689266, 13072433, 13048193, 11312720, 8975824, 8323535, 9830255, 11769709, 12436901, 11513098, 9517679, 7146830, 5124707, 3795346, 2915213, 2383326, 2647933, 3711790, 4536910, 4439563, 4280906, 5061139, 6088253, 5962833, 4777224, 3854874, 3806399, 4268866, 4937057, 5308878, 4279607, 2001152, 1295054, 4601024, 9932788, 12802331, 12181432, 11331550, 12214317, 12727232, 11012919, 8994770, 9049392, 9933917, 9134166, 7265960, 6770290, 7498022, 7090283, 5287524, 4518658, 5961051, 7959096, 9043207, 9939497, 11504632, 12809376, 12701378, 11813535, 11642318, 12524018, 13549207, 13765543, 12706525, 10509956, 8292719, 7664401, 8949815, 10378643, 9940037]
41788I940037k119675j602822N26545J915181J260311l26833q52945N3965P51938
41779I545702q9662j501543j491049R7041J369096J096099J03091n42619j106304
41770G479852j905787j884563l4270K553542L608312K330757p2813k155834l328585
41761F590611l406635k297652l65101J558669K605137K136752J84300j950538
41753E055543k451119j160672n2209m94946j172029k43580J488596J742174N09124
41744C220882R9474J264379J840292J82222k229778k974321j782172K8116J739001
41735A388095L106085L153905J166975j505461k491695j301214K89160Q43962
41727D649812Q09252J119426J655012J788498J441022Q27330n4792r02472q07867
$$ y = [9940037, 7820362, 6217540, 6744085, 8659266, 9919577, 9592744, 8739799, 8793764, 9545702, 9456040, 7954497, 6463448, 6560489, 7929585, 9025684, 9128775, 8586156, 7479852, 5574065, 3689502, 3655232, 6208774, 9817086, 12147843, 12075030, 9919196, 6590611, 3183976, 886324, 521223, 2079892, 4685029, 6821781, 7006081, 5055543, 2604424, 1443752, 1391543, 896597, -275432, -519012, 969584, 2711758, 3220882, 3320356, 4584735, 6425027, 6607249, 4377471, 1403150, -379022, -350906, 1388095, 4494180, 7648085, 8815060, 7309599, 4817904, 3516690, 3805850, 4649812, 5459064, 6578490, 8233502, 10022000, 11463022, 12290352, 12235560, 11333088, 10525221]
41718A0525221N23211J711770R97532j449943l487571l422068j645524L40190
41710D092818J598254J987159J632067J031245J092574K042009K603979J363696
41702A7443801j098824k571197j949680n17426M0855j44696J93006J326401K280596
41693A5002836K439603K206169J903640J091211m38991j706856j500406j71308
41685A8825898M06931q36877k410375j743644J455330M334809M167882J777773
41677B5977727M56219J708523L594641L692091K261821J498134K627334M895224
41669D6711714O856895P632900P278486O828524P656054R981745J2380292J3490815
41661A18817425J3653101J3939498J4201606J3291395J0778847P144580K590192
$$ y = [10525221, 11048432, 12760202, 13757734, 12307791, 8820220, 5398152, 3752628, 4092818, 5691072, 7678231, 9310298, 10341543, 11434117, 13476126, 16080105, 17443801, 16344977, 13773780, 11824100, 11306674, 11347529, 11202833, 11395839, 12722240, 15002836, 17442439, 19648608, 21552248, 22643459, 22204468, 20497612, 18997206, 18825898, 19232829, 18395952, 15985577, 14241933, 15697263, 20032072, 24199954, 25977727, 26433946, 28142469, 31737110, 35429201, 37691022, 39189156, 41816490, 46711714, 53568609, 61201509, 68479995, 75308519, 82964573, 92946318, 105326610, 118817425, 132470526, 146410024, 160611630, 173903025, 184681872, 191826452, 194416644]
41654A94416644k919560q554065j2964393j5738134j7230895j7151611j4944255
41647A04913731j1568045r049868p937384o992039n775370n434522o152706o090094
41639D5913703m265223k484456k613022l626681l442713k280112j872653k354641
41631B2974202k409219j926854k021477k606434k356844j149031k46584J31364
41623A0389123J068497K364456K175230J20757j614987j564490j176200k091993
41615I670393l173391k340507K8089J774718K146339K133981K208130J857057
41607A4304809J144631P08124K40983j053816k382606j834426N15481K001993
41599A3645173R17703j022693j143828N37287J731993J225824J78071K10552J480827
$$ y = [194416644, 191497084, 182943019, 169978626, 154240492, 137009597, 119857986, 104913731, 93345686, 84295818, 76358434, 69366395, 63591025, 58156503, 52003797, 45913703, 41648480, 39164024, 36551002, 32924321, 29481608, 27201496, 25328843, 22974202, 20564983, 18638129, 16616652, 14010218, 11653374, 10504343, 10257759, 10389123, 11457620, 13822076, 15997306, 16118063, 14503076, 12938586, 11762386, 9670393, 6497002, 4156495, 4184584, 5959302, 8105641, 10239622, 12447752, 14304809, 15449440, 16157564, 16398547, 15344731, 12962125, 11127699, 11643180, 13645173, 14562876, 13540183, 12396355, 12933642, 14665635, 15891459, 16069530, 16280082, 17760909]
41590A7760909K860461L242637K508769J624938J678739K518773K824378K041342
41582C7060946J533862K806125N127757O306151N623685M406567L462377J793332
41574F8120802j157329l610909l583143k071026k070864m394820o342751n273523
41566C9616437k102851r4574r33058l191417m447484l838563k319992j159811
41558B1528687p06763m86980j44809M0117k14114l36655N35131J914072J836745
41549B3965431p04635l778127m258055j603697J309013J579924m93207k299965
41541A3716682k224638j011765j04304K83263J015667K453969L592899L029518
41533B0751291P43985j526690k162883j582717j435317k020585j849574k07745
$$ y = [17760909, 20621370, 23864007, 26372776, 27997714, 29676453, 32195226, 35019604, 37060946, 38594808, 41400933, 46528690, 52834841, 58458526, 62865093, 66327470, 68120802, 66963473, 63352564, 59769421, 57698395, 55627531, 51232711, 44889960, 39616437, 37513586, 37419012, 36485954, 33294537, 28847053, 25008490, 22688498, 21528687, 20821924, 20334944, 20190135, 20230252, 20016138, 19679483, 20214614, 22128686, 23965431, 23260796, 19482669, 15224614, 13620917, 14929930, 16509854, 16016647, 13716682, 11492044, 10480279, 10375975, 10659238, 11674905, 14128874, 17721773, 20751291, 21495276, 19968586, 17805703, 16222986, 14787669, 12767084, 10917510, 10709765]
41525A0709765J357513J253814K43799p3116j95058j807434m187661m187461o54571
41516B459590L351372M217784K037984l76301j381469j474221j289623q44226
41508F700890o22238j409180k679771k743284j037885R84222J810016J590083
41500B592853J320299J313544J205724P12721k66553j614389k505741j783189
41492I75269M01369K081590J648255K3773m94199O66550J702913J108394k66271
41483G847643o42427M2056J92224q23706j424518M5582K711876L911901K433604
41474A4294235k11237k051724k873412l307096k991119j308829O79855J056886
41466C287559p8667m43401J121899K909921K889669J410291o406j198698k815720
$$ y = [10709765, 12067278, 13321092, 13564891, 13491775, 13296717, 11489283, 7301622, 3114161, 2459590, 5810962, 10028746, 12066730, 11690429, 10308960, 8834739, 7545116, 6700890, 6078652, 4669472, 1989701, -753583, -1791468, -807246, 1002770, 2592853, 3913152, 5226696, 6432420, 7145141, 6878588, 5264199, 2758458, 975269, 1376638, 3458228, 5106483, 5130256, 4636057, 5302607, 7005520, 8113914, 7847643, 7205216, 7247272, 7439496, 6615790, 5191272, 5236854, 7948730, 11860631, 14294235, 14082998, 12031274, 9157862, 5850766, 2859647, 1550818, 2230673, 3287559, 3208892, 2765491, 3887390, 6797311, 9686980, 11097271, 11090865, 9892167, 7076447]
41457G076447m095011l406760r88646Q59288Q04912N9989J81129P75182N81363
41448A847893k19867l20316M54301P15854l25052j436021r32479R01210J959094
41439B644617R36098j022571j780038q11161L75681L14679o48663r43015K99330
41430f35043K227691L058564J811506n82330k036790j496310j42361J01663j022965
41421A283625k052628j985045j339613q36358l00212N04361J064285R57577N92037
41412b111971L25058k03663r85107r29643N71770K227239K301415Q71449n87894
41403A478653j204457j037707k04013Q00159O47429j127720k536494j279581J793247
41394b670484L529360K740473J312022P81791L38015q50521j645989q35112O30501
$$ y = [7076447, 2981436, -425324, -1413970, -554682, 250230, 310219, 491348, 1266530, 1847893, 1628026, 1307710, 1762011, 2477865, 2152813, 716792, -215687, 685523, 2644617, 3580715, 2558144, 778106, -33055, 342626, 657305, 8642, -934373, -635043, 1592648, 4651212, 6462718, 5880388, 3843598, 2347288, 2204927, 2306590, 1283625, -769003, -2754048, -4093661, -4930019, -5230231, -4725870, -3661585, -2704008, -2111971, -1786913, -1990576, -2975683, -3905326, -3333556, -1106317, 1195098, 2066547, 1478653, 274196, -763511, -967524, -167365, 480064, -647656, -3184150, -4463731, -2670484, 858876, 3599349, 4911371, 5693162, 6031177, 5180656, 3534667, 2699555, 3330056]
41385C330056Q98040l21379j814251k523994k144930r03016M08831R68355J043484
41376a058804J580632K356506K025240N03876n40899m40208o78034j988173k505592
41367g45456q04378J189867Q95577p69054q12455J115937K423983J691820K07400
41358D393241p29688j268212j266909K32106K756171L877450K273822l83635j831890
41349H052456j955813j817031j409515j18721J440277J825486Q31808k16750l44546
41340F287651n7737l16072j135756j720659j625480j209037q82699m76282J64747
41331i71324L93693m64969j625919j388864M01334J754683J209417j94066p43275
41322a629290n27165n21258m47331L93669J072247K27460j186515r50187P42869
$$ y = [3330056, 4228096, 3906717, 2092466, -431528, -2576458, -3479474, -3070643, -2102288, -1058804, 521828, 2878334, 4903574, 5407450, 4866551, 4426343, 3748309, 1760136, -745456, -1549834, -359967, 535610, -233444, -1045899, 70038, 2494021, 4185841, 4393241, 3663553, 2395341, 1128432, 1360538, 4116709, 7994159, 10267981, 9884346, 8052456, 6096643, 4279612, 2870097, 2751376, 4191653, 6017139, 6848947, 6632197, 6287651, 6229914, 5913842, 4778086, 3057427, 1431947, 222910, -659789, -1136071, -971324, -577631, -1042600, -2668519, -4057383, -3656049, -1901366, -691949, -886015, -1629290, -2156455, -2677713, -3125044, -2731375, -1659128, -1431668, -2618183, -3568370, -2825501]
41313b825501J419411M40347N6080J432499K476846J230179r70907j686212q31555
41304G41187J06302P50075J534124J872435Q34431j008808k278520k709482k677249
41295b835505j626322R28529L299396K868469k74007k838493k137345R13711L150439
41286A448872K565269o0790k224793k120428l85942O86645j8708j132429j032466
41277b274770l30387o65993j804239j923453o24769M31090K70375L7737Q46828
41268f037581J866934J758269Q11490L33929O66104J059415J061143Q44446L66572
41259B730721o86058j966855k345687j136598R46081K382139K260722R90316k29477
41250B945304m84924J87788R49679Q76193k39914j544812j749669m97487R78542
$$ y = [-2825501, -1406090, -965743, -909663, 522836, 2999682, 4229861, 3258954, 1572742, 741187, 847489, 1597564, 3131688, 5004123, 5838554, 4829746, 2551226, -158256, -2835505, -4461827, -3533298, -233902, 2634567, 2360560, -477933, -2615278, -1701567, 1448872, 4014141, 3953351, 1728558, -391870, -777812, -91167, -109875, -1242304, -2274770, -2605157, -3271150, -5075389, -6998842, -7623611, -7192521, -6922146, -6884409, -6037581, -4170647, -2412378, -1600888, -1266959, -600855, 458560, 1519703, 2364149, 2730721, 2044663, 77808, -2267879, -3404477, -2458396, -76257, 2184465, 3174781, 2945304, 2460380, 2648168, 3597847, 4474040, 4234126, 2689314, 939645, 442158, 1420700]
41241A420700J081614k46757j468470j389608l96828M74248P60767L80145p03918
41232h8107j751274j239148J084187K914932J813408j417004l449263k502979
41224d635248n274J995370L162029L833008L434050J437003j065410k252413j695124
41215D207991m96753L62788P62828P00208o3870j338144k228796j969054p53039
41206h15841M54514Q09003K87064l34491k23479O54405J480235J454868O16597
41197D382875k60422m25705K00947R16465P91112l26067j372707j118115K84214
41188C072597J368376J165735K38062m84837j051681j831047k210207j304648
41180a037650J72360K76434j386255k572908j219163J542212K673438J245346
$$ y = [1420700, 2502314, 2255557, 787087, -602521, -999349, -525101, 235666, 615811, -88107, -1839381, -3078529, -1994342, 920590, 2733998, 1316994, -2132269, -4635248, -4640522, -2645152, 516877, 4349885, 7783935, 9220938, 8155528, 5903115, 4207991, 3711238, 4074026, 4836854, 5537062, 5473192, 4135048, 1906252, -62802, -815841, -361327, 447676, 734740, 400249, 176770, 831175, 2311410, 3766278, 4382875, 4122453, 3696748, 3897695, 4814160, 5605272, 5279205, 3906498, 2788383, 3072597, 4440973, 5606708, 5844770, 5359933, 4308252, 2477205, 266998, -1037650, -865290, -588856, -1975111, -4548019, -5767182, -4224970, -1551532, -306186]
41172c06186m91974l95088Q18262J141945L85255Q6401Q19012J351241P53997
41163D162865j50650k10129K39529k0212j177965k018139j415564L11392J591951
41154A313078J066445r16594k323638j490433Q24746K176166J370779k32677p41897
41145A045975o0638M88798K8079j233402k545511k961636j764520N26862K103145
41136d372848J764725M35057j38907K87397N05971r2248o88073l20086Q35463
41127a783549J641980J127306l96505j270209k78023J346843R97728j657207l730683
41118d002319k944951o79597M70932M59673Q15923J407302J066995M81837J238904
41109a685301K452080J741259m16591q86867J001702K108511L83107k268758l492536
$$ y = [-306186, -798160, -1193248, -374986, 766959, 1152214, 1238615, 2057627, 3408868, 4162865, 4012215, 3802086, 4041615, 4021403, 2843438, 825299, -590265, -278873, 1313078, 2379523, 1462929, -860709, -2351142, -1526396, 649770, 2020549, 1787872, 1045975, 985337, 1474135, 1502214, 268812, -2276699, -5238335, -7002855, -6475993, -4372848, -2608123, -2173066, -2311973, -2024576, -1518605, -1610853, -2298926, -2619012, -1783549, -141569, 985737, 589232, -680977, -959000, 387843, 1385571, -271636, -4002319, -6947270, -7626867, -7155935, -6696262, -5880339, -4473037, -3406042, -2924205, -1685301, 766779, 2508038, 2091447, 1204580, 2206282, 4314793, 4697900, 2429142, -1063394]
41100a063394l542995l002770q25274K781143M533215K312713j083482j707727
41092a598571n8096N29796n11166q18504L17259J083576P72746P65764J533926
41083B016730J776291J112798P75151R05146p2278k362750l633875k299970R0849
41074a691908J168931P24650j122m75323q05064o59507K34226J199920J393305
41065A088108R44860M29340k06152j260838k271913k313515j243735r2803q3731
41056e010379j290828k234412j222181J442458L167012J950819q53138j954587
41048f005236j97492K194553K615605R08870j217916k279458j857838m37771Q81765
41039e394918J246841J021143J134112J388932O78202q31692j325829J7709J471399
$$ y = [-1063394, -4606389, -7609159, -8434433, -5653290, -1120075, 1192638, 109156, -1598571, -1656667, -1126871, -1638037, -2456541, -2139282, -1055706, -282960, 482804, 2016730, 3793021, 4905819, 5680970, 6586116, 6513838, 4151088, 517213, -1782757, -1691908, -522977, 201673, 200551, -274772, -1079836, -1739343, -1505117, -305197, 1088108, 2032968, 2462308, 2256156, 995318, -1276595, -3590110, -4833845, -4926648, -5010379, -6301207, -8535619, -9757800, -8315342, -5148330, -3197511, -4050649, -6005236, -6202728, -4008175, -1392570, -483700, -1701616, -3981074, -5838912, -6276683, -5394918, -4148077, -3126934, -1992822, -603890, 74312, -757380, -2083209, -2065500, -594101]
41030e94101J072195o48588j674197j405399r44094q61101l49473J121282K549179
41021a734297K442173N58312j826542l103957k569751p59417J137213K194719
41013c661547K278889J875914J492417J128558L13667j155632k569825k895734
41005c193293k150445j506310j630971j694319p03150R41593K145565K677770
40997e113560K898601K570016J336851k394k19123M82862P44387J16057n21294
40988B292403m88779J35880J277282K587766K680686N76701k131590k689763r45021
40979C295565N10418K42306m81498o36262j107000k153079j944197M39095K734680
40970I00028K372488k0060j888409j988242o30040J542846L067362J794241k134286
$$ y = [-594101, 478094, -170494, -1844691, -3250090, -4194184, -5055285, -5404758, -4283476, -1734297, 707876, 1266188, -560354, -3664311, -6234062, -6993479, -5856266, -3661547, -1382658, 493256, 1985673, 3114231, 3427898, 2272266, -297559, -3193293, -5343738, -6850048, -8481019, -10175338, -10878488, -9936895, -7791330, -5113560, -2214959, 355057, 1691908, 1689514, 1470391, 1953253, 2697640, 2813697, 2292403, 1803624, 1939504, 3216786, 5804552, 8485238, 9061939, 6930349, 4240586, 3295565, 3805983, 4048289, 3566791, 2930529, 1823529, -329550, -2273747, -1834652, 900028, 3272516, 3252456, 1364047, -624195, -1254235, 288611, 3355973, 5150214, 3015928]
40961C015928n023696l861845m44115J284900N95986k21289j39787n6621J38230
40952d712309J543814L268097K839212J13755k136734k115759q27183M09120J479702
40943a38285J974145J070325k81578J7585J460558R46202k087320l890439j917060
40934b845867J021802J059451q53554r93966R19506J605295j61927j690774q07198
40925b747232J006404J273640O1523p76425m66355J79146M16134L97663N11895
40916a43607P74326R52745Q47289L98800k50026p96741j005326q82618n82232
40907f87390j83275L28677Q10974Q50414K10755o00369p02201l4446L72894j86630
40897A79403r88453r30721j68985L00350K87043M21839P39357O14851J28454O2434
$$ y = [3015928, -2007768, -5869613, -6313728, -5028828, -4432842, -4654131, -4793918, -4850539, -4712309, -3168495, 99602, 2938814, 3052569, 915835, -1199924, -2027107, -1617987, -138285, 1835860, 2906185, 2624607, 2642192, 4102750, 5048952, 2961632, -928807, -2845867, -1824065, -764614, -1618168, -2612134, -1692628, -87333, -249260, -1940034, -2747232, -1740828, -467188, -405665, -1182090, -1648445, -1469299, -1053165, -655502, -143607, 630719, 1583464, 2430753, 2829553, 2579527, 1782786, 777460, -105158, -687390, -870665, -541988, 268986, 1119400, 1330155, 729786, 27585, -6861, 366033, 179403, -809050, -1739771, -1908756, -1608406, -1321363, -899524, -160167, 454684, 583138, 645572]
40887F45572L44326k1934j105821j673115j205063o88511o34225m3298J470403
40878b911666K212735P75459j384499j681262N2927J665208J824025J115585K12076
40869A880588j010190k199695k199670p69261O61434P87118N1915k56199K49930
40860b804030J003977J567649J838160J435188j18079k287584l329306k033058
40852d727083M19620J322053k50389j865448p03752K370760L523448J028489k337274
40843a219576l110300j599298o62330j241920j564882n18310O53599O72737K79549
40834h310731P93762J906969K201095J208076j43973q59734q39033o04468n94753
40825e242790o94650k57484J143398K791522L121336J403527j165360k600244
$$ y = [645572, 989898, 967964, -137857, -1810972, -3016035, -3704546, -4338771, -4382069, -2911666, -698931, 76528, -1307971, -2989233, -2936306, -1271098, 552927, 1668512, 1880588, 870398, -1329297, -3528967, -4298228, -3636794, -2849676, -2797761, -3053960, -2804030, -1800053, -232404, 1605756, 3040944, 2922865, 635281, -2694025, -4727083, -4307463, -2985410, -3235799, -5101247, -5804999, -3434239, 89209, 1117698, -1219576, -4329876, -5929174, -6591504, -7833424, -9398306, -9916616, -9263017, -8590280, -8310731, -7516969, -5610000, -3408905, -2200829, -2344802, -3204536, -4043569, -4648037, -5242790, -5937440, -6194924, -5051526, -2260004, 861332, 2264859, 1099499, -1500745]
40817a500745k222756j080393l09230J99756J067977J924527J593171q6401j553315
40808a967409j360936j52362J94102q14906j676223j090462L70997J347084J415196
40799c734919R09562j34415j701820k890221k496812o07602J237292J674162Q17928
40790f926845j15972o7718R89503K066476K065263R12352l10417n13509L33087
40781a567780J336300J493869L67789j413661k279623j277214K72982q0468k520852
40772e668658m089515k330232J410922L813196L733613K759696K265405J946266
40764C840693J223126K57438p07802j521283j440745J98711K325426K693366O81119
40755G550049j811053k881272k752746k609984k537510j767698k72802J040407
$$ y = [-1500745, -3723501, -4803894, -5113124, -4913368, -3845391, -1920864, -327693, -414094, -1967409, -3328345, -3480707, -3286605, -4101511, -5777734, -6868196, -6497199, -5150115, -3734919, -2825357, -2959772, -4661592, -7551813, -10048625, -10656227, -9418935, -7744773, -6926845, -7042817, -7110535, -6121032, -4054556, -1989293, -1076941, -1387358, -1900867, -1567780, -231480, 1262389, 1630178, 216517, -2063106, -3340320, -3067338, -3147806, -5668658, -9758173, -12088405, -10677483, -6864287, -3130674, -370978, 1894427, 3840693, 5063819, 5321257, 4613455, 3092172, 1651427, 1850138, 4175564, 6868930, 7550049, 5738996, 2857724, 104978, -2505006, -5042516, -6810214, -7083016, -6042609]
40747f042609J567497J663363J937695K225464J554172n49835k795938l026068
40739c466259q74429J436922J864074J030442N99887L68919q37179k141108j314930
40730c333661J383934K904267J696673k63614q53021p03818j187302j767001j353842
40721c477385n06164j73948K86639J681975K787584J873096m07346j813767j587683
40712a336999p13408K25342J298873J861614J224998M35857J041925K160559J315149
40703G513910j464096l000965j394756J278288K118947J270032P67839R94797
40695H083996N19761j083349k343031k044328q24256j45424n98560j640874k350818
40686b426883k061202p80469O00379R35941J20078n78355l2875J149537J367041
$$ y = [-6042609, -4475112, -2811749, -874054, 1351410, 2905582, 2355747, -440191, -3466259, -4340688, -2903766, -1039692, -9250, 590637, 959556, 122377, -2018731, -3333661, -1949727, 954540, 2651213, 2387599, 1534578, 830760, -356542, -2123543, -3477385, -3983549, -4157497, -3870858, -2188883, 598701, 2471797, 2064451, 250684, -1336999, -2050407, -1825065, -526192, 1335422, 2560420, 2996277, 4038202, 6198761, 7513910, 6049814, 3048849, 1654093, 2932381, 5051328, 6321360, 7089199, 8083996, 8603757, 7520408, 5177377, 3133049, 2308793, 2163369, 1564809, -76065, -2426883, -4488085, -5268554, -4668175, -3732234, -3612156, -4190511, -4223386, -3073849, -1706808]
40677a706808L42910l64503L26058J271940P41877r62056j928099j310526n4603
40668c643810R40336J711692K116327J604738O15896M35443R68528N22409j240352
40659D031207k198248j075959K18789l75185j552249q23151J122003J386029l59244
40650C73992j346173k20023R98243M32511p77408o58311M36420O22912o05576
40641g43413j848122j822995q34770j14932j41028L9431J372112K812370K072784
40632G91437r80307l293792k488551j83044P07334M89129J462965L179142K755352
40623B439665l3335j942406j403248o38353j164916j046311J018815K385332M65571
40614H0814k617525k944709n40099J311167J170644L85049k08293r95769j330333
$$ y = [-1706808, -1363898, -1728401, -1402343, -130403, 611474, -350582, -2278681, -3589207, -3643810, -2703474, -991782, 1124545, 2729283, 3345179, 3780622, 4749150, 5271559, 4031207, 1832959, 757000, 975789, 600604, -951645, -1774796, -652793, 733236, 373992, -972181, -1192204, -193961, 238550, -538858, -1197169, -760749, -137837, -743413, -2591535, -4414530, -5249300, -5364232, -5505260, -5465829, -4093717, -1281347, 791437, -188870, -3482662, -5971213, -6154257, -5446923, -4957794, -3494829, -315687, 2439665, 2406330, 463924, -939324, -1577677, -2742593, -3788904, -2770089, -384757, 80814, -2536711, -5481420, -6021519, -4710352, -3539708, -3154659, -3362952, -4358721, -5689054]
40605e689054N8051K196704K468538N82214q01525r2074J153117J098115K01853
40596A175939l25694o13735j153054j238294j0068J824149K671423J984038N53346
40587D868050p20523j522669j773685j270789L8804J442804J484592n47367k943800
40578i44583k714875N64231L347923K288272j210955k895152j506587J13228p5212
40569c033710m61152Q63066K627291K442783N67781p31197n92097j42717j59034
40560A381014j56325J77181K92849j71083q24231j255696j420484j179846l58167
40551c514788N69837O98780j21065j023378j328853j307213j329782r47486M28624
40542g875324K234130L013478K151786O77099o8876k3174m6780m17449o33127
$$ y = [-5689054, -5631003, -3434299, -965761, -383547, -1185072, -1277146, -124029, 974086, 1175939, 850245, 236510, -916544, -2154838, -2164906, -340757, 2330666, 4314704, 4868050, 4147527, 2624858, 851173, -419616, -380812, 1061992, 2546584, 1999217, -944583, -3659458, -3095227, 252696, 2540968, 1330013, -1565139, -3071726, -2958498, -3033710, -3494862, -2631796, -4505, 2438278, 3006059, 2274862, 1682765, 1540048, 1381014, 1224689, 1401870, 1694719, 1523636, 699405, -556291, -1976775, -3156621, -3514788, -2944951, -2246171, -2367236, -3390614, -4719467, -6026680, -7356462, -8303948, -7875324, -5641194, -2627716, -475930, 201169, 132293, 109119, 62339, -355110, -988237]
40533i88237n77777o80270o62881M91332K537596L279610J275145j706015k641819
40524C26684j185151J94145j44130j192110j500256j291091j375810j376354l28561
40515g872634J611438L058816K759014P10063j620136k178182l03192K087103
40507a747710K396765O17644o70823N2196J260618R27084n72974j520633j543777
40498h01610j529524j642546j201040j99617O25738J181051K073163L171007L301160
40489D977782J723945q19142k723155k767596r83733J145837J694809K17224j619178
40480H46793j964329q90613J96953O28005P92516Q28393L85936l12875m92538
40471A8241j37462j35512p31195q73979K77384J915618K344654R31940j114229
$$ y = [-988237, -1566014, -2246284, -2909165, -2417833, 119763, 3399373, 4674518, 2968503, 326684, -858467, -664322, -808452, -2000562, -3500818, -4791909, -6167719, -7544073, -7872634, -6261196, -3202380, -443366, 266697, -1353439, -3531621, -3834813, -1747710, 649055, 1266699, 595876, 648072, 1908690, 2835774, 2262800, 742167, -801610, -2331134, -3973680, -5174720, -5374337, -4748599, -3567548, -1494385, 1676622, 4977782, 6701727, 5882585, 3159430, 391834, -591899, 553938, 2248747, 2465971, 846793, -1117536, -2008149, -1811196, -1183191, -390675, 437718, 823654, 510779, 18241, -119221, -254733, -985928, -1859907, -1582523, 333095, 2677749, 3609689, 2495460]
40462B495460j921216q80196O30184P77660m27395j126715k74276P85685L93350
40453D52541q01687q86951K52212Q47979J49513n71879k99462L26671O15471J078773
40443A163181K001721K288401J118484l93807o62179Q7627M11547j67468r97405
40434D850102j714891k272940k019290n10444R10384K58808k062187l207266j562613
40425g330337J145446K352755J770958P86151J31872k07289J71502J382522J960340
40416B163920L89602k195806k975050j339123L44231M25241P6756N76617R19418
40407a614194Q5587m37960Q95886K263220P61476k562508l529858r12379J782303
40398c268427J663662L55666O74376K111838K194280O12812o49285m67134L68719
$$ y = [2495460, 574244, -305952, 324232, 1101892, 674497, -452218, -726494, 59191, 452541, -349146, -1236097, -983885, -135906, 13607, -558272, -857734, -531063, 84408, 1163181, 3164902, 5453303, 6571787, 6177980, 5515801, 5603428, 6014975, 5847507, 4850102, 3135211, 862271, -1157019, -1667463, -757079, -498271, -2560458, -5767724, -7330337, -6184891, -3832136, -2061178, -1275027, -1143155, -1350444, -1178942, 203580, 2163920, 2553522, 357716, -2617334, -3956457, -3612226, -3186985, -3110229, -2533612, -1614194, -1528607, -1966567, -1070681, 1192539, 1954015, -608493, -4138351, -5050730, -3268427, -1604765, -1249099, -574723, 1537115, 3731395, 4344207, 3694922, 3227788, 3596507]
40389C596507Q16562N68270k80134j178953j213661l71137R949q47802j801155
40380g01554j586947p64379l43799J49447J293114J789365L15885j636223j493779
40371b978870M17350J389128M89140o37307r87945j242969j415865n22608R18962
40362d570984J119237M31653J299831L708973M120368P96611k956351l333080
40354F16258j223293r4691p51030j228600n71785K47011N38140N89363N32133
40345a346494L97703P70314J746046K007140N88512j297068j889042j386449j054788
40336a464126q70020p3514Q31342P80178J24416j48533l81499j282572j865019
40327d349347p95537R34763J341275Q54119J489969K980474K923066Q79493r45030
$$ y = [3596507, 4413069, 4981339, 4701205, 3522252, 2308591, 1937454, 1947403, 1099601, -701554, -2288501, -3052880, -3396679, -3247232, -1954118, -164753, 151132, -1485091, -2978870, -2561520, -1172392, -683252, -1320559, -2308504, -3551473, -4967338, -5489946, -4570984, -3451747, -3020094, -1720263, 1988710, 6109078, 6905689, 3949338, 616258, -607035, -701726, -1452756, -2681356, -3253141, -3006130, -2467990, -1878627, -1346494, -948791, -178477, 1567569, 3574709, 4163221, 2866153, 977111, -409338, -1464126, -2334146, -2407660, -1576318, -796140, -671724, -820257, -1201756, -2484328, -4349347, -5144884, -4210121, -2868846, -2014727, -524758, 2455716, 5378782, 6258275, 5313245]
40318E313245j569411k437808l886781l855299j660426J39675k54565q29636P66347
40309h274659L023305K804861K55298j511984q75387P63649J589506J300063N04492
40300d20856l0913L97508J562165J977742P91520n67396k16874J261733J620949
40291F375578L62937o89886l29842N39233P76906N23727J58458n62256j406544
40282E748311j255409K1651N80236j035992l426368l814813j595704J057849K007549
40273a712690J239202Q1166l65399K98921J678840K453317J405540p74767j771580
40264B532550n72660R57320O45061q63384j273234k34696M95353L72623Q69502
40255B928435K173003J857876j202190l843654k398601J719795L385480N94845
$$ y = [5313245, 3743834, 1306026, -2580755, -6436054, -8096480, -7956805, -8211370, -9041006, -8274659, -5251354, -2446493, -2191195, -3703179, -4578566, -3814917, -2225411, -925348, -420856, -451769, -54261, 1507904, 3485646, 4277166, 3709770, 3492896, 4754629, 6375578, 6738515, 6048629, 5718787, 6258020, 7034926, 7558653, 7717111, 7154855, 5748311, 4492902, 4514553, 5094789, 4058797, 632429, -3182384, -4778088, -3720239, -1712690, -473488, -392322, -757721, -458800, 1220040, 3673357, 5078897, 4304130, 2532550, 1959890, 2917210, 3562271, 2698887, 1425653, 1190957, 1686310, 2058933, 2928435, 5101438, 6959314, 5757124, 1913470, -485131, 1234664, 4620144, 5214989]
40247E214989l032791l304215n14233J820736J472570p35333k536908k303414
40239c918599k18028J725862J525876m57148j747198q42718J047528J981408J669836
40230G66819R03558k8925q62046m26675J818370L866500K945936n84711l103641
40221E295185k239219J74471R16051j75430n06230R61090J997484N87309j709224
40212E301487j791011M13479J770882N65791j072562n84891J163653J420302l66915
40203F820215k281365l042163k994247k269293m46589J664010K208546R19927
40195E79041l89833n92058n56686j032922j276620p53853k70900l24627j83565
40186d802023L15548N2475j067260j231683L18717J631712J174471L91157Q79551
$$ y = [5214989, 2182198, -1122017, -1636250, 184486, 1657056, 921723, -1615185, -3918599, -4136627, -2410765, -884889, -1342037, -3089235, -3931953, -2884425, -903017, 766819, 1670377, 1641452, 779406, 352731, 2171101, 6037601, 8983537, 8398826, 5295185, 3055966, 3230437, 4146488, 3971058, 3464828, 4425918, 6423402, 7010711, 5301487, 3510476, 3923955, 5694837, 6260628, 5188066, 4603175, 5766828, 7187130, 6820215, 4538850, 1496687, -1497560, -3766853, -4213442, -2549432, -340886, 579041, 189208, -402850, -959536, -1992458, -3269078, -4022931, -4293831, -4618458, -4802023, -4486475, -4434000, -5501260, -6732943, -6414226, -4782514, -3608043, -3216886, -2337335]
40177b337335J248272k95091k073968j141088J754825K985810J409078m73905
40169A076598p11907m9097M37194Q21142Q49871k57111j773603j755417j48792
40160a511122Q05669Q9963o16579J1438Q29740M77232m04543o80078o13775p94172
40150b406227p61849p2150P14008J223888J851212K082216K81611l234070m918741
40141e240102k116083K844573N079537K971042o23398k492976k150178p57222
40133b484807Q47733K172864K446514J148867j034087k443606k008459n79678
40125a934659j64480j330799k099093n89911J866841K171318j26374k146793j890557
40116f244507o67398k64318j68389O61985J419775J014028L22316O04510J063084
$$ y = [-2337335, -1089063, -1384154, -3458122, -4599210, -2844385, 141425, 1550503, 1076598, 364691, 315594, 752788, 1573930, 2423801, 2166690, 393087, -1362330, -1511122, -705453, -615490, -1232069, -1220631, -390891, 86341, -318202, -998280, -1612055, -2406227, -3168076, -3240226, -2526218, -1302330, 548882, 2631098, 2912709, -321361, -5240102, -7356185, -4511612, 567925, 3538967, 2915569, 422593, -1727585, -2484807, -1637074, 535790, 2982304, 4131171, 3097084, 653478, -1354981, -1934659, -2099139, -3429938, -5529031, -6118942, -4252101, -2080783, -2207157, -4353950, -6244507, -6911905, -7176223, -7344612, -6682627, -5262852, -4248824, -3926508, -3321998, -2258914]
40107b258914L29501q17583o78854L97285P77151M40685N13075O15926m57838
40098a139566j824988j291601R12282K145041J435221O22883Q35578Q28689j14033
40089B409506n36096L88853R77851j77488j731485j899595j340166j508928j752284
40080e169832n53359J381721J859779N91267m62662r0068Q31247J194648J110283
40071F93024J022713P70025J57822m11110l89245L11831J286120J763905R68993
40062F174078r94397k753615k854397j282130O92686J900609J953854J044940
40054C881628q3122l75745L46711P84221j83873j579822j426914L38452J603283
40045C304819J007812l86157r73667p35174n44213n43782m26813m84992j059164
$$ y = [-2258914, -1929413, -2746996, -3425850, -3028565, -2251414, -1810729, -1297654, -681728, -1139566, -2964554, -4256155, -3343873, -1198832, 236389, 859272, 1694850, 2523539, 2409506, 1873410, 2262263, 3240114, 3062626, 1331141, -568454, -1908620, -3417548, -5169832, -5723191, -4341470, -2481691, -1890424, -2353086, -2443154, -1611907, -417259, 693024, 1715737, 2485762, 2643584, 2232474, 1843229, 2155060, 3441180, 5205085, 6174078, 5179681, 2426066, -428331, -1710461, -1017775, 882834, 2836688, 3881628, 3798506, 3422761, 3769472, 4553693, 4369820, 2789998, 1363084, 1701536, 3304819, 4312631, 3926474, 2952807, 2217633, 1673420, 1129638, 702825, 217833, -841331]
40036h41331j470668q25517L68772O80355j60278q76604n80001M6729K761n11201
40026d166983n34983K65096J344790K074559K160548J471758O5220j548135k569789
40017a437919k544567j728277p69310p1520M55378R40662J004597J55707j099412
40008e094661j302497M6749J285817O04572j031299p73254J880648L704386J908716
39999A229177j824931l342730j220170J959547L142850J729519r60042l226221
39991b513001l654240j906795N80972J959413K244683K785313L396255K168256
39983E060856j137052l747339l379285j240983J29015L30770M29950L93356k74914
39974c435626m46663J166658K972747K075455r10670j889991P80126L430839K160317
$$ y = [-841331, -2311999, -3137516, -2768744, -2088389, -2248667, -3125271, -3705272, -3658543, -3655782, -4166983, -4701966, -4436870, -3092080, -1017521, 1143027, 2614785, 2680005, 1131870, -1437919, -3982486, -5710763, -6480073, -6551593, -6096215, -5155553, -4150956, -3995249, -5094661, -6397158, -6350409, -5064592, -4460020, -5491319, -6264573, -4383925, -679539, 1229177, -595754, -3938484, -5158654, -3199107, -56257, 1673262, 713220, -2513001, -6167241, -8074036, -7493064, -5533651, -3288968, -503655, 2892600, 5060856, 3923804, 176465, -3202820, -4443803, -4314788, -3984018, -3554068, -3160712, -3435626, -3882289, -2715631, 257116, 2332571, 1421901, -468090, 312036, 3742875, 5903192]
39965E903192j644833l531560k148796j38507M98555O63971J276092J157381m92079
39956A543416j714503l44456K193906K357605l86709k608602j832371J46319M98697
39947a46698k97233O2738J354965J264054j94279k44757J895538L232366J679828
39938H606522m71921l07211R46830J89429k095548k429022K1141K068536J412908
39929G941664k20885j60261J397500K257660J317256o71342k349874k682917j548763
39920E280038j99959k22037j444369j951581p25133R71887J523300R32072M283
39911D168501j022183j821630j260272J003464K985453K227805r74995l668670
39903A637473l690877j876183n42770p38668j537013j542815m65441Q25150J410741
$$ y = [5903192, 4258359, 726799, -1421997, -1560504, -1061949, -397978, 878114, 2035495, 1543416, -171087, -515543, 1678363, 4035968, 3649259, 1040657, -791714, -645395, -146698, -443931, -381193, 973772, 2237826, 2043547, 1798790, 3694328, 6926694, 8606522, 8134601, 7827390, 8774220, 8963649, 6868101, 4439079, 4460220, 6528756, 7941664, 7720779, 7560518, 8958018, 11215678, 12532934, 11861592, 9511718, 6828801, 5280038, 5080079, 4858042, 3413673, 1462092, 736959, 1708846, 3232146, 4164218, 4168501, 3146318, 1324688, 64416, 1067880, 4053333, 6281138, 5306143, 1637473, -2053404, -3929587, -4472357, -5211025, -6748038, -8290853, -8756294, -7931144, -6520403]
39894f520403J135635L98581l01518l93160M82916J634611J521427k35803j736276
39885d013990j033589J012968J798856O84648l08145K14930J059561O21140o59826
39876f23447j181300l73881R70642J692367R64142j031206k694914k422594p16212
39867e416403M98843Q16097J658228L224989L568621J804669j95881q76916j350280
39858C731967k674284l168594j164389J460748J641466k31078j230594o51663
39850b286421n05469j480268j714863j44899J670205J930364P52624p20192j632394
39841d131313j401364j5013J359870J533652J016384J016101J125844J11716j303943
39832f88066j038312Q06983J692211N46022o61106j90969J006206J275998N87730
$$ y = [-6520403, -5384768, -4986187, -5287705, -5680865, -5197949, -3563338, -2041911, -2277714, -4013990, -5047579, -4034611, -2235755, -1551107, -1859252, -1644322, -584761, 36379, -623447, -1804747, -2178628, -1207986, 484381, 1448523, 417317, -2277597, -4700191, -5416403, -4917560, -4101463, -2443235, 781754, 4350375, 6155044, 5959163, 5082247, 3731967, 1057683, -2110911, -3275300, -1814552, -173086, -404164, -1634758, -2286421, -2791890, -4272158, -5987021, -6131920, -4461715, -2531351, -1778727, -2498919, -4131313, -5532677, -5547690, -4187820, -2654168, -1637784, -621683, 504161, 615877, -688066, -1726378, -919395, 772816, 1318838, 657732, 466763, 1472969, 2748967, 3336697]
39823C336697l06852j109159j284612j07076J540570J524094k10256r96468L67838
39814B754776J336997l41483k669945k320468K45079J759599J180846M26373M68540
39805B840314J6087j442924k199817j063281O49614J211150R52818J153114J547899
39796C664974O44144j669577l224675j956367J295583L225714J684880j681425
39788A983251l256694j669655J004309K326042K164994J556442O07312q41665
39780C874336j641071n24221J467953J729195m92370k964874l214346j218174
39772b983572J052679J748511L80525k066585l664080k915456k66374K123336
39764f591016K521433J251865r269j40983N18345Q58590K47523q59487j469123
$$ y = [3336697, 3029845, 1920686, 636074, 528998, 2069568, 3593662, 3383406, 2386938, 2754776, 4091773, 3750290, 1080345, -1240123, -995044, 764555, 1945401, 2371774, 2840314, 2856401, 1413477, -786340, -1849621, -1200007, 11143, 963961, 2117075, 3664974, 4309118, 2639541, -585134, -2541501, -1245918, 1979796, 3664676, 1983251, -1273443, -2943098, -1938789, 387253, 2552247, 4108689, 4716001, 3874336, 2233265, 1709044, 3176997, 4906192, 4413822, 1448948, -1765398, -2983572, -1930893, -182382, 198143, -1868442, -5532522, -8447978, -8714352, -6591016, -4069583, -2817718, -2826987, -2967970, -2449625, -1591035, -1343512, -2202999, -3672122]
39755c672122j209563p34545p51737r40499l60204J121934K391701K309572J015620
39746h29843k86880o96455m71812m97920j138448j868106j985282j343255k77390
39737i395391P72324J321126J043358L89188M53411J520744K276069J463928p8371
39728b33614l40783J017941K162954J642500J14138r26822r42678l46086K38344
39719B385894J87928o86284j558923j448990p99123q36761j230261k90845J898874
39710b378491K762974R38052j326130j307591L02999Q62960n9050m62066N79288
39701h7055J519119P83862r79974j669451o7598K689676L841779J811607j611122
39692F230843l111006k064757j017966j382865j316904N33897J995022P70691
$$ y = [-3672122, -4881685, -5616230, -6367967, -7308466, -7668670, -6546736, -4155035, -1845463, -829843, -1116723, -1813178, -2284990, -2782910, -3921358, -5789464, -7774746, -9118001, -9395391, -8623067, -7301941, -6258583, -5869395, -5415984, -3895240, -1619171, -155243, -233614, -574397, 443544, 2606498, 4248998, 4363136, 3436314, 2493636, 2147550, 2385894, 2573822, 1887538, 328615, -1120375, -1919498, -2756259, -3986520, -4277365, -2378491, 384483, 1322535, -3595, -1311186, -1008187, -145227, -204277, -666343, -87055, 1432064, 2215926, 1235952, -433499, -501097, 2188579, 6030358, 7841965, 6230843, 3119837, 1055080, 37114, -1345751, -2662655, -2128758, -133736, 636955]
39684F36955j375052j163172J074989K334215J822075J189315O71815r81699k913749
39675A295692k576487k26376Q04268q18024k575905k287651p68565P34007K305857
39666d113184L259844J794290j465417k884662q55489J594212J382300l77700
39658a665806j064479n96811j01510P68260K176635K185634k39064k371885j296944
39649b205970J432482K246735J102043O82531J199655K80473k163402l104141
39641e29594j108698J559193K509929K038621J378544O79209j56346o82418r56028
39632D732412j645546k404293j897920j16003J119905P42815p3472J63093J251001
39623A871992J970532J579023O5077j928113l013770k130105j13745R88982M95472
$$ y = [636955, -738097, -1901269, -826280, 1507935, 3330010, 4519325, 5191140, 4209441, 1295692, -1280795, -1507171, -702903, -1520927, -4096832, -6384483, -7153048, -6419041, -4113184, -853340, 940950, -524467, -3409129, -4264618, -2670406, -1288106, -1665806, -2730285, -3327096, -3428606, -2660346, -483711, 1701923, 1462859, -909026, -2205970, -773488, 1473247, 2575290, 3257821, 4457476, 4737949, 2574547, -529594, -1638292, -79099, 2430830, 4469451, 5847995, 6527204, 6370858, 5688440, 4732412, 3086866, 682573, -1215347, -1331350, -211445, 531370, 457898, 620991, 1871992, 3842524, 5421547, 5486624, 3558511, 544741, -1585364, -1699109, -710127, -214655]
39614b14655k79024j73421N02587J151824J789895K128484J269006p89561k523745
39605B861390k657997j640042o27967R1268Q98978J734642J914224Q44406j197116
39596B221786k747647k162964K51261J836182O89329j481677j504554O93915K063793
39587a40576J040435n14249p21410l56064o88795j013966k59965P54126P77970
39578a122494M53826R83475J511917K39431k271815l226122j300308J600295K884110
39569b47685K214231J105630N00072j43875j401527k481729k105390n72215K57023
39560b875465l84521p95362O26252K565094K514034N91079q11304r08761j230361
39551g09315k201907k144798n91439N54060N80062J435595L616103L969653O41917
$$ y = [-214655, -493679, -667100, -164513, 987311, 2777206, 4905690, 6174696, 5385135, 2861390, 203393, -1436649, -2064616, -1973348, -1074370, 660272, 2574496, 3418902, 2221786, -525861, -2688825, -2437564, -601382, 87947, -1393730, -2898284, -2204369, -140576, 899859, 385610, -335800, -691864, -1380659, -2394625, -2654590, -1900464, -1122494, -668668, 314807, 1826724, 2066155, -205660, -3431782, -4732090, -3131795, -247685, 1966546, 3072176, 3572248, 3428373, 2026846, -454883, -2560273, -3132488, -2875465, -3259986, -4055348, -3429096, -864002, 1650032, 2241111, 1429807, 521046, -709315, -2911222, -5056020, -5647459, -5093399, -4513337, -3077742, 538361, 4508014, 5149931]
39542E149931k772957j949420J461063K248891n13341k717598j953861l22673
39534a369965R2767K17646J009807J201013n3225j207739r73384m50283p15984
39525b249347n90264J075573K823351K565673P01119q46675j500356j906925j966997
39516a894848j093669J60162O36453M11778N16908J103287J318729Q01009N6155
39507B015964m31901m09204M27158J764125K152982M88077k166934l496537k689378
39498b345648j178040n52192p52674o09641N34732K033921K504393J292901m91840
39489D35912j011694r2192M01673o31238j512550p9155K780360L843475J749324
39480E883915j369332k829446k328115j245571m75178k6526J46670M6722n6680
$$ y = [5149931, 2376974, 427554, 1888617, 4137508, 3624167, 906569, -1047292, -1369965, -1277198, -1059552, -49745, 1151268, 1098043, -109696, -1083080, -1533363, -2249347, -2839611, -1764038, 1059313, 3624986, 4326105, 3479430, 1979074, 72149, -1894848, -2988517, -2828355, -2191902, -1780124, -1263216, -159929, 1158800, 1959809, 2015964, 1584063, 1174859, 1602017, 3366142, 5519124, 6007201, 3840267, 343730, -2345648, -3523688, -4075880, -4828554, -5438195, -4903463, -2869542, -365149, 927752, 435912, -575782, -667974, -266301, -897539, -2410089, -2489244, 291116, 4134591, 5883915, 4514583, 1685137, -642978, -1888549, -2363727, -2390253, -2243583, -2196861, -2253541]
39471b253541L8448J80713L97326J100504K100446K067141K7336k828263l910967
39462c080857k049356J169507L142741K758874Q88461r54641j776481j321311
39454a223063o1518Q82509N93716m23890m80798J199842L068020K810850J99168
39445F564836k533767l254387j997420k58293Q15655R88888N23173q098L4081
39436H74668O14281Q83201K97493n85873r87701j019896j201011j374902r99333
39427c499073j94815L57041L65427M6980m30135q64441p53443j7358L62350m63727
39417e091194j575979j114372J096522K906938K282213l70256k677577k613851
39409g157556k45091K370268L107306J966270Q56171P60159L27202j441767k555924
$$ y = [-2253541, -2215093, -2034380, -1637054, -536550, 1563896, 3631037, 3658373, 830110, -3080857, -5130213, -3960706, -817965, 1940909, 2829370, 1874729, 98248, -1223063, -1284581, -402072, 191644, -232246, -713044, 486798, 3554818, 6365668, 6564836, 4031069, 776682, -1220738, -1479031, -663376, 325512, 848685, 840587, 874668, 1488949, 2372150, 2669643, 2083770, 1096069, 76173, -1124838, -2499740, -3499073, -3693888, -3336847, -2971420, -2924440, -3354575, -4219016, -4972459, -4989817, -4627467, -5091194, -6667173, -7781545, -6685023, -3778085, -1495872, -1866128, -4543705, -7157556, -7402647, -5032379, -1925073, 41197, 897368, 1657527, 1984729, 542962, -2012962]
39400b012962o12246K702929K979920n93488l612122k586715L98339J444687N69274
39391a322384M93443J529649J470031J3560m54229Q84679J445731q57948m131806
39382i29274m746118j861822J833464L336754K146458R0311r14153p59445p64416
39373b568241j406012j294424O66454K921897K819487L64299j530544j001256
39365a028340M29838M49369p09569r72360M70168K181256K269633K71411k410821
39356I50585l398582j335712K333770M319647K987368J52262j449016j495698
39348C064624j551339j978876j360768P94231K514494J589802j491900l917746
39340b337478l735048j843529m84219l09071J29457J815142L355500K805871P27954
$$ y = [-2012962, -2625208, 77721, 3057641, 2464153, -1147969, -3734684, -3336345, -1891658, -1322384, -828941, 700708, 2170739, 2184299, 1730070, 2614749, 4060480, 3202532, -929274, -5675392, -7537214, -5703750, -2366996, -220538, -130227, -1044380, -1803825, -2568241, -3974253, -5268677, -4602223, -1680326, 1139161, 1503460, -27084, -1028340, -598502, -149133, -858702, -1831062, -1360894, 820362, 3089995, 3361406, 950585, -2447997, -3783709, -1449939, 2869708, 5857076, 6009338, 4560322, 3064624, 1513285, -465591, -1826359, -1032128, 1482366, 3072168, 1580268, -2337478, -6072526, -7916055, -8400274, -8709345, -8579888, -6764746, -3409246, -603375, 124579]
39331A24579l94560J32200J84911j572954l099798j837479J230943K715881J444035
39322a072242l55147n14417N27686J139270O93211l96108j507916j970761j402503
39313d858927l81965J66035M21767J232946K115094J510056l64163r93376Q00823
39304c51710K605494J700555q65319j807058l22770J233201J112219J13187m88691
39295B929108o31114m26195M48462J358660O82724j521976k620329r08965J452792
$$ y = [124579, -269981, -137781, 47130, -1525824, -4625622, -6463101, -5232158, -2516277, -1072242, -1427389, -1941806, -1414120, -274850, 418361, 22253, -1485663, -3456424, -4858927, -5240892, -5074857, -4653090, -3420144, -1305050, 205006, -159157, -1152533, -351710, 2253784, 3954339, 3089020, 1281962, 959192, 2192393, 3304612, 3417799, 2929108, 2297994, 1871799, 2320261, 3678921, 4361645, 2839669, 219340, -689625, 763167]
$$ [...]
##END NTUPLES=NMR SPECTRUM
##END=
