##TITLE=31Pdec_LR-785-R2-C3
 CDCl3, 64 sc
 10.2.2025
##JCAMPDX= 6.0         $$ Bruker NMR JCAMP-DX V2.0
##DATA TYPE= NMR SPECTRUM
##DATA CLASS= NTUPLES
##ORIGIN= UXNMR, Bruker Analytische Messtechnik GmbH
##OWNER= root
$$ XWIN-NMR		Version 3.5
$$ Mon Feb 10 13:44:43 2025 Russian Standard Time (UT+4h)  she@DPX200
##.OBSERVE FREQUENCY= 81.013821
##.OBSERVE NUCLEUS= ^31P
##.ACQUISITION MODE= SIMULTANEOUS
##.ACQUISITION SCHEME= undefined
##.AVERAGES= 24
##.DIGITISER RES= 17
##SPECTROMETER/DATA SYSTEM= spect
##.PULSE SEQUENCE= zgpg30
##.SOLVENT NAME= CDCl3
##.SHIFT REFERENCE= (INTERNAL, CDCl3, 0, 198.062)
##AUDIT TRAIL= $$ (NUMBER, WHEN, WHO, WHERE, WHAT)
$$ ##TITLE= Audit trail, XWIN-NMR		Version 3.5
$$ ##JCAMPDX= 5.01
$$ ##ORIGIN= Bruker BioSpin GmbH
$$ ##OWNER= she
$$ F:/spectra/data/she/nmr/P31/2/pdata/1/auditp.txt
$$ ##AUDIT TRAIL=  $$ (NUMBER, WHEN, WHO, WHERE, WHAT)
(   1,<2025-02-10 13:43:33.79 +0400>,<she>,<DPX200>,
      <created by zg, POWCHK disabled, PULCHK disabled
       configuration hash MD5:
       00 E9 B6 7A A2 85 ED C7 34 08 36 98 17 FE 4E 26
       data hash MD5: 32K
       B3 0F 49 81 3C EC 04 DD DB A2 E4 D9 73 A8 6C EF>)
(   2,<2025-02-10 13:43:36.17 +0400>,<she>,<DPX200>,
      <Start of raw data processing
       efp BC_mod = 2 LB = 1.5 FT_mod = 6 PKNL = 1 PHC0 = 1384.434 PHC1 = 836.6951 SI = 64K 
       data hash MD5: 64K
       98 80 83 97 74 E6 61 3F 33 4E AE FB A0 6D B0 8F>)
(   3,<2025-02-10 13:44:09.40 +0400>,<she>,<DPX200>,
      <pk PHC0 = 390.2694 PHC1 = -766.5998 
       data hash MD5: 64K
       AA 4E 3A 1A 8D 09 9E 97 00 87 D6 69 D3 B7 9B 8F>)
$$ ##END=
$$ 
$$ hash MD5
$$ 11 1A 32 7C CB 06 84 40 28 5E 92 0D DB 85 27 B6
##$RELAX= 
##$RELAX= 
##$RELAX= 
##$RELAX= 
##$RELAX= 
##$RELAX= 
##$RELAX= 
##$RELAX= 
$$ Bruker specific parameters
$$ --------------------------
##$DU= <F:/spectra>
##$EXPNO= 2
##$NAME= <P31>
##$PROCNO= 1
##$TYPE= <nmr>
##$USER= <she>
##$AMP= (0..31)
100 100 100 100 100 100 100 100 100 100 100 100 100 100 100 100 100 100 
100 100 100 100 100 100 100 100 100 100 100 100 100 100 
##$AQSEQ= 0
##$AQ_mod= 1
##$AUNM= <au_zg>
##$AUTOPOS= <>
##$BF1= 81.014009
##$BF2= 200.13
##$BF3= 200.13
##$BF4= 200.13
##$BF5= 200.13
##$BF6= 200.13
##$BF7= 200.13
##$BF8= 200.13
##$BYTORDA= 1
##$CFDGTYP= 0
##$CFRGTYP= 5
##$CHEMSTR= <none>
##$CNST= (0..31)
1 1 145 1 1 1 1 1 1 1 1 1 1 1 1 1 1 1 1 1 1 1 1 1 1 1 1 1 1 1 1 1 
##$CPDPRG= <waltz16>
##$CPDPRG1= <>
##$CPDPRG2= <waltz16>
##$CPDPRG3= <>
##$CPDPRG4= <mlev>
##$CPDPRG5= <mlev>
##$CPDPRG6= <mlev>
##$CPDPRG7= <mlev>
##$CPDPRG8= <mlev>
##$CPDPRGB= <>
##$CPDPRGT= <>
##$D= (0..31)
0 1 0 0 0 0 0 0 0 0.06 0 0.03 2e-05 3e-06 0 0 0.0002 0 0 0 0 0 0 0 0 0 
0 0 0 0 0 0 
##$DATE= 1739180613
##$DBL= (0..7)
120 120 120 11 120 120 24 19 
##$DBP= (0..7)
150 150 150 150 150 150 150 150 
##$DBP07= 0
##$DBPNAM0= <>
##$DBPNAM1= <>
##$DBPNAM2= <>
##$DBPNAM3= <>
##$DBPNAM4= <>
##$DBPNAM5= <>
##$DBPNAM6= <>
##$DBPNAM7= <>
##$DBPOAL= (0..7)
0.5 0.5 0.5 0.5 0.5 0.5 0.5 0.5 
$$ [...]
##$SUBNAM2= <"">
##$SUBNAM3= <"">
##$SUBNAM4= <"">
##$SUBNAM5= <"">
##$SUBNAM6= <"">
##$SUBNAM7= <"">
##$SUBNAM8= <"">
##$SUBNAM9= <"">
##$SW= 400.765351723535
##$SWIBOX= (0..15)
0 1 3 0 0 0 0 0 0 0 0 0 0 0 0 0 
##$SW_h= 32467.5324675325
##$TD= 32768
##$TD0= 1
##$TE= 0
##$TE2= 300
##$TE3= 300
##$TEG= 300
##$TL= (0..7)
0 120 53 12 22 120 120 120 
##$TP= (0..7)
150 150 150 150 150 150 150 150 
##$TP07= 0
##$TPNAME0= <>
##$TPNAME1= <>
##$TPNAME2= <>
##$TPNAME3= <>
##$TPNAME4= <>
##$TPNAME5= <>
##$TPNAME6= <>
##$TPNAME7= <>
##$TPOAL= (0..7)
0.5 0.5 0.5 0.5 0.5 0.5 0.5 0.5 
##$TPOFFS= (0..7)
0 0 0 0 0 0 0 0 
##$TUNHIN= 0
##$TUNHOUT= 0
##$TUNXOUT= 0
##$USERA1= <user>
##$USERA2= <user>
##$USERA3= <user>
##$USERA4= <user>
##$USERA5= <user>
##$V9= 5
##$VALIST= <valist>
##$VCLIST= <CCCCCCCCCCCCCCC>
##$VD= 0
##$VDLIST= <DDDDDDDDDDDDDDD>
##$VPLIST= <PPPPPPPPPPPPPPP>
##$VTLIST= <TTTTTTTTTTTTTTT>
##$WBST= 1024
##$WBSW= 4
##$XGAIN= (0..3)
0 0 0 0 
##$XL= 0
##$YL= 0
##$YMAX_a= 8621
##$YMIN_a= -9283
##$ZGOPTNS= <>
##$ZL1= 120
##$ZL2= 120
##$ZL3= 120
##$ZL4= 120
##$ABSF1= 0
##$ABSF2= 0
##$ABSG= 0
##$ABSL= 0
##$ALPHA= 0
##$AQORDER= 0
##$ASSFAC= 0
##$ASSFACI= 0
##$ASSFACX= 0
##$ASSWID= 0
##$AUNMP= <proc_1d>
##$AZFE= 0.1
##$AZFW= 0.5
##$BCFW= 0
##$BC_mod= 2
##$BYTORDP= 0
##$COROFFS= 0
##$CY= -3
##$DATMOD= 1
##$DC= 0
##$DFILT= <>
##$DTYPP= 0
##$F1P= 0
##$F2P= 0
##$FCOR= 1
##$FTSIZE= 65536
##$FT_mod= 6
##$GAMMA= 0
##$GB= 0
##$INTBC= 1
##$INTSCL= 9.790993e-09
##$ISEN= 30
##$LB= 1.5
##$LEV0= 0
##$LPBIN= 0
##$MAXI= 10000
##$MC2= 0
##$MEAN= 0
##$ME_mod= 0
##$MI= 50
##$NCOEF= 0
##$NC_proc= -9
##$NLEV= 6
##$NOISF1= 182.463
##$NOISF2= 159.3651
##$NSP= 0
##$NTH_PI= 0
##$NZP= 0
##$OFFSET= 198.0616
##$PC= 4
##$PHC0= 1774.703
##$PHC1= 70.09534
##$PH_mod= 1
##$PKNL= yes
##$PPARMOD= 0
##$PSCAL= 0
##$PSIGN= 0
##$REVERSE= no
##$SF= 81.0140089999434
##$SI= 65536
##$SIGF1= 159.3651
##$SIGF2= -187.1042
##$SINO= 113.3802
##$SIOLD= 16384
##$SREGLST= <1H.CDCl3>
##$SSB= 0
##$STSI= 65536
##$STSR= 0
##$SW_p= 32467.5324675325
##$SYMM= 0
##$S_DEV= 0
##$TDeff= 32768
##$TDoff= 0
##$TI= <>
##$TILT= no
##$TM1= 0
##$TM2= 0
##$TOPLEV= 0
##$USERP1= <user>
##$USERP2= <user>
##$USERP3= <user>
##$USERP4= <user>
##$USERP5= <user>
##$WDW= 1
##$XDIM= 65536
##$YMAX_p= 371335037
##$YMIN_p= -97898707
$$ End of Bruker specific parameters
$$ ---------------------------------
##NTUPLES= NMR SPECTRUM
##VAR_NAME=  FREQUENCY,     SPECTRUM/REAL,   SPECTRUM/IMAG
##SYMBOL=    X,             R,               I
##VAR_TYPE=  INDEPENDENT,   DEPENDENT,       DEPENDENT
##VAR_FORM=  AFFN,          ASDF,            ASDF
##VAR_DIM=   65536,         65536,           65536
##UNITS=     HZ,            ARBITRARY UNITS, ARBITRARY UNITS
##FACTOR=    0.49542278885378, 1,            1
##FIRST=     16045.7642231865, 0,            0
##LAST=      -16421.768244346, 0,            0
##MIN=       -16421.768244346, -97898707,    0
##MAX=       16045.7642231865, 371335037,    0
$$ Real data points
##PAGE= N=1
##DATA TABLE= (X++(R..R)), XYDATA
$$ [...]
46235 5070348 8683647 10208186 9934871 9251642 7766667 4438498 989498 834635 4069842
46226 4069842 6785175 6620180 5930327 7597042 10581632 12167305 12245163 12405067 12498143
46217 12498143 11229329 9082482 7704210 7053501 5762924 3686741 1729800 66646
46209 66646 -999544 311831 4641933 8659942 8523096 5500299 4208546 5626177 6289723
46200 6289723 4647604 3345277 4005989 4519790 3514745 3038734 4235034 4656096 3157573
46191 3157573 3521839 9096911 16844760 21052261 20697481 18903657 17123577 14561038
46183 14561038 12082984 11820224 13085386 12924342 10797668 8864196 7573665 5033062
46175 5033062 1312119 -622907 473539 2034021 1804435 1189116 2674624 6056116
46167 6056116 8859638 9046037 6305510 2039915 -1432681 -3049706 -4310289 -6668445
46159 -6668445 -8291395 -6234146 -1508298 1571205 1475601 1126466 2574931 4073063 4146713
46150 4146713 4532093 6453005 7573295 5888184 3682821 4058094 5878689 5909830 4225179
46141 4225179 3744942 5506026 7758026 8880055 8212407 5125374 452639 -2272997
46133 -2272997 -588539 2596676 2086858 -2592477 -6895655 -7802846 -6828168 -6067644 -5001601
46124 -5001601 -2417105 1428620 5695546 9689386 12202760 12546984 12278797 13010637 12762305
46115 12762305 8387982 1836106 -813867 2070508 5017238 3718695 896352 304174
46107 304174 -191887 -4098612 -8422638 -7003778 -404306 4048515 2547886 -535868
46099 -535868 238770 4455198 8218691 9443790 7961348 3488625 -3091022 -8131600
46091 -8131600 -8149245 -3980484 123008 1372991 873816 1422041 4318342 8484431 11751874
46082 11751874 12703700 11583374 9502537 6976326 3843393 563233 -1472777 -1453874
46074 -1453874 -235884 652526 606394 237600 661453 2710731 6081204 8931264 9202522
46065 9202522 6879104 4226835 3317254 4057240 5085443 5566692 5239031 3629628 596739
46056 596739 -2577921 -3828116 -2354038 475408 2442855 2520170 1640036 1494216 2436724
46047 2436724 2903392 1565474 -322190 -109968 2505636 4579239 3652790 913243 -707878
46038 -707878 -254921 1228826 3308550 6326634 9202766 9662361 7397900 4977426 4570768
46029 4570768 5446347 5884142 5890258 6228448 5994450 3536472 -426897 -2871498 -2219480
46020 -2219480 -188212 1079678 2040388 4166984 6454964 6039636 2561696 -472840
46012 -472840 -84141 2237169 3191555 3194764 6107956 12920796 18732375 18167220 12012431
46003 12012431 5896581 3255576 2446413 889788 -946545 -1253739 -588840 -1593690
45995 -1593690 -5406819 -10022435 -12512308 -11936403 -9629207 -7157644 -4755510 -2075626
45987 -2075626 130663 448013 -569174 285047 5152667 11449136 14111369 11486340
45979 11486340 6777553 3385344 1415494 -310615 -1718661 -2885729 -5311209 -8969227
45971 -8969227 -10218856 -6264856 -507681 547600 -4417296 -10139904 -12090819 -11281576
45963 -11281576 -10563545 -10077438 -8879705 -7996506 -8591324 -8955774 -6550117 -2088050 1198424
45954 1198424 1788306 921033 -43493 -787862 -752440 809338 3160530 4477070 4240111
45945 4240111 3484715 2585306 858724 -1221463 -1549154 914997 4560737 7127132 7905642
45936 7905642 7232587 5326394 2660939 267261 -1286198 -2129490 -1684806 1355988 6497326
45927 6497326 10472384 10513751 7539126 4414922 2024290 -933527 -4771297 -7658677
45919 -7658677 -7903606 -5749646 -2540657 534756 2470686 2491777 736226 -1839607 -4477787
45910 -4477787 -6677344 -7182343 -4373279 1416388 6966189 8864647 6980089 4308193
45902 4308193 3339462 3510953 2761091 844581 -186536 963684 2677009 2657992 1550812
45893 1550812 2214094 5205178 7441085 6698061 5139838 5831786 7320890 5235729 -811606
45884 -811606 -5516928 -4346205 1129056 6190169 8894176 10534715 11800707 11568638
45876 11568638 9331809 6298789 3561301 948604 -1725379 -3695606 -4158848 -3090138
45868 -3090138 -713712 2711695 6038372 7375829 6098452 3933841 2991945 3214283
45860 3214283 2917655 1621929 937778 2132457 3893934 3679117 1072151 -1312838 -719070
45851 -719070 2679926 6261234 7998484 8046787 7451079 6608929 5691835 5612209 7322587
45842 7322587 10254494 12359949 11919595 8887828 4545841 480793 -1967150 -1963227 381786
45833 381786 3656652 5517919 4051214 -489875 -5199280 -6533428 -3435396 1765420
45825 1765420 5752880 6972683 5860153 3554612 1374549 575590 1115269 1107281 -1046358
45816 -1046358 -4359917 -6673395 -7892010 -9616981 -11532522 -10895363 -6656411 -1520085
45808 -1520085 1910467 4794423 9303932 13873656 14518503 10509278 5531186 2609654
45800 2609654 672290 -2527069 -6250021 -7450436 -4513464 1291356 7450879 11873057
45792 11873057 13243814 11218855 6851386 2321012 -323270 -506832 511774 749200
45784 749200 -695454 -3074001 -5437513 -7910584 -10603580 -12002677 -10189277 -5684706
45776 -5684706 -1353550 913774 1787775 2356703 2399930 1767371 1472359 1887846 1568771
45767 1568771 -393358 -2483570 -3240607 -3896769 -5852000 -6976548 -4016535 1728175
45759 1728175 4844635 2455637 -2836964 -7320012 -9927709 -10379828 -7538988 -2396185
45751 -2396185 487965 -1761657 -5586895 -5298019 -882494 2520288 2506295 2415073 5540256
45742 5540256 10256414 13053562 13595331 14058568 15083643 15115968 13274759 10738392 9197662
45733 9197662 9326559 10804946 12684254 13611647 12644788 10121092 7249446 4941675 3564302
45724 3564302 3472057 4763629 6457259 7045874 6544171 7229067 11242230 17451805 21671900
45715 21671900 20633300 15327649 9753838 6570211 4848693 2267095 -1448158 -4020157
45707 -4020157 -3193086 733256 4761593 5509799 2349656 -1540807 -2287238 46550 1365016
45698 1365016 -909288 -4002979 -3622661 -125785 2337251 2372523 3255387 7373491 12297368
45689 12297368 14469372 14027431 13267260 12326734 9521045 4962542 866213 -1551574
45681 -1551574 -3057710 -4203777 -4121468 -1808020 2632068 7821717 11168893 10055552
45673 10055552 4590016 -1736316 -5804019 -7936284 -9188026 -7798194 -2278146 3373770
45665 3373770 2931113 -3013870 -6513175 -2691906 4059953 7147671 6592149 6828997 9223992
45656 9223992 11548137 12665713 12952373 11472818 7492439 3943303 4541425 7688399
45648 7688399 8151368 5126585 3371011 4965369 5419272 1069942 -4160517 -3828892 1916817
45639 1916817 6859023 7140624 4989991 4091330 4839013 5220198 4043560 1967022 431439
45630 431439 370996 1433794 2235782 1743919 216205 -1535739 -3126520 -4164318 -3638841
45621 -3638841 -921925 2817598 5071418 3983572 -156416 -4875797 -7070949 -5812737
45613 -5812737 -3865339 -4953404 -9085777 -12432100 -12579917 -11551700 -12044922 -13114914
45605 -13114914 -12090593 -8840014 -5134561 -1225227 3592652 7947437 9522413 8833830
45597 8833830 8297650 7703731 4624191 -226666 -2385106 101213 3730184 4901212
45589 4901212 4542038 4841424 4927284 3283934 1659510 2533690 4598297 4908285 4285670
45580 4285670 6227007 10819302 14052193 13708107 12064957 11634288 11672285 10568054 8769257
45571 8769257 7268463 5405072 2322812 -1016392 -3261939 -4721016 -5970028 -5708676
45563 -5708676 -2496654 1918611 3659439 1600689 -879032 -103870 3388927 6020866
45555 6020866 6090233 5627635 6903861 8730238 7931044 4030809 386571 -133766 1178992
45546 1178992 1206499 -229307 -424048 1511410 2727935 664728 -2915099 -3867521 -894611
45537 -894611 2951621 3994985 1804699 -1137158 -2791581 -3727990 -5855393 -9529101
45529 -9529101 -12669979 -13026717 -10620819 -7241828 -4164643 -1582725 94458 179092 -632708
45520 -632708 -183432 2568660 6037640 8020791 8135112 7221619 5537083 3073060 768729
45511 768729 -492601 -1706819 -4533322 -8058875 -8764340 -4666117 1867362 6546685
45503 6546685 7535418 6360404 5182202 4498264 3513413 1722413 -270201 -1064165 482602
45494 482602 4007594 7391149 8450312 7284370 6332211 7437970 9381952 9489165 7668588
45485 7668588 7278571 10877390 16156584 17942610 14293124 8920059 6833874 8974836
45477 8974836 12400179 14684391 16077430 17278627 17208464 14410175 9667871 5532309
45469 5532309 3260279 1650417 -589506 -2582699 -2481495 -162464 2643197 4621098
45461 4621098 5799097 6170361 5158942 3207186 2288279 3492927 5214326 5181307 3400334
45452 3400334 1537798 285353 -681959 -725516 1387850 5028258 7794258 8479170 8052603
45443 8052603 7456828 6671464 6401698 7996416 10572414 10954466 8227041 5732345 6167587
45434 6167587 7107689 4573930 -720607 -4402154 -4751759 -4016997 -3533179 -1720058 1977918
45425 1977918 4966844 5425997 5357167 7024356 8588389 6627157 2009032 -246397 2503203
45416 2503203 6864321 7761338 4793013 2305693 3628930 7184342 8953221 7318676
45408 7318676 3942806 567513 -2865347 -6385127 -8359032 -7342584 -4433067 -2005102
45400 -2005102 -735433 380142 1523588 1560645 74730 -1948358 -3746860 -5436217
45392 -5436217 -6759002 -6964825 -6495663 -7074275 -9299186 -11633411 -12581440 -12388625 -11725126
45383 -11725126 -10325046 -8217023 -6916272 -7844565 -10459267 -13228478 -15517062 -17161354
45375 -17161354 -17146069 -14430021 -9683346 -4747926 -588811 3066242 6398497 8993603
45367 8993603 10416441 10290714 8221752 4741942 1899584 1635737 3761676 6582292
45359 6582292 9096452 11338510 13038862 13616923 13379484 12939122 11240422 6149683 -2027645
45350 -2027645 -9192230 -11145922 -8032489 -3894884 -2112619 -2362329 -2131066 -205758
45342 -205758 2050699 2599211 1113185 -917382 -2001893 -1812213 -675197 1016994 2492683
45333 2492683 2754259 1869071 1271393 1826693 2488932 2263410 2759779 6752947 14012194
45324 14012194 20383512 21873512 18554668 13726391 10150437 7904823 5344384 1469395
45316 1469395 -2487467 -3808534 -1215313 3063249 5190198 3812767 1028776 -969043
45308 -969043 -2457347 -4341432 -5455371 -3788567 238640 3867787 5521926 6356522
45300 6356522 7601536 8007434 5463389 499557 -3481102 -3891843 -1891081 -785788
45292 -785788 -1888446 -3063426 -1877763 658316 836246 -3031586 -7805510 -8512800 -3861718
45283 -3861718 2230339 4831445 3008254 210596 168805 3254555 7081973 9843073
45275 9843073 11824651 13433120 13222686 9653669 4536175 2479363 5643150 10491184
45267 10491184 11611981 8029887 3676898 1963735 2523524 3939537 6716755 11271821
45259 11271821 14992089 14563237 10799985 8143205 8888280 10576456 10118438 7989191
45251 7989191 6552454 6190246 5417984 3668122 1551525 -1060638 -4778504 -8473914
45243 -8473914 -9542024 -7044917 -3097108 -602738 -814403 -3275752 -6571598 -8591341
45235 -8591341 -7543083 -3583372 1442472 6137665 10152553 12509705 11373380 6609736
45227 6609736 978525 -2640259 -4085431 -4788857 -5112495 -4438389 -3002591 -1814942 -1002923
45218 -1002923 342300 2632751 4935411 5576779 3373114 -910916 -4053784 -2891207
45210 -2891207 1678768 4801078 3194716 -958936 -3352485 -3053410 -2249655 -1989299 -1444091
45201 -1444091 -872806 -1798995 -3676434 -3412105 562917 5972967 9651643 11052558 11747606
45192 11747606 12971897 14721973 16090368 15685725 12743008 8287172 4201960 1157190
45184 1157190 -1188581 -2315859 -1395756 282380 181725 -1464128 -1285641 2281349 6336928
45175 6336928 7552374 6438566 5460674 5129533 4643285 4719217 6686602 9455536 10103938
45166 10103938 7388047 2779346 -1542262 -3930592 -3291996 -156756 2599745 2358629
45158 2358629 83202 -943526 319785 1469175 293678 -2363236 -3986713 -3050281
45150 -3050281 274887 4641724 8130230 9520310 9572761 10165811 11893503 13505299 13863273
45141 13863273 13240695 12367036 11415318 10459334 9900835 9914396 10348835 11523683 13983112
45132 13983112 16801175 17263573 13487164 7032668 1874639 538233 1705659 1913470
45124 1913470 -505106 -3475383 -3397838 946078 7285740 12531011 15549163 17026173
45116 17026173 17850754 18550834 19307337 19339430 17053662 12069399 6449103 2614162 655615
45107 655615 -921408 -2514347 -3220532 -2806557 -1968929 -901057 422990 745776 -1339132
45098 -1339132 -4490072 -5342560 -3028666 -760093 -1627652 -4737033 -7075539 -7553750 -7209381
45089 -7209381 -6494641 -4648019 -1674721 870300 1613681 858654 -172434 -973749 -2003044
45080 -2003044 -3391381 -4050495 -2690215 434617 3709385 6274527 8715703 11042266
45072 11042266 11648488 9773982 7423516 6623316 6098590 3616347 739342 1527946 6385587
45063 6385587 10985155 12129874 10912945 8869341 5322316 995002 75192 4863476
45055 4863476 11427822 14712836 15435424 17276480 19323523 17041137 10271518 4473239
45047 4473239 2925098 2754949 647521 -1950944 -2084572 -229653 1201577 1789385 2336749
45038 2336749 1959131 -763079 -4508620 -5922481 -3575871 601755 3644657 4003603
45030 4003603 2372851 1476314 4155531 10027355 14877142 15192169 12491846 11034278
45022 11034278 11902419 12037088 9163201 4879823 1997251 1230552 1938296 4133190 7741768
45013 7741768 10914420 11080456 7688448 2895111 -342557 -396799 2078967 4555600 4706838
45004 4706838 2980557 2442283 5172142 9602956 12506501 12720351 11438119 9641145
44996 9641145 7307351 4966947 3882871 4244334 4903808 5294665 5848261 6124329 4687959
44987 4687959 1764320 -154952 255934 1156057 669403 -98407 463711 923785 -1040684
44978 -1040684 -4175977 -5153910 -4276779 -5532577 -9924497 -12702398 -9743412 -3895368
44970 -3895368 -1706222 -5072689 -9186226 -8757512 -3976144 420034 703869 -2097816
44962 -2097816 -3790254 -1946609 1219345 1478714 -2289031 -6817570 -8387081 -6582263
44954 -6582263 -3577554 -1173011 292250 993532 827517 -595244 -3516070 -7158438
44946 -7158438 -9514168 -9214565 -7568343 -7089694 -7848738 -7376585 -4737471 -2234027 -1867032
44937 -1867032 -2538443 -2461159 -1985228 -1871316 -996305 1483162 3452368 2333466 -969439
44928 -969439 -3441242 -4025210 -3368311 -948532 3738041 7874166 7394604 2629029 -1820533
44919 -1820533 -3309287 -3709164 -5215563 -7425285 -9654566 -12312831 -14321076 -12891086
44911 -12891086 -8151235 -4614210 -5220193 -6780723 -4584302 688032 4144943 3351229
44903 3351229 401237 -1919551 -2841405 -2559458 -1237770 371929 1093228 590194 -479242
44894 -479242 -1399933 -1682088 -1051161 -61372 154553 -356440 -138283 1040200 1078351 -1112359
44884 -1112359 -2898559 -1125686 3196491 6318997 7131514 7940698 10016972 11761089
44876 11761089 12093690 12490379 13870347 13855236 9626302 2541372 -2330835 -1479128 3451293
44867 3451293 7683768 8278922 6532369 5523939 6116435 6383267 4749065 2081759 77955
44858 77955 -740203 -187143 2731971 8031054 12805436 13449212 9623371 4219726 -241532
44849 -241532 -3309251 -5225973 -6213032 -7163853 -8913105 -10660695 -11008246 -10307913 -9661941
44840 -9661941 -8022311 -3620302 1385165 1722478 -3639082 -8501379 -6870443 -924849
44832 -924849 2000285 -952699 -5241689 -5515668 -1832914 1696735 2208515 504596 -846146
44823 -846146 -624001 -179689 -1812395 -5945952 -10170167 -11330956 -8394938 -3331275 261945
44814 261945 -379723 -4844794 -9363212 -10184933 -7456774 -4330986 -2173061 763539 4829679
44805 4829679 6395982 2793019 -2403476 -3151094 723257 3305758 1308639 -1302488
44797 -1302488 397265 4789872 6072762 2530014 -1306787 -937321 2676675 5257453
44789 5257453 4846824 3364622 3159676 3896598 3523380 1299854 -1247264 -2226051 -1306251
44780 -1306251 463246 1963969 2642937 2447514 1807504 1408062 1504569 1785496 2264822
44771 2264822 3607889 5779171 7053081 5761617 3013510 2260354 5410663 10136034
44763 10136034 11985977 9177036 4676604 3070557 5422142 7894528 6078241 194180
44755 194180 -5119454 -5982965 -2660825 2330323 7152165 10382454 10165558 6342428 2311592
44746 2311592 1846473 4252860 5290148 2995316 -7640 -470318 1724446 4577794
44738 4577794 6391670 6108094 3465902 207598 -742204 1320609 3942292 4988294
44730 4988294 4904710 4250688 1743471 -2873075 -6447391 -6087721 -3592767 -2911573 -4363118
44721 -4363118 -4916145 -3490470 -2161172 -2139392 -2376985 -2685117 -4423115 -6904952 -6756558
44712 -6756558 -2746578 1780131 3409526 2993836 3367859 5276723 7942316 11164652
44704 11164652 13973756 13450747 8353411 2242069 -717021 -1763212 -5161248 -10514421
44696 -10514421 -12383515 -8417156 -3204728 -1810087 -3136116 -2648969 906378 4712706
44688 4712706 6233244 5379190 3222076 1242144 1403244 4438820 7970038 8365070 4698344
44679 4698344 -736335 -5684592 -9614892 -11932403 -11054698 -6821535 -2213711 -607688
44671 -607688 -1730288 -2029271 751843 4698487 6045761 3462121 -981020 -4730351
44663 -4730351 -7291536 -9281996 -10044245 -7793953 -2383167 3293655 5613726 3712423
44655 3712423 148147 -1798486 -1218089 -115312 -1046383 -4195044 -7011716 -6982619 -4182874
44646 -4182874 -378688 3572866 7797003 11285323 12099303 10351944 8747379 8927230
44638 8927230 9398111 8723919 8538591 10861310 14162661 15211086 13790633 12303176 11268224
44629 11268224 8786104 4538105 710931 -1697294 -4008227 -6401226 -7026665 -6058107
44621 -6058107 -6721089 -9825503 -10907125 -6185751 1597598 7164729 10048360 13432379
44613 13432379 17361774 18373187 15706664 12873253 12097421 11567827 9696361 8060378
44605 8060378 7894770 7168953 4113993 1098995 1643607 4930146 6445430 3807518 -433425
44596 -433425 -2045193 359715 4362806 6578446 6346201 6459114 9426956 13448242 14198337
44587 14198337 11006088 8483879 10349569 14150484 14781386 11433002 7846902 6654267
44579 6654267 6911289 7225661 8061753 10075096 12653126 15127904 17453230 18814623 17553560
44570 17553560 13602680 9317114 6737918 5540420 4777854 4921497 6539611 8372833
44562 8372833 8764448 8184077 8218250 8380713 6184849 952714 -4259497 -5805608 -3668122
44553 -3668122 -1293313 -1415219 -3157888 -3678453 -1806821 1000101 3072771 4451684
44545 4451684 5766385 6532470 5984140 4755878 3940446 2975817 721873 -1362663 85413
44536 85413 5364383 9994691 9894498 6291731 3297774 2425681 2324103 2522055 3873505
44527 3873505 5697841 6144364 5784443 7202927 9937381 9572021 4157317 -1558145 -1480353
44518 -1480353 4105099 9205298 9247477 4676379 -1361474 -5606580 -5582372 -1490625 2556000
44509 2556000 2454475 -264054 -72756 4508455 8354001 7081431 3145818 1398260
44501 1398260 1694403 395377 -2449001 -2572099 1480890 5291962 4411379 221062 -2222363
44492 -2222363 -268108 4362982 8262527 9046866 6266976 1507198 -2433244 -3514732
44484 -3514732 -1777075 1336742 4188578 5283825 3733933 278467 -3072307 -5208790
44476 -5208790 -6834966 -8572708 -9471660 -8516578 -6366277 -4139380 -1541073 2063409
44468 2063409 5493676 6611229 4982180 1884648 -2055533 -7179877 -12537768 -15348997
44460 -15348997 -13727113 -8896342 -4060727 -1723612 -2141499 -3437566 -3245640 -1269650
44452 -1269650 50378 -1218395 -3075893 -1658395 3069500 6396136 4967227 1493178
44444 1493178 1200247 5075710 9151531 9925278 8021239 6137329 5366573 4623254 2646792
44435 2646792 -576609 -4080377 -6659697 -7132819 -4659463 191369 4736724 5906326
44427 5906326 3584119 1112476 1021569 1304834 -1711321 -7189508 -9550732 -5420513 1788881
44418 1788881 5922871 4771019 990121 -1815166 -1816009 766570 3696378 3848225 423418
44409 423418 -3607734 -5096964 -4748455 -5399123 -7387218 -8548778 -8341699 -8692757 -10278924
44400 -10278924 -10971917 -9155475 -6254362 -4613418 -4647763 -5347114 -6076847 -6600873 -6485919
44391 -6485919 -5646275 -4727116 -4301531 -4509062 -5722641 -8262862 -11021819 -11820902 -9860244
44382 -9860244 -6665398 -4119065 -2780933 -2449989 -2807464 -3005860 -2240180 -1204568 -1177510
44373 -1177510 -1259192 1062730 5636297 8606039 7364826 4100630 2206038 1427110 -546838
44364 -546838 -3369842 -4256553 -2180088 1159470 4215013 6642612 7645239 6172791
44356 6172791 3232676 1551030 2229628 3617471 3890199 2882002 1137325 -744343
44348 -744343 -1456723 50010 2367909 2797418 1599006 2423535 6881297 11218604 10940590
44339 10940590 6967877 4180861 4729476 6001099 5306267 3379080 1970607 620001
44331 620001 -1824684 -3925506 -2781077 1452625 4612858 3314448 -870148 -3619091
44323 -3619091 -3306945 -2237303 -2577702 -3297361 -2222481 406175 2137850 1575726 -102330
44314 -102330 -1117750 -1528068 -2948883 -5995788 -8641152 -7928178 -3650247 573187 1036196
44305 1036196 -1759934 -4035577 -3545999 -1367067 1144552 4420918 8670325 12430688
44297 12430688 14830531 16904871 18649499 17354683 11783178 5746396 3762715 4639974
44289 4639974 3541126 -362476 -2887091 -1692352 424850 365009 -1108000 -1836319 -1543846
44280 -1543846 -678301 1000601 2545774 1355451 -2919935 -6335825 -5147953 -536081
44272 -536081 3576171 5636915 6762396 7427464 6877190 5293117 4043191 3794442 3977638
44263 3977638 3881353 3243310 2464777 2885188 5309943 7511496 5695392 108732 -3678573
44254 -3678573 -1826074 2153875 2551365 -45582 -277495 3106041 5485859 4062908
44246 4062908 1921537 2268057 3082377 790965 -3769760 -6681416 -6581011 -5636226 -5520298
44237 -5520298 -5285598 -3572989 -1054738 33355 -1840676 -5759793 -8637859 -7879185
44229 -7879185 -4242031 -1202951 -760455 -844772 1951523 7753794 12906534 13925954 10730261
44220 10730261 5860246 1774695 -341932 50390 3214551 8353329 13194062 15365517
44212 15365517 14348055 11510269 8230791 4857662 1741303 31754 405531 1776959
44204 1776959 2478411 2252923 1878284 1259306 -526335 -3207970 -4954068 -4722798 -3771909
44195 -3771909 -3708519 -3665154 -866931 5545823 12305582 14985247 13140587 10801374 10858679
44186 10858679 10848665 6807704 113725 -3328912 -1076195 2813102 4403085 5326959
44178 5326959 8349654 11229826 9993483 6230345 5472309 8598550 10213001 6602399
44170 6602399 667436 -2892472 -3424847 -3008507 -2325088 -532282 2505411 5907725 8560749
44161 8560749 9222919 7463770 5229873 5408818 7919533 9425445 7989320 5736314
44153 5736314 5627479 7746696 10061457 10781710 8891538 4720547 1120836 1376265 4549809
44144 4549809 5796491 2914674 -594383 -947916 1054034 3266264 6368630 10765824
44136 10765824 12702769 8736304 2136717 -594393 1270509 2433436 188541 -2084567
44128 -2084567 -1150266 1189828 1680079 520056 77540 1009994 2145268 3023541 4573038
44119 4573038 7417345 10385848 11058257 8442704 5212545 5403657 8650061 9129369 2852902
44110 2852902 -6168520 -10613389 -8955421 -5544152 -2984442 -40205 2908132 2639336
44102 2639336 -644848 -1374684 3760472 10497955 12849235 10692942 7791857 5408602
44094 5408602 2323344 -857325 -1974452 -1178192 -892400 -2311024 -4750619 -7664480
44086 -7664480 -10287315 -10028484 -4648157 3808109 10054318 10979402 8059938 4608966
44078 4608966 2834603 3353413 5170415 6075922 5165062 4666323 6908391 10024457 9878323
44069 9878323 6341219 4080855 6199617 10555793 13833686 15657287 16316951 13938700
44061 13938700 7698923 1544686 271035 2749746 3365541 254648 -2238813 -581589
44053 -581589 2530231 2424867 -770872 -2985127 -2279278 -671512 -372751 -1301704 -2585197
44044 -2585197 -3802928 -4043414 -2158811 951094 2431457 1203119 -268365 494379
44036 494379 2441695 3013230 2267339 2504787 4461488 6332004 6448898 4800860 1980629
44027 1980629 -1130178 -2471562 -48433 5104136 9219486 10083524 9316287 9421520 10424651
44018 10424651 10886364 10641339 10602432 10769290 10322249 9287701 8436865 7614287 5660775
44009 5660775 2280188 -1152181 -3132719 -3641160 -3625696 -3238748 -1341910 2799290 7622973
44000 7622973 9992760 8361378 4600166 1952596 1809985 3496238 6388001 10411240
43992 10411240 14635746 17439778 18578437 19390239 20351519 20098369 17723334 14561641
43984 14561641 12712852 12903380 14418599 15821932 15255596 11783840 7262114 5074303
43976 5074303 5997151 7092091 5659410 2155442 -1969693 -6589187 -10999071 -12460871
43968 -12460871 -9726923 -5971191 -4748806 -4615797 -1639350 3798554 7134391 6562138
43960 6562138 5459587 6876591 9528788 11010772 11632526 12686786 13325918 11684138
43952 11684138 7727630 3136836 -482220 -1966658 -752521 1784797 2665797 794042
43944 794042 -1096680 212391 4191077 7558517 8593690 8312485 7880732 7217948 6408041
43935 6408041 6428780 7616521 8789938 8902254 8717129 9781059 11965735 12925844 10432382
43926 10432382 5057769 65465 -1685953 -430696 1420931 2488619 3523940 5172163
43918 5172163 6265719 5640653 4659193 6051090 10170924 13944638 14151028 10694521 5916573
43909 5916573 1674554 -1626591 -3606122 -3333215 -961588 1274347 1177188 -534416 -836534
43900 -836534 1839384 5711490 8164159 8959709 9715734 10959960 11332264 9696342 6634118
43891 6634118 3491411 1116183 93456 1128494 4124037 7287150 8142203 5648579
43883 5648579 1042228 -3298850 -5499477 -4934796 -2096976 1748559 4969070 6335922
43875 6335922 5884027 4790352 3955235 2907947 761206 -1829855 -2576068 138692 5353561
43866 5353561 10205894 12080931 10141578 5671344 1315475 -770514 -529387 584856
43858 584856 1623686 2653915 3547238 3889251 4258133 5749006 7797734 8559165 8076850
43849 8076850 8540140 10283368 10506041 7899133 5425094 5621223 6080770 3443573 -518172
43840 -518172 -1389144 942060 2789703 3131668 4196984 5864629 5230252 2493313 1510799
43831 1510799 2908782 2400390 -1534882 -3955927 -1124758 3098423 3118285 -31212 -1138760
43822 -1138760 1237324 4136442 5321209 4399001 740807 -4956703 -8484020 -6295093
43814 -6295093 -937388 2236431 2829366 4937833 9483531 12504699 11741962 9706014
43806 9706014 8606034 6876826 3062631 -697461 -1868181 -1461839 -2117842 -4095177
43798 -4095177 -5388025 -4558197 -1864624 1386219 3648883 4367999 4783424 6186463 7589100
43789 7589100 7220694 6024510 6644188 8708117 8737421 5855853 3860172 5542610 8281072
43780 8281072 8016434 4953274 2284804 1285178 752640 -104098 -1080543 -2172918 -2880943
43771 -2880943 -1555159 2016439 4685194 3530905 391048 -343081 2060196 3872012
43763 3872012 2354960 -996448 -3178517 -3051461 -1288241 862963 2072297 2038350 2528218
43754 2528218 5399374 9302621 10598173 8113550 4630672 2802872 2158860 1594423
43746 1594423 2224515 5243008 8617864 8849674 5596614 2163807 1324197 2596979 3955603
43737 3955603 4438442 4270825 3681811 2762231 2119747 2821766 5412285 9028183 11639991
43728 11639991 11619639 9393257 7173815 6602621 6989969 6437335 4367373 2194055 1574025
43719 1574025 2663046 4126316 4368570 2825891 527584 -761070 -357157 837128
43711 837128 2228789 4963346 9896426 14713177 15435231 11345117 6267756 3901854
43703 3901854 3933559 4267268 4834966 6527381 7910300 6478770 2866333 418019 79439
43694 79439 -1070845 -5014162 -9444071 -10950326 -9015085 -4810678 1481958 9278265
43686 9278265 15355073 16493269 13695872 10666342 8469124 5059936 406029 -1606217
43678 -1606217 1792163 7846207 11296435 10590386 9028502 10199979 13940345 16919147
43670 16919147 16174900 11723067 6178302 2313616 1210524 2420189 4796196 6591907
43662 6591907 5955096 2713362 -1043197 -3528322 -5505779 -8182100 -9981280 -8319534
43654 -8319534 -4242812 -1835909 -2357665 -2485022 56896 2516606 1311049 -2484100
43646 -2484100 -4813602 -3758552 73645 6251351 13719117 18548358 17051892 11386288
43638 11386288 7951955 9220083 10858174 8495797 3760163 1139559 1792112 3627735
43630 3627735 5484601 7610774 8988500 7935375 5598434 5561065 8887288 12135390
43622 12135390 11763873 8457822 5386613 3955006 3476139 3751875 5188211 6660972
43614 6660972 6114222 3938041 3295475 5829277 9061337 9679926 7704168 5446896 3938970
43605 3938970 3053606 4118370 8845405 15206235 17714914 13693191 7196377 4607680
43597 4607680 7363495 10802637 9736371 3867074 -2051307 -2667820 2911340 10008531
43589 10008531 12934384 10807580 7567422 6050932 4446790 135540 -5230076 -7309710
43581 -7309710 -4768060 -616396 1878677 2108797 929220 -778101 -1570954 213596
43573 213596 4186861 7452357 7738941 6020203 5022281 6097579 8585717 11254024 12924644
43564 12924644 12191985 8183668 2036110 -3356524 -5754831 -5504294 -4775467 -5155465 -6370616
43555 -6370616 -7172908 -6724523 -4754191 -1111641 3810328 8461669 11133651 11708373 11272797
43546 11272797 9886711 6430114 1426486 -1867515 -931286 2637550 5083206 4973849
43538 4973849 3691772 2141065 -425186 -4059013 -7035220 -8106637 -8107736 -8239671 -8133544
43529 -8133544 -6808002 -4576050 -2761361 -1973002 -1676435 -1467588 -2178330 -5308628 -10984329
43520 -10984329 -16496651 -17943312 -14282828 -8932748 -6010994 -5743241 -5346634 -3750249
43512 -3750249 -2832934 -3783697 -4950587 -4389517 -2343221 142010 3082006 6408384 8634083
43503 8634083 8546343 7062334 5702426 4345007 2271098 311215 -195799 179842 -80867
43494 -80867 -408198 1438793 5583182 8949967 8911388 6248926 3344822 930253 -1734102
43485 -1734102 -4247661 -4539257 -1327291 3932608 8135807 9137062 7018422 3423942
43477 3423942 409896 -356470 1545270 4701585 6945275 7695053 8453576 10185035 11344197
43468 11344197 10188558 8185052 8539590 11229609 12366926 9671086 5905098 4784961
43460 4784961 5661019 5162544 2817087 1656509 3325884 5673142 5938677 3868320 723836
43451 723836 -2410372 -3834057 -909143 6971695 15899558 20268519 18346513 13654522
43443 13654522 10698797 10732104 12125699 13382031 14310341 14653765 13167899 8976357 3372630
43434 3372630 -701423 -1343770 526283 2434663 3068810 3064052 3106471 2302546 -532047
43425 -532047 -4262050 -5549020 -2435335 2939869 6336316 5839889 3160193 758218
43417 758218 -601862 -1016347 -186397 1475940 1965979 66421 -2047013 -762486 4497826
43408 4497826 10691914 14973279 16944845 16935404 14636402 10611865 7006362 5088554 3606682
43399 3606682 1232261 -625766 693642 5468854 11031261 14503523 14973667 13409198
43391 13409198 11540822 10630497 10649669 10903584 11480331 13012090 14871503 15356907 14379482
43382 14379482 14056166 15516735 17129483 17345158 17059969 17095539 15632683 11072075 5642288
43373 5642288 2722581 1777863 -343375 -3777321 -5362003 -4101626 -2940158 -4188681
43365 -4188681 -6683718 -8668428 -10209528 -11246819 -10348361 -7419574 -5152734 -5703451
43357 -5703451 -7870016 -9264892 -9246876 -8013882 -5052719 -719330 2471410 2490589 409761
43348 409761 -1576516 -3223278 -5256973 -6942365 -7155100 -6681034 -6846849 -6799511 -4878782
43339 -4878782 -2117030 -1546220 -4004647 -7070038 -8344592 -7631557 -5698266 -3159488
43331 -3159488 -1140829 -961469 -2133492 -2090695 1090544 6427004 10900068 11980194 9362689
43322 9362689 5061207 1683745 -109227 -1948981 -4771774 -6655120 -5387020 -2278681
43314 -2278681 -1000676 -2815880 -5338512 -6124354 -5076106 -2971036 -253701 1839653
43306 1839653 1530911 -693966 -1619646 840508 5089837 8452689 10287973 10919695 9799419
43297 9799419 7223404 6023307 8415363 12079287 12425904 8433680 3401048 39819
43289 39819 -2170514 -4374813 -6144946 -6948152 -7164666 -6321826 -2846184 2695669 6559038
43280 6559038 6427637 5042451 6234786 8779264 7916335 2761480 -1655529 -882270 3585667
43271 3585667 7285471 8612066 9125296 9627555 8871192 5995478 2095201 -916199 -1706439
43262 -1706439 34330 3193722 5542932 5909164 5756360 6987153 8630771 8026655 5299267
43253 5299267 3762507 4873816 5684133 3380316 37572 -11524 3804157 7915000 9652871
43244 9652871 9678240 9327647 8533890 7324437 6932896 7925613 8878105 8382277 7198311
43235 7198311 7068625 8255863 9466512 9589635 8492224 6609597 4603422 2992381
43227 2992381 1582753 -32197 -973632 653515 4936451 8807211 9156057 6626425
43219 6626425 4629278 4992516 6419030 7155609 7064025 6367863 4270395 353585 -3608440
43210 -3608440 -4849154 -2617875 955106 3170380 3423373 3402326 4903548 7711605 9874027
43201 9874027 10102323 9332693 9299244 10031083 9848959 7727831 4332433 481085 -3774505
43192 -3774505 -7600624 -8518375 -4982636 824767 4681398 4750695 2696346 452171 -1945664
43183 -1945664 -4458561 -5082584 -1885121 3711822 7671942 7614806 5067891 3087482 2684833
43174 2684833 2343834 586482 -1800147 -2381912 179555 4294769 6790932 6147392 3818348
43165 3818348 2078962 1400667 757568 -228935 -822424 -611767 58038 1249927 3476355
43156 3476355 5955017 6308459 3206815 -1615553 -5141356 -6085175 -4969359 -2219176
43148 -2219176 1815653 5231149 5328806 1934540 -1645686 -2245403 -446507 600693 -791771
43139 -791771 -3339657 -4971411 -5174438 -4967050 -5451167 -6659465 -7259013 -5408263 -652999
43130 -652999 5002974 8805612 10211423 11181515 13218889 15358936 15956818 15265709 14704025
43121 14704025 14216920 12229097 8259490 3811079 175793 -2988603 -6050499 -7969343
43113 -7969343 -7807956 -6426138 -5092896 -3518847 -1273751 -287712 -3157447 -8759252
43105 -8759252 -12317243 -10993749 -7158090 -4572821 -3472753 -1715925 848885 2323332
43097 2323332 2608742 4046889 7454259 10296827 10420282 9514993 10721652 14028507 16356333
43088 16356333 15733437 13166565 10320872 7564146 5065350 3888596 4553226 5723205
43080 5723205 5854037 5355292 5599094 6402229 6264692 4861827 3372616 2186386 387962
43071 387962 -1758908 -1961214 967955 4781914 6507206 6310043 6553712 7758467 7874918
43062 7874918 5531515 1857184 -1294248 -3138837 -3527986 -2344711 63662 3073664
43054 3073664 6629026 10548418 13103515 12348742 9282140 7480774 8680033 10731171
43046 10731171 11006014 9749402 8663525 8186735 7939593 8127113 8603126 8088115 6210558
43037 6210558 4743750 4790931 4520339 2279856 338573 2249970 7308041 10928009 10377309
43028 10377309 7217613 4149482 2347486 2069656 3066069 3964011 3701213 3612483 5355771
43019 5355771 6928053 4386805 -1772478 -5806790 -3994277 607592 2810195 1749986
43011 1749986 108206 -605457 -737946 166114 3461007 8778166 13302477 14096512 10588127
43002 10588127 5129616 1270301 605051 1452454 1844043 2795321 5854215 8271300 5189876
42993 5189876 -2534708 -7662445 -5937019 -1353388 1058848 2733051 7093749 11892007
42985 11892007 12288917 9002856 6866077 6685258 5111808 2101397 1728735 4775945
42977 4775945 6768458 5042585 2249018 982693 277568 -317461 1535802 6216848
42969 6216848 9892323 10216883 9752014 10249194 8377183 1865582 -4349670 -4083422 686666
42960 686666 2490673 -1004014 -5059004 -6158501 -6302645 -8000759 -10039040 -10266166 -8981034
42951 -8981034 -7556165 -6336173 -5467607 -5513565 -5876777 -4707765 -1704649 831518 964584
42942 964584 -486214 -1617751 -1864442 -1462389 76305 3309364 7271368 9795615 9441822
42933 9441822 6693389 3363437 835397 -1235962 -3999743 -6973578 -7801855 -5486445
42925 -5486445 -2446539 -1569759 -2419277 -2607686 -1773921 -1255574 -643868 1611471 4173791
42916 4173791 3566189 50864 -1301848 2446687 7602660 9010809 6757111 4534327
42908 4534327 3816059 3393205 3005709 3370906 3281585 561929 -3930432 -6588803 -5829622
42899 -5829622 -3677182 -2051492 -411910 1944652 4066216 5341344 6873834 8930203
42891 8930203 9058078 5309761 255759 -927130 3577722 10292692 14983543 17247783
42883 17247783 19284940 21406071 21109943 17126759 12415025 11128142 13120286 13718576
42875 13718576 9590139 2918763 -1515053 -1798407 316485 2758563 4917576 6590066
42867 6590066 7542873 8344396 9778771 11273422 11649174 11407349 12177254 13706860 13817856
42858 13817856 12025532 10713169 11477053 12573561 11569740 8511448 4782959 956912
42850 956912 -2058459 -1888518 2189001 6364844 6095546 2435022 1149614 5150692 11034924
42841 11034924 14113157 13779297 12089533 9665348 5842197 1660152 -159377 1548232
42833 1548232 4859333 6774204 5702123 1954712 -2959484 -7041741 -8704418 -7768184
42825 -7768184 -5417679 -2894865 -557576 1428810 2002446 -48529 -3872861 -6214533
42817 -6214533 -4611302 -540570 2238234 2599741 3336363 6541691 9653029 8142165
42809 8142165 1138404 -7675062 -14064168 -16040173 -13468498 -7888180 -2945520 -1995055
42801 -1995055 -4121839 -4921913 -2391675 437324 338997 -1131789 24382 4611700 9505757
42792 9505757 11499900 9626958 4761766 -578850 -2915490 -992584 2189271 2992193
42784 2992193 1971877 2032640 2606855 52877 -5588671 -8923970 -6448998 -1507734 950718
42775 950718 1157561 2317193 4433166 5111862 5006730 7203832 11174532 12422497 9496571
42766 9496571 6893278 8653043 12673580 14231382 12223302 8638507 4242221 -1134086
42758 -1134086 -5158089 -4157197 1798609 8147887 10984345 10562881 9193124 8286811
42750 8286811 8512825 10457359 13573700 16174492 17770732 19773927 22547094 23513799
42742 23513799 20072533 13276935 6941962 3952381 4701997 7761995 10266614 9019791
42734 9019791 3784263 -1094812 -836921 4067611 8506207 9111737 7595067 7147001 7760296
42725 7760296 6537806 1575324 -5505843 -10537869 -10236288 -5278963 340292 3742230
42717 3742230 5920777 8649572 10206716 7312445 939397 -3460403 -2534965 1133473
42709 1133473 3064040 2033822 -282637 -2116773 -2060824 938580 5795527 9333957
42701 9333957 10098509 10181438 11344330 11830677 9776198 7323624 7567803 9049061 7615149
42692 7615149 3242628 710259 2919895 7192443 9288718 8160465 5563481 3560231
42684 3560231 3684737 6311146 9433586 9917582 7315207 4859669 5357956 7507091 7795282
42675 7795282 5131867 2019060 1252770 2564937 3115754 1195825 -1361867 -1556084 363399
42666 363399 1008186 -948164 -2347836 -215870 3713093 5972022 6581399 7634210 8584233
42657 8584233 7511749 5919525 7018587 9404434 8038340 2482651 -1326038 628671
42649 628671 5504591 9274175 12164968 15190864 16111162 13202454 9387054 8171911
42641 8171911 8421389 7399411 6168154 7379195 10067986 11381011 11560597 12486592 13038196
42632 13038196 11021629 8416439 9252598 12773367 14083428 11687407 9131583 8546552
42624 8546552 7770244 5231752 2840698 2045787 1287047 -299023 -392175 2563509 5881943
42615 5881943 5984239 3340504 1777644 4113440 9770925 15225630 16092255 10938289
42607 10938289 3991858 1754764 5773979 10985074 12209460 9683713 6784372 5049677
42599 5049677 3668424 2023733 589678 168667 1101087 2036289 -284353 -7328807 -14754199
42590 -14754199 -15847821 -10091378 -4250011 -3106529 -3572870 -993027 3232103 4873048
42582 4873048 4157891 4302650 5000517 3298590 74453 -235894 3257744 6428107 6954222
42573 6954222 7635412 10638285 12621541 8996439 769712 -5980180 -6691942 -2534076
42565 -2534076 1432108 1203888 -2575358 -5551404 -4729097 -2121686 -1833329 -4126913 -5085608
42556 -5085608 -2468245 1214889 2916221 3499122 5458636 8087828 8046967 4344616 104162
42547 104162 -1137113 889985 3838672 5657142 5869633 4921298 3717064 3814434 6595819
42538 6595819 11138913 13759328 11577814 6767527 5163940 9358764 14954286 15766400
42530 15766400 11431041 7010935 5585232 4695583 1060301 -4295101 -7694398 -7594176
42522 -7594176 -5425874 -2862295 -521334 1123143 1628849 1500639 1711049 2109860 1523767
42513 1523767 -324090 -2048875 -2138942 -546969 1467503 2419787 1414651 -1210861 -3538870
42504 -3538870 -3096175 837350 6028292 9148274 9089184 7938436 8343893 10467676 12261193
42495 12261193 12335085 11262942 9781639 7192800 2768690 -2190647 -5359053 -6215050
42487 -6215050 -6327422 -6730319 -6561128 -4747646 -1614055 1862173 5041899 7043365 6622221
42478 6622221 3941787 1226169 -9771 -1318750 -4725287 -8427181 -8002860 -2470920
42470 -2470920 3670939 6073323 5869692 6941197 9575657 10308648 7790143 5120899
42462 5120899 5069081 6023631 5035614 2711098 2080949 3699095 5017571 4449980 3000755
42453 3000755 1373244 -1458811 -5326728 -7094558 -4101897 2087043 7518544 10473887
42445 10473887 12275210 14234353 15973913 16649707 15990289 14015312 11277882 9458380
42437 9458380 10065707 12114236 12519346 9526811 4815979 1610552 1399629 2928578 3751090
42428 3751090 2361449 -663633 -3214319 -3581448 -1980896 -15821 1059608 1042236 120076
42419 120076 -1579961 -3640058 -5138944 -5097319 -3170790 -159485 2298459 3416362 4811889
42410 4811889 9017380 15621560 20287539 19103664 13100331 7135710 5147750 7703402
42402 7703402 12795147 17013899 17150330 13310437 9875169 10720235 13929561 14192416 10204468
42393 10204468 6186346 5558462 6842972 7326014 7325651 8381285 9716749 9203168 6375250
42384 6375250 2446712 -1326990 -3689888 -3520493 -1762139 -1469833 -3890031 -6217108
42376 -6217108 -5543661 -3339202 -3219581 -5559429 -7378216 -6817275 -4656647 -1741523 1965782
42367 1965782 5536518 7136285 6597893 5624663 4910306 3405585 1138036 249606 1805413
42358 1805413 3515600 2452955 -976022 -3245216 -1390871 4375916 11080620 15184315
42350 15184315 14944509 11492499 7562665 4983091 3709240 3143955 3413274 4848015
42342 4848015 6833402 7841739 6684470 3803230 1405940 1795120 4932317 7988551
42334 7988551 7996204 4713813 382872 -2701589 -3569556 -2391548 -357441 642340 -324685
42325 -324685 -1966457 -2311215 -1155936 373324 2105883 4657967 7176677 7687836 6267566
42316 6267566 5579493 7167112 9223500 9453705 8305952 7447568 6455161 3477171 -1249329
42307 -1249329 -4886046 -5459864 -4201361 -3696401 -4869601 -6705791 -8169744 -9149971 -9525292
42298 -9525292 -8525413 -5912475 -3252718 -2707669 -4234434 -5058947 -2711175 2097123 6346194
42289 6346194 7726578 5975039 2201575 -1654802 -3308945 -1812225 1243592 3487690
42281 3487690 4481657 5285542 5837340 4802917 2012247 -1061740 -3482252 -5349784 -5830821
42272 -5830821 -3272783 1785908 6218285 8212618 9169941 10250212 9817009 6695012
42264 6695012 3444803 3174114 4838241 5194241 4155957 4308429 5738997 5721211 3947424
42255 3947424 3608998 5673016 6251326 2509270 -2108339 -2323578 1331673 3458200 1663337
42246 1663337 -573912 575799 4509150 8421550 11384746 13866289 15122828 13907195
42238 13907195 11162441 9528895 9960058 10680983 9906891 8009224 6398808 5655392 5532386
42229 5532386 5635271 5288892 3890814 2319606 2709574 5469297 7681187 6318660 2359446
42220 2359446 -345310 12547 1589788 2231576 1994768 1632367 923613 -31289 293533
42211 293533 2772540 5567496 5903474 3190409 -1038903 -5320844 -8540025 -8789551 -4469717
42202 -4469717 2962216 9102584 10389463 7069260 2264613 -911364 -1263961 115013
42194 115013 857441 -332277 -1913737 -1001395 3113496 8094071 11595506 13653591 15133947
42185 15133947 15500842 14042914 12249257 12388139 13709356 12671910 7993808 3289005
42177 3289005 2864199 6389528 9958664 11538040 12730342 15149404 17745749 18686827
42169 18686827 17679493 14980384 9946504 2581795 -4580267 -8317800 -8231418 -6818209
42161 -6818209 -6111924 -5589561 -3574320 164028 3455055 3446294 50772 -2541607 142434
42152 142434 6735737 10644247 8442070 4522328 4437992 6840147 6688860 3994188 3162918
42143 3162918 4612909 4130768 1426182 1957818 7489359 11827822 10411042 7909799
42135 7909799 10345899 14784911 14280555 9802441 9094515 14633074 20351305 20988029 17996476
42126 17996476 14601779 11001320 7058391 4881360 5483124 6196393 4369052 1470431
42118 1470431 1313389 5654274 12666315 18239812 18571580 13648832 8151559 6337353
42110 6337353 6540828 4309998 462155 904088 7507839 14557913 16583476 14829703
42102 14829703 12965663 11083543 7958690 5257746 4719782 3997686 112856 -4936871
42094 -4936871 -6570563 -4133437 -757679 1889420 4243418 5199999 2649835 -2171833
42086 -2171833 -5029583 -4145569 -2155307 -2137490 -4488710 -7954605 -10974319 -11727456 -9417445
42077 -9417445 -5739685 -2889680 -475683 3136393 7137852 9023774 8490761 7177289
42069 7177289 4922823 279657 -5033162 -6479291 -2726851 2295676 4655088 4392526
42061 4392526 3143945 1502980 442825 1822767 5361369 8175648 9265149 11184823
42053 11184823 15080173 17589920 15673583 11463396 8963231 8458743 7594539 5699955
42045 5699955 3518830 737616 -2537277 -3802834 -1626827 649701 -1009880 -4942072
42037 -4942072 -6062598 -3473061 -741405 842763 3603879 7558728 9016334 6892921
42029 6892921 5058217 5801899 5996050 3219950 1067191 3704845 8665771 10420238
42021 10420238 8936345 9038025 12081362 13947490 12071833 9490641 9878992 12346701
42013 12346701 13828100 14098042 15482806 18749487 21796417 22309379 20101632 16621361
42005 16621361 13162965 10106547 7751731 7323212 10095358 14935201 17884673 15890074
41997 15890074 10640276 6967442 7402902 10074950 12149833 13161810 14028518 14798169
41989 14798169 14949604 14584897 13789736 11870775 8738850 6133118 5875392 7576877 9556191
41980 9556191 11263204 13007220 13894015 12336142 8892056 6615679 7722114 11131819
41972 11131819 13997605 14661205 13508272 11837381 10653272 10094258 9538301 8488457
41964 8488457 7338373 6787385 6709856 6461937 6305618 7579430 11152364 16275645 21013956
41955 21013956 23348981 22296712 18928779 16040392 15694884 17188278 18349757 18326305
41947 18326305 17762670 16935092 15725465 15123807 16403538 18691826 19761631 19500982 19947915
41938 19947915 21441882 21881411 20801104 20693017 22455585 23045231 20330122 17066894
41930 17066894 16742175 18372376 19363274 20889421 25543028 31387370 33828132 32856131
41922 32856131 33031680 36009449 38441662 38433752 38955142 42830008 48777134 54745439 61216451
41913 61216451 68711668 75700071 81656528 88865547 98682113 109611183 121872136 139723766
41905 139723766 165243275 193368201 217702057 237977016 256343442 269119321 269220559
41898 269220559 256146834 236990386 217031477 195505874 171944959 150296442 133506477
41891 133506477 118850838 102521585 85539316 71532129 61278017 53036886 46432046
41884 46432046 42557599 41278939 41238445 41711236 42093677 40543541 35701892 29243221 24377145
41875 24377145 22016840 20346187 17906320 15213092 13357962 12656206 12795298 13110746
41867 13110746 12842026 12189292 12692817 15284392 18367694 19280142 17489647 14986584 13572709
41858 13572709 13041319 12130160 10223956 7979375 6925477 8199694 11026418 12999280
41850 12999280 12665283 11070414 9831858 8863658 7556826 7019326 8800785 11876843
41842 11876843 13360671 12316393 10694743 10296373 10949368 11889070 12543265 11518137 7541283
41833 7541283 2478183 728510 3943638 8647234 11032574 11950750 14725816 19791428
41825 19791428 24260704 25620387 23133655 16699532 7610914 103736 -1277462 3407223
41817 3407223 9697761 14293930 17827107 21581562 24559966 25335552 24198297 21507993
41809 21507993 16203352 8393860 1673999 -24754 2911930 6742077 9292990 11304349
41801 11304349 13223030 13713991 12154038 10215283 9703443 10385390 10942318 10653724 9265288
41792 9265288 6768709 4495189 4871610 8375729 11790182 11384565 7315210 3119858
41784 3119858 1251939 1113557 1528280 2862187 5636634 8720142 10476877 10945261 11563537
41775 11563537 13179891 15454718 17818310 19757353 20354908 19006037 16874616 16302142
41767 16302142 18141022 20802161 22665432 24077119 25554588 25216432 20468208 12360520
41759 12360520 5890827 4796472 7691010 10753237 12761066 15413121 19496234 23220659
41751 23220659 24601123 23425398 20216229 15144890 9159671 4673175 3450552 4493670
41743 4493670 5386945 5225647 4889713 4870741 4452139 3176401 1737185 982838 1101853
41734 1101853 2198130 4522907 7379894 8803141 7570035 5215071 4871415 7888805
41726 7888805 12343200 15148640 14968515 12640384 9513885 6508802 4755485 5767052
41718 5767052 9878636 15031324 18335276 18916025 18185298 17189470 15185820 11771177 9042692
41709 9042692 9734840 13554197 17322626 19145255 20560546 23384805 25929461 24421556
41701 24421556 17917936 9903768 4482800 2509730 2515732 4113390 8441062 15307919
41693 15307919 21953873 25781989 27121689 27858765 28093638 26077620 21591306 17460531
41685 17460531 16573104 18520560 20595350 21639752 23486780 28341223 35659045 42179883
41677 42179883 44791068 43067755 39079899 35045929 31645958 28695865 26482508 25279877
41669 25279877 24118302 21911833 20063151 21832809 27901920 34301423 36556530 34785526
41661 34785526 32924349 33931210 37813008 43482526 49863098 55210490 58028469 59440091
41653 59440091 62655769 69216875 77245301 83936603 88281030 90994472 93557709 97798242
41645 97798242 104463747 111466866 115391269 115400162 113587823 110825427 105041009 95160374
41637 95160374 84073251 75410161 69475194 64657646 60669322 57530795 53359820 46768865
41629 46768865 40270572 37594943 38252674 38476910 37224411 37099080 38836889 39198291 36103573
41620 36103573 32312400 31555726 33510385 34987139 34215680 31766954 28806542 26557899
41612 26557899 26272217 27818046 29307652 29636150 30046669 31522963 32292538 30328893 27161079
41603 27161079 26397569 28853213 31779169 33047171 33669435 35545099 38665787 41445239
41595 41445239 42523002 41700435 40332553 41183636 46442603 55153372 63830453 70416061
41587 70416061 76522945 84896307 95864767 107765599 120192046 134949471 153482107
41580 153482107 174951277 198037665 223705451 254208490 288796067 321955289 347436421
41573 347436421 363303890 371235039 371335037 360638117 338132122 308745078 279497732
41566 279497732 252734931 226120272 199028494 175358979 158460146 145969302 132478418
41559 132478418 116382778 101535180 92011789 87353129 83846453 78992540 73250608 68037839
41551 68037839 63717460 59990325 57061320 55417323 54948622 55163267 55871017 56689481 56382253
41542 56382253 54261329 52150387 52901908 56309900 58643359 57580721 55434093 55287332
41534 55287332 55953232 54172398 50837799 50909469 56560283 64187196 69759601 73695681
41526 73695681 77976094 81346918 80976643 77421863 74318411 73412734 72990137 71417703
41518 71417703 69292958 67207588 63984174 58773937 53213615 49674041 48112481 46041419
41510 46041419 41295158 34045962 26653725 22257720 22642046 26174820 28312597 25758947
41502 25758947 20372845 17508949 19737401 23489626 23323057 18675298 14276576 13680377
41494 13680377 14792913 13421986 9432159 6653771 7270457 9322455 10326601 10488804
41486 10488804 10867243 10899771 10024498 9833631 11861454 14469096 14865740 13478975 13163172
41477 13163172 14322273 14277328 11989849 9916341 9851017 10207171 9450815 9229903 11212394
41468 11212394 13082579 11155660 5834772 1175106 -466868 -259826 423413 1898868
41460 1898868 4116487 5589855 5632738 5526550 6204250 6575415 5460514 3644935 2630072
41451 2630072 2592946 2896292 3451196 4132144 3841609 1832117 -542414 -920972 1344477
41442 1344477 4654334 7072218 7634275 5972552 2044921 -3196288 -7562343 -8784036
41434 -8784036 -6260639 -1878943 1238847 1637605 1153201 2555187 5586444 7144584
41426 7144584 5976080 4826771 6189258 8136865 7253435 4203981 2747052 3679554
41418 3679554 3770034 1398645 -635243 395932 3329661 6097140 9257776 13291133
41410 13291133 15058197 11314517 4508866 687714 1819129 4310380 5385377 6395844
41402 6395844 8351491 8627900 5163922 716905 -700906 394431 321841 -2018293 -4479483
41393 -4479483 -5964658 -7425350 -8510916 -7275894 -4376160 -3886170 -7862075 -12996369
41385 -12996369 -15149209 -14743045 -14607567 -14408852 -11257884 -5478274 -1650024 -2503409 -4779656
41376 -4779656 -3502005 1291745 4700843 3574616 645337 907079 4997855 8067892
41368 8067892 5884367 708935 -919608 3656973 9606408 10695231 7132837 4608265
41360 4608265 6257995 8949495 8317827 4459027 689637 -1134271 -1442828 -308993
41352 -308993 3069300 8031648 11831187 12335015 10327207 8509213 8811344 10926033 12893890
41343 12893890 12930007 11073281 9051072 8296454 8581296 9161001 10533526 13782795 18305329
41334 18305329 21496518 21192483 17824702 13949308 12039832 12570781 13711590 13179215
41326 13179215 10965995 9593785 10682207 12137807 10584528 6189904 2646368 1856247
41318 1856247 1217411 -2167124 -6621489 -7808777 -4701015 -980630 -171599 -1634483
41310 -1634483 -2559345 -2221987 -2181250 -2733809 -1606562 2634951 7499670 9079913 7219832
41301 7219832 5713461 6829975 8356176 7828898 7132777 9623220 14058696 15390934
41293 15390934 11698422 6576443 3693483 2553393 1342025 519624 829361 382326
41285 382326 -2894005 -7377058 -9454460 -8286132 -6195002 -5041611 -4744099 -4685036 -3990478
41276 -3990478 -1092025 4159944 8439763 8109531 4383428 2192121 3621118 5716763
41268 5716763 5490117 3672835 2025857 65371 -3241179 -6717094 -8248482 -7445311
41260 -7445311 -5292480 -2480026 418346 2549195 4057587 6213455 8645205 8143569
41252 8143569 2394036 -6239415 -12726822 -14301080 -11651774 -6507453 -443195 4636565
41244 4636565 7363879 8298815 8742815 8544132 6824202 4234863 2323991 1090010 -459796
41235 -459796 -1533384 -1210 4033157 7632371 8715437 8097971 7075588 5330597
41227 5330597 2456744 -596871 -3139701 -5877996 -8656796 -8835224 -4311758 2760248
41219 2760248 7636899 8163693 6488660 5789641 7084317 9395602 11335337 11872912 10727220
41210 10727220 8769453 7417916 7141013 6969396 5767764 3700845 2362480 3596918
41202 3596918 7791608 12836242 15304149 13628547 9894607 7538652 7553249 8218889 8339644
41193 8339644 8728607 9705220 9036883 4288599 -3435263 -9775454 -11152104 -7558534 -1731515
41184 -1731515 3208745 5530584 5785683 6201950 8150554 10253679 10234577 8400435 7336000
41175 7336000 7871835 7795118 5758423 3998325 4850714 6361096 4462898 -1063511 -5768378
41166 -5768378 -5874618 -2026625 2575703 5395188 5406089 3183207 1159827 1773040 4385197
41157 4385197 5953109 5455878 5199976 6674578 8134484 8372553 9922340 15233322 21666766
41148 21666766 24002202 20949423 15817038 11548895 8708845 7877651 9812907 12489147
41140 12489147 11789986 6726456 1180460 -795223 1261327 6075901 12727427 18841802
41132 18841802 20016611 14284305 5265250 -1884106 -5948726 -8423542 -8910912 -5658031
41124 -5658031 116087 4395851 5279822 4616772 4265133 3753201 2571209 1880197 2328823
41115 2328823 2394079 674516 -1833326 -3400282 -3970662 -4122962 -3073053 -1282 3472815
41106 3472815 4657005 3585594 3196393 5275119 8236120 9753394 9727623 9281142 8330507
41097 8330507 6117980 3410637 2019716 2019171 1339653 -1142388 -3570799 -3282900 -186209
41088 -186209 3118262 4241505 3344488 2896626 5441136 10855943 15380773 14552882 8215108
41079 8215108 1566975 -281790 2035774 3806501 2839465 1676577 2829088 4710273
41071 4710273 4187814 1375868 -562385 60049 1206445 -98232 -3934508 -7287278
41063 -7287278 -7408143 -4705249 -1834076 -224236 1293649 3782765 5549135 4035427
41055 4035427 -289676 -4139068 -5426452 -4791406 -3012516 172117 3618693 4152068
41047 4152068 558021 -3934898 -5471501 -4160846 -2608344 -1657781 -326474 1537088
41039 1537088 3668340 7273176 12905309 17103620 15239362 8140810 2003313 613276
41031 613276 1357113 627940 -581886 552207 3211801 4069095 2533824 1132494 903196
41022 903196 -166238 -3331541 -6440515 -6575587 -3673720 2876 2930532 5228716
41014 5228716 6936827 7141269 5468941 3394320 2875658 3810280 3877563 1337890 -2743571
41005 -2743571 -5745092 -6461048 -5935382 -5516455 -5144530 -4001619 -2212750 -1183651 -2145257
40996 -2145257 -4604059 -6515396 -6136553 -3449064 507711 4993292 9137963 10768839
40988 10768839 7941232 2317733 -1230883 -2804 3288891 4421788 2970428 1304480
40980 1304480 115297 -1566719 -2871602 -1690191 1102221 2092556 950384 1630345
40972 1630345 6213644 11308132 13172637 13096158 14243500 15729428 14054701 9258347
40964 9258347 5478605 5287874 6812997 7052615 5331605 2716190 349005 -652109
40956 -652109 431302 2462950 2722384 -277398 -5077631 -9014795 -10781663 -10705892 -9496636
40947 -9496636 -7615987 -5343018 -2692861 445743 3597595 5536352 5586317 5025764 6302785
40938 6302785 10195984 14197685 14841851 11892657 8992983 9270424 11556943 12622549
40930 12622549 12091422 12477866 14466739 15283130 12878501 9031354 6502509 5325780
40922 5325780 4025033 2638623 2143091 2333926 2720505 4240754 7490787 10412100 10643088
40913 10643088 9257944 8935380 9057535 6528651 1771605 -250812 3290084 8771945
40905 8771945 10931645 9513768 8240960 8686342 8384984 5012824 -62338 -3320250
40897 -3320250 -2892430 33845 2891172 3802671 2070225 -2140412 -7405622 -10811138
40889 -10811138 -9980321 -6019074 -2905353 -2980878 -4611096 -5401852 -5483622 -5497992 -3810205
40880 -3810205 599426 4087032 1940372 -4114007 -6928035 -3595470 629754 271847
40872 271847 -2983360 -4348356 -3792182 -5167732 -9289069 -12592938 -12577601 -10775989 -9610302
40863 -9610302 -9112840 -7874193 -5480614 -3006929 -1845207 -2236029 -2494400 -387386 3804869
40854 3804869 6620001 5266245 1285649 -1323196 -907656 777522 1641615 1172072 -414607
40845 -414607 -2493267 -3244654 -935441 3159473 5118056 2953335 -499031 -586799 3994997
40836 3994997 9997537 13037708 11522085 7635865 5042166 5364525 6712723 5998353
40828 5998353 2598491 -1025297 -2346538 -1322216 492569 2218945 3966941 5505303
40820 5505303 6038512 5574428 5447053 6652947 8147611 7838932 5382130 2953921 2607994
40811 2607994 3707850 4053093 2979044 1849156 1482004 676592 -2019362 -6085055 -9246757
40802 -9246757 -9372727 -6057664 -1197323 2074439 2305452 1635199 3235251 6766215 8521020
40793 8521020 6700473 4109915 4238173 6892228 9579807 11256089 12445052 13161270
40785 13161270 13075656 12705557 12467373 11724139 10512003 10379139 11290457 10052499 5170917
40776 5170917 1153290 3484312 10437090 14756231 13143791 8906668 4884110 -291862
40768 -291862 -6863265 -10587495 -8538421 -4123149 -2053299 -1391155 1886957 7585155
40760 7585155 11400948 11510043 10574563 10950812 11634318 10907030 9168714 7849793 7369918
40751 7369918 7316062 7501823 7956839 8293169 7394319 3910991 -2000324 -7186170 -7560920
40742 -7560920 -3043539 1217695 593415 -3338993 -5249122 -3145746 -32906 1190241
40734 1190241 1173718 1643264 2314853 1990584 1039033 1035664 2594351 4642075 5574285 4757348
40724 4757348 3236138 2811539 3794871 4219001 2415860 -299345 -1270386 -289388 682216
40715 682216 1540168 4654346 10241595 14081402 12294262 6504783 1588048 -418229
40707 -418229 -1231461 -1973123 -1478831 442880 1408752 108920 -706658 2442163 8467594
40698 8467594 12507199 12168575 10654002 12682890 18892047 25488479 28306793 25848643
40690 25848643 19223438 10990236 4147322 762518 925479 3500474 7668173 12800409
40682 12800409 17229331 18823757 17181898 13946238 10610829 7430383 4837083 4042107
40674 4042107 5176107 6425082 6260648 5127364 3752081 1551589 -1570078 -3640443
40666 -3640443 -3232509 -2274373 -3455278 -5817089 -6141477 -4289868 -3536896 -5086950 -5854783
40657 -5854783 -3223889 954459 3169985 2818322 1775641 1158703 880794 1370367 3444886
40648 3444886 6789800 10146936 12723691 14304483 14592293 13597605 11992764 9952505
40640 9952505 6559892 1820594 -1615948 -750850 3844605 8116468 8875660 6911358
40632 6911358 5513658 6816463 9891518 11900376 10978957 8117103 5798170 4761431
40624 4761431 3324339 568732 -1398373 -126029 3116987 4052653 217912 -6382748
40616 -6382748 -11492886 -12336149 -9393276 -5756800 -4546446 -5796786 -6272804 -3532012
40608 -3532012 649338 2561229 1286145 -1217786 -3892416 -7110624 -9449389 -7865042
40600 -7865042 -2522494 1967188 2286819 529903 164028 733842 -62216 -1238753 284661
40591 284661 4136408 6229061 4410088 1075822 -537012 122528 1777988 3004048
40583 3004048 2194279 -1432736 -5538775 -5957309 -2040965 1437065 -162030 -5425262
40575 -5425262 -8642072 -6466051 -961777 3213921 2984502 -1119494 -5475366 -6303616
40567 -6303616 -3321791 12683 698166 -591911 -1619569 -2073862 -2653430 -2071891 1777945
40558 1777945 7762347 11566104 10511296 6137041 1480074 -1912733 -3461543 -2443514
40550 -2443514 909589 4538932 6206983 5386178 3045280 668962 -253108 602735 1229569
40541 1229569 -837878 -4738914 -6455403 -3900272 297178 2569546 2704038 2294176
40533 2294176 1161571 -1628495 -4551780 -4771885 -2114888 972744 3194852 5235465
40525 5235465 6802200 6007712 2612039 -725167 -1653636 -566197 1174844 3269427
40517 3269427 5281714 5314707 1938541 -3341862 -7057851 -6895042 -3162457 2080315 6609701
40508 6609701 9409233 11012149 12011559 11534768 8639843 5002405 3727933 4650706 3429407
40499 3429407 -2782128 -10848740 -15324535 -15204670 -14213496 -15042853 -16321614 -15723673 -13506583
40490 -13506583 -11576720 -10399628 -8304132 -3733251 2439455 7152902 8010979 5805117
40482 5805117 3501935 2826028 3208156 4226510 6683590 9879145 10367645 6258424 1086813
40473 1086813 -45523 2636982 4279296 2792262 1312627 2282710 3383728 1862365
40465 1862365 -569105 -630740 999549 920528 -1234172 -1976211 993602 5900641 9560493
40456 9560493 10485983 8774411 5323094 2294970 2404417 6171670 10957310 13850937
40448 13850937 14520539 14195456 13049158 10211374 5797969 1321114 -1840483 -3085483
40440 -3085483 -1813150 2403829 8362324 13331522 15593789 15955332 15731943 14279507
40432 14279507 10259713 4877857 1534755 1544801 2232017 808603 -1399913 -781903 3305608
40423 3305608 7636495 9544953 9710705 9602810 8503867 5046540 368542 -2499640
40415 -2499640 -2132183 65740 2119327 3574157 5050615 6738885 7836934 7213862
40407 7213862 4715070 1957485 1105700 2257917 2943480 1249380 -1448157 -2336841 -1016190
40398 -1016190 411483 738036 865424 1336013 1007387 -651197 -1731297 59255 4414848
40389 4414848 8679983 10432096 9070729 5690825 2186964 -224811 -2115743 -4602108
40381 -4602108 -6814830 -6296839 -2714928 687550 756602 -2015831 -5061240 -7072884 -7815000
40372 -7815000 -6478793 -3152775 -817763 -2568595 -7007427 -9374407 -7487998 -3892149
40364 -3892149 -1818153 -1701226 -2202259 -2056877 -268234 2974277 4988795 3067649 -952696
40355 -952696 -1730592 2757991 8708351 12294228 14177615 15769059 15040224 10184822 4529936
40346 4529936 2913824 4707794 5150164 2734475 472557 -32026 -836529 -3020205 -4153562
40337 -4153562 -2174817 1570862 4944235 7817924 10511136 11895291 10886438 8000428
40329 8000428 4243370 479329 -1246244 1448771 7421027 11470127 9804608 4259181
40321 4259181 -646559 -2862946 -3167040 -2536959 -1740854 -2109427 -4114768 -5863145 -5001241
40312 -5001241 -1590589 2289789 4867859 5359666 3646638 751920 -1592352 -3112233
40304 -3112233 -5199394 -7861623 -8773406 -7017722 -4997509 -4123622 -1563770 5036640
40296 5036640 12077655 13950674 11124341 9355271 11215470 13304755 12297888 9000449
40288 9000449 5263906 1397351 -1476214 -559958 4506560 9743102 11630331 11401130
40280 11401130 12135177 13699537 13138128 8748243 1757170 -4984525 -8617525 -7949792
40272 -7949792 -4752545 -2053153 -488628 1613867 3977914 3366784 -1436362 -6682407
40264 -6682407 -8200452 -6390298 -4145235 -2502373 -1587547 -3252275 -8328140 -12631610
40256 -12631610 -10382402 -1575233 7889353 13468874 15587147 15770494 13555361 8999220
40248 8999220 4853456 3722535 4957908 6243066 6698632 6771815 6403947 5062616 3000524
40239 3000524 1385616 1530510 4197912 8693377 12550913 13570849 12462394 11819049
40231 11819049 12136107 10990090 7072290 2713601 694301 488864 -90223 -957781 -147422
40222 -147422 2447654 4388632 4041813 2527372 1696117 1798173 1989725 1956950 2102478
40213 2102478 2750769 3769604 4539084 4119674 2234692 359586 776908 3756081 6477744
40204 6477744 5879240 2248077 -1080873 -1527655 341273 2430401 3857444 5079736
40196 5079736 5982323 5304149 2374067 -1396150 -3398526 -2002776 2391587 8014829
40188 8014829 12880563 15587869 15940460 15232959 15344361 16771457 17708771 15919511 11641017
40179 11641017 7605435 5622786 4381860 2029719 -95558 1299259 6529208 11950641
40171 11950641 14846241 16530368 18712111 19485583 16147689 10219513 5779933 3589076
40163 3589076 1022500 -2146784 -2506118 1067090 4400083 3397779 -731798 -4148317
40155 -4148317 -5503100 -5688687 -4961192 -3334170 -1953613 -1351662 -219323 1576825 1317998
40146 1317998 -1994604 -4173225 -1298861 3654533 4864585 2759481 3112947 7580384
40138 7580384 11619384 12661643 13774320 16861000 18320035 15218230 10934126 10311481
40130 10311481 12776295 14448853 14077268 12675864 9934393 5567764 2368269 3299270
40122 3299270 6560960 7699719 5915248 4324307 4441835 4392269 2688452 133630 -2428230
40113 -2428230 -4934591 -6160925 -4176236 286961 3574220 3244681 392139 -2689449
40105 -2689449 -4877316 -5650823 -4519362 -2082558 37520 1031817 1261376 800937 -385671
40096 -385671 -910206 793347 3356594 3501808 1028440 -243901 1937939 4560529 3546432
40087 3546432 -422168 -2924644 -1527967 1851820 3840674 3058256 793507 -682178
40079 -682178 -583220 -621008 -2733741 -5913699 -7135629 -5787912 -4636207 -5148575 -4647083
40070 -4647083 -472789 5341475 8742884 9477812 10605148 12817786 13194277 10319271
40062 10319271 7154054 6982252 8890209 9444583 7415469 4622170 2722248 1350706
40054 1350706 -170826 -972028 219508 2646840 3724395 2128452 -509541 -2116854
40046 -2116854 -3381917 -6408993 -10452294 -11783451 -8952754 -5630307 -5950211 -8794361
40038 -8794361 -9523347 -6472705 -2701768 -1318980 -1901739 -2249650 -1394608 158522 1497845
40029 1497845 1669389 264231 -1753127 -3046650 -4007656 -6247429 -9696025 -12259544
40021 -12259544 -13128676 -14184423 -16625316 -18123054 -15432924 -8819583 -2081979 1219223
40013 1219223 308300 -3053846 -5910663 -6080332 -4231837 -3140476 -3644377 -2925859 1039101
40004 1039101 4931466 3512016 -2644824 -6671805 -3963072 2010665 4797260 3525007
39996 3525007 3028384 6166023 9675016 9170748 5881776 5446051 10115096 15050065 14323668
39987 14323668 8904354 5494683 7546042 11117184 11255433 8865712 7782835 7722633
39979 7722633 5220048 776012 -567811 2925964 6332187 5262695 2226411 2031332
39971 2031332 4010906 3500865 -548817 -4188111 -4516557 -2986556 -1979222 -1530678 -753741
39962 -753741 97132 541696 1245024 3286649 6950056 11502038 15137123 15540019 12229815
39953 12229815 7985945 5848699 5088697 2777038 -963372 -2840689 -2089247 -2245866
39945 -2245866 -5335258 -7922223 -5862476 -221408 4719226 7104112 7740122 6653452
39937 6653452 3526168 668727 1393230 5236495 8256224 8432476 7506234 6945466 5617615
39928 5617615 2866396 793514 1320842 3071023 3299830 1547840 -487144 -1689964
39920 -1689964 -2398324 -3050201 -3323758 -2575718 -624165 1632370 2492540 1283919 -279735
39911 -279735 -67190 1233283 962467 -1009336 -1209719 2572867 7557905 9203936 6799953
39902 6799953 3853656 3838422 7217136 11766276 14240942 12585761 8039480 4259054
39894 4259054 3178323 3076649 2083256 1471635 2978043 4755404 3560405 91119 -1610784
39885 -1610784 -4598 2327905 3280964 3814262 5041685 6277590 7369539 9495897
39877 9495897 11713028 10135499 3328383 -4292641 -7577495 -6801633 -5334793 -3476619
39869 -3476619 836661 6300471 8392294 6024669 3652764 4918392 7636413 7468920
39861 7468920 3989450 395251 -1074825 -650694 1009688 3455627 5058121 3629599
39853 3629599 -510279 -3701816 -2539810 2325691 6960877 8281426 6363725 2877976
39845 2877976 -1107945 -4753017 -6180746 -3803749 938374 4214524 4147324 2896377
39837 2896377 3247479 4964244 6431507 8131234 11476435 15111055 15942383 14033401
39829 14033401 12958530 14372015 15659433 14622744 13159501 13744375 15076745 14450390
39821 14450390 12344724 11063105 10292448 8033149 5322244 5800997 10070755 14274165
39813 14274165 15513069 15406252 16600016 18588850 19152815 17784088 15389302 12180437
39805 12180437 8208977 4954983 4069986 4915296 5215176 4047920 2697587 2518979 3167872
39796 3167872 3177031 1661581 -545757 -1275161 852466 4406137 6329916 5780841 5447914
39787 5447914 7834872 11480947 12732165 10637812 8029409 7578024 8470229 7671930 3538036
39778 3538036 -2418646 -6911500 -7783954 -5749027 -3224489 -1618075 -587468 -14280
39770 -14280 -1001850 -3726620 -5777825 -4648863 -1273507 790508 -594164 -4553656 -9099550
39761 -9099550 -12445461 -12618712 -8440080 -1858665 2688246 2596823 -350395 -2568550 -2557709
39752 -2557709 -1337659 -293674 105011 54446 -99877 -307771 -981116 -2167670 -2681086
39743 -2681086 -1256716 1324095 2833583 2767515 3128235 5160559 7225742 7468733 6924080
39734 6924080 7822031 9874642 10661053 9345179 7681631 7138721 7172033 7055661 7541004
39725 7541004 9337821 11030625 10069928 5811513 672981 -2060694 -1388458 575942
39717 575942 1004237 -416972 -1036335 1596178 6458011 9725481 8830624 5144969 2140212
39708 2140212 1330781 921074 -1275140 -4466245 -5666883 -3811007 -1413564 -999937 -1320553
39699 -1320553 677323 4777604 7313035 6500979 4846101 4622775 3946767 211963 -4803740
39690 -4803740 -7081361 -6511199 -6696506 -8623223 -8959423 -5951965 -2809853 -2696132 -3912404
39681 -3912404 -3520534 -2906212 -5253154 -9034577 -9052934 -4020097 1600297 4336348 5765275
39672 5765275 7838571 8623329 6303435 3969498 5623558 9262320 9077229 4112616
39664 4112616 -357165 -860552 -209440 -1855302 -4090576 -3287086 -8596 1904035 868104
39655 868104 -1033773 -1242258 1302046 6299252 11619597 13855454 12121927 10107275
39647 10107275 11239214 13151188 10947073 5113161 1292162 1838798 2725274 479218
39639 479218 -2620605 -3009895 -1411154 -495276 -136728 1277001 3112078 3693957 3528507
39630 3528507 4037648 4723824 4797031 5780293 8776247 10791088 8162877 2736709 16586
39621 16586 1383695 2823612 1762718 271518 150519 -322151 -2224741 -2736979 516052
39612 516052 4887972 6190362 4669342 3740570 4122543 3282846 549570 -1083154 638103
39603 638103 3897666 5573188 5333827 5003569 5138757 4703032 3936587 4828099 7369666
39594 7369666 7484752 1544474 -7578389 -12193714 -8556408 -1244789 2902919 2590762
39586 2590762 1197687 623851 159460 350473 3074439 7015264 7451503 2517670 -3665930
39577 -3665930 -6285356 -5400660 -3942799 -2983705 -2055510 -1988379 -3791122 -5776039 -5230637
39568 -5230637 -2555090 -617630 -95038 1339870 4609021 7058189 6156563 3127213
39560 3127213 1115845 1260530 2397880 3630999 5131333 6592143 6769040 5201895
39552 5201895 3264108 2693099 3679274 5097892 6128246 6793227 7191474 7168303 6651770
39543 6651770 5282533 1857027 -4262765 -10795601 -13476981 -10548001 -4834345 -109329
39535 -109329 2873453 5035270 5822783 4387521 2489598 2565719 3342871 1056026 -4801673
39526 -4801673 -10500398 -13153011 -12908849 -9510674 -1449102 9322228 16278287 15354878
39518 15354878 9976112 5878910 3962428 1863998 -351671 -758684 -46302 -707046
39510 -707046 -2554579 -3315775 -3158897 -4376875 -6706230 -7336523 -6137270 -6648536 -10487815
39501 -10487815 -14382619 -14708962 -12304091 -10805205 -12045572 -14677043 -16042847 -14369743
39493 -14369743 -10163937 -5891493 -3312686 -1562555 596342 1759839 54916 -2313371
39485 -2313371 -633207 5548220 11093725 12184246 10938251 10976709 11711572 10141767 6063076
39476 6063076 2195197 311646 72559 1049451 3458032 6929892 10118944 11499123
39468 11499123 10028039 6051467 2138392 1320290 3441797 5105053 4472925 3831444
39460 3831444 5504297 7717647 7421261 5260744 4199775 4387438 3307714 804173
39452 804173 46717 2614057 5735878 5735266 1986638 -3442511 -7843007 -8676299 -4824625
39443 -4824625 1445502 5695862 6023628 4955922 5388455 6629301 6294956 4219098 1984637
39434 1984637 -35129 -2252829 -3264823 -949532 3629262 6495305 5845222 4136626
39426 4136626 3807563 3623750 1383907 -2006556 -3901312 -3733693 -2426830 750923 6902330
39417 6902330 13298748 14742068 10456424 5971748 6018054 8657637 9195044 7162726 5734447
39408 5734447 5880279 5315989 3149093 1951034 4317710 9735265 15491950 18853806
39400 18853806 18217298 14190582 9774096 7518112 6414677 3591391 -1154766 -5057877
39392 -5057877 -6533055 -6610292 -5908242 -3641621 -718651 -209566 -2624749 -3818435 -347370
39383 -347370 5392047 8281031 7030084 4690536 3760435 3678801 2825721 681721 -2021553
39374 -2021553 -3784748 -3226467 -594005 2172172 3650046 4101821 3758039 1882663 -1058816
39365 -1058816 -2367434 -283962 3460946 6215989 7698186 8627106 8339106 6645893
39357 6645893 5980072 8163104 10701215 10171282 7869806 7696897 9519067 9869053 9067496
39348 9067496 11722666 18630715 23720741 21991375 16085024 11573539 9414652 7055949
39340 7055949 4156152 2619235 2340877 1233528 -758578 -1249076 590921 2414176
39332 2414176 1811186 -892349 -3525997 -4296874 -2745224 267208 3111421 4705229
39324 4705229 5346123 5728191 5676140 4774318 3642082 3287117 3500533 3225238 2408750
39315 2408750 2100748 2472898 2047157 -337103 -3483891 -4674418 -2645026 709219 2110197
39306 2110197 506450 -1692969 -1602123 627333 2601585 3504392 4896695 7229936 8166906
39297 8166906 6243069 4190287 5738432 9884355 11413874 7582181 1711101 -1058612
39289 -1058612 336159 2914960 4357429 5511026 8089598 11538143 13310972 11870893
39281 11870893 8473019 5704485 4825830 5075669 5190214 4707105 3754900 2581694 1768887
39272 1768887 2057292 3256513 3991802 3312726 1974021 1281968 1310162 1413178 2003527
39263 2003527 4215126 7687291 10276789 10682342 10108790 10298065 10858957 9976497 7405488
39254 7405488 5134945 4605041 4577557 2918164 -165956 -2152483 -1614155 -190912 -254773
39245 -254773 -1608865 -2010002 -753012 -73805 -2214130 -6037068 -7597125 -4003781 3599537
39236 3599537 10663827 12844979 9750051 5383455 4054611 5535760 5558553 1928365
39228 1928365 -1605612 169076 6461193 10658489 8735902 4501036 4235275 8206111
39220 8206111 10832252 8728873 4985478 4286225 6627554 8146931 6572340 3346244
39212 3346244 968948 561720 2110775 5130206 8546185 11269281 13213206 14645042
39204 14645042 14751947 12646659 9876787 9660559 12739249 15990187 16383247 14535462
39196 14535462 12925794 12251871 11273826 9011505 5578695 2105757 1087135 4873781
39188 4873781 11991482 17119892 17277863 15926232 17704766 21185012 21274970 17558770 14859123
39179 14859123 15222082 14766667 10251177 4038752 -69171 -1997218 -3385368 -3785705
39171 -3785705 -2375685 -994846 -1857951 -3775130 -3793855 -1456423 1267308 3125993 4091008
39162 4091008 3835780 2282613 818537 753179 1517063 2272132 3731255 6108418 7175356
39153 7175356 5350908 3029984 3392463 5345773 5515597 4089618 4208489 6094039 6689672
39144 6689672 5439377 5323436 6877000 6241993 1609591 -2841965 -2730665 313249 1811495
39135 1811495 996906 262467 140386 -767143 -1655035 447758 5972196 11294830 12907328
39126 12907328 10985127 8118379 6383098 6499040 8311298 10917082 12988932 13732968
39118 13732968 13299197 12100210 10104428 6873149 2077033 -3829461 -9271311 -12386193
39110 -12386193 -12526640 -10430834 -6866688 -2331124 1447290 1557616 -2789798 -8105506
39102 -8105506 -9872536 -7564470 -4501036 -3046906 -2346788 -1180800 -491635 -1581094
39094 -1581094 -3554559 -4402043 -3613962 -1990413 379898 3908872 7437763 8547271
39086 8547271 6714605 4564183 4804666 6971086 8443725 7886055 6180540 4409694
39078 4409694 2688002 1193960 644661 915635 475968 -1683968 -4337003 -5208298 -3299277
39069 -3299277 663378 5118014 7948204 7019451 2304972 -2929768 -4918414 -3376991
39061 -3376991 -1081695 335431 1891204 4060977 4705749 2073568 -1758318 -2820771
39053 -2820771 -207852 2877603 3201949 1087748 -627455 -168552 1459217 1989598 511369
39044 511369 -1605792 -2237000 -629817 2199134 4788547 6270301 6293772 4988931 3312783
39035 3312783 2472408 2508687 2304524 1406725 643739 206670 -1340014 -4548023 -6855367
39026 -6855367 -5294379 -1107974 959238 -1389295 -5087766 -5959667 -3773571 -1105081
39018 -1105081 1203679 4616706 9306120 12837233 13371718 12226451 11956821 13105783
39010 13105783 14006640 12914809 9387241 4507978 722376 275063 2434802 3413656
39002 3413656 867372 -2537454 -2447118 931494 2990369 1396286 -791966 -180015 1840739
38993 1840739 1609876 -1260281 -3858614 -4285290 -2926601 22235 5038466 10722592
38985 10722592 13566104 11770291 7717394 5240856 5304614 5506385 3388238 -748974
38977 -748974 -4399233 -5601475 -4534478 -2313126 715087 4114593 5599920 2885555
38969 2885555 -2096608 -3959788 -828693 2360313 634363 -3450824 -3433132 1253814
38961 1253814 4427908 2485369 -698302 -256784 2705278 3939416 2837512 2552629
38953 2552629 4612244 6780127 6428596 3999837 2537247 4392922 8510652 11281189
38945 11281189 10775801 9292898 10011277 12112742 12193377 10111284 9464723 11477925 12651463
38936 12651463 10430842 7201322 5821453 4812644 1654148 -2008066 -2572178 -5372
38928 -5372 2661072 3750893 3205718 238941 -4978164 -8595248 -6806150 -1903953 -52406
38919 -52406 -2894139 -5793009 -4907279 -1533313 1642160 4128267 5531881 3879551 -1134318
38910 -1134318 -5909445 -6551456 -2935563 2473857 7559502 10454469 9072868 3628104
38902 3628104 -1718321 -2405984 1597575 5849883 5838151 527922 -7152322 -12239007 -11554167
38893 -11554167 -6899921 -3178767 -2377130 -1352450 2955586 8497794 10913557 9640837
38885 9640837 8057647 8360213 9520591 10165311 10268280 9466426 6731726 2904404 913365
38876 913365 1831982 2984569 2000589 645483 1748096 3750586 2087474 -3947125 -9474930
38867 -9474930 -10513145 -8778022 -7609398 -6194851 -1881684 3463222 4502012 339183
38859 339183 -3243140 -1402247 3696326 7075610 7888135 8524843 9217509 8060475 5646173
38850 5646173 5340294 8313658 11584371 11987716 9646158 6681377 4603800 3746620 3507554
38841 3507554 2607776 653843 -546780 882783 3621443 4428343 2757472 1394327
38833 1394327 2127301 3722955 4921971 6222257 7316120 5995560 1788388 -2038296
38825 -2038296 -2692106 -1898968 -2969626 -5564976 -6439379 -4424037 -1734344 -583769 -900231
38816 -900231 -1372218 -728657 2119860 7404805 13502324 17734858 18529134 16340715 12794130
38807 12794130 9475900 6972781 4387013 392789 -4640506 -8360342 -8861441 -6550158
38799 -6550158 -3157806 -121392 1533232 1317433 290751 494952 2363044 4134662
38791 4134662 4662876 4862222 5330978 5006451 3864547 4209092 6669185 7465844 3192745
38782 3192745 -3488715 -6843763 -5606224 -3428675 -2452464 -994623 1936095 4292057
38774 4292057 4668296 4629248 5417605 5422001 3116143 28715 -1414477 -887997 1084543
38765 1084543 5098396 10751316 14218208 11427666 3531458 -3530162 -5345569 -2884237
38757 -2884237 297203 2429134 3752924 3908282 1386998 -3936782 -9043984 -9963330
38749 -9963330 -5999791 -884102 1131415 -103970 -983934 1033544 4417453 5953113
38741 5953113 4698130 2159953 -544270 -3604413 -6403717 -6648808 -3175828 1520230
38733 1520230 3586984 2435531 1014015 1124717 906598 -1494080 -4021240 -3390462 -551315
38724 -551315 40517 -3187761 -6606406 -6505311 -3464094 59938 3557039 7297965 9647225
38715 9647225 8799910 6064308 4450959 4627464 4909518 4628845 4626146 4633334 3164104 386680
38705 386680 -1608627 -2132521 -3078438 -5833096 -9108015 -10930209 -10946334 -9615401 -6925660
38696 -6925660 -3487917 -1544043 -2942304 -6474394 -8710507 -7630045 -4508140 -1902015
38688 -1902015 -434302 1569111 5081053 8137664 8131703 6014266 5843341 9172355 12227525
38679 12227525 10731322 5749666 2048801 1713789 2320926 1054590 -2129414 -5416874
38671 -5416874 -6695815 -4219874 1762170 7935709 10932909 11421490 12559170 14530252
38663 14530252 14047298 9914451 5489295 4038314 4658503 4674078 3483350 1980332 319915
38654 319915 -1645187 -3289476 -4155375 -4394251 -3231816 735005 6365680 9752329 9141835
38645 9141835 7561362 8163305 9357555 7474071 2326079 -2988542 -6306287 -7298319
38637 -7298319 -5578967 -1481621 2075696 2190208 363105 860408 4352041 6528484
38629 6528484 4060502 -993174 -4303429 -4562008 -3768218 -3618357 -3576936 -2263657 544821
38620 544821 3622902 5607753 6287730 6391940 6373106 6216789 6451055 7942323 10058046
38611 10058046 10578900 8635170 6305510 5774582 6283850 5775945 4183663 2623503 415674
38602 415674 -3938550 -9007125 -10923135 -8419589 -4676608 -2996224 -2929949 -2102454 142732
38593 142732 2732118 5057366 7217295 8787062 9054718 8239989 7236521 6403199 5754279
38584 5754279 6050759 8207494 11253634 12190436 8955896 3108042 -1354304 -1791951 1125115
38575 1125115 5032174 8140284 9406951 7907348 3713412 -991713 -3318266 -2489484
38567 -2489484 -257201 1462758 2205657 2289047 1961162 1402528 330765 -2242220 -6202738
38558 -6202738 -8583530 -6135332 -50572 4621999 5251832 4474237 5286593 6384063 4967708
38549 4967708 1738444 -178026 47070 252325 -1435099 -4895706 -8632217 -10113384
38541 -10113384 -7054058 -765937 3495597 2500425 -267175 672115 4969293 7657781
38533 7657781 7187313 7011694 8692871 8752850 4570356 -883630 -3310853 -3159969 -4144855
38524 -4144855 -7400357 -10251352 -10342106 -8589487 -7553255 -8002112 -7793547 -4377537 1710511
38515 1710511 6858523 8494920 7818322 7218150 6885845 6294896 7117129 11043448 15702308
38506 15702308 16801474 14068129 10890405 8040203 2686690 -5142713 -10135645 -8383015
38498 -8383015 -2653197 1799450 3424981 3648585 3168087 2246383 2242184 3731458 5075987
38489 5075987 5376364 6401423 8905910 9982518 7624677 5079083 6101253 8004903
38481 8004903 4825917 -3382712 -9947592 -10841909 -9441594 -10231733 -12144050 -11250665 -7381415
38472 -7381415 -4571937 -5642599 -8918022 -10750708 -9891756 -8417876 -8528187 -9458582 -8665836
38463 -8665836 -5636849 -2589708 -976708 365534 2355819 3625142 3646388 5289014
38455 5289014 10571023 15642090 14739825 8844674 5361477 7945364 11403031 9432229
38447 9432229 3466613 -259796 16168 109094 -2818671 -6119133 -6104060 -3015812 731893
38438 731893 4606382 9071550 12113206 10481818 4713706 -433682 -1842003 -1485478
38430 -1485478 -2217771 -2924590 -828535 3398103 6398985 6904058 6187258 4684727 2303832
38421 2303832 1761869 6803135 16157061 23678347 25768736 24244455 20587683 13083458
38413 13083458 2772123 -3456554 -927666 5630749 8481548 7337031 7455539 9656819
38405 9656819 9143457 3933269 -1811020 -3849124 -2333965 769325 4365808 7218523
38397 7218523 8052197 7712906 8016685 8089919 5442609 1010756 -827312 1965435 6935266
38388 6935266 11259570 14021856 13874618 9208124 2231646 -1539986 -19358 2976838
38380 2976838 3794656 3451937 3933547 4203593 2928501 1657027 2147833 3512076 4835218
38371 4835218 7476691 11683121 14102126 12305043 9142804 8892010 11302565 13049491
38363 13049491 12920744 11861817 9933512 7177014 5722561 6930195 7922605 5223269
38355 5223269 680162 -681140 1973869 4553049 4506919 3635674 3994439 5005243 5505253
38346 5505253 5297204 3936694 1073315 -1532895 -1533472 84252 37797 -1859320 -2342263
38337 -2342263 -740306 -925502 -4942318 -8746557 -7749606 -3669552 -1864498 -3558925
38329 -3558925 -4885039 -3337351 -1390611 -2545707 -6208887 -8248985 -5851092 -612888
38321 -612888 3223882 3041596 -91253 -3438391 -5610355 -6773859 -6964952 -6055194 -4992332
38312 -4992332 -4782319 -3990560 176639 7257525 12552212 12659917 9860739 8416335 8225956
38303 8225956 5700715 460736 -2853826 -810759 3952548 6551228 6480276 7346403 10828290
38294 10828290 14294220 15051559 13947375 12947122 11431807 7636118 2604146 -380999
38286 -380999 -312047 432135 107775 -22729 1324494 2647435 1985293 192642 -584754
38277 -584754 -411387 -894839 -1858919 -1552822 20194 824395 207759 -39724 1195162
38268 1195162 2633317 3113891 3439390 4060539 3077615 -981515 -5663157 -6682741 -3367381
38259 -3367381 508152 1904069 2273910 4642262 8485660 9906824 6883616 2207819
38251 2207819 88022 1224520 2945341 3538212 4276892 6735590 10039628 12110166
38243 12110166 12517561 12550007 12754315 11682710 7496877 575331 -5634881 -6971695 -2684630
38234 -2684630 3151186 5734999 4786941 3782373 4236673 3925567 1687701 295034 2065126
38225 2065126 4793891 5453300 5298911 7097229 9244415 7682494 2923273 -14070
38217 -14070 1035804 3041869 3705893 4693195 6975629 7625146 4358733 -173733 -1887276
38208 -1887276 -554210 1195902 1917292 1784024 1116493 920450 2678119 5190923 4276080
38199 4276080 -1369359 -6694189 -6512813 -2905079 -1808840 -3802339 -3652730 1110157
38191 1110157 6548104 8485210 7657151 6563047 5090376 2233732 -578973 -1170970
38183 -1170970 -206581 -252596 -1948759 -3539199 -3968801 -4178273 -4823509 -4482327 -1431042
38174 -1431042 3364820 6313561 4778348 46051 -4096556 -5537182 -5372103 -5094644
38166 -5094644 -4167476 -1893821 -113434 -1344804 -4561788 -5653495 -2896831 401921
38158 401921 211703 -3070876 -5721880 -5847301 -5155378 -5670124 -6827583 -6841544 -5682485
38149 -5682485 -5233304 -6682475 -8915576 -9827940 -8482584 -5568759 -2513736 -862138
38141 -862138 -1709600 -4375361 -5945484 -3794241 1117456 4937155 5435712 4324694 4311427
38132 4311427 5548854 6451365 6638833 7045189 7678387 7221869 5004415 2070268 110077
38123 110077 163072 2314256 5918483 10096026 14227444 17529348 18300286 15114296 9393717
38114 9393717 5115927 4733879 6726590 8194937 8027540 6194572 2463836 -1708108
38106 -1708108 -2376530 2322518 8349780 10200165 8008194 6276305 6542134 6138663 4137584
38097 4137584 3161278 4005757 3517400 146278 -2742646 -1936214 1012649 3329681 5728526
38088 5728526 9929922 14234077 15524216 13867892 11589863 9392588 6828702 5008498
38080 5008498 5029067 4792314 1190866 -5132182 -10675185 -14029039 -16239866 -16821401 -13748968
38071 -13748968 -7824965 -2877184 -503420 1602725 4643577 5811950 2770096 -1950851
38063 -1950851 -3898631 -2148559 752618 2773980 3740794 3684012 2487370 1088021 1066203
38054 1066203 2762434 4899644 5940331 4937734 1661583 -2733230 -5493454 -4367530
38046 -4367530 -318712 2970641 2810668 4841 -2623038 -3233135 -1788742 1248852
38038 1248852 5507188 9751940 11741640 10242622 6739189 4009719 3112344 2776823
38030 2776823 1568151 -701303 -3664627 -6744969 -8460734 -7429418 -4921354 -4211481
38022 -4211481 -6021842 -7025417 -4997733 -2898421 -4449322 -7522804 -6295076 559640
38014 559640 8232863 12650314 14528470 15351386 13758985 8610293 2365659 -1654193
38006 -1654193 -3260328 -4101830 -4380531 -3413035 -1685151 201982 2910612 6028593 6232752
37997 6232752 1278947 -5277501 -7158593 -3136326 1566374 2039944 -1095307 -3950104
37989 -3950104 -4146485 -2091326 564512 2385235 3117770 3851263 5352251 6396043 5307866
37980 5307866 3089497 2917943 5909441 9227410 9406397 6263790 2677463 1548186
37972 1548186 3606201 7171346 9433355 8698372 5662611 1983936 -1690530 -4890203
37964 -4890203 -5535214 -1771882 4312836 7835520 7035379 5423632 6659989 9871909
37956 9871909 11912746 11772986 10241316 7293594 2990582 -306292 -57877 2364071
37948 2364071 2779651 -234586 -3461931 -3410733 -355611 2978881 5015488 6314628 7961441
37939 7961441 10101190 11831344 12111958 10875194 9049696 7287266 5423915 3776088
37931 3776088 3711116 5534457 6982442 5902156 3697690 3675597 6310830 8921947 10163805
37922 10163805 11666723 14163436 15044452 11797138 5699040 -32527 -4046190 -6709266
37914 -6709266 -7758559 -6597287 -4009038 -1291822 1648399 5281272 8334573 9047348
37906 9047348 7994731 7163100 6540584 4455380 1485688 918315 4115653 8030490 9107054
37897 9107054 7702924 6610239 6619358 5981969 3923103 2536961 4460863 9532222 14394448
37888 14394448 15519239 12715830 9349521 8524375 9556739 9459373 7409301 5522300
37880 5522300 4953865 4073349 1952659 832510 2376764 3596873 248907 -6486099
37872 -6486099 -10552571 -8582353 -3470365 494051 2731503 4900679 7202979 8634600
37864 8634600 9100381 8959271 7833963 5954347 5257035 6813569 8486994 7854187 6310166
37855 6310166 6896266 8567291 6652632 -114381 -6756865 -8127811 -4838217 -850320
37847 -850320 2110973 4587010 5741736 3618165 -1127566 -4865640 -4827437 -1152588 4727630
37838 4727630 11041238 14826484 13401851 8108992 3957768 3694447 4414590 2142126
37830 2142126 -2349760 -5068427 -4567018 -2783564 -786137 2539370 6871344 8940638
37822 8940638 6578699 2174978 60838 1603308 4481888 5890720 4953550 2581553
37814 2581553 220892 -1550857 -3722104 -7203496 -10006488 -7994434 -158183 8486665
37806 8486665 11771541 9223894 5361282 2829436 -214760 -5317917 -10001149 -10952077
37798 -10952077 -8466101 -5238053 -2445778 361858 2677273 3216743 2308925 1449188
37790 1449188 460001 -2243180 -6059949 -7651105 -5390560 -2096142 -1271932 -2255255 -1596276
37781 -1596276 1630640 4767352 5953885 6681594 8587289 9957324 7865424 2853502
37773 2853502 -1120535 -1575227 -17003 1330280 3070174 6826725 11209012 12458622
37765 12458622 9438848 5621187 4965746 7527366 10570000 12553448 13887614 14461197
37757 14461197 13038306 9730276 7027176 6980556 8458268 8568430 6187904 2764794
37749 2764794 27297 -1544699 -1884686 -774649 835968 353824 -3618264 -8205322
37741 -8205322 -8149019 -1713980 6721467 11244409 10476813 7507295 4843704 2099662 -1109053
37732 -1109053 -2867003 -1363087 2113675 4703740 5716735 6909582 9334305 11679420
37724 11679420 11932037 9474747 5514780 2505238 2864361 6762731 11060625 11909833
37716 11909833 8867363 5304911 4383994 5740387 6581581 5024201 1803018 -566420
37708 -566420 40539 3425089 7303137 10080349 12730137 16563444 19974699 19871164 16281618
37699 16281618 12658904 10878000 9008062 5626187 3229162 4545411 7670395 8215518
37691 8215518 5135100 1293710 -985222 -1734535 -1029374 1788536 5964307 9090344
37683 9090344 9863770 9064944 7394139 4637807 1609364 512166 2192181 4822830
37675 4822830 6229556 5786896 3407685 -1017846 -5966342 -8343324 -6958867 -4192947
37667 -4192947 -2542019 -1337502 1083591 3678389 3874007 1635667 -171654 675334
37659 675334 3798080 7568826 10527427 11452649 9738756 6039552 1584807 -2850088
37651 -2850088 -6302282 -6853284 -3379675 2194887 6188830 6775592 5023690 2823649
37643 2823649 1537913 2235379 4940818 7523516 7596020 5915076 5649980 7719340 9346303
37634 9346303 8331620 6243227 5525109 5516864 3804389 367386 -2093085 -1699129 598642
37625 598642 2582910 3004475 2201538 1391741 1377325 1694944 1611138 1872428 3806904 6235932
37615 6235932 5776885 1873702 -1072704 488617 3456653 2182330 -2715413 -4640918
37607 -4640918 -732470 3762914 3136721 -1074467 -3648443 -3729312 -4630625 -7062548 -7522518
37598 -7522518 -4009827 590016 2481983 1739110 1290667 2763581 5093957 6535876
37590 6535876 6716233 6798417 8088284 10270727 11133170 8799230 4223353 509617 -340596
37581 -340596 1032048 3130854 5553317 8545231 11676523 13765959 13620777 10647533
37573 10647533 5580932 792855 -1244143 -270443 1858387 3691309 5307272 6756717
37565 6756717 7189100 6311499 5079270 4102032 3167043 3223185 6281547 11405028 13376756
37556 13376756 8611686 835611 -2783432 -458905 3016038 3734183 3103386 3702923
37548 3702923 4739554 4138671 2373284 1329352 1031493 113035 -1582649 -3268989 -5240043
37539 -5240043 -8201391 -10933227 -10974993 -7951103 -4376850 -2527758 -1802339 54703 3846601
37530 3846601 7744205 9112968 7295746 4379907 2888009 2962803 2698819 1166117 -318863
37521 -318863 -387072 526048 1532616 2952602 5077567 6569150 6114931 4940677 5522485
37512 5522485 8006484 9894167 9338417 6901895 3916025 1132184 -439940 563469
37504 563469 3805788 6545923 6534766 4800277 4085211 4986106 5249362 3128966 62433
37495 62433 -955895 974162 3841362 5618126 6690707 8511483 10829513 11925158
37487 11925158 11303529 10117906 8472433 4589159 -1786457 -6950951 -6617365 -1132861
37479 -1132861 4727903 6983578 5662145 2953728 249271 -2249513 -4364189 -5445620
37471 -5445620 -4841813 -2782345 -947252 -1423528 -4318989 -7136016 -7452447 -5398045 -2523282
37462 -2523282 397104 2805526 3132637 603573 -2714667 -4314206 -4800598 -6065882
37454 -6065882 -6917491 -4572662 -306920 1090693 -1520796 -3722183 -2621013 -1057718
37446 -1057718 -1768781 -2007203 1517233 5914836 5821578 1757959 -874549 -297846 -230105
37437 -230105 -2953519 -5858327 -6338054 -5489356 -4842457 -3458795 -943467 146491 -1803493
37428 -1803493 -3832412 -2335997 1201460 2352365 641331 30706 2288322 4144700
37420 4144700 2801985 680633 1624342 4715252 5701378 3689535 2227551 3026034 2700040
37411 2700040 -1742308 -7248709 -8312264 -4722606 -1695681 -2453679 -4602177 -4719879
37403 -4719879 -2837075 -555753 2032582 4888411 5875116 3153139 -1600600 -5054082
37395 -5054082 -6259690 -6338978 -5280418 -2107064 2158670 4710355 4525273 3467121 3510602
37386 3510602 4732631 6077518 6232962 3945430 -403762 -3754990 -3311111 -394621
37378 -394621 1316945 1294499 2469188 5484442 6686461 3891305 547500 903483 3534437
37369 3534437 3480928 -441126 -4237556 -4391236 -1525617 2034194 5266753 7740814 8327740
37360 8327740 6582612 4135248 2903237 2525341 1135227 -1538732 -3344316 -2256273
37352 -2256273 1410529 5775433 9207374 10565739 8901336 4650768 602385 -426541
37344 -426541 840757 898493 -1496313 -3139069 -607866 5235453 10809752 14089046 14911541
37335 14911541 12655634 7047082 872766 -1582749 459475 3378152 3922468 2637893
37327 2637893 2042361 3714849 7752020 12736638 15655566 14397207 11021634 9764759
37319 9764759 10960472 10208328 4997587 -1367618 -4659924 -5063574 -4590637 -2417485 3053184
37310 3053184 9635986 13360654 13933390 14002143 13746042 10784798 5679356 2948917 5090097
37301 5090097 9073455 10626642 9360227 7861451 7817366 8781221 9264311 7759808 4133232
37292 4133232 1010605 2067663 7574535 13042116 13705899 9320302 3408837 -1009336
37284 -1009336 -3524916 -5087236 -6276384 -6841735 -6274554 -4879613 -4102005 -4839142 -5526561
37275 -5526561 -3593511 585126 2988110 468699 -5405857 -10481824 -12772947 -13304277
37267 -13304277 -13081205 -11492676 -7989950 -3680394 -442212 895666 1142391 1906900
37259 1906900 4174969 7367348 10017571 11657717 13360854 15729177 17206168 15829838
37251 15829838 12362999 9939828 10118619 10812678 9281538 6228813 5387353 9016925
37243 9016925 14959639 18654194 17493932 12770953 7782050 4674607 3128306 1564548
37235 1564548 -776725 -3002963 -3655038 -2329857 191222 3421840 7948913 13934083
37227 13934083 19354651 21189976 18852743 15368530 14219270 15543040 16322498 14065701
37219 14065701 9562458 6122451 6574995 10698295 15047031 15723616 12051651 7222014
37211 7222014 4704010 4651872 4861175 4479850 4837819 6545443 7952468 7648768 6909320
37202 6909320 7896727 10193427 11036660 9106069 6452153 5929886 7811300 9936342 10520433
37193 10520433 9540915 7565904 4802780 2001323 965279 2650469 5264832 5927110
37185 5927110 4347254 3292074 4851818 7751131 9371278 9140266 8464027 8150765 7589431
37176 7589431 6217809 4316184 2341720 763241 604446 2770506 6370738 8763839
37168 8763839 7923547 4251147 -185243 -3542182 -5062429 -4796434 -3170677 -826209
37160 -826209 1356584 2375329 1809960 617064 516527 2017933 3690796 4046320 3308229
37151 3308229 2289517 413783 -3425971 -8279080 -11206480 -10403714 -7071661 -3815300
37143 -3815300 -2232331 -2410219 -3649413 -4855889 -4711699 -2229089 2455400 7545279
37135 7545279 10208269 9041169 6313571 6094664 9081291 11226840 9412472 6390200
37127 6390200 6885911 10221613 11087974 7561135 3772593 3324474 4347158 3562754 1652290
37118 1652290 1199738 1799323 935248 -1607211 -3644122 -4235269 -4318124 -3918459 -1606815
37109 -1606815 2899815 7853817 11623617 13856600 14180998 11686640 6531190 753839
37101 753839 -3343962 -4986948 -4912651 -4414165 -4565167 -5578384 -6667303 -6995376 -6654255
37092 -6654255 -6239868 -5868326 -5264663 -4282714 -2511660 892466 5667214 9250770 8845238
37083 8845238 4852077 859757 -149095 1589394 4083766 6183892 7663106 7683062
37075 7683062 4862121 -698925 -6386806 -9055288 -8075958 -5665092 -3850527 -2096901
37067 -2096901 940318 4080662 4142392 265343 -4160803 -5120860 -2336030 1207986 3057812
37058 3057812 3189731 2805643 2774059 3170289 3344335 2576349 1362119 1586256 4543630
37049 4543630 9162571 13012088 14723100 14748699 14338803 14708536 16775786 20656950 25434759
37040 25434759 30062299 34518255 39872849 47327563 56756970 65335646 68248054 62786828
37032 62786828 52072206 42730586 38233983 36391619 33725447 29451042 24046780 17340973
37024 17340973 10480165 6819827 7624964 9177507 7585256 4414526 3779137 5823215
37016 5823215 7690413 9503028 13774147 18888716 18990467 12169193 4154340 1473629
37008 1473629 4417889 8873045 11715765 11899597 9207970 4976497 2145942 1971934
37000 1971934 2048256 -372974 -4523902 -7457273 -7827069 -6452357 -4323875 -1906782 361133
36991 361133 2264886 3838399 4529879 3593196 1826165 1057899 1140323 -283689 -3826240
36982 -3826240 -6644731 -6398788 -4514588 -3411677 -2867827 -1787398 -1375522 -3143941 -5157831
36973 -5157831 -3941701 323623 3834805 4398192 3507777 2756924 1252595 -1954053 -5022550
36964 -5022550 -4927983 -1358686 2256619 1971639 -2399300 -6405618 -5197330 1030219 6965801
36955 6965801 8239613 6074636 4596842 5099386 5274727 3437661 1035079 651620 3196213
36946 3196213 7431348 11149475 12682832 12126449 10985519 10118101 8877071 7090684
36938 7090684 6388990 7720139 8704928 5964127 -233860 -5981114 -8415684 -8218671 -7247815
36929 -7247815 -5998945 -4203418 -1987467 731351 4630134 9556896 13528592 14205939
36921 14205939 11253228 6981181 4747680 6200493 9388379 10243242 7080700 2999382
36913 2999382 2278207 4961147 7111419 6333252 4567513 4718741 6883609 9358927 11453115
$$ [...]
##END NTUPLES=NMR SPECTRUM
##END=
