##TITLE=31Pdec_LR-785-R2-C2
 CDCl3, 24 sc
 14.2.2025
##JCAMPDX= 6.0         $$ Bruker NMR JCAMP-DX V2.0
##DATA TYPE= NMR SPECTRUM
##DATA CLASS= NTUPLES
##ORIGIN= UXNMR, Bruker Analytische Messtechnik GmbH
##OWNER= root
$$ XWIN-NMR		Version 3.5
$$ Fri Feb 14 14:11:15 2025 Russian Standard Time (UT+4h)  she@DPX200
##.OBSERVE FREQUENCY= 81.013821
##.OBSERVE NUCLEUS= ^31P
##.ACQUISITION MODE= SIMULTANEOUS
##.ACQUISITION SCHEME= undefined
##.AVERAGES= 64
##.DIGITISER RES= 17
##SPECTROMETER/DATA SYSTEM= spect
##.PULSE SEQUENCE= zgpg30
##.SOLVENT NAME= CDCl3
##.SHIFT REFERENCE= (INTERNAL, CDCl3, 0, 198.062)
##AUDIT TRAIL= $$ (NUMBER, WHEN, WHO, WHERE, WHAT)
$$ ##TITLE= Audit trail, XWIN-NMR		Version 3.5
$$ ##JCAMPDX= 5.01
$$ ##ORIGIN= Bruker BioSpin GmbH
$$ ##OWNER= she
$$ F:/spectra/data/she/nmr/P31/2/pdata/1/auditp.txt
$$ ##AUDIT TRAIL=  $$ (NUMBER, WHEN, WHO, WHERE, WHAT)
(   1,<2025-02-14 14:09:52.67 +0400>,<she>,<DPX200>,
      <continue with go, POWCHK disabled, PULCHK disabled
       configuration hash MD5:
       00 E9 B6 7A A2 85 ED C7 34 08 36 98 17 FE 4E 26
       data hash MD5: 32K
       A6 16 B6 DD 21 2E 71 8D C6 46 45 DD D6 CA EB 48>)
(   2,<2025-02-14 14:09:57.60 +0400>,<she>,<DPX200>,
      <Start of raw data processing
       efp BC_mod = 2 LB = 1.5 FT_mod = 6 PKNL = 1 PHC0 = 1550.195 PHC1 = 150.6954 SI = 64K 
       data hash MD5: 64K
       A4 A4 2C 4D FC 74 51 AD 7A B5 32 C4 92 C2 86 68>)
$$ ##END=
$$ 
$$ hash MD5
$$ DF 9B B9 2A 10 B4 D9 9C 16 A3 1E D6 F5 EC CC 3B
##$RELAX= 
##$RELAX= 
##$RELAX= 
##$RELAX= 
##$RELAX= 
##$RELAX= 
##$RELAX= 
##$RELAX= 
$$ Bruker specific parameters
$$ --------------------------
##$DU= <F:/spectra>
##$EXPNO= 2
##$NAME= <P31>
##$PROCNO= 1
##$TYPE= <nmr>
##$USER= <she>
##$AMP= (0..31)
100 100 100 100 100 100 100 100 100 100 100 100 100 100 100 100 100 100 
100 100 100 100 100 100 100 100 100 100 100 100 100 100 
##$AQSEQ= 0
##$AQ_mod= 1
##$AUNM= <au_zg>
##$AUTOPOS= <>
##$BF1= 81.014009
##$BF2= 200.13
##$BF3= 200.13
##$BF4= 200.13
##$BF5= 200.13
##$BF6= 200.13
##$BF7= 200.13
##$BF8= 200.13
##$BYTORDA= 1
##$CFDGTYP= 0
##$CFRGTYP= 5
##$CHEMSTR= <none>
##$CNST= (0..31)
1 1 145 1 1 1 1 1 1 1 1 1 1 1 1 1 1 1 1 1 1 1 1 1 1 1 1 1 1 1 1 1 
##$CPDPRG= <waltz16>
##$CPDPRG1= <>
##$CPDPRG2= <waltz16>
##$CPDPRG3= <>
##$CPDPRG4= <mlev>
##$CPDPRG5= <mlev>
##$CPDPRG6= <mlev>
##$CPDPRG7= <mlev>
##$CPDPRG8= <mlev>
##$CPDPRGB= <>
##$CPDPRGT= <>
##$D= (0..31)
0 1 0 0 0 0 0 0 0 0.06 0 0.03 2e-05 3e-06 0 0 0.0002 0 0 0 0 0 0 0 0 0 
0 0 0 0 0 0 
##$DATE= 1739527667
##$DBL= (0..7)
120 120 120 11 120 120 24 19 
##$DBP= (0..7)
150 150 150 150 150 150 150 150 
##$DBP07= 0
##$DBPNAM0= <>
##$DBPNAM1= <>
##$DBPNAM2= <>
##$DBPNAM3= <>
##$DBPNAM4= <>
##$DBPNAM5= <>
##$DBPNAM6= <>
##$DBPNAM7= <>
##$DBPOAL= (0..7)
0.5 0.5 0.5 0.5 0.5 0.5 0.5 0.5 
##$DBPOFFS= (0..7)
0 0 0 0 0 0 0 0 
##$DE= 6
##$DECBNUC= <off>
##$DECIM= 4
##$DECNUC= <off>
##$DECSTAT= 4
##$DIGMOD= 1
##$DIGTYP= 9
##$DL= (0..7)
0 0 52 120 120 21 21 25 
##$DP= (0..7)
$$ [...]
##$SUBNAM2= <"">
##$SUBNAM3= <"">
##$SUBNAM4= <"">
##$SUBNAM5= <"">
##$SUBNAM6= <"">
##$SUBNAM7= <"">
##$SUBNAM8= <"">
##$SUBNAM9= <"">
##$SW= 400.765351723535
##$SWIBOX= (0..15)
0 1 3 0 0 0 0 0 0 0 0 0 0 0 0 0 
##$SW_h= 32467.5324675325
##$TD= 32768
##$TD0= 1
##$TE= 0
##$TE2= 300
##$TE3= 300
##$TEG= 300
##$TL= (0..7)
0 120 53 12 22 120 120 120 
##$TP= (0..7)
150 150 150 150 150 150 150 150 
##$TP07= 0
##$TPNAME0= <>
##$TPNAME1= <>
##$TPNAME2= <>
##$TPNAME3= <>
##$TPNAME4= <>
##$TPNAME5= <>
##$TPNAME6= <>
##$TPNAME7= <>
##$TPOAL= (0..7)
0.5 0.5 0.5 0.5 0.5 0.5 0.5 0.5 
##$TPOFFS= (0..7)
0 0 0 0 0 0 0 0 
##$TUNHIN= 0
##$TUNHOUT= 0
##$TUNXOUT= 0
##$USERA1= <user>
##$USERA2= <user>
##$USERA3= <user>
##$USERA4= <user>
##$USERA5= <user>
##$V9= 5
##$VALIST= <valist>
##$VCLIST= <CCCCCCCCCCCCCCC>
##$VD= 0
##$VDLIST= <DDDDDDDDDDDDDDD>
##$VPLIST= <PPPPPPPPPPPPPPP>
##$VTLIST= <TTTTTTTTTTTTTTT>
##$WBST= 1024
##$WBSW= 4
##$XGAIN= (0..3)
0 0 0 0 
##$XL= 0
##$YL= 0
##$YMAX_a= 3019
##$YMIN_a= -3078
##$ZGOPTNS= <>
##$ZL1= 120
##$ZL2= 120
##$ZL3= 120
##$ZL4= 120
##$ABSF1= 0
##$ABSF2= 0
##$ABSG= 0
##$ABSL= 0
##$ALPHA= 0
##$AQORDER= 0
##$ASSFAC= 0
##$ASSFACI= 0
##$ASSFACX= 0
##$ASSWID= 0
##$AUNMP= <proc_1d>
##$AZFE= 0.1
##$AZFW= 0.5
##$BCFW= 0
##$BC_mod= 2
##$BYTORDP= 0
##$COROFFS= 0
##$CY= -3
##$DATMOD= 1
##$DC= 0
##$DFILT= <>
##$DTYPP= 0
##$F1P= 0
##$F2P= 0
##$FCOR= 1
##$FTSIZE= 65536
##$FT_mod= 6
##$GAMMA= 0
##$GB= 0
##$INTBC= 1
##$INTSCL= 9.790993e-09
##$ISEN= 30
##$LB= 1.5
##$LEV0= 0
##$LPBIN= 0
##$MAXI= 10000
##$MC2= 0
##$MEAN= 0
##$ME_mod= 0
##$MI= 50
##$NCOEF= 0
##$NC_proc= -9
##$NLEV= 6
##$NOISF1= 182.463
##$NOISF2= 159.3651
##$NSP= 0
##$NTH_PI= 0
##$NZP= 0
##$OFFSET= 198.0616
##$PC= 4
##$PHC0= 1550.195
##$PHC1= 150.6954
##$PH_mod= 1
##$PKNL= yes
##$PPARMOD= 0
##$PSCAL= 0
##$PSIGN= 0
##$REVERSE= no
##$SF= 81.0140089999434
##$SI= 65536
##$SIGF1= 159.3651
##$SIGF2= -187.1042
##$SINO= 113.3802
##$SIOLD= 16384
##$SREGLST= <1H.CDCl3>
##$SSB= 0
##$STSI= 65536
##$STSR= 0
##$SW_p= 32467.5324675325
##$SYMM= 0
##$S_DEV= 0
##$TDeff= 32768
##$TDoff= 0
##$TI= <>
##$TILT= no
##$TM1= 0
##$TM2= 0
##$TOPLEV= 0
##$USERP1= <user>
##$USERP2= <user>
##$USERP3= <user>
##$USERP4= <user>
##$USERP5= <user>
##$WDW= 1
##$XDIM= 65536
##$YMAX_p= 226638589
##$YMIN_p= -373308362
$$ End of Bruker specific parameters
$$ ---------------------------------
##NTUPLES= NMR SPECTRUM
##VAR_NAME=  FREQUENCY,     SPECTRUM/REAL,   SPECTRUM/IMAG
##SYMBOL=    X,             R,               I
##VAR_TYPE=  INDEPENDENT,   DEPENDENT,       DEPENDENT
##VAR_FORM=  AFFN,          ASDF,            ASDF
##VAR_DIM=   65536,         65536,           65536
##UNITS=     HZ,            ARBITRARY UNITS, ARBITRARY UNITS
##FACTOR=    0.49542278885378, 1,            1
##FIRST=     16045.7642231865, 0,            0
##LAST=      -16421.768244346, 0,            0
##MIN=       -16421.768244346, -373308362,   0
##MAX=       16045.7642231865, 226638589,    0
$$ Real data points
##PAGE= N=1
##DATA TABLE= (X++(R..R)), XYDATA
$$ [...]
9378 12255271 10266205 5808450 -3229756 -13944975 -20612702 -20511718 -16051970 -11488834
9370 -11488834 -8867263 -7260173 -4968320 -1819269 844450 2325973 3860378 6824014
9362 6824014 10364682 12304850 11880459 9808236 6475048 2816932 2223213 7280346 14062877
9353 14062877 14610257 7251595 -196523 -585335 3866554 7118920 8766773 11820963
9345 11820963 14486153 11801527 4630326 -185304 480494 2237665 703078 -2242973
9337 -2242973 -1929227 2950245 9322382 12299346 8447834 -514239 -7559692 -7361451 -2849931
9328 -2849931 -918617 -3025436 -5436405 -7370988 -11326404 -14913835 -11026460 786647
9320 786647 10848968 11761773 7724481 6400537 7544093 5929344 773486 -4561992
9312 -4561992 -8886313 -12589514 -13300866 -8787791 -2681033 -924213 -3022810 -2532223 3733275
9303 3733275 12076830 17670317 19065416 16430536 10125584 2663736 -1696487 -1469302
9295 -1469302 195466 -422152 -3490691 -6640363 -8563933 -10404516 -14049435 -19500361
9287 -19500361 -24016685 -24429898 -20300499 -13700074 -6247046 1262637 6217691 4946487
9279 4946487 -1962732 -8307434 -8977781 -5680735 -3518398 -4369693 -6490365 -8284346 -9163243
9270 -9163243 -8386702 -6135671 -4450563 -4740543 -5933243 -6868891 -8042756 -9111100 -8037678
9261 -8037678 -5056580 -3336474 -2680460 2227577 12454738 18913231 12769139 -1779692
9253 -1779692 -12379206 -13392792 -8393706 -564575 10044586 20198569 23877670 20866773
9245 20866773 17551986 17524953 18146390 17470485 17066931 16312261 11776096 4953931 2851776
9236 2851776 7280635 10888536 8087383 2942131 1211689 1142487 -1796523 -6495392 -8923230
9227 -8923230 -8889348 -7843618 -3789919 4969371 13709587 15321158 9081563 476391 -5900278
9218 -5900278 -8763488 -7937402 -4831440 -3103253 -4080744 -3854841 216181 3313401 -111045
9209 -111045 -6148232 -6041647 -78433 1720078 -5969015 -16624552 -21930341 -21827329 -20364733
9200 -20364733 -17493345 -10733690 -1662470 4777102 6335360 5111881 4047669 4606498
9192 4606498 6887103 9285516 8891782 4916430 1129519 2028188 6520881 8354622 4031907
9183 4031907 -2004773 -2390478 3836857 9547556 7870627 69839 -6874990 -9160346
9175 -9160346 -9528990 -11672306 -14838024 -16025919 -14803203 -12744786 -9608944 -3836346
9167 -3836346 3169417 6762675 4344076 -1388731 -5880207 -7629098 -8035933 -7612231 -4527299
9158 -4527299 2731948 12362868 19696732 20801327 15689465 7999287 1575794 -2484178
9150 -2484178 -5590112 -9144437 -12708564 -14563365 -14010439 -13007679 -14674052 -19374160
9142 -19374160 -23197296 -21916913 -15884001 -8977993 -3255543 2328275 7628653 9607877
9134 9607877 6925144 3068010 2022112 3042322 2755391 712310 -458834 582672
9126 582672 2475115 3552801 3026206 380911 -3890534 -7587551 -9131130 -9596724 -10053282
9117 -10053282 -8555972 -3145284 3692949 7704404 8795679 9371429 7580254 -1364665
9109 -1364665 -15940898 -26844339 -27901258 -23253008 -19993018 -18527273 -15133945 -10164767
9101 -10164767 -7588553 -8197985 -8900722 -8077556 -6710003 -4571364 -275820 4501027 5572336
9092 5572336 2135900 -1909845 -3687238 -4342450 -4888160 -3467469 453868 2794440 -635863
9083 -635863 -8509835 -15809003 -19137909 -17391988 -9882937 1902084 12336328 16314282
9075 16314282 15618862 16317022 19844642 21387869 17915554 12830964 10488230 10510027 10584016
9066 10584016 11091750 13123929 14818486 13973142 12327684 12853441 14088769 11825224 6103665
9057 6103665 1997510 2745414 5908442 7363064 5805248 2204038 -1994751 -4524598
9049 -4524598 -2890498 2661932 8333604 10251855 7659963 2484018 -2284771 -3600620
9041 -3600620 -399345 4486026 6621336 4841914 1800731 -225308 -1048816 -114976 3514989
9032 3514989 7648971 7806443 3678164 745347 2887176 7195974 9154017 9221500 10578405
9023 10578405 13532450 16173326 17904636 18433755 15886835 9919732 4023487 659012
9015 659012 -2672949 -7650667 -9267095 -2741681 6357674 7414877 -257310 -6312638
9007 -6312638 -4417807 137928 848717 -120683 2331016 6886614 8613589 7317484 7028025
8998 7028025 9291146 12111431 14092913 15056935 13639329 8639675 2284358 -1722693
8990 -1722693 -3224718 -5239714 -8753271 -11457824 -11929984 -11382234 -10259396 -6692707 -408634
8981 -408634 4805682 5605187 4219439 5473761 9288240 10190383 5380377 -527482 -1528549
8972 -1528549 1949676 5107783 6545459 8726710 11246462 9949345 4654653 1843511
8964 1843511 5870948 12258734 14300507 12221491 10423886 9290460 6297247 2864657
8956 2864657 3007084 6314020 9140469 11884327 17634175 23950636 24470355 19731256 17483006
8947 17483006 19679360 18366688 9046429 -681355 -2531983 -393090 -3744696 -13299589
8939 -13299589 -21336919 -22885502 -18919794 -11218263 -1805509 4334779 3696736 633078
8931 633078 2325084 7995755 10132683 6174614 1509828 10137 -984379 -4097309 -7097411
8922 -7097411 -7834467 -8378389 -10581315 -12028241 -10128838 -6596574 -4263382 -2513309 492905
8913 492905 3476170 3588830 912494 -1540313 -1374870 1745537 6943944 12296325 15242027
8904 15242027 14877147 13210243 12736227 13604008 14312982 13994443 12636203 10208149 7101441
8895 7101441 4574558 3345344 2414494 509013 -1941072 -3363141 -2913799 -687365 3226339
8886 3226339 8341935 12487792 12549018 7758334 1954672 1086881 7282955 16016523 20786086
8877 20786086 20278910 18468616 17517623 14537604 7562624 664722 -1195257 540114
8869 540114 1363567 2345706 8603285 19288961 26529515 26335346 23660308 23283681 22412142
8860 22412142 17607950 13334912 16358573 24721617 29416492 25778897 17145672 8276820
8852 8276820 1468769 -1202430 1395091 5308845 4281842 -1243703 -3392275 2343033
8844 2343033 10745656 14490199 13244535 11193694 9865491 8374786 7419234 7506052 5597292
8835 5597292 -545429 -6073362 -3485415 6584128 15131390 16477899 14338982 14048273
8827 14048273 14523301 11998548 7358705 4586416 4162275 2841640 -772653 -4311774
8819 -4311774 -5121151 -2760640 1627597 5843290 6926206 3471244 -2469983 -7655581
8811 -7655581 -11106578 -13529517 -14893329 -15276165 -16497805 -19371189 -20573357 -16399807
8803 -16399807 -8916681 -3794374 -2214795 -20845 4522609 7723951 7119003 5843754
8795 5843754 7327570 10010658 10769233 9849812 8805292 6907897 3541638 1348425 2940945
8786 2940945 6637828 9132549 10293010 11757328 13030578 12845388 12330744 12860552 12780467
8777 12780467 10451436 8503960 10377878 14290123 15574196 13678841 11708245 10166159
8769 10166159 6863009 2619207 1150577 2745565 3421564 1122348 -2288492 -5776328
8761 -5776328 -10467028 -15333041 -17201670 -16508025 -17332590 -19802818 -18378815 -10464288 -1039176
8752 -1039176 4654651 7547596 9960682 10129617 7043020 5979940 12158320 21301578
8744 21301578 23553180 16485276 8381672 7686695 13619971 18703825 17507604 11255692
8736 11255692 5450883 4317465 7428318 11432755 14008717 14504103 11811680 5338673
8728 5338673 -1487105 -3015275 1406104 5741290 4816645 -364210 -6810505 -13753979
8720 -13753979 -19117482 -17573839 -8130436 703343 371572 -5982352 -8376939 -4251957
8712 -4251957 171903 1553976 3430283 7600551 10244642 9482073 9138396 10979242 9863831
8703 9863831 1719568 -8757989 -13565567 -10593880 -2681521 8332292 20771230 29496613
8695 29496613 29906168 24698472 21049599 21397716 22026297 20317988 17712800 14804112 9337843
8686 9337843 1373047 -4435886 -4811117 -2225334 81774 3960040 12861655 24813611
8678 24813611 33652858 36305714 34430482 29441534 20975115 11090888 4976902 4966083
8670 4966083 7384520 7843318 6538356 5683772 4937952 2948768 920283 699157 1217014
8661 1217014 882940 1792060 6900305 14071780 17933936 17364831 16158650 16167986 15140224
8652 15140224 12238425 10229067 10298348 9629689 6394639 2656890 125725 -2375380 -4985195
8643 -4985195 -5516236 -4871502 -7972093 -15151470 -18296142 -11225376 601797 6886278
8635 6886278 5275854 1004328 -2801766 -7036882 -10825328 -11299740 -8713645 -5619415
8627 -5619415 -1806051 3798905 7481918 4313166 -2916808 -5950195 -3013972 -1006284
8619 -1006284 -4236857 -8668953 -10175626 -11146734 -14496863 -17139408 -14764097 -9142775
8611 -9142775 -5849783 -7243834 -11241513 -14718708 -15422758 -12996084 -10308678 -11103531 -14708761
8602 -14708761 -16521192 -15273859 -15259739 -18703806 -20737607 -16041683 -6717982 926212
8594 926212 4599484 6603751 8315756 8431980 5710532 304845 -6605086 -12345832 -13837984
8585 -13837984 -11419698 -9343825 -10182035 -11427701 -10292854 -8860296 -10991884 -16405607
8577 -16405607 -21084793 -21628885 -16794707 -7689989 761084 2169285 -3833526 -9987552
8569 -9987552 -11099227 -10958235 -14507132 -18098684 -15312866 -9155574 -9114984 -16737377 -23269795
8560 -23269795 -22799760 -19055625 -16457357 -12701780 -5214634 1337037 273362 -7572058
8552 -7572058 -14692080 -15487285 -10258562 -2367504 4903291 9372253 10707653 10393109 10144157
8543 10144157 11164518 14877356 21825635 28936797 30776980 25492533 17537537 12952047
8535 12952047 13821240 18311929 23116406 24013498 17504591 5407908 -4391368 -5586333
8527 -5586333 -726890 2477015 1031796 -1052237 -33869 2463715 3220401 2806128 4345419
8518 4345419 8528096 12578340 13831556 12210838 8965260 4869945 705091 -1752306
8510 -1752306 -903232 2542020 5823668 6910255 6278962 5723924 6332490 8119828 10690808
8501 10690808 13314694 14819724 14290969 11869951 8706112 6502243 6877611 9925076
8493 9925076 13111317 13072617 9214623 4203921 282218 -3159751 -7412888 -11894385 -15199722
8484 -15199722 -16772050 -16024934 -12179083 -6977957 -4690917 -6259272 -6192172 329164 9336828
8475 9336828 12539911 9099266 6839161 10755806 16164884 15884537 9532638 2298082
8467 2298082 -1997358 -2940863 -1206918 1868650 3462906 1236273 -3826479 -8112695
8459 -8112695 -8521351 -4248202 3094376 10101463 13911103 15014514 16111568 17440498
8451 17440498 15804411 9715623 2661381 -1195562 -2104538 -2503945 -1862743 2305156 9179982
8442 9179982 14471553 15958185 15880841 16805576 17836131 16465080 12163389 6260102 -525175
8433 -525175 -8346714 -16193647 -21399204 -22084671 -19290936 -15703704 -12668803 -9659834 -6517176
8424 -6517176 -4354072 -3521600 -2640114 -1116567 -576400 -1468346 -384828 5376791 11695900
8415 11695900 10973860 2283103 -6493089 -8565300 -6116331 -5457744 -7907888 -9472737
8407 -9472737 -7641827 -4510457 -3453139 -5327862 -7967170 -8115029 -4712678 -1240331
8399 -1240331 -2998629 -10514333 -17633660 -18153826 -12425832 -5267073 346444 4504314
8391 4504314 7323644 8601326 9746060 12427011 15284696 15050871 11325563 7806204
8383 7806204 8254501 12801004 18073027 19589745 14983434 6900446 1887110 4147149
8375 4147149 10992540 16339910 17337805 14944388 9663619 954429 -9166490 -16001114
8367 -16001114 -16911974 -13503529 -8250014 -1635550 6141778 12854135 15318446 12093907
8359 12093907 4851430 -2078434 -4118348 -82846 6815133 12689485 16418363 17777554
8351 17777554 14712943 6412837 -2218559 -3983971 2304708 10862273 16516874 19000024
8343 19000024 19128013 15841643 9374880 3172011 -439976 -3519073 -8616786 -14086208
8335 -14086208 -15998484 -12808561 -5885843 2493554 9299289 10925801 6160475 -1763140
8327 -1763140 -7892294 -9677101 -7799636 -4791570 -3604802 -5074542 -5793509 -1512696
8319 -1512696 6081375 9823168 6499251 1554050 928584 2603400 1581377 -124868
8311 -124868 4471929 16205660 27419369 31662829 30046743 26404698 21561056 15284850
8303 15284850 9661833 6759692 5345485 3033909 -40272 -2380120 -4438418 -7919048
8295 -7919048 -12416412 -15138940 -13919476 -9012436 -2385546 3231752 5195372 2892447
8287 2892447 -948089 -2493703 -777335 1829111 3309027 4379468 6232650 7815019
8279 7815019 7588842 6935562 8628461 11531094 10303524 2595861 -6172683 -8651451 -4733716
8270 -4733716 -1131799 -2453479 -6921666 -11130488 -14143273 -15129181 -11760545 -4382542
8262 -4382542 1943493 3667458 4181306 8513291 14858368 16744928 12683644 8106293
8254 8106293 7298341 8572640 8877637 8569028 9252808 10468746 11032065 10854272 9230329
8245 9230329 4318691 -2847771 -6563642 -2487832 5867647 10414525 7900948 2676805
8237 2676805 -193086 -1122438 -3639300 -8298277 -11667673 -10804064 -6480298 -1606181 1688478
8228 1688478 2310904 -766582 -7302803 -13806868 -15286233 -10089151 -1540371 5831767
8220 5831767 9680276 8808008 2219418 -7901114 -14909900 -13661058 -6856822 -1722831
8212 -1722831 -1151297 -2242891 -2909448 -4466880 -6746116 -6254642 -1908768 2009582 1981696
8203 1981696 408480 809438 1445741 -1439924 -6595216 -9557059 -10428201 -14127369 -22131606
8194 -22131606 -28898481 -28666904 -22499477 -16187649 -13315790 -12717725 -11528687 -8318257
8186 -8318257 -3046602 4277872 13217597 21035456 23107864 17619540 9497397 6556322
8178 6556322 10720667 16180755 17941788 18372520 21725364 25589670 23421907 14309417
8170 14309417 4420864 -1506259 -4638443 -6902960 -7022642 -4488878 -2754569 -4395365
8162 -4395365 -6241210 -3716449 1721416 3770020 -423572 -6622376 -8722227 -5332733
8154 -5332733 -391889 1547249 105702 -614038 3099634 9534110 13058003 11181875
8146 11181875 7711585 7088216 7854593 4864781 -2905116 -9968767 -10187033 -2918500 7004684
8137 7004684 13617721 13827060 9043387 3959003 2784596 5757283 9390540 10037383 6851580
8128 6851580 1766731 -2525708 -4681998 -5451446 -6290805 -7243511 -7089712 -5760547 -4937118
8119 -4937118 -5359227 -5485638 -4546188 -5035014 -9540668 -16350626 -21235094 -22918190 -23513109
8110 -23513109 -23758702 -21600863 -16384247 -10894656 -7385091 -4369367 401242 5915171
8102 5915171 9286220 9741854 8937678 8132271 6912881 4092545 -1523069 -10279322 -20025313
8093 -20025313 -26398598 -26747621 -23235950 -20285610 -19425063 -18457073 -15307608 -10609133 -6248398
8084 -6248398 -3114577 -917271 844132 2208299 2489161 816298 -2425571 -5272168
8076 -5272168 -6351007 -6719314 -8007458 -9166562 -7061501 -681659 6841272 11126535
8068 11126535 10482824 6632200 2594333 420721 392683 1996318 5484584 11471351 18399520
8059 18399520 22240086 20871963 17441293 16203790 15593885 9609334 -2750201 -13508407
8051 -13508407 -14147138 -5561438 3525132 6524060 4241665 1160811 -10380 541353
8043 541353 1655090 2957191 5375099 10082501 16550160 22318630 25378237 25679802 23405862
8034 23405862 17562237 8262924 -1121748 -6825786 -8956524 -10303210 -11562539 -10813477
8026 -10813477 -7677471 -4836424 -4675871 -6823543 -9434906 -10529478 -8028764 -1620761
8018 -1620761 4888908 6555573 3747504 2128632 4689794 7633961 6682717 3790647
8010 3790647 3915743 7652891 10883088 10095692 4831507 -3249852 -10184544 -10616118 -3459180
8001 -3459180 4242689 3595158 -6102937 -17320329 -23630121 -24564405 -21438199 -14068363
7993 -14068363 -3683855 5350014 9635790 10039852 9231640 8668800 9343873 12156632 15466962
7984 15466962 15255589 10028504 3065320 -2157788 -5915522 -9317944 -10557642 -7456414
7976 -7456414 -1835401 1822150 974703 -3771810 -10281015 -15563558 -16925217 -14936692
7968 -14936692 -13411670 -14288785 -14983858 -13177760 -10953464 -10691989 -10221757 -6802420 -3170236
7959 -3170236 -3872852 -7283279 -7442844 -3235850 444927 779858 -26154 -748490 -3571380
7950 -3571380 -8282006 -10062261 -6498583 -1918381 -951371 -1833898 -222353 3572025 5556788
7941 5556788 4243027 1829844 144696 -1532444 -4912057 -10496387 -15983316 -16352265
7933 -16352265 -8096256 5405593 15659285 17824546 14665503 10301107 4482588 -3716129
7925 -3716129 -10950863 -13499217 -13450607 -15715372 -20321962 -22783882 -21493958 -19798583 -20227173
7916 -20227173 -20720001 -17746577 -10557997 -1709048 4750368 5707891 1452712 -4494125
7908 -4494125 -8935665 -10895295 -9313183 -2734242 5745355 7449334 -2430665 -16696818
7900 -16696818 -23326281 -19529348 -12856687 -9367739 -7561849 -4624645 -1842494 -1382092
7892 -1382092 -2837111 -5265551 -8225970 -8932340 -3082424 8976161 20835819 27004433
7884 27004433 27704318 25158731 19515928 10829298 1108219 -8008395 -16091902 -20976707
7876 -20976707 -19700064 -14355159 -11488575 -12630530 -11174220 -2825015 6599678 9354227
7868 9354227 6732109 5276252 6061281 5250177 2789343 2639203 5035204 5798988 3970644
7859 3970644 3955165 8842006 16551814 23659015 28625606 30357059 27757726 21948853 15762450
7850 15762450 10579186 6457032 4536233 5399105 5907033 2443276 -3042711 -5299912
7842 -5299912 -3934132 -3595584 -5576070 -5659234 -2139559 462229 -1062858 -2985541 -680539
7833 -680539 4295496 7722184 9658325 12973834 17328692 19211537 16733727 10905302
7825 10905302 3480671 -3330932 -6411031 -4182883 1272419 6764957 11248748 14513033
7817 14513033 14984256 11949563 8055268 6057493 4538340 607331 -4268865 -5508437
7809 -5508437 -2526552 -406753 -3167079 -8518197 -11211172 -9684084 -7516094 -8943412
7801 -8943412 -14066542 -18625515 -18542892 -14532425 -11123485 -10680862 -10147219 -5290167 3218559
7792 3218559 10166197 11638598 8541470 4652134 2981676 3924051 5366895 4466454 280191
7783 280191 -5525969 -10974780 -15451754 -18061768 -16321593 -9097494 -31570 4647991
7775 4647991 2005599 -5374155 -12522434 -15766803 -14149536 -9740566 -6646747 -7500692
7767 -7500692 -10289450 -10049503 -4141401 4915425 11582851 11618507 5375883 -1863715 -3947608
7758 -3947608 234762 5970981 8971874 9995172 10917560 9285215 1520372 -9812368
7750 -9812368 -17316952 -17669161 -14500825 -11755869 -9186122 -6050528 -4171662 -4210695 -3011937
7741 -3011937 1527057 5968544 5781935 2225111 678779 3181118 6489347 7415364 6705214
7732 6705214 6849718 8310841 9015060 6802245 2153741 -1355954 -301347 4362539 7887274
7723 7887274 7613055 6294139 7645556 10490644 10386992 6359863 2877694 4560719 11025625
7714 11025625 17723053 20546263 19041112 15895030 13676743 12074478 8979794 4320953
7706 4320953 1066814 1382266 3652691 5148187 5948474 7659583 9319376 7605720 1237730
7697 1237730 -6911350 -12090805 -10678242 -2194572 9046804 15337994 12384716 5139159
7689 5139159 3450288 10764663 20001830 22026827 15591373 7059353 2464810 2160536
7681 2160536 2221116 -873131 -6809027 -11837643 -12792745 -10514137 -8268961 -7451854 -7010765
7672 -7010765 -6744774 -7999583 -10495297 -11871787 -11768415 -12874759 -15797728 -16462784 -11926903
7663 -11926903 -5820207 -3852090 -5888284 -6960776 -4966909 -2655603 -2256163 -2832099
7655 -2832099 -3470196 -4471786 -4060499 1543265 12174562 21356117 22996839 18194417
7647 18194417 12713260 9853295 8746060 7863821 6639281 4300363 451217 -2985535
7639 -2985535 -3140256 -217501 1817415 -594189 -6852023 -12829784 -14287462 -10037352
7631 -10037352 -3238940 707806 -621806 -3556192 -2364789 3451549 8287939 7534387
7623 7534387 2825465 -1445351 -4086816 -6457463 -7711064 -5251160 -417045 566255
7615 566255 -6137288 -16389719 -22727596 -22832465 -20008374 -16514281 -11189141 -4544964
7607 -4544964 -1306762 -4472105 -9936581 -11212135 -7759202 -4187797 -2267921 597208
7599 597208 4046040 1989743 -9016962 -22761401 -29611227 -27535892 -22157166 -17419831
7591 -17419831 -11920202 -4692509 1307419 4072913 6424279 11318690 16193741 16181501
7583 16181501 11596649 7973304 8343324 9021957 4771283 -3875513 -10601728 -10306894 -4658581
7574 -4658581 7656 -206443 -2942583 -3416420 -669614 2178247 3579903 6280622 12760883
7565 12760883 20475004 24378061 22843839 18284436 12872237 6932989 1377023 -1837520
7557 -1837520 -2534616 -2587241 -2319497 153023 4383726 5960195 2451180 -1863873 -1241950
7548 -1241950 3380099 6145107 5421205 5888315 10463780 15154982 14684896 9501338 3811315
7539 3811315 -642628 -5110402 -9857357 -13367427 -14748312 -13990888 -10918250 -6975462
7531 -6975462 -6550595 -12136211 -18762341 -18262886 -9832803 -1627501 -554060 -5212794 -10673506
7522 -10673506 -14660519 -15612724 -10257840 1094928 10585104 10643995 3939310 -462767
7514 -462767 665805 2645095 2010176 407613 -1118993 -4212593 -7424994 -5494227 2019669
7505 2019669 7734826 6685077 3903823 6092223 10474331 8991146 759028 -6977798
7497 -6977798 -9274214 -7921275 -5240542 -210326 6987539 11752995 9813662 2561604
7489 2561604 -4710073 -8198417 -7819124 -5632937 -3234880 23381 6014723 13878446
7481 13878446 18312345 14464157 3968505 -6696274 -13345641 -16395363 -16681729 -13459266
7473 -13459266 -7502327 -2104333 809662 2295191 2563034 -755752 -7927688 -13818147
7465 -13818147 -12830402 -5839381 485248 688501 -4605047 -9800771 -9206285 -2146256 5826061
7456 5826061 8241463 4662199 299855 -1258620 -1368841 -1532770 -44962 3557031 4833219
7447 4833219 -176667 -8358930 -12963385 -12267631 -10469131 -10755099 -11814318 -11332636 -9248396
7438 -9248396 -6919591 -5716889 -6562037 -8486947 -8078714 -3062204 3953255 7997422 7443176
7429 7443176 4450723 890898 -2382887 -3077216 808147 6258030 7024258 1662604 -4278166
7420 -4278166 -5723029 -3712534 -1707722 -547838 87233 -882549 -3383897 -4220512 -1622740
7411 -1622740 805323 -989750 -4618408 -4123452 1134590 5352986 4335812 288502
7403 288502 -2488431 -2843562 -1958077 -423273 1516637 2789456 2786607 2689545 3768183
7394 3768183 5184410 4988780 2823240 511423 278337 3024287 7734708 11883646 13052730
7385 13052730 10948048 7484304 4645592 3173525 3570746 6432195 10178884 10207159 3336451
7376 3336451 -7056656 -13358222 -12055577 -7109407 -3670798 -1543103 2087700 5887785
7368 5887785 5222500 -358333 -5328026 -5525386 -3190223 -2130753 -1758057 55273 1153635
7359 1153635 -2458430 -9430606 -13876509 -13810825 -13508256 -15851067 -17365411 -13927184 -7407939
7350 -7407939 -2769624 -1274337 -494377 882247 2161806 3203228 4113084 3408651 155375
7341 155375 -3075836 -3417137 -2903751 -5456939 -8822461 -5639135 5447705 15474209
7333 15474209 15812633 8836834 3460115 3526395 6036317 8392751 10666645 10966343 5658788
7324 5658788 -3292975 -6966479 114919 11663712 16517221 12099242 6226707 5905052
7316 5905052 9241563 10023345 6273916 1115536 -2593200 -4824271 -6148653 -6262947 -5457763
7307 -5457763 -4973731 -4520565 -1454694 5585729 13485634 17406631 16269853 13166553 10318565
7298 10318565 6446978 424946 -4994517 -5842024 -2410376 635073 -170197 -3559734
7290 -3559734 -6163912 -6591347 -5508083 -3218844 567362 4707917 6438338 4369563
7282 4369563 748974 -765694 295567 316965 -3438425 -7866818 -6502177 2165576 11118661
7273 11118661 11914511 4199935 -4705499 -9217064 -10731524 -12478178 -13305292 -10243651
7265 -10243651 -5068516 -3680728 -8508007 -14836114 -15972032 -9997867 -502918 7282641
7257 7282641 9777224 6469830 286383 -4146231 -4485864 -2972321 -3518888 -6484916 -7678478
7248 -7678478 -3338886 4654453 9997827 8998582 5266694 5509446 10721357 14326177 10873996
7239 10873996 4034782 2181655 7001584 11252076 8992408 3488823 1831504 5034988
7231 5034988 7860233 6874694 3950165 1583681 -848315 -4289416 -6609688 -4971495
7223 -4971495 -490047 1987628 -923379 -7429957 -12521895 -13146585 -10997253 -10104234 -11987821
7214 -11987821 -13939864 -12519272 -8017791 -4403732 -4976187 -9079290 -13255069 -14644253
7206 -14644253 -12711848 -8504455 -3580321 -19528 -255096 -5058485 -11282410 -13437727
7198 -13437727 -9335825 -3272451 -1439137 -4661040 -8375136 -9691148 -10670035 -13144870
7190 -13144870 -14348975 -11283389 -6774024 -6528016 -10803342 -13197734 -8309382 2540820
7182 2540820 13826888 21081484 22685291 19261416 13292131 7990760 4971462 3350888
7174 3350888 1489435 -968260 -2715736 -1939052 1303894 3078872 -2132744 -14847657
7166 -14847657 -27754985 -32376258 -27510108 -18189379 -8208997 1475088 8050186 7291939
7158 7291939 425094 -5308936 -5838446 -4946727 -6497223 -7428786 -3720024 1009420 -333519
7149 -333519 -7566482 -13385570 -13946815 -13037108 -14686103 -17377532 -18191887 -18290885 -20646405
7140 -20646405 -24724156 -26885691 -25257077 -21618004 -18532226 -16530024 -14700320 -12865234
7132 -12865234 -11983725 -12473624 -13371330 -14124706 -16232148 -21099897 -26517071 -27942522 -24124869
7123 -24124869 -18801214 -15441804 -13253239 -10734209 -10169156 -14623926 -22006566 -26186560
7115 -26186560 -23562462 -15168875 -3209492 10098717 20223014 21905831 15147014 6150723
7107 6150723 274215 -2939616 -5680690 -6424745 -2506221 3730774 6004490 2034343
7099 2034343 -2794107 -1506081 6247676 13813773 14863646 9483634 2698547 -1389269
7091 -1389269 -2401433 -1576312 356769 2273901 2085839 -613973 -2613882 -482625 4302493
7082 4302493 6108379 1689454 -5771730 -10091454 -8519618 -3983222 -1539175 -3372253
7074 -3372253 -7440908 -10688362 -12476762 -13798692 -14307551 -12973337 -11687197 -14362587
7066 -14362587 -20614237 -23988447 -19770128 -11782087 -7546355 -8889154 -11754489 -13551803
7058 -13551803 -15279888 -16798397 -15629795 -11664790 -8512634 -8526610 -10020714 -10667538 -10380759
7049 -10380759 -9986103 -10454485 -13895586 -21125303 -27587782 -26768085 -19308974 -13382918 -13309218
7040 -13309218 -13241386 -6323744 4560093 10520046 8047254 1406184 -4208302 -6736221
7032 -6736221 -5830159 -2506552 -121791 -1651515 -5764830 -8406312 -7583758 -3750703 3080619
7023 3080619 12564013 21014741 23489096 19470292 13429981 9592170 8864775 10260546
7015 10260546 11627816 9242237 1077737 -8669650 -12455756 -8383816 -2801537 -2105922
7007 -2105922 -5313846 -7160773 -5606782 -3072167 -1996414 -2391689 -3246934 -3888890 -3922599
6998 -3922599 -3341397 -2608141 -1768936 -178183 1995151 3139968 2521173 2125395 4174063
6989 4174063 7459199 8663191 7464027 7576616 11391850 15925831 16514691 13181353 10330438
6980 10330438 10337212 10610556 7936739 2786294 -2527306 -7358970 -11716829 -13795262 -11948419
6971 -11948419 -7990106 -4992619 -2495195 2299343 8935737 13710011 15589268 17281324
6963 17281324 19188964 17642758 11849400 7407585 8561898 11031377 7814502 -621375
6955 -621375 -7467711 -9136855 -7998977 -6265627 -2985026 1968620 5809336 6512361 5066449
6946 5066449 2641766 -1318094 -6703223 -11342223 -13816861 -15481026 -17909437 -19917474
6938 -19917474 -18741663 -13357667 -5653802 1232263 5581304 8653289 13120148 19162684
6930 19162684 23292433 22619882 19036848 16861888 17192818 17189521 14546170 10124726 6224733
6921 6224733 4385695 4667847 5235317 3398761 -939022 -4174384 -3742330 -2115263 -2775070
6912 -2775070 -4294126 -3062458 -350235 -852112 -4552835 -6341395 -4619732 -3914419 -6816472
6903 -6816472 -9469475 -8338977 -5913173 -5465085 -4932513 -1094230 3732298 4649782 1703812
6894 1703812 -677645 -635368 -638628 -2574994 -4971547 -5519361 -3701971 -658850 1803812
6885 1803812 2403904 1954260 2769586 5168476 6142551 3286166 -1605867 -4892655 -5371096
6876 -5371096 -4012157 -1253628 2551222 5150884 3891313 -978359 -6500875 -10154362
6868 -10154362 -11425121 -11243820 -11338074 -13013508 -15277652 -15641927 -13811428 -12156479 -11015499
6859 -11015499 -6869903 1848948 10219825 12228267 8665901 5326515 4796685 4655461
6851 4655461 3071763 1360135 626062 9416 -1031395 -2106945 -3863323 -7028774 -9359763
6842 -9359763 -7660735 -3466555 -2056320 -4141118 -3384398 4456249 13870003 15822350
6834 15822350 9592297 3378120 3452689 7626231 10846192 12668928 15359690 17260987
6826 17260987 13531244 4031276 -4419710 -6369991 -4623207 -4970292 -7115690 -6368336
6818 -6368336 -2686843 -1065204 -2339112 -996922 5012250 9294175 6615792 1375723
6810 1375723 60617 223547 -4913810 -13809754 -17553484 -13096757 -7049379 -4784602
6802 -4784602 -3472626 884450 6007056 7698461 7506286 10984856 19816996 29184674
6794 29184674 32655697 27966999 18455075 9695949 4466859 1250561 -1878750 -3662747
6786 -3662747 -1850038 2778640 7150077 8987756 6691039 -862201 -10368576 -13448416
6778 -13448416 -6170405 3265499 3844708 -2830002 -5120600 1013384 6990804 5885250
6770 5885250 1153694 -2790977 -8184783 -15798106 -18867876 -13557424 -7571748 -8878450
6762 -8878450 -12518855 -9337749 -2533893 -3193160 -11964745 -17909428 -15769901 -12369010
6754 -12369010 -13386599 -14575776 -10449508 -2877326 3878325 9297999 12754634 10336712
6746 10336712 1501212 -6503698 -7269380 -4379666 -5732725 -11717708 -15489950 -13356811
6738 -13356811 -8509635 -4554588 -1177177 2262005 3327084 -566520 -7951337 -14159545
6730 -14159545 -15640658 -12497171 -7458477 -3233649 -785929 379292 1086124 2347950
6722 2347950 5613666 11380405 17400275 20207910 19264234 17852304 18731652 20550167 20101976
6713 20101976 16816161 13131060 11045376 9918493 7530997 2369354 -4732820 -10491040
6705 -10491040 -11517879 -7916944 -4045238 -4562864 -9719932 -15016654 -15359682 -9653097
6697 -9653097 -2063882 1445563 -843761 -4001252 -1988494 4526316 8923916 7954488
6689 7954488 6283777 8963058 13047187 11599496 4354140 -1024608 1397745 9535253
6681 9535253 17618657 22409293 23221941 19894463 13956509 9133398 7378940 6067102
6673 6067102 1905631 -4068998 -8472463 -10974833 -13876106 -16877491 -16451783 -11238173
6665 -11238173 -4546938 -13313 2291529 3540241 2721376 -1458105 -6715747 -8634884
6657 -8634884 -6170294 -3075965 -2693314 -3111871 526540 9352908 18555106 22947199 23184837
6648 23184837 23967232 26501941 26500490 21526292 16664649 18466792 25011953 27426364 21575133
6639 21575133 12944894 8315270 7822818 8288852 9449603 12093834 13588054 10960772
6631 10960772 6521815 4758795 4583743 479695 -8355468 -15598046 -16048496 -11614031
6623 -11614031 -6991826 -3401232 681138 5409959 8924995 9289915 5620787 -1041883
6615 -1041883 -7173532 -9310260 -8027125 -7027131 -7637045 -7221973 -4112811 -640698 711084
6606 711084 1103938 2806588 5239954 6031811 4304825 1042610 -2118177 -3126367 -750020
6597 -750020 3085416 4641097 3279314 2132384 2641897 2136229 -1279636 -5484356 -8423260
6588 -8423260 -10961052 -12434571 -8296804 2948051 14567944 18950018 16892201 14030243
6580 14030243 11562084 7403847 3755481 5321805 10880825 14489580 15091715 17174183
6572 17174183 21242550 21830276 17061020 12436276 11950794 12504453 10889666 9519159 10459692
6563 10459692 9985310 4869419 -991382 -2561054 -2187142 -5405147 -11313487 -14423326
6555 -14423326 -14432332 -16539089 -21755648 -24000423 -19007945 -10586769 -4916779 -2655158 -297346
6546 -297346 3152001 4744614 2264458 -2650886 -6842363 -9511188 -12596330 -17609800
6538 -17609800 -23060232 -25490376 -22631112 -15029705 -5174502 3982819 10163964 13017678
6530 13017678 14316930 15559909 15499398 11702418 4366838 -3562482 -9969711 -14410793
6522 -14410793 -15163155 -9562878 447672 6765993 3181239 -6655333 -13174708 -12157802
6514 -12157802 -8397101 -8093452 -11554983 -15079424 -16844663 -17704191 -17468406 -14171940 -8034361
6505 -8034361 -3214283 -3006548 -4873720 -3807701 -384706 -984297 -8065870 -14545365 -11976518
6496 -11976518 -1556309 7897694 11171921 10227890 7244392 791427 -9129572 -17848779
6488 -17848779 -21310776 -21034723 -20697876 -20444521 -17355372 -9684390 1244485 11533555
6480 11533555 16224440 13136749 6320288 2630565 3800105 5323461 4085741 2669489
6472 2669489 4437753 9025376 14890410 21493834 26471685 26024529 21311008 18802743
6464 18802743 20543033 20435156 15155392 11578491 15858449 21406666 17400614 5094569
6456 5094569 -4789656 -8495319 -11955085 -17485034 -19200734 -14373721 -9661679 -11612193
6448 -11612193 -18087557 -23263892 -25277404 -25048036 -22594254 -18403855 -14693610 -12389180
6440 -12389180 -10076703 -7580219 -6704370 -7072717 -5602753 -1664909 1516082 1839513 259957
6431 259957 -2902940 -8100871 -12054158 -9480474 -1248833 5485640 7358908 8156097 9719779
6422 9719779 7723920 929674 -3490995 -296065 5006999 4873838 1272734 577505 2158160
6413 2158160 1239140 -445386 3307249 11789347 17160388 15825774 12139781 9918971
6405 9918971 7435390 2463192 -3746876 -9399154 -14214383 -17202261 -16690502 -13515499
6397 -13515499 -10249318 -7060284 -2632999 1092981 535878 -2653584 -2140759 3949362
6389 3949362 9720663 9745191 5999902 3699964 3978644 3790986 425887 -6362350 -14424892
6380 -14424892 -19476080 -17660647 -9918731 -2040882 1047693 -528436 -3594486 -5583367
6372 -5583367 -5349954 -2983471 -57345 1923849 3779521 7028782 10243923 10582362 9137190
6363 9137190 10206889 13900569 14335841 8005895 -210609 -3089612 -164309 2828598
6355 2828598 1364861 -4381082 -11550917 -16706121 -17218280 -13560128 -9375561 -7292434
6347 -7292434 -6307179 -5229293 -5928970 -9761089 -13074892 -10757148 -3392200 3211529 5369395
6338 5369395 4628942 3672865 3212941 3754930 6608633 11316535 14823678 15131852 13859733
6329 13859733 13569615 14235734 13974730 11885168 8447189 4018830 -1381942 -7071115 -11651739
6320 -11651739 -13983533 -13751154 -11544690 -8913632 -7724625 -8632167 -10423928 -11438828
6312 -11438828 -11291709 -10635759 -9743802 -8370952 -6981257 -7008477 -9354432 -13197674 -16643974
6303 -16643974 -17884819 -15394775 -8366697 1468020 9229685 10481263 5987658 1082450
6295 1082450 -371960 512906 953892 647768 592900 144436 -1674447 -3433212 -3261340
6286 -3261340 -2609778 -4408682 -7953585 -9553108 -8258781 -6659620 -5400105 -1734813
6278 -1734813 4636895 8903258 7205475 1643658 -3741324 -8245396 -12183102 -13009187
6270 -13009187 -8640013 -2272702 1015012 830198 -67919 -2110751 -8008381 -16073665
6262 -16073665 -20526828 -19469112 -17231584 -17059372 -16278384 -11297841 -3590774 2168959
6254 2168959 3266417 101877 -5092656 -8516203 -6434509 774554 7810196 9535354
6246 9535354 5419444 -1798534 -8923832 -12369268 -9230575 -1541142 3217956 -565020
6238 -565020 -10459995 -19932437 -26070489 -29718344 -30268987 -25687864 -17565716 -11351806 -10338882
6229 -10338882 -12617601 -14652494 -14691068 -12027090 -6530658 -477461 2272846 1008242
6221 1008242 -301594 1670798 4755322 4272003 -215401 -3599594 -804833 7621724
6213 7621724 15700456 17465503 12527439 6269530 4101707 6206801 9154100 11403594
6205 11403594 14176298 17052344 16737589 11995491 6466044 3820237 2645182 -553306
6197 -553306 -5063341 -6542241 -3380947 1011081 2707275 1374711 -702670 -1560689 -900954
6188 -900954 -143619 -1424494 -5062848 -8181132 -7645152 -4134378 -1117140 28703 1131238
6179 1131238 3166782 4285468 3302686 2434815 4465374 9053153 13798264 17269979 18825593
6170 18825593 16959178 10659778 2058312 -4650915 -7240843 -6917433 -5763147 -4280799
6162 -4280799 -1884909 1327452 4018607 4580058 2596551 -461493 -2212579 -1271834 1870183
6153 1870183 5466018 7335196 5822913 1744325 -797145 1967783 8230287 11526506
6145 11526506 8500731 3398305 2512532 6078394 8592367 6026065 -344271 -6827972
6137 -6827972 -11005808 -12139353 -10241394 -5664111 1160376 9119956 14804494 13504865
6129 13504865 4548368 -5545875 -8616391 -3494298 3669501 7326237 7462815 6575692
6121 6575692 5533385 3762313 670281 -4416993 -11322329 -17091531 -17657195 -12622672
6113 -12622672 -6013227 -1325748 1568416 3729888 4608197 3906007 3094712 2909674 1494626
6104 1494626 -3076171 -10124824 -17250360 -21828419 -21338143 -15417728 -8116355 -4076166
6096 -4076166 -1767646 4318556 13513021 17835264 14137419 9695201 10059165 8982788
6088 8982788 -1017298 -14296027 -19070411 -14781987 -10423120 -7562333 1153367 15145356
6080 15145356 21883568 15486602 7170842 8833231 16010146 17098280 11970120 9984996
6072 9984996 13946131 17696640 18204125 19241142 22169672 22422919 17758888 12602579 10869511
6063 10869511 10186563 6736648 1526744 -1638781 -1546527 -67972 927223 1261184 2223535
6054 2223535 5234844 9393381 10927762 7355782 1228513 -3345756 -6589528 -11026305
6046 -11026305 -14574876 -11919944 -3827199 1329268 -1689194 -8104222 -10563125 -8401941
6038 -8401941 -4951970 -343490 6715263 12832010 12501262 6239601 286484 -2235604
6030 -2235604 -4741634 -10708229 -18355588 -23763438 -25958403 -26779759 -27759855 -28553446 -26988581
6021 -26988581 -20451476 -9403962 586573 3586006 708429 -812005 2661945 6351721
6013 6351721 4608359 -530776 -2669645 -474230 1606951 1405585 1961867 4560648 3939697
6004 3939697 -5157458 -18991209 -27212852 -24425303 -15645668 -9126770 -7152839 -6502474
5996 -6502474 -5354030 -5305993 -6754759 -6786554 -3789187 -956202 -1956083 -4889447 -4186145
5987 -4186145 1943653 9329569 13377319 13599603 11771039 8776305 5253818 2999021
5979 2999021 3221339 4548417 4658260 3008589 575493 -1817096 -3354156 -2981567 -1407126
5970 -1407126 -1922131 -6501059 -11923539 -12799569 -8316940 -3034491 -672515 -168645 1089897
5961 1089897 3061169 4041355 3732742 2903622 1132071 -2678713 -7701306 -11081696 -10999740
5952 -10999740 -8668440 -6536291 -5110880 -2659752 1560575 4870015 3830248 -425195
5944 -425195 -2012231 2535386 8807093 9476217 3941566 -850551 367509 5217189 8572327
5935 8572327 9388437 9400980 8041798 3158316 -4120218 -9268238 -9582626 -6870318 -4619391
5926 -4619391 -4687908 -6927094 -9831909 -11083720 -9288276 -5685778 -2797025 -1402827 -406485
5917 -406485 561551 417986 -1358849 -3879469 -6260341 -8260554 -9648507 -10877839 -13962696
5908 -13962696 -19798380 -24437016 -21613362 -10638445 1102424 5825418 3539218 393188
5900 393188 641309 2972153 4096286 3454348 3795499 7842692 14377731 18000092 14377000
5891 14377000 5781086 -1132579 -3774509 -6435250 -12586149 -18081150 -16244576 -7586769
5883 -7586769 467109 3012845 2198016 1915940 2426516 1871004 -325076 -3563736 -7086717
5874 -7086717 -9301689 -8600922 -6547300 -7670353 -13715418 -19983352 -19916697 -12200721 -1311882
5865 -1311882 7701754 12775442 14365206 14220082 14498541 15889481 16304873 12930466 5686764
5856 5686764 -2496052 -8624336 -11746350 -12674753 -13076587 -14417400 -16247075 -15870772 -11346177
5847 -11346177 -4474246 992016 3829394 5935093 8522143 10254842 9842117 8177221
5839 8177221 6838277 6472008 7733874 11563025 16799474 19526320 17031945 11050872
5831 11050872 4924633 -938983 -7885859 -14260381 -15490766 -9692999 -587817 6253514
5823 6253514 8306474 6707641 4142519 3127258 4423059 5828507 4106980 -709874
5815 -709874 -4628104 -4669997 -2737736 -2627333 -4832827 -6743871 -6781943 -5442473 -2803112
5806 -2803112 1753467 6859622 9144560 7230016 3723671 1942317 2308994 3216955 3771230
5797 3771230 3995904 3532157 2007745 215418 -544167 -63673 851062 1718793 2808847
5788 2808847 4725517 8256609 13716421 19382447 21648882 18445910 12017141 6641582
5780 6641582 3894045 1791636 -1740147 -6639518 -11902023 -16496941 -18406506 -15447537
5772 -15447537 -8896124 -4206917 -5461004 -10111017 -12017983 -9474497 -7363451 -10673289
5764 -10673289 -18438179 -25526719 -28292145 -26458997 -21263239 -14767691 -10408768 -10854909
5756 -10854909 -14420728 -16105434 -13369931 -8684340 -5115577 -2146617 1724373 4864625
5748 4864625 4889986 3660855 4986329 7200266 3434181 -8258875 -19510200 -20525505
5740 -20525505 -11980306 -3912747 -3993748 -10798821 -18025636 -21040861 -18591476 -12114251
5732 -12114251 -5608226 -3737870 -7551060 -12853780 -14128725 -9464565 -1317292 6018124
5724 6018124 8942757 6511431 1582364 -1115160 198643 2064807 -143549 -6282320
5716 -6282320 -11293320 -11262911 -8140674 -7355217 -11307028 -16530926 -17784314 -13929887 -8407346
5707 -8407346 -4349119 -1573232 724389 1041721 -1792522 -4512862 -1718468 7305933
5699 7305933 16944224 21128522 18521195 11694081 4486098 1179447 4524532 12024797
5691 12024797 16853086 15142488 10262005 7482830 6995273 5436976 1993669 -1165259
5683 -1165259 -3137337 -4668426 -4980999 -2564980 948513 2022348 765327 966814 3639660
5674 3639660 4847770 1639894 -3889169 -8586459 -12366194 -15601752 -16121176 -12493422
5666 -12493422 -7489548 -4322001 -1638148 3608889 10112425 13702106 13927310 14257103
5658 14257103 15716033 15272864 11663831 8186029 7579574 8104226 7533701 7684881 11218505
5649 11218505 16009781 16768753 11726787 4400431 -1270195 -4571875 -6376534 -6633563
5641 -6633563 -4839486 -1335888 3008063 7269966 10019415 9956963 7989292 6948839 7516365
5632 7516365 5893037 -1653895 -12092975 -16598438 -9841696 3637982 14435206 18288561
5624 18288561 18316024 17871608 15329713 8287488 795 -2804475 1373267 6123549 5002153
5615 5002153 -452932 -3229568 94999 5955155 9249618 8931048 6977871 4542764
5607 4542764 1569201 -1160038 -2315219 -2209994 -2528589 -3618261 -3959460 -2798885 -1366692
5598 -1366692 -500176 1176407 5201175 10709750 15641326 19554946 23239986 25938759
5590 25938759 25154880 19802737 12209769 6402202 5012951 7647304 11268748 12520814
5582 12520814 10937345 9456555 10308543 11287707 8690797 3495197 887834 2675320
5574 2675320 4115601 873884 -4130683 -4514916 975960 7585745 11037127 10891964 8130821
5565 8130821 3876244 932584 2094540 5269848 4092204 -4214802 -14444626 -19263608
5557 -19263608 -17015871 -11297198 -5288187 211629 4742788 7737120 9621360 10596608
5549 10596608 8890241 3087769 -4141849 -7762461 -6186326 -2716309 -795825 -632295
5541 -632295 -1300933 -3117456 -6104237 -8514008 -9161818 -9544541 -11330071 -13102265 -12266872
5532 -12266872 -9415900 -7808547 -8366700 -8146579 -4982909 -1172816 -348868 -2095770 -2336598
5523 -2336598 984879 4962928 5475296 2433222 -19035 2058781 8727076 16344192
5515 16344192 20321201 18156299 11242336 4040335 507126 896361 2532532 3450465
5507 3450465 4068402 5225256 6217145 5746250 3828246 1827966 1195613 2540700 4854594
5498 4854594 5220738 1079883 -5919977 -10050179 -7588044 -1707454 1060316 -1373582
5490 -1373582 -4985038 -5669560 -4071328 -3396265 -4714826 -6203605 -5987796 -4237984 -2566071
5481 -2566071 -1832520 -556464 3786758 10862969 15870375 14182960 7496041 2513267
5473 2513267 2643970 3871851 727798 -6206399 -11719062 -13376878 -13955583 -16406211 -19591747
5464 -19591747 -20496595 -18698167 -16601879 -15784418 -14891232 -11746127 -6587105 -2127645 -452185
5455 -452185 -785168 -689472 1372925 5155998 9139686 10952323 8678326 3603416 630122
5446 630122 3490180 9931143 14149418 13633271 10637554 7308366 3721646 1668466 5223780
5437 5223780 14331084 21924613 21819015 16627077 13150090 12275527 9307622 3443837 266666
5428 266666 3095895 7370563 6927812 2104414 -2165183 -3891605 -5549513 -8772430 -11284521
5419 -11284521 -10217768 -6404200 -3871944 -5660947 -10998779 -16332257 -18271261 -15367943
5411 -15367943 -8196833 809391 7693766 8848703 3577274 -5672131 -15462581 -22496983
5403 -22496983 -23302371 -16184697 -4920939 2580791 1988168 -2989607 -6030995 -5700828
5395 -5700828 -4785973 -4877087 -5560879 -6925982 -8453538 -7221466 -2313651 531485 -4951699
5386 -4951699 -15017378 -18474979 -11224173 -1507622 1966239 629495 710995 2985147
5378 2985147 3385224 217228 -4475893 -8359709 -9344412 -5221759 2895088 9155035 9492219
5369 9492219 7422540 8674033 12163753 11850074 6410869 1151336 -5729 948519 837359
5360 837359 65515 737733 3109674 5482056 5548679 1550934 -5251955 -9257284 -5230121
5351 -5230121 4682742 11943044 11194722 6184991 4458996 8463078 13939561 15636403
5343 15636403 12604411 8327108 6817047 8539883 9921657 7025046 -609133 -9891500
5335 -9891500 -16735230 -18172080 -14071061 -8426853 -6773665 -9836539 -11752560 -7546093
5327 -7546093 -120443 4187278 4942283 7179177 12692988 17926827 20827777 23194123
5319 23194123 24341229 19133971 6391689 -5915631 -8983703 -3571302 2372316 3871109
5311 3871109 2266035 599206 734756 4370489 12178306 21107306 25684048 23046218
5303 23046218 15193752 6583406 1270578 1529934 6470930 11730732 12751466 9118439
5295 9118439 4528355 2432186 2917084 3847111 3820702 3622601 5171707 8897412 12173153
5286 12173153 11434714 6362377 711672 -1859826 -1636820 -1622716 -3604317 -6395763 -7154444
5277 -7154444 -4044594 1195577 3455939 -630723 -7398962 -9055751 -3096944 4485976
5269 4485976 7250748 5768000 4003030 2160693 -1835532 -6124923 -6141858 -1838010 1568991
5260 1568991 929595 -1127198 -1128679 423093 1027071 -6600 -1793289 -3910913 -6450289
5251 -6450289 -9313217 -12514120 -16131801 -19611585 -22296576 -24376640 -25682607 -24366706
5243 -24366706 -19442389 -13986343 -12175932 -12995642 -11050873 -4777211 499114 -14812
5235 -14812 -4025277 -6149884 -5087885 -3017467 -711846 2127813 3657115 2306645 1586418
5226 1586418 6635095 15168460 17779728 10127749 -76306 -2607391 2298065 6034412
5218 6034412 4793568 3891549 7904346 12884092 12453737 7476249 4288602 5251898 6820885
5209 6820885 7049837 9197087 15499087 21975151 23286087 19897252 16263203 13730222
5201 13730222 9912932 4681538 1945075 4106035 8454008 11175252 12191061 13634352
5193 13634352 15719795 17081986 18017541 20211538 23247616 24242431 21907744 18732641
5185 18732641 17477486 17087838 14476287 9883986 7723132 11054059 17350506 21637512
5177 21637512 22349082 21537430 20133612 16444789 10072313 4138256 1696234 2161503 3440404
5168 3440404 5776580 10962740 18843086 26918225 32601755 33939152 29499318 20321626
5160 20321626 11013548 5776796 3721744 1177222 -1804047 -1143291 4523376 10879741
5152 10879741 13523711 13144772 12680918 12141555 9487895 5061146 1895848 2095232 5387207
5143 5387207 10926274 17947008 24231042 26219264 22118015 14134991 6694820 2712405
5135 2712405 2102793 3463133 6052543 9557806 12879229 14821785 16094811 18650116
5127 18650116 21924437 21731206 15197456 5577931 -740132 -1659554 -794709 -1328867 -1924562
5118 -1924562 -210649 2709779 3918319 3265249 3611896 6815315 11381775 14354316 14451193
5109 14451193 12931202 11641280 10597147 8249926 4436822 1526395 1097323 1115915 -702110
5100 -702110 -1804608 2800623 12699653 20970184 22624850 20257701 18799527 18245939 15119305
5091 15119305 8686947 2034272 -1696003 -1408288 1775581 3679866 -1191453 -13225659
5083 -13225659 -24711917 -27360232 -21527685 -13956214 -8209225 -2996486 905430 -687388
5075 -687388 -7755123 -13200568 -11064981 -3247470 5096104 12293091 18202035 19896031
5067 19896031 15284707 8887805 7995673 13519639 19660060 22300302 22373222 20605506 15130905
5058 15130905 6774046 1271724 2155159 5224902 4553365 1059691 36099 2046104
5050 2046104 2183865 -1607854 -5110234 -4273282 -413214 3277771 6264253 8698003 8544542
5041 8544542 4721456 728652 821316 3817100 4759030 1856873 -2457602 -6776413 -11807786
5032 -11807786 -15409466 -12211779 -1520522 8524157 9213202 1583490 -5812148 -8148279
5024 -8148279 -8558219 -10897286 -13156986 -10661048 -2814659 6453505 13406982 16675266
5016 16675266 15766671 11104002 5993020 4981636 8441021 11674723 11897083 13188660
5008 13188660 20404462 30095608 33217214 27199473 19480089 16852505 16867744 13813437
5000 13813437 8442866 5866311 6574653 6116065 2908684 127329 -795947 -2722792 -6847152
4991 -6847152 -9035175 -5364281 1619132 5326258 2519276 -3758344 -7889671 -7038496
4983 -7038496 -3028208 727923 3641535 7568677 11815103 12276692 8130480 5298895
4975 5298895 8507465 13399182 12930050 8838645 8678426 12921991 14666861 12690120 13984160
4966 13984160 19949082 21021233 11804090 2295106 4735306 15543686 20461878 14287771
4958 14287771 5761632 3921960 8319227 13555984 16529211 17240446 17074946 17866826 19905651
4949 19905651 20794844 18626487 15113909 12849344 11184910 8020022 3837617 553075
4941 553075 -1771861 -3578751 -3215600 592093 5607505 9097575 11970197 16211593 20313982
4932 20313982 21051699 17884801 12402707 6070091 1634563 2846284 8497723 10829395
4924 10829395 5089265 -3074444 -5292544 -1706107 1541521 2179220 2332610 2576796 2696158
4915 2696158 5511336 12798261 20112896 22505184 22016450 22466711 21338142 15430260 9869810
4906 9869810 11211566 15575406 14945201 11739137 14472293 21454303 22709867 17412137
4898 17412137 15338658 20201535 25109154 26061717 26636596 27382592 23840472 17574919 16529301
4889 16529301 22227856 28663559 34314846 41979712 47770645 46254422 45110050 55856259
4881 55856259 71513511 75803768 72923575 80407161 93043013 89806108 79824411 92751400
4873 92751400 105496234 36302501 -141423211 -322912073 -373308362 -284987322 -172008046
4866 -172008046 -118967653 -104188617 -78853364 -49259237 -45260757 -59321593 -62781144
4859 -62781144 -53496606 -47729288 -44351488 -32296662 -19579357 -22369515 -33952650 -33611936
4851 -33611936 -20890051 -14644067 -21016584 -26835654 -24759390 -22834798 -26366188 -29121513
4843 -29121513 -26950405 -24938650 -26345707 -26606543 -22603951 -18188293 -17028330 -17610639
4835 -17610639 -17390061 -15627366 -11745712 -6583889 -3927849 -4928472 -4061252 2266417
4827 2266417 7160801 2425547 -7335446 -10673322 -7151282 -7317902 -15015968 -21820196
4819 -21820196 -21178494 -16924446 -14085214 -11254899 -7128324 -6141581 -11369885 -17736058
4811 -17736058 -18299215 -13569836 -9775055 -10463778 -13570005 -15046090 -12785130 -8093868
4803 -8093868 -4559362 -4382942 -5809389 -5619306 -3198851 -81268 2839454 4707164 3346319
4794 3346319 -1709989 -6746750 -8614370 -9804500 -13835699 -17888538 -16449010 -11032909
4786 -11032909 -9135049 -13220431 -17524375 -17005695 -13397551 -10762716 -10447735 -11946787
4778 -11946787 -13656399 -11569030 -2718581 8460945 12790660 7645420 635345 -266973
4770 -266973 4518618 9583268 11680431 10372135 5836640 -412056 -5552957 -8864492
4762 -8864492 -12595971 -17917869 -23062553 -26485896 -27999909 -25891992 -17969737 -7227752
4754 -7227752 -954686 -1405114 -2750012 -620182 1214212 -1493032 -4811766 -2585198
4746 -2585198 2641673 2407263 -5161645 -12701356 -13833553 -9943010 -5361997 -1133586
4738 -1133586 3568978 7297740 7100549 2531967 -3174514 -5959606 -4244416 387460
4730 387460 5037881 7329262 5537072 -1122174 -10163225 -15126086 -11147855 -1869490
4722 -1869490 3146356 -345513 -6302889 -7112946 -3425445 -1378852 -3066132 -4879625
4714 -4879625 -4053139 -1846579 -237997 242874 -1081035 -4887044 -9277020 -10882199 -9543075
4705 -9543075 -8496524 -8840970 -7732425 -4124393 -2247357 -5697274 -11072817 -12284969
4697 -12284969 -9663753 -9318928 -13170611 -15299470 -10840233 -3854543 -1832466 -5071015
4689 -5071015 -6943807 -4183057 -1444705 -3992560 -10051546 -13235331 -9961180 -1856804
4681 -1856804 7053292 12747009 12459116 6771660 49805 -3534371 -4125256 -4781752 -7029300
4672 -7029300 -9743161 -11268502 -10446636 -6827599 -2380388 -1446581 -5629306 -9957450 -8297614
4663 -8297614 -2079992 1176551 -1291511 -3217350 1698321 10661154 15338282 12212333
4655 12212333 5804513 2547842 4389097 8284802 9804823 6920622 1661373 -1518886
4647 -1518886 236524 5375844 9370910 9289699 7008979 7187356 11134067 13653213 8660754
4638 8660754 -1871149 -8460872 -5856216 -462366 -1971816 -10456869 -17289998 -17567021
4630 -17567021 -15376309 -15983813 -18402651 -18020991 -12726714 -4224717 3994626 8600694
4622 8600694 8746107 7085164 6236530 5033544 1774983 -371361 2994318 8911965 9290627
4613 9290627 3087628 -1271925 1420153 5675254 5199530 3037098 5114425 9357696
4605 9357696 9335248 5320702 3553232 5882417 7450073 4459683 -1937313 -9585638 -17444507
4596 -17444507 -23128679 -23376831 -18275040 -11497952 -5828205 -1475112 1538969 2916870
4588 2916870 3844110 5830066 8115531 9342951 10678761 13411018 14800590 11389481
4580 11389481 5866723 4834035 8939909 10941988 5711619 -2665064 -6586001 -3968155
4572 -3968155 1278252 4737645 4448684 568911 -5045155 -9947721 -13377733 -16225628
4564 -16225628 -18101409 -16956265 -13133408 -11044976 -13987765 -18865640 -19240890 -13481913
4556 -13481913 -7231396 -6798968 -11662252 -15124164 -12203656 -5248692 -627726 -1119231
4548 -1119231 -4016118 -6445006 -8847617 -11464778 -11084114 -5230674 2382488 5114186
4540 5114186 1796381 -2059669 -1801008 1213128 2942039 2073737 650316 1392737 5572073
4531 5572073 11944131 16993955 17548048 13611020 7741968 2201811 -1823126 -3294003
4523 -3294003 -2215089 -1035244 -2530099 -6335371 -9818751 -11879319 -13232290 -13529529
4515 -13529529 -11479813 -7749986 -4444301 -1597246 2376711 6502205 7417333 4819106
4507 4819106 3178208 6333633 12974693 18676572 20023821 16149254 9113951 3421136
4499 3421136 2065882 2532916 166449 -4201020 -4608102 849392 6338239 6276839 2140350
4490 2140350 -1991931 -5916978 -10838932 -14415511 -13793185 -11098845 -10428577 -10943917 -8436911
4481 -8436911 -3052539 2402 -2139411 -6693921 -10219093 -12453091 -13620060 -12117848
4473 -12117848 -7660081 -3808210 -4137017 -7253720 -8403457 -5524379 -1428589 84939
4465 84939 -1671652 -4723030 -7372384 -9129726 -9282524 -6639489 -1791892 1661818 170341
4456 170341 -5286124 -9205240 -6822925 1149120 9244119 12160400 9017665 3411948
4448 3411948 -669525 -3077024 -6703629 -11939913 -13956879 -7955636 3949863 14106752
4440 14106752 17423357 15280015 11426946 7343584 2468092 -4119450 -13477699 -25334873
4432 -25334873 -35479588 -37791298 -31076471 -21368591 -15146213 -12452013 -8965569 -2564333
4424 -2564333 5037138 11400433 14992989 14734432 10823804 5603012 1343086 -2245351
4416 -2245351 -6127044 -8410691 -5718463 1431625 7100773 5454572 -2767482 -10251308
4408 -10251308 -9859452 -1472352 8050279 11942634 9964491 7111980 7162277 9543043 11890087
4399 11890087 12709972 11015958 6228142 -151932 -4805092 -5847272 -4463694 -2967900
4391 -2967900 -3123571 -6217229 -11707241 -15316679 -12098423 -2890727 5418971 7596451
4383 7596451 5041956 2017049 879332 2851893 8888365 16382095 18826419 12849470
4375 12849470 3027794 -3795524 -6508145 -8822668 -13119894 -18683363 -23515473 -24569876
4367 -24569876 -19008373 -8724612 -490269 2142444 3424946 7545245 10612017 6811561
4359 6811561 -1022125 -4697282 -2597403 -443834 -940042 -759993 1547978 2511670 601481
4350 601481 -613374 1224999 3500297 3773606 3615045 4681730 5505037 4704177 3446915
4341 3446915 2747678 2242760 3032912 7096292 12266163 13013577 8557078 4882820 5718966
4332 5718966 6925189 3916953 -363032 -294770 3020392 2916214 -3699735 -12750523 -17775697
4323 -17775697 -15373548 -7228128 592851 1839810 -3887998 -10452642 -11877896 -7602325
4315 -7602325 -180478 8232751 14749165 15523531 10634097 5773055 4979751 5013195 1464173
4306 1464173 -3102490 -3021451 1067902 3422221 2525209 2262282 3835010 3548605 110324
4297 110324 -2279852 -625960 2610975 4887228 7960307 12996518 15936332 13002256
4289 13002256 7871601 7617630 12654605 16208433 14099091 9981460 9025706 10578653
4281 10578653 10489913 8351297 8277073 12461073 17352574 17972345 14239201 10806058 11062761
4272 11062761 13424904 14229081 12615534 10852652 10394212 9690250 6887110 3447263 3132519
4263 3132519 6975996 10778284 9165174 1881413 -5401974 -6891318 -2077293 5057747
4255 5057747 10573383 12974755 12519452 10534843 9331686 10595044 13053315 13152422 8871378
4246 8871378 1839615 -4971381 -10398878 -14744008 -17274506 -16120778 -11173997 -5555720
4238 -5555720 -2602091 -1659723 1389459 8705659 17152137 21895128 22092247 20715501 19527108
4229 19527108 17408382 13896525 10841564 9189421 7405733 5092893 4931399 8179870
4221 8179870 11122012 9603136 4968062 1656982 655204 -386350 -1659914 -523592
4213 -523592 3746010 8803535 13346882 18522143 24317435 27986259 27427307 23672368 19066062
4204 19066062 15041961 12193859 10472669 8829014 6270793 3309139 1153477 336361
4196 336361 1390310 5026782 9856601 12605254 13153192 15970859 22873404 28273509 26925046
4187 26925046 22691387 22900463 27065369 29119741 28506748 29803103 32243165 29646304
4179 29646304 21702562 15703369 15186959 16172918 16830482 20877115 27827556 29850359 23451900
4170 23451900 15468488 12078797 10348968 6454411 3818987 6188983 9973529 10459452
4162 10459452 9180577 8797023 7355212 3983452 3445763 8497085 14428418 17395067
4154 17395067 20901101 27921325 34755758 39077083 44910983 52903731 56319321 54289827
4146 54289827 56502269 65663498 70278362 66619925 70170384 88940591 105909840 111819120
4138 111819120 132819369 186884976 226638589 177136381 38366684 -96147359 -143525978
4131 -143525978 -117531323 -86470203 -80762770 -79439636 -65590016 -50634383 -45797957
4124 -45797957 -44445861 -39527752 -35243814 -34908157 -34503924 -33128026 -35392999 -39766423
4116 -39766423 -37801362 -28780375 -23172380 -27225862 -34215780 -35148532 -29648085 -22565584
4108 -22565584 -17258648 -15664521 -18813188 -24326411 -28186278 -30361428 -34071149 -39266160
4100 -39266160 -41915205 -39663745 -33326303 -23952252 -14100667 -10185706 -16140176 -25445513
4092 -25445513 -27256451 -20776178 -16001743 -19413572 -26577130 -30586478 -30490246 -28815791
4084 -28815791 -27282637 -27898634 -32528319 -38187860 -37682418 -28197485 -15568992 -7575834
4076 -7575834 -6241174 -8361993 -10080897 -9246804 -6348658 -4375617 -5215833 -6281857 -3999909
4067 -3999909 104200 1286164 -957119 -2611665 -2436776 -3680255 -7409524 -9946218
4059 -9946218 -9100752 -7917284 -9551916 -12349669 -12365820 -7757906 597904 9732484 15342327
4050 15342327 15544960 13908899 14675645 15781399 12299227 6186747 4945814 9299477
4042 9299477 10451078 3092299 -6271063 -8696450 -4171723 1581595 5844585 8248577
4034 8248577 6091606 -2523450 -13084994 -18097407 -14982708 -6712102 2955834 10590055
4026 10590055 12273331 7027447 -389042 -4605102 -6061206 -8165889 -10208634 -8417369
4018 -8417369 -2917468 1839568 3482556 3631470 3170229 450230 -4722244 -9475383 -11744443
4009 -11744443 -12400894 -12196000 -9896617 -5348071 -1646193 -1874848 -5295079 -8772057 -10790152
4000 -10790152 -12110093 -13178711 -13037337 -11221743 -9277324 -9243183 -11043951 -12489419 -12015253
3991 -12015253 -10302950 -8533549 -6231216 -2215281 3080469 7822072 10716071 11076182
3983 11076182 7804625 777975 -7032615 -11552716 -12036606 -11127400 -10443856 -9022987 -6580584
3974 -6580584 -5049834 -5664955 -7276375 -8649686 -9640606 -9155867 -5284230 1137475 6500544
3965 6500544 9515379 12476780 15490993 14209407 7132313 1067375 4040261 15037440
3957 15037440 25744666 30776869 31020110 27882510 20231739 8433497 -2860803 -8161263
3949 -8161263 -5455538 3296128 13509099 19588146 18267726 11783495 5983287 4406881
3941 4406881 5625291 6682493 7136720 8636785 11840516 15021402 15494147 12054580 6214473
3932 6214473 1091183 -881388 1054717 6440484 13375718 18070087 17200763 11710846
3924 11710846 6015154 2256767 -2154350 -9690172 -18213831 -23827319 -25722360 -25165965
3916 -25165965 -21863426 -15104619 -7175543 -1616296 1577843 5498130 11016923 15078222
3908 15078222 14691255 10128197 3888597 -1361092 -3866157 -3991805 -4304668 -6526573 -8862186
3899 -8862186 -8406478 -5342420 -2072662 1071941 5924693 12266676 16825743 17270018 14593855
3890 14593855 10812525 6711672 2736327 -60889 -1064872 -735158 245070 1219657 1147823
3881 1147823 -421853 -2284945 -3367605 -5104811 -9633582 -15696216 -18890864 -16542002
3873 -16542002 -10462822 -4666703 -2035547 -3068813 -5937325 -7734156 -7157842 -5351883
3865 -5351883 -2755875 2810522 12032249 20245154 22274925 20109894 20502283 24834576
3857 24834576 26984509 22647617 15317227 10411101 8331073 6909901 6732949 9591752
3849 9591752 14020866 16496651 15932457 13978588 12030069 10541082 10043387 10228249 8990745
3840 8990745 4721210 -1291728 -6647821 -10816729 -14267784 -15947241 -14261285 -10048612
3832 -10048612 -6255124 -4671670 -4596343 -4587278 -4286550 -4640781 -6920059 -10875171 -13665387
3823 -13665387 -12184447 -7028215 -2183573 9023 1018970 2012542 982554 -3190090
3815 -3190090 -6797739 -5522909 -808957 2404941 3386795 6256087 12692586 18791389
3807 18791389 20793908 19882854 18789589 16933018 12317065 6338937 3111722 4393699
3799 4393699 7926034 10774369 11839715 10728122 6804378 940550 -3568691 -3984738
3791 -3984738 -1343350 1262263 3256252 6997062 12997476 17294287 15709332 9342106
3783 9342106 3379053 961852 646911 -60585 -1290758 -1965900 -2351255 -3772651 -6622011
3774 -6622011 -9802545 -11734333 -11408575 -9167312 -6882739 -6507983 -7926498 -8995868 -8068132
3765 -8068132 -5548205 -2680220 -111470 1576047 1163596 -2018656 -6654268 -10282933
3757 -10282933 -11560426 -11035583 -9711417 -7577223 -4289774 -1295673 -2012690 -8324572
3749 -8324572 -17274502 -23434469 -24884343 -24179575 -22612312 -17490465 -7949622 470838
3741 470838 2071363 -622021 -533451 3242024 4962000 2315842 -440869 -1181717 -4182868
3732 -4182868 -11627788 -17238236 -14234585 -5519088 -19618 -1379645 -5458616 -7149468
3724 -7149468 -4803176 661342 6316970 7683096 2727984 -5120222 -11196228 -15433267
3716 -15433267 -20301526 -24668041 -24655352 -20176970 -15766740 -14270665 -13774102 -11793170 -9059301
3707 -9059301 -7760272 -8454757 -9846062 -10064156 -7906074 -4158374 -1260633 -316727 393376
3698 393376 2312628 3896694 3318485 1790894 1352271 1647539 2260426 5414285 11728273
3689 11728273 15947351 12892124 5942113 2802531 3622881 1034155 -7215342 -13818198
3681 -13818198 -13053758 -9115635 -8686894 -10847137 -9924091 -4847687 -319801 -237766 -3768691
3672 -3768691 -7091217 -6872388 -3254714 -413585 -2093220 -6409013 -8564236 -8722133 -11666940
3663 -11666940 -17256624 -18006618 -10109452 -794923 841861 -4265908 -8289549 -7626050
3655 -7626050 -4644726 -1634609 204931 -1721504 -7604890 -10571338 -3580233 9305170
3647 9305170 16134190 12219928 4633437 222208 -2703999 -7177613 -9704694 -5846348
3639 -5846348 1142935 4079070 2041892 689636 2968578 4971944 2262793 -3549243
3631 -3549243 -6680329 -3781288 2973515 8564948 9634916 6409676 1114194 -4473466
3623 -4473466 -9465517 -12784924 -13162777 -10502982 -6288922 -2264967 772221 3065324
3615 3065324 5651615 9776632 15407352 20404052 22286123 20714177 17126984 12326279
3607 12326279 6035225 -1246579 -7747984 -12182335 -14674521 -15769053 -15784875 -15116031 -13879600
3598 -13879600 -11663584 -9163279 -9039790 -12388254 -14989152 -10979097 -998272 7215272
3590 7215272 8026699 3983978 458563 -1603934 -3456596 -2482102 5339035 17173179
3582 17173179 23429580 18412341 7327680 220344 1239196 6154522 8640586 6251838
3574 6251838 811345 -4451646 -7175701 -6381570 -1943347 5648201 14419803 20389650
3566 20389650 19910340 13831623 8077178 7971319 12097760 13846186 9651138 3512275
3558 3512275 1523169 3596190 3849160 -734187 -5580317 -4497006 2196799 8712158
3550 8712158 11621801 12737011 14040011 14002384 11152782 8176209 9057094 13505094 17391839
3541 17391839 18241801 17345016 16320260 14570172 11388258 8462379 8405872 11456000 14804904
3532 14804904 15194097 12093000 8722065 9484713 15249664 21506436 22797771 18926750
3524 18926750 14855121 14215690 15292051 14474451 11514976 9685054 12193044 19697223
3516 19697223 29569370 36296476 35091541 27435880 20713512 19370775 18831099 12292324
3508 12292324 1445203 -5429318 -5592735 -5301662 -9277246 -13281140 -11398158 -5654238
3500 -5654238 -2771631 -4372194 -6116227 -5014413 -2255559 457650 2257927 1055611
3492 1055611 -4620429 -11113551 -12106423 -7170526 -3213729 -5152550 -9296601 -8932151 -3053785
3483 -3053785 3726083 7167858 5844471 21203 -7743981 -12100244 -9232829 -1986708
3475 -1986708 2387970 179987 -5270834 -8183449 -6170266 -983572 4221156 6861292
3467 6861292 5430196 -61858 -7614092 -13847942 -16156895 -14949319 -13230497 -13005511
3459 -13005511 -12807358 -10486350 -7667881 -8307907 -12340498 -14395974 -10846961 -5034591
3451 -5034591 -2643295 -4344068 -6353381 -6365795 -5164288 -3582077 -1868913 -1629439 -4502830
3442 -4502830 -8664655 -10015370 -7247269 -2717224 1809311 6749391 11371135 12461349
3434 12461349 7981489 -276675 -8685320 -14361205 -15751754 -13785564 -12726272 -16095836
3426 -16095836 -20984941 -20787942 -15031295 -11314692 -14413432 -18545611 -15489416 -6680656
3418 -6680656 -1156781 -3345877 -8977975 -12638406 -13632341 -13735566 -14280941 -16795953 -21969279
3409 -21969279 -26351265 -24508115 -16746583 -10555897 -11323126 -15304727 -15659694 -12261419
3401 -12261419 -10367109 -11241765 -10156421 -4557603 1002916 827977 -4432455 -9408018
3393 -9408018 -11011966 -10530774 -9863173 -9207586 -8733349 -9512084 -11489989 -12499176 -10675896
3384 -10675896 -6573218 -1895753 2261774 4571274 2714040 -4053149 -12368292 -17298276
3376 -17298276 -17286860 -14555798 -11153703 -7567099 -5335820 -7247157 -13026533 -17688197
3368 -17688197 -16656527 -10577608 -2935602 4638167 11619508 15573128 14559286 11852228
3360 11852228 13323829 19225623 22916072 19561479 12365925 7812285 8063037 11025715
3352 11025715 14922987 18816790 20485591 18135966 13630240 10220617 7501171 2669852
3344 2669852 -3148309 -4539316 719652 7978143 11853033 12392921 12180688 10840213 6814612
3335 6814612 2418333 2083490 6008481 9894370 11035432 10367357 7959946 1394647 -9079638
3326 -9079638 -17833670 -19757695 -16381653 -12807472 -10517657 -7003129 -1540412 2806721
3318 2806721 3710945 3007246 3917177 6496798 7596203 5071020 941914 -337706 3078773
3309 3078773 7957187 9838200 8781375 8725253 10719541 10322299 4148187 -3995807 -7416546
3300 -7416546 -5324301 -2988817 -3719566 -5308688 -5053813 -3767432 -2911422 -1644555 426800
3291 426800 458480 -4197569 -11262829 -15494050 -14963446 -12782309 -12489204 -13974745 -14853400
3282 -14853400 -14465449 -14950400 -18007996 -21542999 -21304890 -16638687 -12705895 -14631417 -20592245
3273 -20592245 -24002920 -22226058 -18952330 -17011239 -13715295 -6610102 129605 160842
3265 160842 -5947500 -11339538 -12375459 -12418547 -14905179 -17484026 -16285965 -12765044 -11901409
3256 -11901409 -14663193 -16557450 -14374498 -10610253 -8973083 -8405506 -5299130 -399245
3248 -399245 1039780 -3214738 -8964435 -11958958 -13696485 -16909278 -18393055 -12189599
3240 -12189599 655436 11168520 12590284 7270054 2203898 1616059 5231814 9764872
3232 9764872 10355108 4590185 -2949479 -4423021 867143 4825213 2332791 -1173731
3224 -1173731 1073430 5933890 5642343 470185 -2524402 -1706327 -2718242 -7514965 -10230945
3215 -10230945 -6757091 -1187147 1114174 916913 1206425 831582 -2741768 -7663898 -9820903
3206 -9820903 -8812030 -7422392 -6537505 -4746953 -2186228 -681203 7153 2399925 6794281
3197 6794281 9481802 7296550 2311053 -97719 2282415 5555709 4173111 -2421420
3189 -2421420 -9170278 -11532609 -10162492 -8272657 -6684491 -4347666 -2325279 -3327205
3181 -3327205 -6989451 -9041889 -6326810 -272565 5233131 6910804 2764018 -6755692
3173 -6755692 -16767975 -20352216 -15267576 -6412249 -215307 1139950 -1123720 -5461217
3165 -5461217 -9751975 -11056331 -9063241 -7719371 -9911190 -12033983 -7684279 3690312
3157 3690312 15261228 20222862 18081134 13254436 9980167 9619205 11181526 12934903
3149 12934903 13683817 13107544 11350874 8911645 6772876 5440392 3608460 -743696
3141 -743696 -7279930 -12728404 -14106228 -11211985 -5514241 1396703 7232076 9021074
3133 9021074 5561718 -1088783 -7363682 -10166765 -7319108 781749 8873031 9900973
3125 9900973 3007932 -4417623 -5576507 -2499467 -2085684 -6329619 -10725380 -11053546 -7423787
3116 -7423787 -1893435 4014316 8930959 11736449 12629412 12262327 10201521 6172805 1849636
3107 1849636 -958290 -2657227 -3594941 -993304 7768666 19283350 25840594 23771006
3099 23771006 16667697 9678556 4121474 -1067574 -5945031 -9820083 -12907278 -15785454
3091 -15785454 -18070065 -18492078 -15709086 -9332779 -1382247 4000956 4229768 1165721
3083 1165721 -1612596 -3487437 -6030236 -8349163 -6861704 -239774 8429950 15229875
3075 15229875 18725890 19205662 17123532 13114367 7746670 1104810 -5679401 -9354374
3067 -9354374 -7894303 -4420392 -4416394 -8967745 -13963008 -15950350 -15207301 -12863948 -9035592
3058 -9035592 -4789338 -2441144 -2856163 -5332770 -10044079 -16550262 -19929728 -13861727
3050 -13861727 681056 14536004 20240296 18687442 14469435 9888142 6262529 5832136
3042 5832136 8237231 9056969 5714872 1407322 -99292 486778 1761961 5703423 12807284
3033 12807284 17224965 13191104 4041725 -1396896 -347631 1572039 -867400 -6413592
3025 -6413592 -10383698 -9982258 -6201028 -2957111 -3771522 -7335759 -8241480 -4327705 -251288
3016 -251288 -638394 -3588835 -5533815 -8223967 -14131066 -18232640 -13058428 -1117740
3008 -1117740 6359446 4196306 -1047007 -2259834 -1215856 -3203098 -8250045 -12167249
3000 -12167249 -12312856 -8506876 -1255656 7776477 15836452 21679203 25783226 27110551
2992 27110551 23300706 15490601 8894397 6471981 5682485 3583319 1267100 731891
2984 731891 1109448 966304 1109058 2174069 2392199 565803 -1549097 -2425779 -3324646
2975 -3324646 -5045861 -5411293 -3065906 -690914 -1164968 -3399474 -4998033 -5609024 -4222335
2966 -4222335 2614462 14752063 24160978 23084198 14522817 8246691 7549390 6731897
2958 6731897 1709967 -4061854 -6290107 -6332177 -7464949 -8897812 -7379896 -2456535 2950982
2949 2950982 5896378 5382642 2351682 -695868 -1362472 -61705 22978 -3157866 -7686750
2940 -7686750 -9818814 -8154924 -4774751 -2641206 -2325909 -1201301 3539685 10375887
2932 10375887 13244704 7909646 -1998953 -7800422 -4892334 3051730 9185898 10247534
2924 10247534 7469017 3522477 574839 -219601 551731 780132 -911660 -3449020 -4592818
2915 -4592818 -3431323 -984963 1041646 1553058 861428 910979 4053354 10637411 17865406
2906 17865406 21602222 19613129 13289807 6456107 2232222 721445 36981 -415126
2898 -415126 1034200 5119108 8991701 8893444 4877858 617369 -1372912 -1947491 -2534129
2889 -2534129 -2839479 -2541312 -2966852 -5243737 -8255143 -10119383 -10422875 -9259951 -5399489
2880 -5399489 2139129 11132681 17156836 17803967 14125544 7963238 394647 -6375110
2872 -6375110 -8571310 -5045454 -393877 -559928 -5405427 -8783828 -6657888 -1783583
2864 -1783583 1508373 3778091 8073786 13278169 14720322 11188524 6651117 4076726
2856 4076726 2035322 -686533 -1538048 1466783 5410130 6477379 5740809 6624808 8541554
2847 8541554 7980280 5117674 4208431 6831285 9288068 8160083 4724757 1973499 167851
2838 167851 -2544752 -7011800 -12180176 -15957368 -16231901 -12731759 -8380497 -6830411 -8136872
2829 -8136872 -8993556 -7657428 -6090886 -6483863 -8328336 -10041402 -10942564 -10416403 -7706853
2820 -7706853 -4040897 -2615741 -4998693 -9643242 -14858064 -20308655 -24384114 -23864730
2812 -23864730 -18735721 -14001107 -13544718 -14922843 -13500305 -9047302 -4491994 -713085
2804 -713085 2783974 3746509 -1079411 -10353215 -18661900 -22651733 -22827093 -19765222 -13353029
2795 -13353029 -6333696 -3720941 -6797707 -11326159 -13276423 -12734837 -10581996 -5580412
2787 -5580412 2187352 8370947 8659140 4135230 -819468 -4126544 -6201398 -6343325 -3229139
2778 -3229139 1503237 4572652 6680576 12614890 23590208 32891999 32721798 23863661
2770 23863661 14867613 11674755 11519169 8488056 2232232 -1833568 9664 5273358
2762 5273358 8875900 8982021 7804513 7998587 10013172 12511587 13821950 12807215 9446075
2753 9446075 5077104 1452539 -1083839 -4321474 -10299610 -18083878 -23106250 -21525562
2745 -21525562 -15674560 -12793024 -16441053 -21405458 -20364978 -13710559 -7820629 -4373924
2737 -4373924 1834688 12492591 20277143 18789113 12558614 10496913 13081334 13754334
2729 13754334 11085818 10864244 15432318 19111001 17017791 11710566 7371258 3194015
2721 3194015 -2661004 -6984794 -5046119 1928263 7540782 7614711 3492764 -1036865 -3218231
2712 -3218231 -2540934 -802569 -307809 -779778 292856 3259012 5214392 5152643 6602498
2703 6602498 11929654 17346877 17831400 14321995 11115173 8146893 1621277 -8297939
2695 -8297939 -16098221 -17830196 -14648023 -8840088 -1259297 6016047 9421377 8747657
2687 8747657 8271222 10414326 11815415 8793676 3774554 2646719 7454060 14928654
2679 14928654 21011122 23655183 21837931 15154558 5351548 -3435118 -7000338 -3647641
2671 -3647641 4803654 13822198 18771665 17976067 13341470 7982637 4109719 3215820 6350038
2662 6350038 12680934 18725483 20539328 16732075 9055439 734526 -5454122 -8455632
2654 -8455632 -8952379 -7744135 -4657760 -453481 1163451 -3293801 -11362187 -15681785
2646 -15681785 -12793565 -7802519 -7484619 -11403212 -13467773 -10384708 -4330617 1812057
2638 1812057 7210717 10617950 9471837 3321260 -4624642 -10952669 -14811783 -16121723
2630 -16121723 -13864513 -8298005 -2671698 -50291 405537 1562420 3556728 3629841 853470
2621 853470 -1495886 353529 5802159 10205777 9911195 5850676 1637357 -1049683 -3710131
2612 -3710131 -7432512 -9931508 -8098580 -2787676 1339473 1065336 -2512167 -7075068
2604 -7075068 -12334352 -18021956 -20853528 -17345877 -9758825 -5708418 -9929122 -18390010
2596 -18390010 -22951304 -21023775 -18051073 -20034872 -26010931 -29750850 -27559798 -21763592
2588 -21763592 -16501754 -12978932 -10373503 -8922544 -9176896 -9544180 -8170929 -7064623
2580 -7064623 -10303926 -16967658 -19917862 -14473229 -5219672 -536972 -2566076 -6816026
2572 -6816026 -10055604 -13122199 -15776243 -14597932 -8455279 -1670585 1415923 1638700
2564 1638700 1459866 -455423 -6591129 -14645504 -19424900 -20069971 -20391639 -21586520 -19631018
2555 -19631018 -11846641 -1938765 4407523 6275132 7164957 9947469 14675546 19679184
2547 19679184 22314339 20151477 14109555 9211061 9402134 12464371 12989100 9866519
2539 9866519 7591467 9908486 15242207 19342950 19853779 16991265 11956321 6501247
2531 6501247 2824187 2232488 4100106 6491532 7267719 5047746 678665 -2517079 -2181590
2522 -2181590 -704943 -2883266 -9286651 -15258772 -17859971 -19905569 -24099967 -26790915
2514 -26790915 -22654721 -13996877 -9622277 -13609487 -19968204 -20588099 -14909116 -8844119
2506 -8844119 -6504488 -6341012 -4732213 -519782 4605013 8637169 11194227 13119140
2498 13119140 14606850 14403466 11462526 6769204 2309536 -1311689 -4573322 -6780448
2490 -6780448 -6601112 -5146773 -5473810 -7627235 -7280095 -1927803 4160074 4893130 705909
2481 705909 -2400850 -1752753 -1068345 -3390193 -5682662 -3670180 1351719 4845703 6361121
2472 6361121 9683594 15604355 19239170 16677970 11092785 9167779 12871988 17477478
2464 17477478 17218792 10681913 800335 -8260439 -13783764 -15899095 -17138132 -19573126
2456 -19573126 -22193259 -22472708 -20569587 -19763225 -21782011 -23973839 -23043321 -19873307 -18113464
2447 -18113464 -18987006 -20330594 -20610699 -21063078 -23087792 -25652776 -26325031 -23590868 -17821415
2438 -17821415 -11476395 -8295893 -9831033 -12224356 -9449920 -1465855 3681566 -1228247
2430 -1228247 -13313658 -22347292 -21871162 -14523299 -6872326 -2608849 -1668460 -2724846
2422 -2724846 -4080740 -3578795 -125819 4454440 6339332 3291507 -2536628 -5778616
2414 -5778616 -2801134 4088397 8398088 6276336 562417 -3011636 -2204277 948011
2406 948011 4150604 6647563 7684721 6729559 5642715 7222807 10506193 10841851 6441003
2397 6441003 1732045 1551152 4452533 5049693 1595834 -2013654 -1376992 3793617 9961194
2388 9961194 12756278 10221264 4946337 2306768 4735404 8693739 9340163 6779405
2380 6779405 4807675 4775763 4596881 3356191 2403278 1254608 -2848161 -9323726 -12527099
2371 -12527099 -8878200 -2611398 -880497 -5282163 -11524798 -15461529 -15740338 -12175792
2363 -12175792 -5940943 -786075 340516 61740 3677365 10797023 14432836 10336186
2355 10336186 2968870 -867255 -726816 -773428 -2032793 -1647958 798118 1435751 -2130159
2346 -2130159 -7161772 -9808080 -9679842 -8237274 -5501432 -1522900 856695 -1319115
2338 -1319115 -6030319 -7567006 -3732666 1359115 3231736 3005845 4755460 8664067
2330 8664067 10384057 7429892 3168293 2765365 6812165 10996116 11599299 9371748 7368876
2321 7368876 6345439 3828206 -2204479 -9917810 -14864779 -14526836 -10929634 -8463459
2313 -8463459 -9415217 -11916305 -12188046 -8608013 -3388541 -51197 452902 53621 -376864
2304 -376864 -3503558 -11864544 -22476776 -28267359 -25815765 -18963775 -13228048 -9496270
2296 -9496270 -5816567 -2554470 -1357472 -316787 4594081 12524170 16866416 13321662
2288 13321662 5031607 -2655222 -8749503 -14462382 -17662159 -14578703 -6317938 791746
2280 791746 2152766 -693656 -3128011 -2338355 1414543 5888669 8117312 6404000 2169196
2271 2169196 -1273267 -2153142 -1269343 248382 2204423 3980066 3990738 1521393 -2263813
2262 -2263813 -5806806 -8385893 -9673489 -9859018 -10499322 -12981340 -15451417 -13892151 -7662799
2253 -7662799 -1454707 221175 -1776344 -3730818 -4241194 -3715461 -1058962 4340497 8054149
2244 8054149 3594686 -8317868 -17994027 -17434999 -9649494 -3596347 -2070366 375059
2236 375059 7514078 14836370 15853230 11609522 9193000 11340393 12277026 5921615 -5247986
2227 -5247986 -13237148 -14865216 -14660987 -17035712 -19952640 -18989414 -14642733 -11714025 -12533929
2218 -12533929 -14544261 -14743652 -13178029 -11042902 -8294458 -4951848 -2505202 -1728601
2210 -1728601 -581152 3254159 8621724 12214187 13168666 13424815 13185129 9407223 895193
2201 895193 -7574447 -9461334 -4073799 2937024 6600409 7073315 6332494 3850247 -1761881
2192 -1761881 -8798249 -13500271 -14713149 -14752167 -15365797 -15297427 -12751961 -8388787 -4617348
2183 -4617348 -2989302 -3174867 -3758499 -3530899 -2608789 -2224937 -2580323 -1680166 1821064
2174 1821064 5397620 5421071 3281358 4773981 11740165 18220994 17925793 12235186 6872298
2165 6872298 3385934 -874914 -5706008 -6999234 -3629346 -250483 -1105682 -5054721
2157 -5054721 -9230021 -13967841 -20456871 -25789745 -24735943 -16596688 -7377485 -4042463
2149 -4042463 -7728632 -13142720 -14058200 -9165931 -2755587 143608 -1238422 -3658031
2141 -3658031 -4112920 -2347365 409240 3137477 5090717 5903992 6200321 6669175 6340271
2132 6340271 3600021 -727491 -3487560 -3191132 -1770068 -1227394 -630132 2037425 6781708
2123 6781708 12024282 16717916 20444544 22525521 22521105 21007541 19230222 18799592 21288696
2114 21288696 25885550 27840274 23032896 14797449 11561661 15552778 18793405 14022775
2106 14022775 4783509 -738235 -1755175 -3565504 -6714715 -5938708 18102 5744814
2098 5744814 8252682 11115347 16007078 16976800 8663564 -4445549 -12849057 -13319976
2090 -13319976 -10091765 -6986439 -4053668 -1334287 -508276 -1716914 -2533119 -1427972
2082 -1427972 312487 1073848 1138559 1473928 1943487 1644695 177835 -1593906 -1349599
2073 -1349599 3372596 12030257 19714674 21081559 16075510 10151070 8237955 9652567
2065 9652567 9464348 4032351 -5130138 -12479624 -13670398 -10253983 -8255996 -10826499
2057 -10826499 -13588389 -9836834 207963 8841978 10508068 8404084 8758859 11247030
2049 11247030 9659234 1918496 -5238271 -4161635 3724464 9254839 6246708 -2113807
2041 -2113807 -8045587 -7641934 -3198598 745182 1453480 -829453 -3537448 -4009300 -2752154
2032 -2752154 -3770265 -9590649 -16779796 -19328765 -16342428 -12959655 -12985699 -14391957 -13934205
2023 -13934205 -12470818 -12436010 -12922008 -11550647 -9709249 -11294646 -16284678 -19799434 -18647545
2014 -18647545 -15358756 -14000130 -14644155 -14131904 -10706627 -5909867 -2679673 -2889305 -6028834
2005 -6028834 -9237049 -9354831 -6024656 -2278652 -1183081 -2357033 -2728553 -510586 2541241
1996 2541241 3224009 846904 -1595814 -713984 3198482 6515302 6825190 5366787 3816233
1987 3816233 667631 -6395432 -15223859 -19634585 -16152649 -8067443 -1496376 811093
1979 811093 325239 -954713 -2791891 -5552863 -8522958 -10203929 -10023236 -9352195 -10328659
1970 -10328659 -13243176 -15568895 -14493943 -10211716 -5721327 -3520561 -3530133 -4010079 -3130174
1961 -3130174 296976 5981988 11548713 13908736 11689190 5816121 -1493452 -6924052
1953 -6924052 -6585355 527997 9563667 13515228 10805184 6358119 4209242 2435752
1945 2435752 -2588137 -10019158 -15591604 -16846061 -14509282 -10133147 -4985665 -157131
1937 -157131 4578800 10985914 19439143 27084296 30942663 31277553 29715437 26123376 20407800
1928 20407800 15495913 14511372 15734105 14098916 7527066 -1223622 -8268106 -10969628
1920 -10969628 -7933534 -915473 4087118 2604577 -1535457 -406420 6817882 12916730
1912 12916730 14064580 15125933 19993956 23367871 18273006 7395259 89505 207216
1904 207216 3097992 3646536 1324652 -2758622 -8133086 -12825190 -13384473 -9226270 -4126440
1895 -4126440 -1696472 -1470337 -675794 2017187 5604356 8053427 7611849 3956617 -1429940
1886 -1429940 -6755368 -11428701 -15034391 -15864270 -12621242 -7108357 -2962972 -1856736
1878 -1856736 -2922035 -5357598 -8979420 -12429859 -13797764 -13430854 -13569210 -14849903 -15764460
1869 -15764460 -15836982 -16370740 -17406095 -16987982 -14492794 -11818765 -10123638 -8200292 -5288575
1860 -5288575 -2524847 -186985 3339595 8004318 10639466 9372344 6675452 5617894
1852 5617894 5829593 5697356 5603359 5932146 4700225 700782 -3495952 -5316535 -6303054
1843 -6303054 -8290703 -8319305 -2906965 4490262 6743884 3489240 2003717 6749949 13753526
1834 13753526 16929441 14712886 8488709 -277882 -8492737 -11725104 -9682197 -7969421
1826 -7969421 -11195530 -17440150 -22419252 -25480043 -27682025 -27182418 -21283665 -11441229
1818 -11441229 -2280982 3128218 3952372 -216994 -7744333 -13225880 -12061836 -6247470
1810 -6247470 -1694597 -462279 324593 2581648 5082896 7326281 10740973 14868329
1802 14868329 16516526 14219283 9971600 5382476 53701 -4741141 -5241419 -784697
1794 -784697 3651004 3811081 1807445 1774963 3024564 2231256 293871 1422595 5727748
1785 5727748 8079778 5549488 1487051 92564 627881 -32344 -1789316 -1981233 -602125
1776 -602125 -1198205 -5897058 -12095786 -15540464 -15380161 -14700543 -16510417 -20441565 -23569494
1767 -23569494 -23629545 -20842219 -16888204 -12905273 -9111583 -6173866 -5673292 -7906750 -9612643
1758 -9612643 -6029043 3467769 13239357 16975726 14629219 11221518 9121323 5281948
1750 5281948 -2371319 -9649153 -10937641 -7339727 -5642150 -9409790 -15040339 -17361088
1742 -17361088 -15484606 -11464085 -6377689 -705387 3079613 1668029 -4786535 -11331237
1734 -11331237 -12509248 -8130086 -4155099 -6679518 -14592285 -19736842 -15807587 -5635068
1726 -5635068 2522784 4384683 2059456 -1700206 -6728901 -12184671 -14962956 -13857665
1718 -13857665 -11707056 -10843639 -9672818 -6512361 -3590150 -3844977 -6390009 -8541206
1710 -8541206 -9859663 -10737338 -9753106 -6605892 -5027414 -7770710 -10821273 -8261700 -1415215
1701 -1415215 3150469 3972565 5839175 9820679 9809694 2205201 -7237969 -10671149 -7809408
1692 -7809408 -4062312 -2602738 -2556832 -2354914 -908544 2462127 6083859 6391840 3440990
1683 3440990 2765126 7626475 12586168 10375765 3205566 708761 6516803 13028103
1675 13028103 11526613 2891965 -4502798 -4618765 992781 5905785 4920344 -1338347
1667 -1338347 -6757142 -5626336 1386419 8312512 10813345 10212923 10488072 13292651 16587643
1658 16587643 16712621 11646666 3770541 -929376 1379590 7539588 10780527 8729683
1650 8729683 4967867 2681093 1046983 -781055 -762516 1859940 3271490 197469 -4176299
1641 -4176299 -4009847 798722 4714927 4733077 3761110 4984479 7043909 6747057 3417411
1632 3417411 -1661034 -7609915 -13261238 -15969397 -13983777 -9283369 -5706788 -4562404
1624 -4562404 -4008024 -2429187 -235334 1928589 4593325 8040361 10896866 11403017 9338890
1615 9338890 5748443 1433201 -3253520 -7635243 -10920340 -13022462 -14118567 -13525442
1607 -13525442 -10369977 -5726461 -2667831 -3037488 -4838297 -4032130 1106389 8133154
1599 8133154 12789184 12647952 8783684 4693143 3486557 5373337 7929447 9342865
1591 9342865 10736878 13966816 17602063 17378148 11445901 3195885 -2621584 -4957811
1583 -4957811 -5657106 -5051758 -1553268 4312363 8662412 8543658 5355495 2411101 936513
1574 936513 385229 869638 2433605 3051950 927531 -1220780 1938726 10679245 17845029
1565 17845029 16763419 9108590 1921347 -1140497 -1718111 -1152819 2029421 7909942
1557 7909942 12630748 12709670 9460039 6521018 4660216 1776324 -2659053 -5788037 -4514286
1548 -4514286 797936 6201595 7452404 3783287 -1274027 -3309823 -1240836 2679566
1540 2679566 6285235 8734616 8658676 4558523 -1745764 -5473529 -4761625 -2973323 -2711546
1531 -2711546 -1401982 3176103 6614204 2973912 -5797073 -11739353 -11341404 -7918271
1523 -7918271 -3997879 1431782 7086219 8597628 6611139 8429097 16932282 24177081
1515 24177081 21956902 13649733 8760209 9464590 10006318 7167695 3638093 1521221
1507 1521221 -363869 -1993462 -1119316 1925419 3517205 2095151 -284868 -2443087
1499 -2443087 -5175321 -7054329 -4819541 124124 1233707 -4053443 -9576842 -8517775
1491 -8517775 -2228896 2791283 3274613 581367 -3196691 -6209052 -6246352 -3532730 -2631380
1482 -2631380 -7667651 -16689595 -23858708 -25640846 -21778717 -12718360 -799014 7634775
1474 7634775 6935439 -709153 -7264715 -8408098 -7088789 -7325027 -9027208 -10194876 -10012717
1465 -10012717 -7843154 -2684715 4215436 9076635 9838797 8145209 5664536 1719293
1457 1719293 -3320099 -5805260 -3441840 130057 -1051816 -8324002 -17764355 -24797342
1449 -24797342 -26442873 -21116696 -10758833 -2438956 -2803856 -9790423 -13895798 -9392409
1441 -9392409 -824618 3677086 2147316 -1109040 -2253493 -641645 3537948 9498186
1433 9498186 13547474 11195388 3402284 -2861964 -2787808 517603 1468559 358302 1747913
1424 1747913 6046160 8339827 6241245 3399103 2817448 1662016 -3180948 -8156569
1416 -8156569 -7078087 -261678 5903986 8036532 8941495 10996259 11700948 8094385 1343486
1407 1343486 -5899734 -13146506 -19740288 -21968708 -17003435 -8472880 -3801176 -5663831
1399 -5663831 -9252885 -8875989 -4879357 -2589537 -5499382 -10911365 -12786397 -8772690
1391 -8772690 -3355090 -2555305 -6103176 -7600355 -3032164 4142300 8290724 8835554 8984437
1382 8984437 9664167 8941426 6467305 4238696 2873338 1018094 -761642 1000902 8171394
1373 8171394 17745425 24183499 23359742 14258996 -250213 -13424807 -18529554 -14876388
1365 -14876388 -8443013 -5195126 -5400316 -5416813 -2739750 2477303 8926214 14832232 18072470
1356 18072470 17513939 13983849 9083487 3818837 -949554 -3899446 -4108560 -1837556
1348 -1837556 1916300 5779342 8219317 9092401 10552651 13888661 15799682 11591682
1340 11591682 2737568 -3251903 -2657949 -913662 -4746687 -12687390 -17687832 -16275506
1332 -16275506 -10241002 -1342056 10153173 22165309 30865575 34368393 33067347 27183756
1324 27183756 17817361 9178122 4975974 3290812 -36426 -3862331 -3592908 58496
1316 58496 1666336 1202692 4945733 13370314 17099000 10576269 1815407 722884 4105253
1307 4105253 1849108 -6233913 -10508633 -6967940 -1849844 158659 2294865 7290972
1299 7290972 11481820 11951704 12066531 14143197 12806372 2696078 -11179481 -18024317
1291 -18024317 -14402822 -6656714 -1257183 1247007 2490280 2151657 -363388 -3463808
1283 -3463808 -4657507 -2950249 505335 3065229 2599718 361983 509800 4727075 9236396
1274 9236396 10089931 9138454 10329617 11921028 8390177 -114943 -6760340 -7868586 -7451664
1265 -7451664 -9370394 -11311080 -10645107 -10359168 -13345170 -15465113 -11380172 -4379839 -2832415
1256 -2832415 -7979912 -12656195 -12303497 -10019868 -9151024 -7764424 -3594977 1099710 3373916
1247 3373916 3967759 4290464 3055711 -70964 -1071019 3312316 9365852 10302476 5381219
1238 5381219 647599 620140 3074916 2934969 -1305213 -6219885 -7471963 -4743801 -2400659
1229 -2400659 -3949059 -6262719 -2632397 7580804 16652772 18250169 14868633 11792892
1221 11792892 8724318 3538107 117031 3952903 11664709 13894205 9051250 5533081
1213 5533081 8612015 13769055 16031534 17052019 17927528 13511235 1431625 -9751261
1205 -9751261 -10348742 -3405556 174587 -2393202 -4163969 -1844964 -738459 -4374624
1197 -4374624 -8052698 -6876379 -3576843 -3291760 -5165581 -4411691 -122701 3668756 3742804
1188 3742804 1219599 -238531 2153654 7863009 12745461 12542096 7793722 3514551
1180 3514551 2843493 3386559 1658949 -1352076 -1788820 1755554 7495071 13586954 18632250
1171 18632250 19977504 15612476 8289401 3906737 3958234 2605358 -5982971 -19248720
1163 -19248720 -28394724 -28282511 -22070241 -15804595 -11799860 -8980464 -6616585 -4383089
1155 -4383089 -523143 5792485 10453891 7185554 -4230649 -16203558 -21828892 -21679104
1147 -21679104 -19668966 -16266850 -10326677 -4594345 -3349758 -5505750 -5849843 -3223527
1139 -3223527 -1708276 -2806141 -2527992 1433400 5363526 5874022 5510315 7448516 8842411
1130 8842411 5150405 -1579971 -4662436 -1711149 3870852 9576813 16051636 22027765
1122 22027765 22767371 16099775 6087627 -1980693 -7434579 -12722153 -18591920 -23478403
1114 -23478403 -26061836 -25833183 -22010419 -14308823 -4744256 3032648 6560632 5951257
1106 5951257 2578540 -2552324 -8506962 -12918798 -12187409 -4824345 5413937 12035577
1098 12035577 12958873 13115178 17390344 22790219 21726126 12744352 3231671 -34391
1090 -34391 1357093 1978649 1064735 2029653 5439139 7422420 5351014 1257482 -1537096
1081 -1537096 -2399881 -2581709 -2453910 -1126745 2137416 6957214 11433577 12526528 8377293
1072 8377293 1028162 -4415109 -4221462 1050265 8016239 13156328 13834000 9402661 3166227
1063 3166227 1040075 5378512 11189250 11411925 5498534 -310124 -1317851 383663
1055 383663 49911 -3501583 -7803131 -10373563 -9965085 -6001995 452784 6178113 8718234
1046 8718234 9128153 9769453 10626851 10462321 10304571 12148042 14774376 15022621 13373368
1037 13373368 13621128 15832968 14761420 8133520 1817201 2237099 7115349 9225030
1029 9225030 7186498 6211977 8469096 9382492 5597863 1000371 945137 4311923 5933128
1020 5933128 4799437 4737417 7006640 7102926 1143267 -7796752 -13070187 -12794241 -11194504
1011 -11194504 -11573265 -11890024 -9434961 -6457753 -6910018 -9177771 -7223747 684932 9572053
1002 9572053 15659760 21031531 26757667 26890236 15966415 -366777 -9698515 -7543607
994 -7543607 -1085117 2268768 3113225 4568082 5221974 2200865 -2933896 -6218746 -6938053
985 -6938053 -7383074 -8664706 -9964468 -10510883 -9722749 -7036189 -3830118 -3309687 -5926097
976 -5926097 -7429679 -4608516 -481175 -72024 -3301925 -6407142 -8514420 -11691374 -15412421
967 -15412421 -16438492 -14483390 -12965063 -13182645 -12437814 -9448405 -7275616 -8663610 -11930997
958 -11930997 -13658041 -12528296 -8716148 -2678731 3195083 4792471 967168 -4220278
950 -4220278 -6516542 -6592911 -7474897 -8925374 -7747359 -2749127 3558093 8014485 9510069
941 9510069 8968906 8275417 8805805 9897123 9596066 7722676 6557815 7360877 8385592
932 8385592 8075717 7678518 8012624 6129959 -866522 -9958452 -14313738 -11222921 -4728815
923 -4728815 -516862 -1218724 -6256216 -12542817 -15098581 -10767353 -2318329 4146841 6366054
914 6366054 7270676 9048269 10290647 10309455 11494195 14602430 15740657 11640592 5008667
905 5008667 1074433 1186942 3100856 5012926 5505739 2001880 -5925338 -13146792 -13787597
896 -13787597 -8844930 -4407459 -2779968 -577277 3946061 7260100 6322181 3373880
888 3373880 2096407 2331539 1520533 -1049839 -3925328 -5455854 -4376356 -786567 1964604
879 1964604 -359857 -6305186 -8058738 -965115 9252502 13272152 10069720 6831134
871 6831134 7878691 9438637 6556067 238059 -4918239 -6855625 -6842803 -6182807 -5093454
862 -5093454 -4072938 -3819790 -3426326 -334035 6605064 14144325 16120531 9630455 -364736
853 -364736 -4960462 -1017220 5339139 6811687 3801569 1701736 1658528 -462682 -6003908
844 -6003908 -10265304 -9466422 -6177063 -4527593 -3711190 -349911 5025022 8222736 7276008
835 7276008 4422900 2389544 1688012 1625131 1318721 -440852 -3776456 -5887106 -3493090
826 -3493090 1714329 2740476 -5130772 -17675724 -25372505 -23795787 -17949416 -15183631
818 -15183631 -16243888 -16275676 -13487446 -12153327 -15335226 -18949379 -17265628 -11768691 -9265206
809 -9265206 -11946272 -14915472 -14309922 -12338929 -12169357 -12859950 -12454055 -11730339 -11297328
800 -11297328 -8898161 -3564613 1321377 3555746 6759809 13793685 19010098 14520806
792 14520806 2737420 -4968308 -2382140 5645874 12068321 15240343 15817088 13202186
784 13202186 8648541 6164832 6510560 5307383 937300 -923699 4381993 12221526
776 12221526 14727719 11900116 10211271 11989971 12805180 9253218 3416166 -1510755
768 -1510755 -5223264 -8231582 -9438167 -7824451 -4384228 -1047011 892294 973413 -70493
759 -70493 -60551 2738886 7429325 11663889 14518156 16502231 17697361 18159481 19175608
750 19175608 21329522 22132556 18745278 12514953 7475986 4923702 3374455 3392795 7282648
741 7282648 13069640 14218059 7892117 -935924 -6490404 -9062967 -11411605 -12558748
733 -12558748 -10252494 -6860004 -7216958 -11564179 -15302679 -15183047 -11501894 -4984576 3495856
724 3495856 10007113 9689104 3386073 -2144526 -2515949 -473676 -611559 -3336974 -6622495
715 -6622495 -9913588 -12787220 -12779263 -8626492 -3709201 -2382877 -4280974 -5778952 -5549173
706 -5549173 -4818569 -3802894 -2698763 -5030417 -13984802 -24994139 -28259033 -20833777
698 -20833777 -10661188 -5696854 -4519955 -1835239 2154699 4078284 5092878 8511145
690 8511145 11437576 7124385 -3407866 -9948585 -6555163 -56929 -274286 -6346223
682 -6346223 -8818957 -3229378 4416765 6112805 1248036 -4165732 -4925157 -1329022 2311370
673 2311370 2155420 -2176317 -8124817 -12702039 -13972036 -10962337 -4068721 3943183 9144463
664 9144463 10033766 9008015 9217183 10935692 12240575 12365995 12726234 14588225 16793285
655 16793285 16365710 11668174 5108203 1702258 3568220 6717944 5666554 781206
647 781206 -2159881 3749 4226230 7173107 10278115 15529969 19909135 18919100 13807365
638 13807365 10356741 11069886 12957667 13077819 12121067 11886836 12761745 14456744 16167008
629 16167008 15632435 11449128 6754185 6615789 10556773 11857932 6557925 -670811 -2859175
620 -2859175 44158 2277018 875727 -1042039 480893 5139386 9353978 10050485 6488700
611 6488700 119196 -5920529 -7995196 -4346444 2990284 9113725 10077015 6339114 2176061
602 2176061 1489511 4704027 9735231 14451011 17210640 16647150 12925212 8336632 4745301
593 4745301 1302484 -3322932 -7694288 -9448753 -9575363 -11477687 -15909304 -20213101 -22637383
584 -22637383 -23653890 -22565503 -17224352 -8862104 -3214282 -4122221 -8733256 -11331806
576 -11331806 -9498400 -4636869 668068 3471716 1480190 -3956229 -8026554 -8034330 -6540580
567 -6540580 -6724004 -7350441 -5182418 76767 6139018 11026670 12876740 9822128 3437535
558 3437535 -761216 -217516 427997 -3250880 -7077164 -3635717 6019749 13186351 13516600
549 13516600 10977109 9212798 6567281 2385697 1487553 7654742 16909635 21852205
541 21852205 20257737 15904791 12894639 12263882 12832623 12798963 11179981 9120776 8927848
532 8927848 11215424 14374940 16889985 18027937 16446956 11345462 5409804 2969265
524 2969265 4210941 4990028 3683305 3900876 8038384 12360717 12009213 7731769 4015189
515 4015189 3047430 4000115 5931186 7649458 6615632 1923101 -2815518 -3188724 161818
506 161818 2594939 1778160 125973 1424253 7228738 15632980 21534773 19841579 11257314
497 11257314 3428430 3323870 9769551 16335758 19487508 19838503 17247539 10326730 1026630
488 1026630 -5369491 -6228349 -3854317 -955436 2211993 4883817 4118037 -1279977 -7842161
479 -7842161 -10960643 -9729114 -6670981 -4348666 -3752445 -4513947 -5172815 -4164632 -1485965
470 -1485965 1321783 2917308 2824538 986187 -1402373 -1381808 2508580 6725736 6038142
461 6038142 820600 -2689822 -460283 4860442 8982654 11133502 11566378 8352975 1108584
452 1108584 -5037840 -4422135 1218493 4335249 1011745 -4994861 -7920521 -6233288 -2443804
443 -2443804 356418 557528 -1241703 -2482135 -1141834 1463829 2063304 131784 -774916
434 -774916 2413369 7923411 11013589 9578444 6364916 5455904 7626862 10002348 10007210
425 10007210 8431828 7747997 8403903 8756316 8588961 10138142 14393433 18585222 19356578
416 19356578 16772875 12884505 7898203 1012052 -5655898 -7825339 -4631767 -352828
408 -352828 991938 323291 858507 2785699 3248659 939479 -1828725 -2123813 135921
399 135921 2550046 3204128 2333739 1285111 822737 1034110 2299840 5106265 8574720
390 8574720 10320048 8715762 4661513 254564 -3508994 -6520631 -7845301 -6108516
382 -6108516 -1684646 3065264 6109034 7136648 6617017 5056693 3600814 3653907 4907800
373 4907800 5112373 3101801 1079276 2349783 7075964 11646074 12520708 9811883 6475011
364 6475011 4333680 1792123 -3853796 -12243305 -19491310 -22492000 -22242943 -21514767 -20637686
355 -20637686 -18075870 -14475296 -12779829 -13555637 -13373710 -9787023 -5497426 -4959480 -8272063
346 -8272063 -11128009 -10205537 -6234331 -1964810 694083 1356456 831875 502808 810951
$$ [...]
##END NTUPLES=NMR SPECTRUM
##END=
