##TITLE=31Pdec_LR-785-R2-C1X
 CDCl3, 64 sc
 6.2.2025
##JCAMPDX= 6.0         $$ Bruker NMR JCAMP-DX V2.0
##DATA TYPE= NMR SPECTRUM
##DATA CLASS= NTUPLES
##ORIGIN= UXNMR, Bruker Analytische Messtechnik GmbH
##OWNER= root
$$ XWIN-NMR		Version 3.5
$$ Thu Feb  6 13:57:50 2025 Russian Standard Time (UT+4h)  she@DPX200
##.OBSERVE FREQUENCY= 81.013821
##.OBSERVE NUCLEUS= ^31P
##.ACQUISITION MODE= SIMULTANEOUS
##.ACQUISITION SCHEME= undefined
##.AVERAGES= 64
##.DIGITISER RES= 17
##SPECTROMETER/DATA SYSTEM= spect
##.PULSE SEQUENCE= zgpg30
##.SOLVENT NAME= CDCl3
##.SHIFT REFERENCE= (INTERNAL, CDCl3, 0, 198.062)
##AUDIT TRAIL= $$ (NUMBER, WHEN, WHO, WHERE, WHAT)
$$ ##TITLE= Audit trail, XWIN-NMR		Version 3.5
$$ ##JCAMPDX= 5.01
$$ ##ORIGIN= Bruker BioSpin GmbH
$$ ##OWNER= she
$$ F:/spectra/data/she/nmr/P31/2/pdata/1/auditp.txt
$$ ##AUDIT TRAIL=  $$ (NUMBER, WHEN, WHO, WHERE, WHAT)
(   1,<2025-02-06 13:56:28.68 +0400>,<she>,<DPX200>,
      <continue with go, POWCHK disabled, PULCHK disabled
       configuration hash MD5:
       00 E9 B6 7A A2 85 ED C7 34 08 36 98 17 FE 4E 26
       data hash MD5: 32K
       C8 BD 8C 50 08 31 D2 54 02 0C CA 58 5F 4E 31 30>)
(   2,<2025-02-06 13:56:31.06 +0400>,<she>,<DPX200>,
      <Start of raw data processing
       efp BC_mod = 2 LB = 1.5 FT_mod = 6 PKNL = 1 PHC0 = 1362.437 PHC1 = 978.8952 SI = 64K 
       data hash MD5: 64K
       63 60 A3 AC AF C4 E1 A1 54 25 75 EF C8 4F EB 4B>)
(   3,<2025-02-06 13:57:11.45 +0400>,<she>,<DPX200>,
      <pk PHC0 = 21.997 PHC1 = -142.2001 
       data hash MD5: 64K
       8F 77 A1 68 E8 94 62 6D 07 F0 AA B0 62 CD D1 21>)
(   4,<2025-02-06 13:57:16.20 +0400>,<she>,<DPX200>,
      <abs ABSG = 5 
       data hash MD5: 64K
       75 FA 6D F9 49 DA AB 64 B4 70 79 D2 BD 5F BC D0>)
$$ ##END=
$$ 
$$ hash MD5
$$ 24 A7 14 91 5D 33 0D 50 8F AF 47 E5 A3 9D F8 11
##$RELAX= 
##$RELAX= 
##$RELAX= 
##$RELAX= 
##$RELAX= 
##$RELAX= 
##$RELAX= 
##$RELAX= 
$$ Bruker specific parameters
$$ --------------------------
##$DU= <F:/spectra>
##$EXPNO= 2
##$NAME= <P31>
##$PROCNO= 1
##$TYPE= <nmr>
##$USER= <she>
##$AMP= (0..31)
100 100 100 100 100 100 100 100 100 100 100 100 100 100 100 100 100 100 
100 100 100 100 100 100 100 100 100 100 100 100 100 100 
##$AQSEQ= 0
##$AQ_mod= 1
##$AUNM= <au_zg>
##$AUTOPOS= <>
##$BF1= 81.014009
##$BF2= 200.13
##$BF3= 200.13
##$BF4= 200.13
##$BF5= 200.13
##$BF6= 200.13
##$BF7= 200.13
##$BF8= 200.13
##$BYTORDA= 1
##$CFDGTYP= 0
##$CFRGTYP= 5
##$CHEMSTR= <none>
##$CNST= (0..31)
1 1 145 1 1 1 1 1 1 1 1 1 1 1 1 1 1 1 1 1 1 1 1 1 1 1 1 1 1 1 1 1 
##$CPDPRG= <waltz16>
##$CPDPRG1= <>
##$CPDPRG2= <waltz16>
##$CPDPRG3= <>
##$CPDPRG4= <mlev>
##$CPDPRG5= <mlev>
##$CPDPRG6= <mlev>
##$CPDPRG7= <mlev>
##$CPDPRG8= <mlev>
##$CPDPRGB= <>
##$CPDPRGT= <>
##$D= (0..31)
0 1 0 0 0 0 0 0 0 0.06 0 0.03 2e-05 3e-06 0 0 0.0002 0 0 0 0 0 0 0 0 0 
0 0 0 0 0 0 
##$DATE= 1738835696
##$DBL= (0..7)
120 120 120 11 120 120 24 19 
##$DBP= (0..7)
150 150 150 150 150 150 150 150 
##$DBP07= 0
##$DBPNAM0= <>
##$DBPNAM1= <>
$$ [...]
##$SUBNAM3= <"">
##$SUBNAM4= <"">
##$SUBNAM5= <"">
##$SUBNAM6= <"">
##$SUBNAM7= <"">
##$SUBNAM8= <"">
##$SUBNAM9= <"">
##$SW= 400.765351723535
##$SWIBOX= (0..15)
0 1 3 0 0 0 0 0 0 0 0 0 0 0 0 0 
##$SW_h= 32467.5324675325
##$TD= 32768
##$TD0= 1
##$TE= 0
##$TE2= 300
##$TE3= 300
##$TEG= 300
##$TL= (0..7)
0 120 53 12 22 120 120 120 
##$TP= (0..7)
150 150 150 150 150 150 150 150 
##$TP07= 0
##$TPNAME0= <>
##$TPNAME1= <>
##$TPNAME2= <>
##$TPNAME3= <>
##$TPNAME4= <>
##$TPNAME5= <>
##$TPNAME6= <>
##$TPNAME7= <>
##$TPOAL= (0..7)
0.5 0.5 0.5 0.5 0.5 0.5 0.5 0.5 
##$TPOFFS= (0..7)
0 0 0 0 0 0 0 0 
##$TUNHIN= 0
##$TUNHOUT= 0
##$TUNXOUT= 0
##$USERA1= <user>
##$USERA2= <user>
##$USERA3= <user>
##$USERA4= <user>
##$USERA5= <user>
##$V9= 5
##$VALIST= <valist>
##$VCLIST= <CCCCCCCCCCCCCCC>
##$VD= 0
##$VDLIST= <DDDDDDDDDDDDDDD>
##$VPLIST= <PPPPPPPPPPPPPPP>
##$VTLIST= <TTTTTTTTTTTTTTT>
##$WBST= 1024
##$WBSW= 4
##$XGAIN= (0..3)
0 0 0 0 
##$XL= 0
##$YL= 0
##$YMAX_a= 2887
##$YMIN_a= -28622
##$ZGOPTNS= <>
##$ZL1= 120
##$ZL2= 120
##$ZL3= 120
##$ZL4= 120
##$ABSF1= 198.0616
##$ABSF2= -202.7028
##$ABSG= 5
##$ABSL= 3
##$ALPHA= 0
##$AQORDER= 0
##$ASSFAC= 0
##$ASSFACI= 0
##$ASSFACX= 0
##$ASSWID= 0
##$AUNMP= <proc_1d>
##$AZFE= 0.1
##$AZFW= 0.5
##$BCFW= 0
##$BC_mod= 2
##$BYTORDP= 0
##$COROFFS= 0
##$CY= -3
##$DATMOD= 1
##$DC= 0
##$DFILT= <>
##$DTYPP= 0
##$F1P= 0
##$F2P= 0
##$FCOR= 1
##$FTSIZE= 65536
##$FT_mod= 6
##$GAMMA= 0
##$GB= 0
##$INTBC= 1
##$INTSCL= 9.790993e-09
##$ISEN= 30
##$LB= 1.5
##$LEV0= 0
##$LPBIN= 0
##$MAXI= 10000
##$MC2= 0
##$MEAN= 0
##$ME_mod= 0
##$MI= 50
##$NCOEF= 0
##$NC_proc= -9
##$NLEV= 6
##$NOISF1= 182.463
##$NOISF2= 159.3651
##$NSP= 0
##$NTH_PI= 0
##$NZP= 0
##$OFFSET= 198.0616
##$PC= 4
##$PHC0= 1384.434
##$PHC1= 836.6951
##$PH_mod= 1
##$PKNL= yes
##$PPARMOD= 0
##$PSCAL= 0
##$PSIGN= 0
##$REVERSE= no
##$SF= 81.0140089999434
##$SI= 65536
##$SIGF1= 159.3651
##$SIGF2= -187.1042
##$SINO= 113.3802
##$SIOLD= 16384
##$SREGLST= <1H.CDCl3>
##$SSB= 0
##$STSI= 65536
##$STSR= 0
##$SW_p= 32467.5324675325
##$SYMM= 0
##$S_DEV= 0
##$TDeff= 32768
##$TDoff= 0
##$TI= <>
##$TILT= no
##$TM1= 0
##$TM2= 0
##$TOPLEV= 0
##$USERP1= <user>
##$USERP2= <user>
##$USERP3= <user>
##$USERP4= <user>
##$USERP5= <user>
##$WDW= 1
##$XDIM= 65536
##$YMAX_p= 257508207
##$YMIN_p= -304866214
$$ End of Bruker specific parameters
$$ ---------------------------------
##NTUPLES= NMR SPECTRUM
##VAR_NAME=  FREQUENCY,     SPECTRUM/REAL,   SPECTRUM/IMAG
##SYMBOL=    X,             R,               I
##VAR_TYPE=  INDEPENDENT,   DEPENDENT,       DEPENDENT
##VAR_FORM=  AFFN,          ASDF,            ASDF
##VAR_DIM=   65536,         65536,           65536
##UNITS=     HZ,            ARBITRARY UNITS, ARBITRARY UNITS
##FACTOR=    0.49542278885378, 1,            1
##FIRST=     16045.7642231865, 0,            0
##LAST=      -16421.768244346, 0,            0
##MIN=       -16421.768244346, -304866214,   0
##MAX=       16045.7642231865, 257508207,    0
$$ Real data points
##PAGE= N=1
##DATA TABLE= (X++(R..R)), XYDATA
$$ [...]
##PAGE= N=2
##DATA TABLE= (X++(I..I)), XYDATA
7391a4009393k591451L350956R525721Q590202K112668k028423j683587j719779
7383A546914m102742m801799j574319K041934K411221K40276k125939l333283
7375i697737k126923J593407M310514K382560j574309j333505L156829N034671
7367A745507J476304j429131J543682O249999N731454Q01828j801325P25444M582231
7358A9625993N280746K018858k986258o384768o005985l577152l139885m730735
7350A00814l183939L465661Q662058N810258j387526l957197q38348R43256j211212
7341H403825j671149K620842O022578L452791j048411j029991K118353K429162
7333B1298000l47106r75069J801942K829368j546042q333947j2079164j0296901
$$ plain form
7391 -14009393 -16600844 -13249888 -3724167 4866035 6978703 4950280 3266693 1546914
7383 1546914 -2555828 -7357627 -8931946 -6890012 -4478791 -4238515 -6364454 -9697737
7375 -9697737 -11824660 -10231253 -5920739 -3538179 -5112488 -6445993 -3289164 1745507
7367 1745507 3221811 1792680 3336362 9586361 15317815 16119643 14318318 15043762 19625993
7358 19625993 24906739 26925597 23939339 17554571 11548586 7971434 4831549 100814
7350 100814 -3083125 382536 9044594 14854852 13467326 9510129 8671781 9615037 8403825
7341 8403825 6732676 9353518 15376096 18828887 17780476 16750485 18868838 21298000
7333 21298000 20950894 19975825 21777767 24607135 23061093 14727146 2647982 -7648919
7325g648919l860350M051532Q254138M982446k880497p451823n023467m26263
7317a0003203K86046j886436j712118J725036M109985K714444m44769k584098
7309g795113l170007j971678J871075O753694Q075676L957787r29124r42895K578226
7300H427641L176644j134235m820109l034992J303606K126281q81018k592798
7292B571020p15866J222081J24683j888993j403037R87989K416501K270077J619645
7283G204100K85227j650712j300862L165444P134715L805602n641805j1924710
7275A076999r386098k241106L258051O739468R734166R811325M954996n39459
7267B3408342j609026q21646l764002q375614p524730j447805J861303k952J70375
$$ plain form
7325 -7648919 -11509269 -7457737 796401 5778847 2898350 -4553473 -9576940 -10003203
7317 -10003203 -9717157 -11603593 -13315711 -11590675 -7480690 -4766246 -5211015 -7795113
7309 -7795113 -10965120 -12936798 -11065723 -4312029 3763647 7721434 6792310 5849415 8427641
7300 8427641 11604285 10470050 5649941 2614949 3918555 6044836 5163818 2571020
7292 2571020 1855154 3077235 3201918 1312925 -90112 897877 3314378 5584455 7204100
7283 7204100 7489327 5838615 4537753 7703197 14837912 18643514 13001709 1076999
7275 1076999 -8309099 -10550205 -7292154 -552686 9181480 18992805 23947801 23408342
7267 23408342 21799316 20977670 17213668 8838054 1313324 -134481 1726822 1723870 1894245
7258A894245O166937J0405061N374834m066892p580065l755103M02534J405873
7250A0247424K324067M611549M712583M41472m907962p054085n620266k897068
7242A857714n60069J080633K541280M456369O003819M760361J79690l993819l673217
7233A2652761J31456K913731K785421J515265K95996j420958l019023k848817
7225A3005832j738641k437423m785750n165422j774726K891692N685749N732462
7217A1413773L294062n85325k779856o06595L424094L741376k75566l224714k176870
7208A2224379p97604k308790l849473j799032K102270M427438N422597N808201
7200B1229986K761455m717551j0244595p291573L17605K986082o71319k757994
$$ plain form
7258 1894245 8061182 18466243 23841077 19774185 12194120 8439017 8841551 10247424
7250 10247424 12571491 17183040 21895623 22337095 17429133 10375048 4754782 1857714
7242 1857714 1297645 2378278 4919558 9375927 15379746 20140107 20319797 16325978 12652761
7233 12652761 12784217 15697948 18483369 19998634 20294630 18873672 15854649 13005832
7225 13005832 11267191 8829768 4044018 -1121404 -2896130 -4438 5681311 11413773
7217 11413773 14707835 14122510 11342654 10736059 14160153 17901529 17625963 14401249 12224379
7208 12224379 11426775 9117985 5268512 3469480 5571750 9999188 15421785 21229986
7200 21229986 23991441 19273890 9029295 1737722 2055327 5041409 4370090 1612096
7192A612096N19009L169883J48092m042236k845819J598663J606315m588266j0230331
7183a3052594q720595r27197O823918R578876P537949M064327J143097k064548
7175D383233n869653p505415m566585M22536K698093K087177K717469N495378
7167a37767O080206K343921j292268n23768K087462J516915j737242l045361r93262
7158D298836J607370K859818L205192K442835O8416j637931L18476M046772M010571
7149B1220355r51821n400688n001470k254065j821458l722691m645354l520904
7141f098096j983218n08559K306552O526383R458066Q238759L022300k440675
7133A8521512l470639R65851O136432O177063J557082j114176J517628M109450
$$ plain form
7192 1612096 2131105 5300988 5449080 1406844 -1438975 159688 1766003 -2822263 -13052594
7183 -13052594 -21773189 -22700386 -15876468 -6297592 1240357 5304684 6447781 4383233
7175 4383233 -1486420 -8991835 -13558420 -13135884 -10437791 -8350614 -5633145 -137767
7167 -137767 5942439 8286360 6994092 6470324 8557786 10074701 8337459 5292098 4298836
7158 4298836 5906206 8766024 11971216 14414051 14482467 12844536 13163012 17209784 21220355
7149 21220355 20268534 14867846 9866376 7612311 5790853 2068162 -2577192 -6098096
7141 -6098096 -8081314 -8589873 -6283321 243062 9701128 17939887 20962187 18521512
7133 18521512 15050873 16016724 22153156 28330219 29887301 28773125 30290753 34400203
7125C4400203M37984o377903p365569o31337N668184M931139P35473M5749K394584
7116C4238507J579904l796094p713108n686232j417448j445260n816118p880291
7108B063860l277740L880139N650437R1267n853601m437495L291706Q433585N054156
7099A4896314k673429o184470l341985l7120j320347m875883n058716n48251M740804
7090d403083O841915N135631J403986j837909k304539K20606K787382K281096
7082A0125085k56784p96216J746366L726594K229441p00442j519876k91402N33129
7073A4795895K68078m86066k678653o880180r416195n423096L534765R504751
7065C219299P533218J175580l277727m192473l571122k386717p25876k238j089232
$$ plain form
7125 34400203 34838187 28460284 21094715 20463378 26131562 31062701 31798174 31843923 34238507
7116 34238507 35818411 32022317 24309209 18622977 17205529 15760269 9944151 2063860
7108 2063860 -1213880 2666259 8316696 8407963 2554362 -1883133 1408573 9842158 14896314
7099 14896314 12222885 6038415 2696430 2659310 1338963 -3536920 -8595636 -9143887 -4403083
7090 -4403083 2438832 7574463 8978449 7140540 4836001 5056607 7843989 10125085
7082 10125085 9868301 9072085 10818451 14545045 16774486 16074044 14554168 14262766 14795895
7073 14795895 15063973 14577907 11899254 5019074 -4397121 -9820217 -6285452 3219299
7065 3219299 10752517 11928097 8650370 4457897 886775 -1499942 -2225818 -2228056 -3317288
7056c317288k015114j108818n50662k713566m740246j909967M198193O497788
7048e659680K276135k887015l196031j97942Q76753r07664j698260J023309N083347
7039e287048O514520M086453M50945r91926j87408k35722k267244k764181J190502
7030E08891O116712O250533K416257R69033L609621M905833J839077j238968q39569
7021B4537420n75098l729413o017484l033577M18277k606242q455740p405347
7013f867204O21440N628110L483923J299372L805292N024514n53901p430909p612651
7004b602014l126803j376430k512530o56513M508939O445824K165755l736441
6996h90213o559769o445817m430571P9324N398209O790334L067758m78294O14103
$$ plain form
7056 -3317288 -5332402 -6441220 -6991882 -9705448 -14445694 -16355661 -12157468 -5659680
7048 -5659680 -3383545 -6270560 -9466591 -9664533 -8787780 -9695444 -11393704 -10370395 -5287048
7039 -5287048 1227472 5313925 5764870 4772944 4585536 4349814 2082570 -681611 508891
7030 508891 6625603 12876136 15292393 16261426 19871047 24776880 26615957 25376989 24537420
7021 24537420 23962322 20232909 14215425 11181848 11600125 8993883 538143 -6867204
7013 -6867204 -6245764 -617654 2866269 4165641 7970933 12995447 12441546 5010637 -2602014
7004 -2602014 -5728817 -7105247 -9617777 -10274290 -5765351 680473 2846228 -890213
6996 -890213 -7449982 -13895799 -18326370 -18247046 -12848837 -6058503 -2990745 -3469039 -2854936
6987b854936L521723K993924n51521k474443j273483N52744J908820M036208N870568
6978A1729604L927519j310944l801537j80588M147952J857039n503502q995742
6970A869801m452477K240386L820060R47961o71869P53297J756983J98332j448020
6961E014454l96293K210644L280230K055407M55852P383J61045k29332q44148
6952A1715242j79019J977829L209337R76550l588827o322122n233079k884829
6944c28918j993181j140838K168962O133510O457837K920937k01082o71636q96786
6935A2448805k617385l277226m80352L107424K869591j304076m829541m209260
6927A707980o36342K210932K353175J023034N63954J377817J853052J585600K589390
$$ plain form
6987 -2854936 666787 3660711 3109190 634747 -638736 -85992 1822828 5859036 11729604
6978 11729604 15657123 14346179 10544642 10364054 14512006 16369045 10865543 1869801
6970 1869801 -2582676 -342290 3477770 4425731 3753862 4507159 6264142 6462474 5014454
6961 5014454 4618161 6828805 10109035 12164442 12620294 12627677 12788722 12559390 11715242
6952 11715242 11536223 13514052 16723389 17699939 14111112 7788990 2555911 -328918
6944 -328918 -2322099 -3462937 -1293975 4839535 11297372 14218309 14017227 13345591 12448805
6935 12448805 9831420 6554194 6073842 9181266 12050857 10746781 5917240 1707980
6927 1707980 1071638 3282570 5635745 6658779 7222733 8600550 10453602 12039202 14628592
6918A4628592N382064O239083K166460l006728k709753K539012N305455K164948
6910C2709133j911947k379841j761201l524736n323130l646524l76848J071882
6902A4856788K021747M822087O604277L584467j234782j822669J421706L084708
6894C3338329J928991J146544O06871k951121q016636q882791n150778k677967
6886I341442l432539k494704K281847N648407L725189O8747j363622k460308n125987
6877F188472n601023p46996M984094N223313P56140k704522k698574q42480J537913
6868F096337L670481L888154K131741Q85788J59070l743425j0052191j0317997
6860g282042k94954J0666599J1119998L989698J021908L825537K924435m390142
$$ plain form
6918 14628592 20010656 26249739 28416199 25409471 22699718 25238730 30544185 32709133
6910 32709133 30797186 28417345 26656144 23131408 17808278 14161754 13784906 14856788
6902 14856788 16878535 21700622 28304899 31889366 30654584 28831915 30253621 33338329
6894 33338329 35267320 36413864 37020735 34069614 26052978 17170187 12019409 9341442
6886 9341442 5908903 3414199 5696046 11344453 15069642 15138389 13774767 11314459 6188472
6877 6188472 587449 -159547 4824547 10047860 10804000 8099478 5400904 4558424 6096337
6868 6096337 9766818 13654972 15786713 16672501 16831571 13088146 3035955 -7282042
6860 -7282042 -7576996 3089603 14209601 18199299 19221207 23046744 25971179 21581037
6852B1581037q542699l700101K514711J667238k774811l193955o50579q41372
6844F059469k387696R62114Q389625J1349262N615304k938613o436590l813961
6836A6798914N45437L098633L450957K548977J015574j044713l513864n551943
6828A7347972n688984l236323N50645L180246K753588n94402m275752m743903
6820E293087r28680M067242O432667O208077N841309N015977J168170m437761
6812B8660088o385730l141710l64960k469185n480206l469514J596559K949433
6804A1894775j15891j634100R15197K908123O90231k691368k827228k62710J951666
6795A0828695L265637M370262L697678n94055o317577q613942n655512o05631
$$ plain form
6852 21581037 13038338 9338237 11852948 13520186 10745375 7551420 6900841 6059469
6844 6059469 3671773 4633887 13023512 24372774 29988078 27049465 20612875 16798914
6836 16798914 17344351 20442984 23893941 26442918 27458492 26413779 22899915 17347972
6828 17347972 11658988 8422665 8973310 12153556 14907144 14312742 10036990 5293087
6820 5293087 4364407 8431649 14864316 21072393 26913702 31929679 33097849 28660088
6812 28660088 22274358 19132648 18767688 16298503 10818297 7348783 8945342 11894775
6804 11894775 11778884 10144784 11059981 13968104 14658335 11966967 9139739 8877029 10828695
6795 10828695 14094332 18464594 22162272 21568217 15250640 6636698 981186 375555
6787C75555K250646J695826j40810m79902J284246K961949J945756j770205n564651
6778B558410o886576m899592j51813N277574P738272N131168M74992q67952J608314
6769I982797K749651l94550m105312m142302k199122k034655k543545K7267M971923
6760B312152P721788O604758L908642R86969k241586l388796M29912N858139N090889
6751B7282867l208731j0672628j0153503m610698j213656j442988j864582q54870
6743f738789P05699K599415M125297K409263k919138n887125j173010O613424
6735b64964P398054o81888q586591q404191j999191M259127P591965Q353823O162180
6726A3828324R17192m582259o592537m183640N32535M477027M995035J522462
$$ plain form
6787 375555 2626201 4322027 4181217 3701315 4985561 7947510 9893266 8123061 2558410
6778 2558410 -4328166 -9227758 -9379571 -4101997 3636275 8767443 9242435 8374483 9982797
6769 9982797 12732448 12337898 8232586 4090284 1891162 -143493 -2687038 -2659771 2312152
6760 2312152 10033940 16638698 20547340 21534309 19292723 15903927 16333839 22191978 27282867
6751 27282867 24074136 13401508 3248005 -1362693 -2576349 -4019337 -5883919 -6738789
6743 -6738789 -6033090 -3433675 691622 3100885 181747 -5705378 -6878388 -264964
6735 -264964 7133090 6451202 -2135389 -10539580 -12538771 -8279644 -687679 7666144 13828324
6726 13828324 14745516 10163257 3570720 -612920 -80385 4396642 9391677 10914139
6718A0914139k748399l125187J144768N644915O145703L050057m83819k347615
6710A8194562k222109j003720n98002j768325j651982L030880R482911J0251542
6702C3715757L258244m490930o455665m941781n452844p232452n604633q12736
6694A982960K228494J902932J466493K753354L649640K208812j114914n241624
6686I836147q266009o421800J364107Q393160O168679l603175r545897n299707
6678g374495K727656N632572L773310L013303M160275L108420o60881k654598
6670A1725562q98028N67881k265322p343379r103878n393915M21648L943408M524217
6661c821806M610072N204948M146135q5011m694393n140819p83100M324756O052180
$$ plain form
6718 10914139 8165740 5040553 6185321 11830236 17975939 21025996 20542177 18194562
6710 18194562 15972453 14968733 14370731 12602406 10950424 13981304 23464215 33715757
6702 33715757 36974001 32483071 26027406 21085625 15632781 8400329 2795696 1982960
6694 1982960 4211454 6114386 7580879 10334233 13983873 16192685 15077771 9836147
6686 9836147 1570138 -4851662 -3487555 4905605 11074284 7471109 -2074788 -7374495
6678 -7374495 -4646839 985733 4759043 7772346 11932621 15041041 14380160 11725562
6670 11725562 10827534 11395415 9130093 1786714 -7317164 -12711079 -12289431 -8346023 -3821806
6661 -3821806 788266 5993214 10139349 10054338 5359945 219126 -563974 3760782 9812962
6652I812962L577887j164066m798480l986142J025116M712466K166376l366328
6644G979791l807947J934894N292220j9002q835276j1762930p192994p98851L684218
6635a3525877P041433R534171R394599O647838L827737K342582J635460J805663
6627B8703606L345443M395337K238975k096305m426203l063251l95727J371082
6619C0072957K053338P02053m138955r776512r930494l028425M163791N000853
6611A5118606J584100L28535J734493P01757l684236n428344r22364M463076L361868
6602A7257491l279031p912419o986345m335623l482829k245434J949339O001129
6594c033722N411390J903469Q80758K381627J182503l392824m934405l11603M116912
$$ plain form
6652 9812962 13390849 12226783 7428303 3442161 4467277 9179743 11346119 7979791
6644 7979791 4171844 6106738 11398958 11379956 2544680 -9218250 -16411244 -17210095 -13525877
6635 -13525877 -6484444 3049727 12444326 19092164 22919901 25262483 26897943 28703606
6627 28703606 32049049 36444386 38683361 36587056 32160853 29097602 28701875 30072957
6619 30072957 32126295 32828348 28689393 18912881 8982387 5953962 10117753 15118606
6611 15118606 16702706 17031241 18765734 19467491 15783255 10354911 9432547 13895623 17257491
6602 17257491 13978460 6066041 -920304 -5255927 -8738756 -10984190 -9034851 -3033722
6594 -3033722 2377668 4281137 5161895 7543522 8726025 5333201 398796 87193 4204105
6585D204105K054870k349122r46687M967407O232394J70552n295966l873128L96517
6576E560942P44939j954950k041003J293655L251299J321680j234316o75740J957752
6567H224258K673784r7081l795196n179585m000212k155579o2175L584088P695040
6558F887342P724190J699998n115078n904943j361275J790119P74284m39769R28880
6549F983748K002725L22155j293064J1839J550134n23746m558859n897067l679370
6540e081505q26021P92779J129099j01843k190552k094102J533755M953797M299270
6531B414677J776460K062646M630251N245768L333442J557846n55224n320148
6523A5145718r647054p208973R10470N738361L042025j333194k130624k578871
$$ plain form
6585 4204105 6258975 3909853 2963166 7930573 14162967 14333519 9037553 5164425 5560942
6576 5560942 6305881 4350931 2309928 3603583 6854882 8176562 6942246 6266506 8224258
6567 8224258 10898042 10800961 7005765 1826180 -2174032 -4329611 -4391786 -807698 6887342
6558 6887342 14611532 16311530 11196452 5291509 3930234 5720353 6494637 6054868 6983748
6549 6983748 8986473 9308628 8015564 8027403 9577537 9053791 4494932 -1402135 -5081505
6540 -5081505 -5907526 -5114747 -3985648 -4087491 -6278043 -8372145 -6838390 -1884593 2414677
6531 2414677 4191137 6253783 10884034 16129802 19463244 21021090 20465866 15145718
6523 15145718 5498664 -1710309 -799839 4938522 7980547 6647353 4516729 1937858
6515A937858o253511q504109l702304L999676N571679K47729l925305j727700
6507a2355987L699696O919260O261297L455615J467801K652470N675359N536688
6499B3312199L38577m321744k764204J474645N69319m846945o128773m26122M535996
6490A1742948K413693k708426l870198j618068j074107k920019l323847o49030
6482b007054K761892M380113L494320O48143k117826k025295R65001L277863K508161
6473A1885318O74006L95164Q35706M03549L32270J894951K913311J100977j704076
6464A8731176k805868l350668n063804n334216j508665K434948P28188l953952
6456a22861l147701M089099Q782517N277798q55820k160779J46456M59737j295579
$$ plain form
6515 1937858 -4315653 -12819762 -16522066 -12522390 -6950711 -6702982 -10628287 -12355987
6507 -12355987 -8656291 -1737031 4524266 7979881 9447682 12100152 17775511 23312199
6499 23312199 23650776 19329032 16564828 18039473 18608792 13761847 7633074 7206952 11742948
6490 11742948 14156641 11448215 7578017 5959949 4885842 1965823 -1358024 -2007054
6482 -2007054 754838 5134951 8629271 9277414 7159588 5134293 6099294 9377157 11885318
6473 11885318 12559324 12954488 13790194 14193743 14526013 16420964 19334275 20435252 18731176
6464 18731176 15925308 12574640 7510836 2176620 667955 3102903 3831091 -122861
6456 -122861 -3270562 818537 9601054 14878852 14023032 11862253 12008709 12468446 11172867
6447A1172867m89067L841597P289221O385000K486452r10484k122865k213911
6439B5438810l174224n000707m817872p28708L944838L914574j05969j491106
6431A7979636K264263M966545J176285m621085m276951J707661N091169K134034
6423B6421557k018242k312849j087338l414173r154391j3143585j1443124m864923
6415b1017068K620714O982320O246177J414919m095977o538874m299142Q51456
6407a7835475M996399N568669L877355L209567M482196N378460L878984M78939
6399A4035094l445215o757205p424394l795751J493728K894127k69171j624599
6391d893386K880700P740253N542758j437233m333103r79662J500549j672563
$$ plain form
6447 11172867 10683800 14525397 21814618 28199618 30686070 29775586 27652721 25438810
6439 25438810 22264586 17263879 12446007 11717299 15662137 19576711 19470742 17979636
6431 17979636 20243899 25210444 26386729 21765644 17488693 19196354 24287523 26421557
6423 26421557 24403315 22090466 21003128 17588955 8434564 -4709021 -16152145 -21017068
6415 -21017068 -18396354 -11414034 -5167857 -3752938 -7848915 -14387789 -18686931 -17835475
6407 -17835475 -12839076 -7270407 -3393052 -183485 4298711 9677171 13556155 14035094
6399 14035094 10589879 3832674 -3591720 -7387471 -5893743 -2999616 -3268787 -4893386
6391 -4893386 -2012686 5727567 11270325 9833092 5499989 4520327 6020876 4348313
6383D348313n742479l941019K807557P596850O295736J454810j451950m431K559933
6374A3923320Q94653n439455j0194150p958566j293001L296423M215569M404423
6366A849216L973450L41938m237055l156802M174644R492810O850889N84627k139917
6357A7733800j298031j462109l637096n073480m331461j931794J473349L788672
6349E261850J607141m305563p388204l878617R06592O17211j807538N92067O010734
6340b384327N564699k337254q405201n635078J612228N313802M082011J170060
6332a019060k407426o775474q428365l064320P055894J3563523J1154376L431907
6324A3511055j782124j177423J500660R05340l433580o806696n063874M99769
$$ plain form
6383 4348313 -1394166 -5335185 -2527628 5069222 11364958 12819768 11367818 11363387 13923320
6374 13923320 14817973 9378518 -815632 -8774198 -10067199 -6770776 -2555207 1849216
6366 1849216 5822666 6164604 1927549 -1229253 2945391 12438201 19289090 19873717 17733800
6357 17733800 16435769 14973660 11336564 6263084 1931623 -171 1473178 5261850
6349 5261850 6868991 2563428 -4824776 -8703393 -7796801 -7179590 -8987128 -8395061 -2384327
6340 -2384327 3180372 843118 -7562083 -13197161 -11584933 -6271131 -2189120 -1019060
6332 -1019060 -3426486 -10201960 -18630325 -21694645 -14638751 -1075228 10079148 13511055
6324 13511055 11728931 10551508 12052168 12957508 9523928 2717232 -2346642 -1846873
6316a846873M651298L948112J05426k044115O09988O170093Q913645M735916m044848
6307B1198642j0612107j0974920p425858l753746j28653M452104P509799N628386
6299E893647O67493j569525N92164K569724R72316j132356P93747N676763Q255825
6290B2719798N998663J420046j899285k974263l044920l489358m494379m733104
6282I503198k459720J978565N034437L092867k737836o575663m039401K202694
6274E999141N183043K065910k556251l148477n84544L2259k510298l887672j174768
6265e81657K826897M112170K741844R91360o04924k086876j621015J815751N108497
6256A2702047M526637J479360N27156K149260J900598k675912q183903r721829
$$ plain form
6316 -1846873 2804425 6752537 6857963 4813848 5423836 11593929 20507574 25243490 21198642
6307 21198642 10586535 -388385 -7814243 -11567989 -11696642 -7244538 265261 5893647
6299 5893647 6561140 4991615 5583779 8153503 9125819 7993463 8787210 14463973 22719798
6290 22719798 28718461 30138507 28239222 25264959 22220039 18730681 14236302 9503198
6282 9503198 7043478 9022043 14056480 17149347 14411511 7835848 3796447 5999141
6274 5999141 11182184 13248094 10691843 7543366 6958822 6991081 4480783 593111 -581657
6265 -581657 2245240 6357410 9099254 10090614 9485690 7398814 5777799 7593550 12702047
6256 12702047 17228684 18708044 19235200 21384460 23285058 20609146 12425243 2703414
6248B703414o315041q76660L104023L998991K816969J906832J792841K30314l859601
6239E502082p253586o243459k157588O36976J145910J875589L258089K918194
6231c17793P64831j59757J096072J956549J289936J184818K306109K220408K60556
6222A0601729o88765L35471j99794m368789q440895p862396l080364K555667P010343
6213d137793Q751866N954067K65194k537834K12947L785448L090460R048j133504
6204A4259899j205253l233773n270051l500172j64562o76425m008833l899719
6196g698889M37985K957358J217987j17553J204826L34976n175768q520225l121346
6187a8480649O097761Q712584L418741j203718l4374K234099K00958l363683k428452
$$ plain form
6248 2703414 -3611627 -4488287 -1384264 2614727 5431696 7338528 9131369 9361683 5502082
6239 5502082 -1751504 -7994963 -10152551 -9515575 -8369665 -6494076 -3235987 -317793
6231 -317793 447038 287281 1383353 3339902 4629838 5814656 8120765 10341173 10601729
6222 10601729 9912964 10248435 10048641 5679852 -2761043 -10623439 -13703803 -11148136 -4137793
6213 -4137793 4614073 10568140 10833334 8295500 8508447 12293895 15384355 15393403 14259899
6204 14259899 13054646 9820873 4550822 1050650 886088 209663 -3799170 -7698889
6196 -7698889 -7260904 -4303546 -3085559 -3203112 -1998286 -1663310 -6839078 -15359303 -18480649
6187 -18480649 -12382888 -3670304 -251563 -1455281 -1489655 744444 945402 -2418281 -4846733
6178d846733K342832M264654M81597m050201l928162n68250J040513J50780L77136
6169d735834K783378L811433J433638j055485j86602K228388K352689L59613q40251
6160F150967q43012j200285j144380R95267K878259M69994m366351m863245K13518
6151a709268L423251m62958o129030n552298K20974L711612K763949K230246M310073
6142B806551M710041N59904m103582m504852k181854j470350k297698j491355
6134g973195P83550J350116J77436O97515L197577L320443n77665l565785j413853
6125d003861K328641J623075k366195k936937J576762N119509K957007k017565
6117B280436m388568l265489j252679K52655J476307K217676K140539J525257
$$ plain form
6178 -4846733 -2503901 1760753 2242350 -1807851 -5736013 -6304263 -5263750 -5112970 -4735834
6169 -4735834 -1952456 1858977 3292615 2237130 2050528 4278916 6631605 6991218 6150967
6160 6150967 5307955 4107670 2963290 3958557 6836816 7306810 2940459 -1922786 -1709268
6151 -1709268 1713983 1251025 -4878005 -10430303 -10209329 -6497717 -3733768 -1503522 2806551
6142 2806551 7516592 8076496 3972914 -531938 -2713792 -4184142 -6481840 -7973195
6134 -7973195 -7189645 -5839529 -5662093 -4964578 -1767001 1553442 975777 -2590008 -4003861
6125 -4003861 -1675220 -52145 -2418340 -5355277 -3778515 1340994 4298001 2280436
6117 2280436 -2108132 -5373621 -6626300 -6373645 -4897338 -2679662 -539123 986134
6109I86134J03685k614349m694985l009308J081141J826078j991148l371797K564819
6100i119730R413373P944597L93015k613156J688244M638565L97409n550163o129140
6091A063014k988170j346803o94035K517188O889856P746905M638072J029645
6083A8855672k018144n793480q365811n600168J371254N631228L684064K91666
6075H056281J105668M623262N539907L110809J055839K58280k800821q862401
6067A2086824j1989914o803057K780389O851128J778204n073264m953292J171079
6059d151903M693249J083104m738664n609502j281693K210812Q25741k822020
6051i790876l607950o58913J962475J042443j477577j498366J252196L001207
$$ plain form
6109 986134 1089819 -1524530 -6219515 -9228823 -8147682 -6321604 -8312752 -11684549 -9119730
6100 -9119730 293643 8238240 8631255 6018099 7706343 12344908 12742317 7192154 1063014
6091 1063014 -1925156 -3271959 -3965994 -1448806 5441050 13187955 17826027 18855672
6083 18855672 16837528 11044048 2678237 -2921931 -1550677 4080551 7764615 8056281
6075 8056281 9161949 13785211 19325118 22435927 23491766 23750046 20949225 12086824
6067 12086824 96910 -6706147 -3925758 2925370 4703574 -369690 -5322982 -4151903
6059 -4151903 541346 1624450 -3114214 -8723716 -10005409 -7794597 -6968856 -9790876
6051 -9790876 -13398826 -14057739 -12095264 -11052821 -12530398 -14028764 -12776568 -9775361
6043i775361J931767J322050M659974R713017J0477891M667990l157729o442700
6035A3396899l336774J777686K946213j029511n065382l780013J271280L011386
6027I191784j728634p583170p697762k261657L210262N425912N193697L795705
6019G546137J874906P74317R32327l345l596313o607561m893467J85471M005581
6010B18053N589503O703213N964817J005686m480210m119236L72857O34093m656462
6001G232314p164688l190423l99461m472810q505877m070762M570557P003764
5993h997386K355423j436992q76543L20232K81048J617414M750758O349644N330524
5984I694122M090708L210253P61366k769351m545439m618965n460380o063443
$$ plain form
6043 -9775361 -7843594 -6521544 -1861570 7851447 18329338 22997328 19839599 13396899
6035 13396899 10060125 11837811 14784024 13754513 8689131 4909118 6180398 9191784
6027 9191784 7463150 -120020 -7817782 -10079439 -6869177 -1443265 3750432 7546137
6019 7546137 9421043 10195360 11127687 11124342 7528029 920468 -3972999 -3787528 218053
6010 218053 5807556 12510769 18475586 19481272 15001062 10881826 11254683 11888776 7232314
6001 7232314 67626 -3122797 -3522258 -7995068 -16500945 -20571707 -16001150 -8997386
5993 -8997386 -6641963 -8078955 -8955498 -8635266 -8354218 -6736804 -1986046 4363598 9694122
5984 9694122 13784830 16995083 17756449 14987098 10441659 5822694 362314 -5701129
5976e701129k596739M141008P842275N010982p65998m371898m407787j694557
5968b543843K631577N837541M824956N57498k357056j769273p5971N12486O86709
5959H304624J188187J458331J885875L031418K278858l352559j0328284j0945794
5951f479344m536374L55692j761862n481342l594914J950256M439710L347253
5943a1760925L829082P444067R966426Q081637L192998j541507m092441l547946
5935A1571391n32472K331814K824636J554323J37873j537908l804426m808518
5927G736713k968583n97936j382212m577819n157878k45239P079704J1024195
5919A0910945Q680425K401610k295703j768615J830278K758235j283093o237197
$$ plain form
5976 -5701129 -8297868 -4156860 3685415 8696397 7930399 3558501 -849286 -2543843
5968 -2543843 87734 5925275 10750231 11307729 8950673 7181400 7105429 7617915 8304624
5959 8304624 9492811 10951142 12837017 15868435 18147293 14794734 4466450 -6479344
5951 -6479344 -11015718 -10660026 -12421888 -17903230 -21498144 -19547888 -15108178 -11760925
5943 -11760925 -7931843 -487776 9478650 17560287 20753285 19211778 15119337 11571391
5935 11571391 11038919 13370733 16195369 17749692 17887565 16349657 12545231 7736713
5927 7736713 4768130 4170194 2787982 -1789837 -6947715 -7192954 -113250 10910945
5919 10910945 19591370 21992980 19697277 17928662 19758940 22517175 21234082 14996885
5911A4996885p258311m682360j968131j38878K087049M138762L678829O04566
5903A1458411k517816m104803m547951l571344j68785L907295M045647j524692
5895B975962p887670p922614m29569P956519R629722M053606k038351k419729
5887C917876K152273O208845O426861L598746q76145o268774j0049576q730476
5879c620370k976638J958733K849904J693145N09363j872205m696301k925861
5871i080230M502257R378599M605313m018296n072958J814339O350501M073868
5863A2553393J713412L809438M649820r31055p455141p107157k067783k46062
5855D918865k389059j927513L524995Q258775P035922J681736k744922m105946
$$ plain form
5911 14996885 7738574 3056214 1088083 949205 3036254 7175016 10853845 11458411
5903 11458411 8940595 4835792 287841 -3283503 -3452288 455007 4500654 2975962
5895 2975962 -4911708 -12834322 -13263891 -5307372 4322350 8375956 6337605 3917876
5887 3917876 6070149 12278994 18705855 22304601 21428456 15159682 5110106 -3620370
5879 -3620370 -6597008 -4638275 -1788371 -95226 414137 -1458068 -6154369 -9080230
5871 -9080230 -4577973 4800626 9405939 5387643 314685 2129024 8479525 12553393
5863 12553393 14266805 18076243 22726063 21795008 14339867 7232710 5164927 4918865
5855 4918865 2529806 602293 4127288 12386063 19421985 21103721 18358799 14252853
5847A4252853l422777j980618m33535P24786J373008J785377J761217L29418l114624
5838A1275105p358906r211081n712142K199770Q943851R517772N299502J787093
5830A6740964P08490j203558m550627m334666J487430O170086L414217j667512
5822A6764824N77478Q274070R066687r16028r431344n369022M595828N622406
5814B9184899l779975j0470679o286442J468593K433651k463516n306034m142494
5806F38003l710927n460437m907635M1989M726366M514245J150201j013119j198108
5797e219422p56704J041638M851398P153487L956731k229705m798243k550755
5789A448425r43951k746728l811230r67112K049711J241467k53649K415627O631838
$$ plain form
5847 14252853 10830076 8849458 8415923 9140709 10513717 12299094 14060311 14389729 11275105
5838 11275105 3916199 -5294882 -11007024 -8807254 136597 9654369 14953871 16740964
5830 16740964 17449454 16245896 11695269 7360603 8848033 15018119 18432336 16764824
5822 16764824 17342302 25616372 34683059 33767031 24335687 18966665 23562493 29184899
5814 29184899 25404924 14934245 8647803 10116396 12550047 10086531 4780497 638003
5806 638003 -3072924 -8533361 -13440996 -13399007 -8672641 -4158396 -3008195 -4021314 -5219422
5797 -5219422 -5976126 -4934488 -83090 7070397 11027128 8797423 3999180 1448425
5789 1448425 504474 -2242254 -6053484 -7020596 -4970885 -3729418 -3983067 -1567440 5064398
5780E064398N672395n18266n145807m873734l249831k942136j669861J597924
5772f064918K982588L80959j539781J788331O896409O992189K151217j304857
5764A2282137p68240n70379m084937p785327o305845o15160K480677j136088p248893
5755a3752055p773925n71911P296035Q025761L206564J476606N919949R275379
5747A3102403M689474l894784p538316m906239k200330k306920j767468J100545
5739c721635K834582J846057J767703M253547M788919L16489m560925m581576
5731B943161k194957k428959l482921l47122M660253L955145k627530n862692
5723e385622j98433Q470102J1547649Q199982K981405j704734n629077p016898
$$ plain form
5780 5064398 10736793 10218527 5072720 198986 -3050845 -5992981 -7662842 -6064918
5772 -6064918 -3082330 -2701371 -4241152 -2452821 4443588 11435777 13586994 12282137
5764 12282137 11513897 10943518 6858581 -926746 -7232591 -7847751 -5367074 -6503162 -13752055
5755 -13752055 -21525980 -22097891 -14801856 -6776095 -3569531 -2092925 3827024 13102403
5747 13102403 17791877 13897093 6358777 1452538 -747792 -3054712 -4822180 -3721635
5739 -3721635 -887053 959004 2726707 6980254 11769173 12085662 7524737 2943161
5731 2943161 748204 -1680755 -5163676 -5510798 -850545 3104600 477070 -5385622
5723 -5385622 -5584055 2886047 14433696 22633678 25615083 23910349 18281272 11264374
5715A1264374m406239k90024J809660K474493M289416O017775L820230j949250
5707B3030435o030965n344008k680118j682767j750835n18014J230254N50986
5699F804968k548450m112675j164527M210333P091024N325434J445407j100487
5691A5951027j963999k885040l962346l406146r80204R96388J084740P17779J219468
5682F771667J339989J69314J35956L405477O620423L842178m703194j1013528
5674F568282q494853Q8341O206405N242545K59475k771039j297302K012861K469819
5665A0284534j532065o282491o685146k731784P3278j869678m818852k535573
5657a6097777M924765J0962324J0843575O679355L075802J314312o4240j622628
$$ plain form
5715 11264374 6858135 6568111 8377771 10852264 15141680 21159455 24979685 23030435
5707 23030435 16999470 11655462 8975344 7292577 5541742 5023728 6253982 6804968
5699 6804968 4256518 143843 -1020684 3189649 10280673 15606107 17051514 15951027
5691 15951027 13987028 11101988 7139642 3733496 2753292 3749680 4834420 5552199 6771667
5682 6771667 8111656 8280970 8416926 11822403 18442826 22285004 17581810 6568282
5674 6568282 -1926571 -1838230 4368175 9610720 9870195 7099156 5801854 7814715 10284534
5665 10284534 8752469 2469978 -4215168 -6946952 -6873674 -8743352 -13562204 -16097777
5657 -16097777 -11173012 -210688 10632887 17312242 20388044 21702356 21638116 20015488
5649B0015488k757988l357261l082551n15125M029185O235043K291638m687396
5641A8171033p167287l072296J189505k55549m737534n530289j274408L421855
5633G45030M972027L814226J224457k184192m455788l127601P14674K798705J456644
5624E958182k07995N75772K267713K136443L82805j188975k025523j951740o3052
5615E883630K664121K206362l331053r119511q408332j278287N481529P242749
5607A341208N987327M804952K443985l240220r117553q886749j705397N290559
5599c081888N544758J579007J079893N505281P910365L825373j364145q14789
5591B0183855K359990l06760q287616j1299734m479084M294691O307707L642793
$$ plain form
5649 20015488 17257500 13900239 10817688 10302563 14331748 20566791 22858429 18171033
5641 18171033 11003746 7931450 9120955 8865406 4127872 -1402417 -2676825 745030
5633 745030 5717057 9531283 10755740 8571548 4115760 988159 1702833 4501538 5958182
5624 5958182 5750187 6325959 8593672 10730115 11112920 9923945 7898422 5946682 5883630
5615 5883630 8547751 10754113 7423060 -1696451 -10104783 -11383070 -5901541 1341208
5607 1341208 7328535 12133487 14577472 11337252 2219699 -6667050 -8372447 -3081888
5599 -3081888 2462870 4041877 5121770 10627051 18537416 22362789 20998644 20183855
5591 20183855 22543845 22237085 13949469 2649735 -1829349 2465342 8773049 12415842
5583A2415842K976437M083532K187808k298140m399671k907382r67894J99396
5575A1289928J448715Q73143m054569r951279j0176498m381926J056169K503409
5567a1392908K401659K660847J839294L27443J339984M568241N311171K153171
5559I208902r05528k055826m233365p360652o072340M35680M180407J2144n562005
5550a2352583m268710J310710L109747O81226K442K389161L630351K486686J448090
5541a562880j25214n010357j0057096p763719K097326J0018528R044783L309050
5533d9579P43832K548366M216641L288266J426800M84263K74710N8263k9017N24852
5523A3487397J383859J145398q29530k343867k87855M176492N290255K57309n759666
$$ plain form
5583 12415842 15392279 19475811 21663619 19365479 14965808 12058426 11090532 11289928
5575 11289928 12738643 13611786 9557217 -394062 -10570560 -14952486 -13896317 -11392908
5567 -11392908 -8991249 -6330402 -4491108 -4163665 -2823681 1744560 7055731 9208902
5559 9208902 8303374 6247548 2014183 -5346469 -11418809 -10983129 -6802722 -6790578 -12352583
5550 -12352583 -16621293 -15310583 -12200836 -11519610 -11517168 -9128007 -5497656 -3010970 -1562880
5541 -1562880 -1688094 -6698451 -16755547 -24519266 -22421940 -12403412 -3358629 -49579
5533 -49579 694253 3242619 7459260 10747526 12174326 12658589 12933299 12991562 12962545 13487397
5523 13487397 14871256 16016654 15187124 12843257 12555402 16731894 22022149 22279458 16519792
5514A6519792o121759j678355J626916J973352K382227L325605J652061k538009
5506A7141830m883194m324426m931788p621228p020722p94194M379646K102241
5498e951835l475958l719088J457805M371754K174727P10358M347450Q789973
5490H705186P685781J889667k393960k514109j883616l599439n369300k925973
5482d05763L278829P665039O229250J450925j172435j63504Q41813j100068m078319
5473A2545767m382510j975244p05462l098119o558072o039664m90953M807562
5465e896695M099206j145048l352529J212530P052624O948117J850306j490900
5457I277611j021463j340327m733883o637072k934099L155789N495396L034903
$$ plain form
5514 16519792 10398033 8719678 10346594 12319946 14702173 18027778 19679839 17141830
5506 17141830 12258636 7934210 3002422 -4618806 -11639528 -12433722 -8054076 -5951835
5498 -5951835 -9427793 -13146881 -11689076 -7317322 -5142595 -4432237 -84787 8705186
5490 8705186 16390967 18280634 15886674 13372565 11488949 7889510 2520210 -405763
5482 -405763 2873066 10538105 16767355 18218280 17045845 16882341 17724154 16624086 12545767
5473 12545767 8163257 6188013 5482551 2384432 -4173640 -10213304 -10704257 -5896695
5465 -5896695 -1797489 -2942537 -6295066 -5082536 1970088 8918205 10768511 9277611
5457 9277611 8256148 6915821 2181938 -4455134 -7389233 -4233444 1261952 4296855
5449D296855n60524k801253l782642l363413j184946R84507O55521j376911j470273
5440h603079J789188N390665N700788K650416r52837l075203m073089m841579
5432f014730m567741j622520L146954N826026L949988L37804m27988J342539J222628
5423C192960j524282j817677L059578P675713N332273k082458o286963l531179
5415D017965J664712L785481K650325J134844M44741N6961K9758Q89256K122592
5406A6796635K497738J645336M33986j37396m9082j73842q66203r01855R63538
5397B0208855L187007K297738k098595n441499l866048R6722R04850k024499l921913
5388I342618k220360R3814P7656n93814N68410J979859O15976k737529m841979
$$ plain form
5449 4296855 3736331 935078 -2847564 -6210977 -7395923 -6411416 -5755895 -7132806 -8603079
5440 -8603079 -6813891 -1423226 4277562 6927978 5975141 2899938 -1173151 -6014730
5432 -6014730 -10582471 -12204991 -9058037 -3232011 717977 1055781 627793 1970332 3192960
5423 3192960 1668678 -148999 2910579 10586292 15918565 13836107 7549144 4017965
5415 4017965 5682677 9468158 12118483 13253327 13698068 13755029 13784787 14674043 16796635
5406 16796635 19294373 20939709 21373695 21236299 21187217 21013375 20147172 19245317 20208855
5397 20208855 23395862 25693600 23595005 18153506 14287458 14384180 15289030 13264531 9342618
5388 9342618 7122258 7216072 7293728 6699914 7268324 9248183 9864159 7126630 2284651
5379B284651n239789n947066o494557l925258J422592M655260L176528J056538
5371i011101L085598P211127P431939L054091R051K112622N511692M322620j330580
5362B2397059o095823o490252m059364k016193j447595j240277j18000J783702
5354B713257K899630K113599O86254Q21123J961847J053665k227818l740780j071551
5345E209226J790390K29253l130499j985852L415180O005319K344104k991101
5337A0886020n242613n585548o278320n287941m59778M830536N297965R25700
5329i13979l643398n255203m206652j724509Q90154J797796N75139l39596J106973
5320a1713275L221193L213503J673788J311397K539384L437706K996993J428322
$$ plain form
5379 2284651 -2955138 -8902204 -15396761 -19322019 -17899427 -13244167 -10067639 -9011101
5371 -9011101 -5925503 1285624 8717563 11771654 11780705 13893327 19405019 23727639 22397059
5362 22397059 16301236 9810984 5751620 3735427 2287832 1047555 929555 2713257
5354 2713257 5612887 7726486 8412740 9233863 11195710 12249375 10021557 6280777 5209226
5345 5209226 6999616 7228869 4098370 2112518 5527698 11533017 13877121 10886020
5337 10886020 5643407 57859 -6220461 -11508402 -11968180 -7137644 -1839679 -913979
5329 -913979 -4557377 -9812580 -14019232 -15743741 -14853587 -13055791 -12480652 -12820248 -11713275
5320 -11713275 -8492082 -5278579 -3604791 -2293394 245990 3683696 6680689 8109011
5312H109011j514067n384499p387554n144662k89544L566852N271348N619202
5304B846087M146431K04617l999539n353716l963264j802408J217994N528055
5296a175743P830468M275890k644659n866267k859752J997838M526285M972376
5288A1056436M443311K617487L90918l67063j041418m812702r581193q712988
5280f007212j340971M741622M148424J143329Q95856M21850m399746q411254l486564
5271a2294666P215515J1380470M567072l831162m421729n9051M95237m068027
5263a016341o557833j814716O531562J0367329N796550l079807q222873n383483
5255c379612K062630P210543O877180L480549M00767j809216l644487l647430
$$ plain form
5312 8109011 6594944 1210445 -6177109 -11321771 -11611315 -8044463 -2773115 2846087
5304 2846087 6992518 7197135 3197596 -2156120 -6119384 -7921792 -6703798 -1175743
5296 -1175743 6654725 10930615 8285956 2419689 -440063 1557775 6084060 11056436
5288 11056436 15499747 18117234 18508152 18141089 17099671 12286969 2705776 -6007212
5280 -6007212 -7348183 -2606561 1541863 2685192 3581048 4002898 -396848 -8808102 -12294666
5271 -12294666 -5079151 6301319 10868391 7037229 2615500 2556449 3051686 -1016341
5263 -1016341 -7574174 -9388890 -2857328 7510001 13306551 10226744 2003871 -3379612
5255 -3379612 -1316982 5893561 12770741 16251290 16652057 14842841 11198354 7550924
5247G550924R4900N968083Q928691N837423m87646m228418l372125j561717k335975
5238A6394140l931310k509860J042280J802234j477803l938998j798768K227195
5230G809110L658583K558594J188528r79725m580104n649311n25454N883743M609259
5221A3973223l913166r008877n043363N46598o12690n092754m429057R47784L733337
5212h898965K730038L820214Q088852Q676242K019976n965145q800131p653379
5204e982298o188705l556485J769071O348041O553409N204934O633222Q098797
5196A8879986L658712m979068r283745n712280L70794L360638L200183J163124
5188A0658344l156067p934953q426841l676141J136195K212690J940081K988876
$$ plain form
5247 7550924 7645824 13613907 22542598 28380021 27892375 23663957 20291832 18730115 16394140
5238 16394140 12462830 9952970 10995250 12797484 11319681 7380683 5581915 7809110
5230 7809110 11467693 14026287 15214815 14235090 9654986 4005675 3480221 9363964 13973223
5221 13973223 10060057 1051180 -3992183 -3445585 -4058275 -9151029 -13580086 -12632302 -8898965
5212 -8898965 -6168927 -2348713 5740139 14416381 16436357 10471212 1671081 -5982298
5204 -5982298 -12171003 -15727488 -13958417 -7610376 -1056967 4147967 10781189 18879986
5196 18879986 22538698 17559630 8275885 2563605 2934399 6295037 9495220 10658344
5188 10658344 7502277 -432676 -8859517 -12535658 -11399463 -9186773 -7246692 -4257816
5180d257816L264375J084106j7051K807979N445093K550086l835402p469736o833301
5171g261667m694836j440155M195817R317395Q980634L886927l99760j893168
5163A0691187l643652o578528p393563m791922j829395k79985J859552N114577
5155f851729N904884K073314k871754m009852j012295K163181J912848j453750
5147d145153l493833q017O405234P082807j310555r638513p258800K498090O543085
5138c325655P14595n816612n810742k752915r97591J998020P567812R602053M308032
5129E486997j569124q91293J990123j138470p957245r071505k951020K542988
5121a3558549K564694L36300l15557K20640P18605J029109K33044j717040j251068
$$ plain form
5180 -4257816 -993441 90665 73614 2881593 8326686 10876772 7041370 -428366 -7261667
5171 -7261667 -11956503 -13396658 -9200841 116554 9097188 12984115 12584355 10691187
5163 10691187 7047535 469007 -6924556 -11716478 -13545873 -13825858 -11966306 -6851729
5155 -6851729 -946845 1126469 -1745285 -5755137 -6767432 -4604251 -2691403 -4145153
5147 -4145153 -7638986 -7647003 -1241769 5841038 4530483 -5108030 -12366830 -9868740 -3325655
5138 -3325655 -2611060 -8427672 -14238414 -16991329 -17988920 -15990900 -8423088 1178965 5486997
5129 5486997 3917873 3026580 5016703 3878233 -4079012 -13150517 -16101537 -13558549
5121 -13558549 -10993855 -10657555 -10973112 -10752472 -10033867 -9004758 -8771714 -10488754 -11739822
5112a1739822L893529Q136417L933161n756847r111571j569793P465129P787336
5104C037539J543732k089897m42319J121800o90117j989885J669017P567342Q232369
5095A7959581J121933p143183q337569k837345J236056j044475n756654o954200
5087a1755856m358165r05738K930129P392968R340521N862838K82063j279179
5079G509581J442569L035326Q84513j857265j966555J58382L026332N659852O023303
5070B3916038K322702l090745n085901k135000J999772L573519K527041M91994
5062B4519420j358792j913798p47418N03882J46557p03691l83050n10000l254986
5053A6298124n952991l903450J607292L868606J96735m604732n526889k884296
$$ plain form
5112 -11739822 -7846293 290124 4223285 -1533562 -10645133 -12214926 -4749797 3037539
5104 3037539 4581271 2491374 2049055 3170855 2480738 490853 2159870 9727212 17959581
5095 17959581 19081514 11938331 3600762 763417 1999473 954998 -4801656 -11755856
5087 -11755856 -16114021 -17019759 -14089630 -6696662 2643859 8506697 8788760 7509581
5079 7509581 8952150 11987476 12871989 11014724 9048169 9206551 12232883 17892735 23916038
5070 23916038 26238740 23147995 18062094 15927094 17926866 21500385 24027426 24519420
5062 24519420 23160628 21246830 20499412 21003294 21149851 20446160 20063110 19553110 16298124
5053 16298124 10345133 6441683 8048975 11917581 12114316 7509584 1982695 -901601
5045i01601R76467N154077Q074005O863502J912910j836983j083913J627249K429434
5036B3215147J665350K044372L710087L983788R57347m132366p506649o207550
5028A7729526k289878j933223p390863j2079436q509382P61343O438703N698440
5020a574770M305346N120705L497945k730157p168962m236057J900903L880539
5012B995492J646836J63506N95233L34107o62377R2094K217103K459163K2854
5003I864011k225807k176562j029239r80537k291371l016885j047472L120795
4995B16933N892230M447227O70560j285513q32868r10266k462759l300403k710439
4986b75298k397666k153879J26184K993291J888987l013865n496283k540381J194014
$$ plain form
5045 -901601 74866 5228943 13302948 20166450 22079360 20242377 19158464 20785713 23215147
5036 23215147 24880497 26924869 30634956 34618744 35576091 31443725 23937076 17729526
5028 17729526 15439648 13506425 6115562 -5963874 -14473256 -13711913 -7273210 -1574770
5020 -1574770 2730576 7851281 11349226 8619069 1450107 -2785950 -885047 2995492
5012 2995492 4642328 4805834 5401067 5735174 5072797 5164891 7381994 9841157 9864011
5003 9864011 7638204 5461642 4432403 3451866 1160495 -1856390 -2903862 216933
4995 216933 6109163 10556390 11226950 9941437 9108569 8198303 5735544 2435141 -275298
4986 -275298 -2672964 -4826843 -4700659 -1707368 181619 -2832246 -8328529 -10868910 -9674896
4977i674896J451614O41458J757854K340666P5764j160956K501527P037347N944484
4968A0914862N46846k217059m47195J186866p0743j467831l75442J602761J702532
4959A1375597j94711k252164l177958l073609k671736k123301q16087R58626J292388
4950f82955l36819p77302K589646O543907N572645P1687m314390n125102m682388
4941a141071l429794Q47832O120526O433635J447479j983120m60836J327147m93037
4932H668761l298357m337292m801956m442290o68044L905539K687835k606831
4924d892635j994001N718578Q238610q73786j0612697r424982k175665L87210
4916a5629368j220736k11416L014840L880323K932914K261931j629l313684k100425
$$ plain form
4977 -9674896 -8223282 -7581824 -5823970 -3483304 -3407540 -4568496 -2066969 4970378 10914862
4968 10914862 11461708 9244649 8797454 9984320 9913577 8445746 8070304 9673065 11375597
4959 11375597 11180886 8928722 5750764 2677155 5419 -2117882 -2933969 -1975343 -682955
4950 -682955 -1019774 -1797076 792570 7336477 12909122 12980809 8666419 3541317 -1141071
4941 -1141071 -4570865 -3723033 2397493 8831128 10278607 8295487 7834651 9161798 8668761
4932 8668761 5370404 1033112 -3768844 -8211134 -8879178 -4973639 -2285804 -4892635
4924 -4892635 -6886636 -1168058 7070552 6196766 -4415931 -13840913 -16016578 -15629368
4916 -15629368 -16850104 -17061520 -14046680 -10166357 -7233443 -4971512 -4973141 -8286825 -10387250
4907a0387250K609285P86616q454551j0757282L4703Q448385K045940p102958
4899b2777112l454847N913490P044043N026281J0358449J4268226M480664p481745
4891A3377449l808029O318526J859094j1974029j3737879m730818k903449o357773
4883b1956908o75179N721329m613156j7228696o407326J0959624j438676k7942215
4875f3581203k3169663q489190n6874195j52877753j65192019k5056482J47921194
4868c47319311J87776451R5294050J0684851Q684252L0941903J6953415q157793
4861e142182n495967O657976l27353j0251889O9490J3561626N786220j0327557
4853e469636j0624324j636273j957205o468839j191012P237560O398803L576776
$$ plain form
4907 -10387250 -7777965 -6991349 -15445900 -26203182 -26168479 -17720094 -15674154 -22777112
4899 -22777112 -26231959 -20318469 -13274426 -8248145 2110304 16378530 20859194 13377449
4891 13377449 9569420 15887946 17747040 5773011 -7964868 -12695686 -15599135 -21956908
4883 -21956908 -22632087 -16910758 -21523914 -38752610 -45159936 -34200312 -35638988 -63581203
4875 -63581203 -86750866 -95240056 -152114251 -304992004 -470184023 -495240505 -347319311
4868 -347319311 -159542860 -64248810 -53563959 -44879707 -13937804 3015611 -5142182
4861 -5142182 -10638149 -3980173 -4307526 -14559415 -14489925 -928299 4857921 -5469636
4853 -5469636 -16093960 -17730233 -19687438 -26156277 -27347289 -20109729 -13710926 -10134150
4845a0134150R028126J1814815l26306j3408736p524193Q633242J1274266o77003
4837H680061p890265l377302K101237K659620K661490K361366k033543o268380
4829a105716l186312K983650L047278o20638N81821M300930J473443o130959q507377
4820g163880m517701j351924Q0668M396639R165748P762960K444789N03346J36696
4811A1457341n284992j1586937q170985L180320R562596P005670L971725M142457
4803A4277195J454541n113167p055857j445244K721741r26065o315434n556002
4795g958292j31094M072739N189265L982847O40413k942974l185625o6908K440170
4786B040541K487035J803216R30925r94402j955108P61623M334028L410646r58629
$$ plain form
4845 -10134150 -1106024 10708791 10382485 -3026251 -10550444 -1917202 9357064 8680061
4837 8680061 789796 -2587506 -486269 2173351 4834841 7196207 5162664 -1105716
4829 -1105716 -4292028 -1308378 1738900 1118262 1700083 6001013 7474456 1343497 -7163880
4820 -7163880 -11681581 -13033505 -12952837 -8556198 609550 8372510 10817299 11320645 11457341
4811 11457341 6172349 -5414588 -13585573 -10405253 -842657 6163013 10134738 14277195
4803 14277195 15731736 10618569 3562712 2117468 4839209 3913144 -2402290 -7958292
4795 -7958292 -8089386 -4016647 1172618 5155465 5795878 2852904 -332721 -399629 2040541
4786 2040541 4527576 6330792 7261717 6267315 4312207 5073830 9407858 12818504 11859875
4777A1859875k729557p04502Q59368Q44101J829469K411897j525410p319385p101879
4768a576023l23487M849257M422700L136472L923548L009509j004662l012827
4760A3424487q28806K37070k961493n553237l508912m46386k65691l65027K271802
4751B003807M945739M621276L280741K996263J815780q70918j434217R10748J189988
4742A9459207k177320l017443J798152N144403P43080n895174o364895k743100
4734F946910k221524l574513l7148P158640R166612L097378m203048o597710m930776
4725D804821k070804R48903K401732p4596m859608o727072l551664J180661L458371
4716d489256K856830J148785N9649O10749K077165K207848P74837Q89611L690211
$$ plain form
4777 11859875 9130318 8425816 9285184 10129285 11958754 14370651 12845241 5525856 -1576023
4768 -1576023 -1899510 2949747 7372447 10508919 14432467 17441976 16437314 13424487
4760 13424487 12595681 12832751 9871258 4318021 809109 362723 97032 -267995 2003807
4751 2003807 6949546 11570822 14851563 17847826 19663606 18792688 17358471 18269219 19459207
4742 19459207 17281887 14264444 16062596 21206999 21950079 16054905 9690010 6946910
4734 6946910 4725386 1150873 1113725 8272365 17438977 20536355 16333307 9735597 4804821
4725 4804821 2734017 3682920 6084652 6010056 1150448 -5576624 -9128288 -7947627 -4489256
4716 -4489256 -1632426 -483641 -423992 186757 2263922 4471770 5246607 6136218 9826429
4707I826429M661247o0568o371483p108733k541844N33773n96818j672382N03746
4698b826633L718232N303063N483052M192324J75510m825228o327096l754492
4690A138732j812282k919172l368825M8792M389928N087519K271185q26253k386760
4681A622864j991612L45969K323867N80971l162779k115743N132733R530861L486553
4672A5753684o396810o995162K781118J0183169O101198m099341r906022q458284
4664a036450l775247R07132M530235N547506L182137k51739j930021j852107j023465
4655D297981R78266L442243K721413k587459p319457n866618p29577R71029j563828
4646e656007k152004J648196M348746J675682k400721k072281J433657K342590
$$ plain form
4707 9826429 14487676 14427108 8055625 946892 -1594952 -1061179 -1657997 -3330379 -2826633
4698 -2826633 891599 6194662 11677714 15870038 16045548 11220320 4893224 1138732
4690 1138732 -673550 -3592722 -6961547 -6912755 -2522827 2564692 4835877 4009624 1622864
4681 1622864 -368748 -22779 2301088 2882059 -280720 -2396463 2736270 12267131 15753684
4672 15753684 9356874 2361712 5142830 15325999 21427197 17327856 7421834 -1036450
4664 -1036450 -4811697 -3904565 625670 6173176 9355313 9103574 7173553 5321446 4297981
4655 4297981 5276247 8718490 11439903 8852444 1532987 -4333631 -5063208 -4092179 -5656007
4646 -5656007 -7808011 -6159815 -1811069 -135387 -2536108 -4608389 -3174732 -832142
4638h32142r96849m600545m844966k284443K79390J181462J276214K607102N028098
4629c186679M990674L88859m355256k863777L371297N903455J763523k026481
4621C985615J58262L981303L425869O59504M10139P44649j800233l327388P73432
4612I011152M489713j288769j1826002j2389631r4790J0940722R658028J490661
4604I991084l173032l060148j992175j85895K735932L315113J79728j774638K85248
4595F321217J050056l687857q286665n980573n62260q5268l414897l060330J418179
4586a6288398L109523R2233j470283K324239P471163Q698969N988436K770334
4578A2696216J670953K692872K780485j535100q137730r177821j333682P678819
$$ plain form
4638 -832142 -1828991 -6429536 -11274502 -13558945 -13279555 -12098093 -10821879 -8214777 -3186679
4629 -3186679 1803995 2192854 -2162402 -5026179 -1654882 4248573 6012096 3985615
4621 3985615 4143877 8125180 11551049 12210553 12620692 13365341 11565108 8237720 9011152
4612 9011152 13500865 12212096 386094 -12003537 -12098327 -1157605 8500423 9991084
4604 9991084 6818052 3757904 1765729 1579834 4315766 7630879 7810607 6035969 6321217
4595 6321217 7371273 3683416 -4603249 -10583822 -11146082 -11231350 -14646247 -17706577 -16288398
4586 -16288398 -13178875 -13086642 -14556925 -12232686 -4761523 3937446 9925882 12696216
4578 12696216 14367169 17060041 19840526 18305426 10167696 989875 -343807 7335012
4570G335012Q751165L486203n85549k582006o442272r607803n265378M344384
4562e66244Q676970M776527J117175K505561K669857k900872p714630n416901
4554C147443r50511j618823m345226j868990L580992L551354k252037n214430
4546e970228j346732L595957M232248L029873M319754O540047M899403j033729
4538A8266593o280292o417329k324121J384670J714376K22705K70795K330796
4530I168193L741784K842682R90873k493r1603P5396Q9044j010803l746630n790043
4520F266400l978143J12262P08851l817213p359513m315532K126816M353127O08079
4511e294866l698339l758488j78638L628384N255327M262962J955674N04013P59760
$$ plain form
4570 7335012 16086177 19572380 18986831 16404825 9962553 354750 -4910628 -566244
4562 -566244 8110726 12887253 14004428 16509989 19179846 16278974 8564344 3147443
4554 3147443 2196932 578109 -3767117 -5636107 -2055115 1496239 -755798 -5970228
4546 -5970228 -7316960 -3721003 511245 3541118 7860872 14400919 19300322 18266593
4538 18266593 11986301 5568972 3244851 4629521 6343897 6566602 6837397 9168193
4530 9168193 12909977 15752659 16743532 16741039 16649436 16724832 16813876 15803073 12056443 6266400
4520 6266400 2288257 2400519 3109370 -707843 -8067356 -12382888 -10256072 -5902945 -5294866
4511 -5294866 -8993205 -12751693 -12930331 -9301947 -4046620 216342 2172016 2676029 3435789
4502C435789J370879J115243O45559M80552p20716l717053o303841n752744k248144
4493a1694476J976685N112577N709162K898122r01680o59360M494187Q202558
4485A5137775M845607k117521m898631k525405j286729m556275q181374p210920
4477a0793473k420589J765796K585627O81836j129854j73739L090723M763560
4469a630113K362706j290451k090496r30954j784092m688752n586479k799385
4461a8438016J191653M213834N623666L583071k694393p837962m763269M148628
4453a4972788P981739K557061k981081R4858O962201P060001k60883o245333n936783
4444e741008k586640M2968J995564L219402K105924m75590j041165R48820K034252
$$ plain form
4502 3435789 4806668 5921911 6567470 7048022 6327306 2610253 -3693588 -9446332 -11694476
4493 -11694476 -9717791 -4605214 1103948 4002070 3100390 2441030 6935217 15137775
4485 15137775 19983382 17865861 12967230 10441825 9155096 4598821 -3582553 -10793473
4477 -10793473 -13214062 -11448266 -8862639 -8180803 -9310657 -9484396 -6393673 -1630113
4469 -1630113 732593 -557858 -2648354 -3579308 -5363400 -10052152 -15638631 -18438016
4461 -18438016 -17246363 -13032529 -7408863 -3825792 -6520185 -14358147 -19121416 -14972788
4453 -14972788 -6991049 -4433988 -7415069 -7320211 -358010 6701991 6441108 195775 -5741008
4444 -5741008 -8327648 -8284680 -6289116 -3069714 -963790 -1439380 -2480545 -1531725 502527
4435E02527Q35355N56669L148678N182573K799560k123166m192445j386542L060966
4426H384175M859333K622502j779573m964527m311559r0554M184774M330622p21326
4417A2513867p350534r931661o236554k98263J706394r43185k339919J841776
4409a1038079P555725P336612N17404n922701o511875k692867J690473N429979
4401c635329Q167239P892225L919061l95402j586660q60813j584501l733333m478964
4392C703523l022643j003686J084678L849696N749656M319671J142306J048393
4384A6871594M762769O576310K066551n151549p707717l462632K814993N347536
4376B2117855K317068l774730q189421p468409l125346o22122k592187n007831
$$ plain form
4435 502527 1337882 1894551 5043229 10225802 13025362 10902196 6709751 5323209 8384175
4426 8384175 13243508 15866010 14086437 9121910 4810351 4719797 8904571 13235193 12513867
4417 12513867 5163333 -4768328 -11004882 -11303145 -9596751 -10539936 -12879855 -11038079
4409 -11038079 -3482354 3854258 4371662 -1551039 -8062914 -10755781 -9065308 -3635329
4401 -3635329 4531910 12424135 16343196 15947794 14361134 13500321 11915820 8182487 3703523
4392 3703523 680880 -322806 761872 4611568 10361224 14680895 15823201 16871594
4384 16871594 21634363 28210673 30277224 25125675 17417958 13955326 16770319 22117855
4376 22117855 24434923 20660193 12470772 5002363 1877017 1254895 -1337292 -6345123
4368f345123k923926K166500M791097L674797K415564K642909K182431N92781
4360I197030N53403J945819O49172l603607m241584K242180Q543297N432838m882370
4351A5836178j1690502j0493265p019881o291412n591254j103486M943411Q092302
4343a3317909Q145275P311869N082125j80823o189949q015668m459688M00809
4335a1223959K674876K878617L519028M575598L520271n50720m780811n726571
4327e113671l692486j940955j701291p15883K110587L835712K066383m23744J08013
4318e467335J617129q14896o052615p150735j612200M508019N069407J302354
4310h600872j838044j936226J112978O570186J0624827P858717o94640n874977
$$ plain form
4368 -6345123 -9269049 -7102549 -2311452 1363345 3778909 6421818 8604249 9197030
4360 9197030 9750433 11696252 12345424 8741817 4500233 6742413 15285710 20718548 15836178
4351 15836178 4145676 -6347589 -13367470 -19658882 -25250136 -26353622 -21410211 -13317909
4343 -13317909 -5172634 2139235 7221360 7040537 850588 -7165080 -11624768 -11223959
4335 -11223959 -8549083 -5670466 -2151438 2424160 5944431 5393711 612900 -5113671
4327 -5113671 -8806157 -10747112 -12448403 -13164286 -11053699 -7217987 -5151604 -5575348 -5467335
4318 -5467335 -3850206 -4665102 -10717717 -17868452 -19480652 -14972633 -9903226 -8600872
4310 -8600872 -10438916 -12375142 -11262164 -4691978 5932849 13791566 13096926 7221949
4302G221949j862383N415083P073465L506655O53224j188284n405898r020560
4294F393251n582962K282995M397711j017659l703775K350325R143574P390422
4286B1653882L57990k969593j930296k277830m475398l542087P41107K296081
4278I853856j501044n436833m130181P30045L351509J093668l209364m552893
4270c801237n21749O054687R237281N978487o14845n229223o116440m983596k913494
4261b910129L03519L366823L478722L0048l911620m831910k446682L74187R19805
4252e627237k95785k56182J996925K901012o81250m996274k856182N433342J0438383
4243F056752O155006j337475k901429O93107J630779k175016m914724k725958
$$ plain form
4302 7221949 5359566 10774649 17848114 21354769 22007993 20819709 15413811 6393251
4294 6393251 810289 3093284 7490995 6473336 2769561 5119886 14263460 21653882
4286 21653882 22011872 19042279 17111983 14834153 10358755 6816668 7557775 9853856
4278 9853856 8352812 2915979 -1214202 -484157 2867352 3961020 751656 -3801237
4270 -3801237 -4322986 1731701 10968982 16947469 16332624 11103401 4986961 3365 -2910129
4261 -2910129 -2606610 760213 4238935 4268983 357363 -4474547 -6921229 -6547042 -5627237
4252 -5627237 -5923022 -6179204 -4182279 -1281267 -1962517 -6958791 -9814973 -4381631 6056752
4243 6056752 12211758 10874283 7972854 8665961 10296740 8121724 3207000 481042
4235D81042J385890L139299J822669j073522l194672j389741M438900Q127741
4227A3737606L919177m056468n983704l40501M295515K923739Q24129K982034
4219A8301527N291519K162794l679937n520484k091763K908126O354847N746115
4211B9472744j139902j0861760j3877488o265378L056049M226578L63283N67140
4203E541266L985578K562568k990647l353828K714751N282378K59254l335571
4195A0665749P83092M843119L79209o794174o039224M50551J657249m173478p670355
4186e898262l907842J506300L457403M180872N764488M888451J39538k772951
4178G357997O58135N577529M509531j516707n240466m099599k137303k079687
$$ plain form
4235 481042 1866932 5006231 6828900 5755378 2560706 1170965 5609865 13737606
4227 13737606 17656783 13600315 7616611 7276110 11571625 14495364 15319493 18301527
4219 18301527 23593046 25755840 22075903 16555419 14463656 17371782 23726629 29472744
4211 29472744 28332842 17471082 3593594 -2671784 384265 4610843 4974126 5541266
4203 5541266 9526844 12089412 9098765 5744937 8459688 13742066 14001320 10665749
4195 10665749 11448841 16291960 16671169 9876995 3837771 4288322 5945571 1772093 -5898262
4186 -5898262 -9806104 -8299804 -4842401 -661529 5102959 9991410 10130948 7357997
4178 7357997 8016132 13593661 18103192 16586485 11346019 7246420 5109117 3029430
4170C029430k149888j159589p67813j228388n6710L092558M779245L315849J739323
4161A0594017K497151L083204L79160l905260n825937m645912k175778P61138
4153G61783L497458L705138N37815k618428k526624o21822R65842L988842Q801253
4144A6491257Q965222j98030j0897749j1301193k910228K591871K961623O584415
4136A2287188J2390329Q049083l618774K193979L4688074O0165251L8764143j8718162
4128A46201111n8692142n0631129j8689487p03963j724233l872404j272620k025582
4120H589551n987297l749594M207993O111995j606022q360344o324996q51332
4112g970046O72304L7877K285809O137523O739503L306085j099063m182453n073606
$$ plain form
4170 3029430 879542 -280047 -1047860 -2276248 -2332958 759600 5538845 8854694 10594017
4161 10594017 13091168 16174372 16553532 12648272 6822335 2176423 645 761783
4153 761783 4259241 7964379 8502194 5883766 3357142 2735320 3701162 7690004 16491257
4144 16491257 25456479 25258449 14360700 3059507 149279 2741150 5702773 12287188
4136 12287188 24677517 32726600 29107826 31301805 65989879 126155130 164919273 146201111
4128 146201111 87508969 36877840 18188353 17484390 15760157 11887753 10615133 8589551
4120 8589551 2602254 -1147340 3060653 9172648 7566626 -793718 -7118714 -7970046
4112 -7970046 -7297742 -7259865 -4974056 1163467 7902970 11209055 10109992 5927539 853933
4103H53933l369704p30430n89720l330902m508724r04072M231193N360380K096075
4094h91971j128193j550444n80823j76948k28947k49267q40692k092785k476525
4085a0216595r79227R36232J232500L22126K64497J363963J864821J225984J021541
4076b964158J513414K36635l749675o831440n338728j062182J603294K323240
4068a4269600L891816N913763N383838L427438M552186P766793N916125k753032
4060A9829327r622948p507148j012262J406869M7731M97967J973611j073240p419966
4051b880059r074442l597819K264614L214740J882879J913236J725425q48311
4043e399737l428335k994297p03954J099672L064306O260716Q535090P181690
$$ plain form
4103 853933 -2515771 -3246201 -3835921 -7166823 -11675547 -12579619 -8348426 -2988046 -891971
4094 -891971 -2020164 -3570608 -4151431 -4328379 -4557326 -4806593 -5647285 -7740070 -10216595
4085 -10216595 -11195822 -10259590 -9027090 -8704964 -8440467 -7076504 -5211683 -3985699 -2964158
4076 -2964158 -1450744 -1214109 -4963784 -11795224 -17133952 -18196134 -16592840 -14269600
4068 -14269600 -10377784 -4464021 919817 4347255 8899441 16666234 22582359 19829327
4060 19829327 10206379 2699231 1686969 3093838 3141569 3639536 5613147 4539907 -2880059
4051 -2880059 -11954501 -15552320 -13287706 -10072966 -8190087 -6276851 -4551426 -5399737
4043 -5399737 -8828072 -11822369 -12526323 -11426651 -8362345 -2101629 6433461 13615151
4035A3615151L118570n73546k357869k237522m01581J771039J647370j305331
4027A3276281m028054l703853j102413J402953K595557J651051k149517o677805
4019A264200p254077k754919J440027J49989m220869m838519M18643O659870Q307294
4010h28361M780509j9119j889427j67101J641275R711l564025m097225l65578
4001d499341L068676K938018K150626M158602O381154M237381q26979k914195
3993A4693942l08221K476539J193221l640174q540621r726679m671069M902264
3985c620798J1997262J0681416L478794j746174k110096j959871m382813o311965
3977F025755m449842r54342M38411J87391P30211J146575j387942n758076o697442
$$ plain form
4035 13615151 16733721 16160175 13802306 11564784 11163203 12934242 14581612 13276281
4027 13276281 9248227 5544374 4441961 5844914 8440471 10091522 7942005 1264200
4019 1264200 -5989877 -8744796 -7304769 -7154780 -11375649 -16214168 -15795525 -9135655 -828361
4010 -828361 3952148 3933029 2043602 1876501 3517776 3527487 -36538 -4133763 -4499341
4001 -4499341 -1430665 1507353 3657979 7816581 14197735 18435116 17608137 14693942
3993 14693942 14385721 16862260 18055481 14415307 5874686 -3851993 -8523062 -3620798
3985 -3620798 8376464 19057880 22536674 20790500 18680404 16720533 12337720 6025755
3977 6025755 1575913 621571 1059982 1247373 1977584 3124159 1736217 -4021859 -10719301
3968a0719301j232071P110043J1641728R122437K563079k116765k021150K89748
3960A4637748N22616k064313m582116n194472n350365o516269p066681m543286
3952b0157138O1267K587935P36172k498629j707483M298667R846343Q296925O74462
3943B138521m444579j495120M566569N095473J2770k442730J624345N694095K495070
3934A3244414n315994r157195o372532k424801j792540k052374J127880O706833
3926f036309R072954N119072j831594n640366l812111N65077L123774L120257
3918C680754K950807L807580M166726K919983J594714J984471L193535K760682
3910B7059252j92131m237284p156501p156003l903413L10444J870889n9033k170650
$$ plain form
3968 -10719301 -11951372 -4841329 6800399 15922836 18485915 16369150 14348000 14637748
3960 14637748 15160364 13096051 8513935 3319463 -2030902 -8547171 -15613852 -20157138
3952 -20157138 -20095871 -17507936 -16771764 -19270393 -20977876 -16679209 -6832866 1464059 2138521
3943 2138521 -2306058 -3801178 765391 5860864 5873634 3430904 5055249 10749344 13244414
3934 13244414 7928420 -1228775 -7601307 -10026108 -11818648 -13871022 -12743142 -6036309
3926 -6036309 3036645 8155717 6324123 683757 -3128354 -2563277 560497 3680754
3918 3680754 6631561 10439141 14605867 17525850 19120564 21105035 24298570 27059252
3910 27059252 26867121 22629837 15473336 8317333 4413920 4724364 6595253 6536220 4365570
3901D365570j615827k58143j570224m661846n079349j380810K731164L580417
3893c889048J670968l86628j193726m85872J479201K840686J164542k479591l239612
3884d519080J096739N982652N842263J863178j75158J254932J691849j661122
3876A1376253n234879m332268J01892K778969O75888l784058n621052k401612
3868f440867L039025N067792J586945k904207k798276J135338L408312K271667
3860D365729J265579J732444L25837l302534l305014K711187P193034L144626
3852A4130888l932362l694139K797112N025423J40292l276288k26042L121416
3844A4086300J098437k257110j712425N5293r98067j983719P24217L182495L79573
$$ plain form
3901 4365570 2749743 2491600 921376 -3740470 -8819819 -10200629 -7469465 -3889048
3893 -3889048 -2218080 -2604708 -3798434 -4284306 -2805105 35581 1200123 -1279468 -4519080
3884 -4519080 -3422341 2560311 8402574 10265752 10090594 11345526 13037375 11376253
3876 11376253 6141374 1809106 1910998 4689967 5365855 1581797 -4039255 -6440867
3868 -6440867 -3401842 1665950 3252895 348688 -2449588 -1314250 2094062 4365729
3860 4365729 5631308 7363752 7689589 4387055 1082041 3793228 10986262 14130888
3852 14130888 10198526 6504387 9301499 14326922 14467214 11190926 10964884 14086300
3844 14086300 15184737 12927627 11215202 11270495 10272428 8288709 9012926 12195421 12574994
3835A2574994l996713l309793O24685J292006q52388o92052K58588l491310q316932
3826e908915l869381R161838J6032276P920547n476547j0049115n277863k66058
3818B266782J180329K239763L977763L716424J329334q559O28684Q15546q48254
3809A5297812l250732n205214o129271n275056l153946k131730k769074j877047
3801a4494258K415945O385158N801306K786763K429078M469994M262176J087313
3793A5143475p73693L77194J135015m35048j327901P00615K627703P00228l816406
3784A4331182o674943o135713l670196j137155J72105o14450k412649j818234
3776g960053K966557Q525631R209165L780164l072862o206348n012354k149271
$$ plain form
3835 12574994 8578281 5268488 5893173 7185179 6332791 5640739 5899327 2408017 -5908915
3826 -5908915 -9778296 -616458 15415818 23336365 17859818 7810703 2532840 2266782
3818 2266782 3447111 5686874 9664637 13381061 14710395 14701836 15330520 16146066 15297812
3809 15297812 12047080 6841866 712595 -4562461 -7716407 -9848137 -12617211 -14494258
3801 -14494258 -12078313 -5693155 108151 2894914 5323992 9793986 14056162 15143475
3793 15143475 14369782 14746976 15881991 15446943 14119042 14819657 17447360 18147588 14331182
3784 14331182 7656239 1520526 -2149670 -3286825 -3114720 -3729170 -6141819 -7960053
3776 -7960053 -4993496 3532135 12741300 16521464 13448602 7242254 2229900 80629
3768H0629O22389L080740L903845P42771n485087q989470n188377K542370O163565
3759b526625L331103J8473J105920L270381J179457l316071l984060q9379K755356
3750A744555J129617k665341n776219p507413o122042L82136Q140122Q958567
3742a716018J897758l095455J430552R153900R217382K272388j579097J239069
3734A8820479L525748j71185n702274p071145m844763k811072j950054j867029
3726b071295l334061n304496m049634N21440K606087n68778k983642N41413M334807
3717a0308159M05811o966724o311793K584398P493934K879786k044502O26241
3709a1641008M869843K378996k567264n25385O959757R902769N268946r04196
$$ plain form
3768 80629 703018 3783758 7687603 8430374 2945287 -6044183 -11232560 -8690190 -2526625
3759 -2526625 804478 822951 1928871 5199252 6378709 3062638 -921422 -1010801 1744555
3750 1744555 2874172 208831 -5567388 -13074801 -19196843 -18814707 -10674585 -1716018
3742 -1716018 181740 -2913715 -1483163 7670737 16888119 19160507 17581410 18820479
3734 18820479 22346227 22175042 16472768 9401623 4556860 1745788 -204266 -2071295
3726 -2071295 -5405356 -10709852 -14759486 -14238046 -11631959 -12200737 -15184379 -14642966 -10308159
3717 -10308159 -9902348 -16869072 -23180865 -20596467 -13102533 -10222747 -12267249 -11641008
3709 -11641008 -6771165 -4392169 -6959433 -7484818 -525061 9377708 14646654 13742458
3701A3742458n014535q902343j1534508q269678m22739L764829R41052k397740
3693a8093204j94347M960878P509336O302866K605654k953077p392765n559648
3685a2814307K048512P336507N294495R17774K64405Q65183k023325n236440k587720
3676e934916L561206M892312j16837m761809n246709m798429n452231l764956
3668b1622369K132155P482925P044260K350961p73303M01512L293844L778729
3660D088714O00457l213432l288980P07317L855888K263285j192849p86689L740548
3651F774259O967795N328385O34721l709212n724026m098645R76616N608703N211206
3642A7969802N83176l074785l651061l808761m382085j967455M224274Q475986
$$ plain form
3701 13742458 8727923 -174420 -11708928 -19978606 -20401345 -16636516 -15695464 -18093204
3693 -18093204 -18287551 -13326673 -5817337 485529 3091183 138106 -7254659 -12814307
3685 -12814307 -10765795 -3429288 1865207 2782981 3047386 3912569 1889244 -3347196 -5934916
3676 -5934916 -2373710 2518602 2401765 -2360044 -7606753 -12405182 -17857413 -21622369
3668 -21622369 -19490214 -12007289 -4963029 -2612068 -3385371 -2983859 309985 4088714
3660 4088714 4689171 1475739 -1813241 -1105924 2749964 5013249 3820400 3033711 6774259
3651 6774259 13742054 19070439 19705160 15995948 10271922 6173277 7149893 12758596 17969802
3642 17969802 18552978 15478193 11827132 8018371 3636286 1668831 5893105 14369091
3634A4369091N791243o15596l534042j223598J543696P49160k419424m499279
3626A0161251m287149l293081k784154j763920J077591L696764J609830n576831
3618a159699j1132975q493661o5112N713282N191013K229041M50862r07084k051637
3609a0225970n7342N398964Q944816O302326L72025l296599l755193l575915l579784
3600c472672k724004j055078P76405K995705M834140L821599J24837j473997J993577
3591E820512O079051M667349p31929l066137l02352J969408o28872n066990n972336
3582B767704l188415j055877j928985l516549k734547j3368J652141J206846R69271
3573e841779K621823L881842J811350j783745j971650K191318N974576N392312
$$ plain form
3634 14369091 20160334 19544738 16010696 14787098 16330794 17079954 14660530 10161251
3626 10161251 5874102 2581021 -203133 -1967053 -889462 2807302 4417132 -1159699
3618 -1159699 -12292674 -20786335 -20851447 -15138165 -9947152 -7718111 -7267249 -8174333 -10225970
3609 -10225970 -10283312 -4884348 4060468 10362794 10734819 7438220 3683027 107112 -3472672
3600 -3472672 -6196676 -7251754 -6475349 -3479644 1354496 5176095 5300932 3826935 5820512
3591 5820512 11899563 16566912 15834983 12768846 12466494 14435902 13807030 8740040 2767704
3582 2767704 -420711 -1476588 -3405573 -6922122 -9656669 -9670037 -8017896 -6811050 -5841779
3573 -5841779 -3219956 661886 2473236 689491 -1282159 909159 6883735 12276047
3565A2276047J702766j920443m517310n996255n044182j272321K748450L986899
3557A963651K029462j276068l081543n22554N686035Q612674J801091j0069047
3549E143701j4096567n875069L941853M674483j42183o46571L814046O382818
3541C196511N351214M573372L521668k113924r784733j0526805k332176N895059
3533b219814O997885M348321M025752N180347L349292j558665n722235o833201
3525G567682n201021j861905J415442K375113Q58697p00968o80588J20267R45133
3516D837852K042432K404336K49041l111448l889108j780133r80238l208578m360839
3507g796683j259155K575494K159549j200273k231640J89005K198503J618329
$$ plain form
3565 12276047 13978813 12058370 7541060 1544805 -3499377 -4771698 -2023248 1963651
3557 1963651 3993113 2717045 -364498 -887052 4798983 13411657 15212748 5143701
3549 5143701 -8952866 -14827935 -10886082 -6211599 -6353782 -7000353 -3186307 3196511
3541 3196511 8547725 13121097 16642765 14528841 4744108 -5782697 -8114873 -2219814
3533 -2219814 4778071 9126392 13152144 18332491 21681783 20123118 14400883 7567682
3525 7567682 2366661 504756 1920198 4295311 5154008 4453040 3772452 3892719 4837852
3516 4837852 6880284 9284620 9533661 6422213 2533105 752972 -227266 -3435844 -7796683
3507 -7796683 -9055838 -6480344 -4320795 -5521068 -7752708 -7563703 -5365200 -3746871
3499c746871Q13743K060359L784759L403253J596400J176216K422486K242474
3491A3752819j105465m737593m968833k845185k139415k449363M46591O155789
3483B109345P837436K460865l134410k148938J647742Q94785k499110j322876
3475E844839K858559J263507o149562q255332K17939R833689J0021801K747592
3467A8383032l421016n278207m418237j306675K959242M118054O69519k131443
3459I574269k13166K292451L36151l015833k417005l54834k674798p538590q282916
3450a2294271n147642m367317o180810l646499N150426J2597434J2196548O597396
3442D905265J804751o69351k452438l894692m360620l632751j004281L735772
$$ plain form
3499 -3746871 -2933128 -872769 2911990 6315243 7911643 9087859 11510345 13752819
3491 13752819 12647354 7909761 2940928 95743 -2043672 -4493035 -4046444 2109345
3483 2109345 9946781 12407646 9273236 7124298 8772040 9666825 7167715 5844839
3475 5844839 8703398 9966905 3817343 -4437989 -4220050 5613639 15635440 18383032
3467 18383032 14962016 9683809 5265572 3958897 6918139 11036193 11705712 9574269
3459 9574269 9361103 11653554 11989705 8973872 6556867 6202033 3527235 -4011355 -12294271
3450 -12294271 -17441913 -21809230 -27990040 -31636539 -26486113 -13888679 -1692131 4905265
3442 4905265 6710016 6040665 3588227 -306465 -4667085 -8299836 -9304117 -5568345
3434e568345P332505N350965j024862n023297l323341o17169k172549n875864
3426a0921957n680667l56321N282635O661954L598970j331047n716245q134315
3418a6596993p855560m874487k72144L863164N812664O012392O351945O972133
3410e86886N654382J976764m18452J197063L529453J515109l483415m959279r41605
3401C483134L038674K283635q17626j700316n35540m08401j542403j566214r2711
3392B142232P74363J08309o72801l45376P67515K159588L829961N144653M665602
3383A8574046J966124j328704l103482k904194j988602j595256j799796j899724
3375E920412j095519J224947M602421O395803L423803l575186q935729q394802
$$ plain form
3434 -5568345 1764160 7115125 6090263 1066966 -2256375 -2873544 -5046093 -10921957
3426 -10921957 -16602624 -16958945 -11676310 -5014356 -1415386 -2746433 -8462678 -16596993
3418 -16596993 -24452553 -29327040 -29599184 -25736020 -19923356 -13910964 -7559019 -586886
3410 -586886 5067496 7044260 6625808 7822871 11352324 12867433 9384018 4424739 3483134
3401 3483134 6521808 8805443 7987817 6287501 5751961 5343560 3801157 2234943 2142232
3392 2142232 2916595 3024904 2352103 2006727 2774242 4933830 8763791 13908444 18574046
3383 18574046 20540170 19211466 16107984 13203790 11215188 9619932 7820136 5920412
3375 5920412 4824893 6049840 10652261 17048064 20471867 16896681 7960952 -433850
3367d33850m994724m649941o767379m970578K099023P381057N798242J550513
3359d987637J73168m61577m193311o866507j960180O777894Q688205K203283k691473
3350c318135j37195L377259J073610k665529r3611O769294R123547M552494n89542
3341A8092192j414130n82628k820492p854220j0964369q450887j248392N819869
3333i423057P968582M510785p60205l523911k871533j073762k78665j94358J062155
3324d583969L961854N791585L271655k534003o107184m014643O61387K910974
3316f42344K333948J575771P91165j367391l020282j199192K095503K179649k77570
3307B469257k99652K089033J426565k811733l945758M35454L195886r06148o147100
$$ plain form
3367 -433850 -5428574 -10078515 -16845894 -21816472 -19717449 -12336392 -6538150 -4987637
3359 -4987637 -4814469 -5276046 -9469357 -16335864 -18296044 -11518150 -2829945 -626662 -3318135
3350 -3318135 -3455330 -78071 995539 -1669990 -1763601 5005693 14129240 18681734 18092192
3341 18092192 16678062 16095434 13274942 5420722 -5543647 -13994534 -15242926 -9423057
3333 -9423057 -1454475 3056310 2296105 -1227806 -4099339 -5173101 -5451766 -5646124 -4583969
3324 -4583969 -622115 5169470 8441125 5907122 -200062 -4214705 -3553318 -642344
3316 -642344 1691604 3267375 4058540 2691149 -329133 -1528325 567178 2746827 2469257
3307 2469257 2169605 4258638 5685203 2873470 -1072288 -636834 2559052 1652904 -4494196
3298d494196m986627K3118J257945j674458k679647O91546N096488P239477N660786
3289F134432o51537r128117j2119934n622836L235900N066979J831671K582527
3281h670915P582236P625151J8824n908832l136366K702586K939121j536178l701610
3272b085983j135428L007521O150674P671318O496051K288031k412167m924585
3264A5055432n742819o212646n264915j872707J493960J771064Q5647j02855J645336
3255H55497K989131L255913L486745K553021k083183q779385j1237178o165431
3247a5124870J486981M146027R75182j765410M12410M506295M957971J728775
3239A323361m194K299490M793273K916093k077121n054364l931853j570497j111542
$$ plain form
3298 -4494196 -9480823 -9457705 -8199760 -9874218 -12553865 -11862319 -6765831 473646 6134432
3289 6134432 5482895 -3645222 -15765156 -21387992 -18152092 -13085113 -11253442 -8670915
3281 -8670915 -1088679 6536472 6555296 646464 -2489902 212684 3151805 1615627 -2085983
3272 -2085983 -3221411 -213890 5936784 13608102 20104153 22392184 19980017 15055432
3264 15055432 9312613 3099967 -2164948 -4037655 -2543695 -772631 -686984 -789839 855497
3255 855497 3844628 7100541 10587286 13140307 11057124 2277739 -8959439 -15124870
3247 -15124870 -13637889 -9491862 -8516680 -10282090 -9869680 -5363385 -405414 1323361
3239 1323361 1319167 3618657 8411930 11328023 9250902 4196538 264685 -1305812 -2417354
3230b417354k201359k383132k93946L211118N955236O145331L895518Q20098k210867
3221A0520643n513365p982252o516249m14951N797385P179831M404138J536533
3213I011713l26751k620862m050980j874450J506389q2287o688215r989233m371122
3204a9485798N047180R635466P951195M388517J045932l084994o945772p439705
3196h887979m380612q93104J024827J718956J391502K91791N93148L648121N796391
3187C03041J961107o039708j0006681n840891J386357N247373N914625O530079
3179e44698O107876J820579m009252n607065k338901J72367j278780l063642j434232
3170a0175748J325284J513660Q03202K906316N840266M097967j700338m155052
$$ plain form
3230 -2417354 -4618713 -7001845 -7295791 -4084673 1870563 8015894 11911412 12731510 10520643
3221 10520643 5007278 -2974974 -9491223 -9906174 -4108789 3071042 7475180 9011713
3213 9011713 8684962 6064100 2013120 138670 1645059 1562772 -5125443 -15114676 -19485798
3204 -19485798 -14438618 -4803152 3148043 7536560 8582492 5497498 -1448274 -8887979
3196 -8887979 -13268591 -14161695 -13136868 -11417912 -10026410 -9734619 -9141471 -5493350 303041
3187 303041 2264148 -3775560 -13782241 -19623132 -18236775 -12989402 -7074777 -544698
3179 -544698 5563178 7383757 3374505 -2232560 -4571461 -4399094 -5677874 -8741516 -10175748
3170 -10175748 -8850464 -7336804 -6533602 -3627286 2212980 6310947 4610609 455557
3162D55557n7257M236612K209221l278197n180107l102657k328516m011131l633100
3153a4689575M40640L748447L257520K289104M454156P189847N677983L15064
3145A2683186m075984m860350l448634j408269J455991M904462P202238P161073
3137A9613713N280919K166224k424842p812975j0911150q403089r52143N883647
3129B440304O561961J625737k706534j844714K139682M349571L587640J963275
3121A8116922n411l199086n542398l491623J208812K145094j940730l819265J488443
3112D960758P872958O176929k406042q110156o340636k281897j176741j093198
3104b398025J616158N086113M769774O95705k551526k340006r77678j689966l992833
$$ plain form
3162 455557 398300 4634912 6844133 3565936 -1614171 -4716828 -7045344 -11056475 -14689575
3153 -14689575 -14248935 -10500488 -7242968 -4953864 -499708 6690139 12368122 12683186
3145 12683186 8607202 3746852 298218 -1110051 345940 5250402 12452640 19613713
3137 19613713 24894632 27060856 24636014 16823039 5911889 -2491200 -3443343 2440304
3129 2440304 9002265 10628002 7921468 6076754 8216436 12566007 16153647 18116922
3121 18116922 18111511 14912425 9370027 5878404 7087216 9232310 7291580 3472315 4960758
3112 4960758 12833716 19010645 16604603 8494447 2153811 -128086 -1304827 -2398025
3104 -2398025 -781867 4304246 9074020 9769725 7218199 4878193 3900515 2210549 -1782284
3095a782284m492335j488320K630590M100611K157719m06500r14188M21099J779472
3086B005864K165793J572711K26063r38863k84001K461070M983178M607853J053672
3077A7853340l788877p446784p474593k819075L665228O423311L431746q04375
3069I039921j252593Q27272O72435k187794l451587p71867L376690N641293M702655
3060A6596425K36959o770113j2147951j1400838n730031j167347k83897Q85664
3052a9781129N400429R362081P251440M27850m191268k969831P20268J904173
3044a875987M06405M74465M686987R414722P941764q83473r080494p842804J317954
3035D559539P878943N235469k286501p044207p681514p337101o305731k172900
$$ plain form
3095 -1782284 -6274619 -7762939 -5132349 -1031738 1125981 719481 -194707 226392 2005864
3086 2005864 4171657 5744368 5970431 5031568 4747567 7208637 12191815 16799668 17853340
3077 17853340 14064463 6617679 -856914 -3675989 -10761 6412550 9844296 9039921
3069 9039921 7787328 8614600 9287035 7099241 3647654 2875787 6252477 11893770 16596425
3060 16596425 16833384 10063271 -2084680 -13485518 -19215549 -20382896 -20666793 -19781129
3052 -19781129 -14380700 -5018619 2232821 2660671 -1530597 -4500428 -3780160 -1875987
3044 -1875987 -1469582 -995117 3691870 13106592 21048356 20164883 11084389 3241585 4559539
3035 4559539 12438482 17673951 15387450 8343243 661729 -6675372 -12981103 -15154003
3027a5154003M008042P019402M022730j438092l406553M461M895096N817631J674781
3018G443495k892161l139803n97117r16712n190654p690175m256151J484643L882380
3009a1872255L292193L442518L944416J617722k297621k921046J88034K031543
3001b574496M92177k34677L111249P281132P462490L952776M80283j289735k325537
2992A6355662l386047m479059n698079o456153n287081j933780K043965N680325
2984c160247R021483J0179313N925086k349565p364333m567530J234274K408844
2976A1327325j116046l407449k446096j978867l696583m203762j487010J274409
2968e734079J174515L35951J844458M393701M671351K798039J802678K814000
$$ plain form
3027 -15154003 -11145961 -4126559 -103829 -1541921 -4948474 -4944013 -48917 5768714 7443495
3018 7443495 4551334 1411531 814414 -102298 -5292952 -12983127 -17239278 -15754635 -11872255
3009 -11872255 -8580062 -5137544 -1193128 424594 -1873027 -4794073 -4606039 -2574496
3001 -2574496 -2082319 -2316996 794253 8075385 15537875 19490651 19970934 18681199 16355662
2992 16355662 12969615 8490556 2792477 -3663676 -8950757 -10884537 -8840572 -3160247
2984 -3160247 5861236 16040549 21965635 19616070 12251737 7684207 8918481 11327325
2976 11327325 10211279 6803830 4357734 2378867 -1317716 -5521478 -7008488 -5734079
2968 -5734079 -4559564 -4223613 -2379155 2014546 6685897 9483936 11286614 14100614
2960A4100614L677042J991723k178742o130467o373023k115887K635418K920238
2952H526916m43426j355542K663071O197382L856506j461904l061768k44103K205012
2943A6882144K440361K837647L353722Q14829l792737m293492J260122O089304
2935B5591900L885629k290273n241166l952500l025139m188273m328371j481251
2927D970556K091658L164770N56507m660521q837575p065026R36497P499663N043667
2918C700196k881935n034855J709547P061265J817795q510600j1152662l576718
2910a6867967M176542M167005P9180m90835K551498L157734o52498l516179n72313
2901g967833N337987P228293L213699j163221m76925L635313N443646L217929
$$ plain form
2960 14100614 17777656 19769379 17590637 11460170 5087147 2971260 5606678 8526916
2952 8526916 8083490 6727948 9391019 15588401 19444907 17983003 14921235 14677132 16882144
2943 16882144 19322505 22160152 25513874 26328703 22535966 18242474 19502596 25591900
2935 25591900 29477529 27187256 21946090 17993590 14968451 10780178 6451807 4970556
2927 4970556 7062214 10226984 10783491 6122970 -2714605 -9779631 -8843134 -1343471 3700196
2918 3700196 818261 -4216594 -2507047 4554218 6372013 -2138587 -13291249 -16867967
2910 -16867967 -12691425 -8524420 -8445240 -8936075 -6384577 -3226843 -3879341 -7395520 -7967833
2901 -7967833 -2629846 4598447 7812146 6648925 6172000 9807313 15250959 18468888
2893A8468888O82083M43688J43572k666441n137991k583066L958916P846381N132720
2884B6288750o85978l733975k828091j236128j298165k196032k472010k012381
2876I825990j092651M50687K225917K907711J669565j040603m457170p720325
2868B769121q887467o157796j260357J226934K77420J093194P346920J3305219
2860I713188R969272j261183q348972m494429K656554K590760l034042m169900
2852C621248K052991P835489O613838J004660k986480l755273l341591l360636
2844G684246m624580p551306j0393490r675486m472752J971329O166681P292197
2836a3603161N451873Q26395l835282l949089J152020O690046Q992077R590386
$$ plain form
2893 18468888 19150971 19594659 19738231 17071790 11933799 9350733 13309649 21156030 26288750
2884 26288750 25602772 21868797 19040706 17804578 16506413 14310381 11838371 9825990
2876 9825990 8733339 9184026 11409943 14317654 15987219 14946616 10489446 2769121
2868 2769121 -6118346 -12276142 -13536499 -12309565 -12032145 -10938951 -3592031 9713188
2860 9713188 19682460 18421277 10072305 5577876 8234430 10825190 7791148 3621248
2852 3621248 5674239 13509728 20123566 21128226 18141746 14386473 11044882 7684246
2844 7684246 3059666 -4491640 -14885130 -24560616 -29033368 -27062039 -20895358 -13603161
2836 -13603161 -8151288 -7324893 -11160175 -15109264 -13957244 -7267198 1724879 11315265
2828A1315265J0058117P650337P45778n497383m931013O13983M054234K958565
2820B6967883O50099j263103m497160p979297p167784j690680K165921j36423
2812G049456m822587n144552k79105M400402M104941q14461n824284o169608j189109
2803h688907M470832N584538K577660O12092K171000L958482K435905j040015
2795A2081587k790131j727506N61883K235356J630866k076898o292274n824007
2787b201124O60997P346959P872902L332550j10713j18792j46897k655873m944510
2778I035499l505609M60507K261142o10551n506369p222102l286057L207807O512481
2769A346748M346141J29386j543840j04305J777790K515020K659104K496249J403392
$$ plain form
2828 11315265 21373382 29023719 29769497 24272114 19341101 19955084 24009318 26967883
2820 26967883 27617982 26354879 21857719 13878422 6710638 5019958 7185879 7049456
2812 7049456 2226869 -2917683 -3196788 1203614 5308555 4494094 -1330190 -7499798 -8688907
2803 -8688907 -4218075 1366463 3944123 4556215 6727215 10685697 13121602 12081587
2795 12081587 9291456 7563950 8125833 10361189 11992055 9915157 3622883 -2201124
2787 -2201124 -1540127 5806832 13679734 17012284 16901571 16782779 16635882 13980009 9035499
2778 9035499 5529890 5990397 8251539 7640988 2134619 -5087483 -8373540 -5165733 1346748
2769 1346748 5692889 5822275 4278435 4174130 5951920 8466940 11126044 13622293 15025685
2760A5025685k52449r32998k71560J49796r20502k566070k812699j002158J187929
2751G604974J110974j728733l981802j854408L059915M268924j013073o716017
2743G50754n307641J757408O054943L823829j93011j277904j125567k977203n373464
2734c867856m902459j995268J79022O88594J101347K125150L091466L646323L293283
2725C359602O73892l891984o664877m501166N32800L751932L895109L111409K156654
2716B423371J5349k054046r74422K698838M189403J123152k959816l767185j684317
2707i89673K72735J090067J636773J962933J360200m8748j547929k465128j609535
2698c38305J831720N615781N301742k37515o450022q237611n258512n19083L275733
$$ plain form
2760 15025685 14773236 13840238 13568678 13718474 12797972 10231902 7419203 6417045 7604974
2751 7604974 8715948 6987215 3005413 1151005 4210920 8479844 7466771 750754
2743 750754 -4556887 -2799479 3255464 7079293 6886282 5608378 4482811 1505608 -3867856
2734 -3867856 -8770315 -10765583 -10586561 -9897967 -8796620 -6671470 -3580004 66319 3359602
2725 3359602 4033494 141510 -6523367 -11024533 -10491733 -6739801 -2844692 266717 2423371
2716 2423371 2438720 384674 -589748 2109090 6298493 7421645 4461829 694644 -989673
2707 -989673 -716938 373129 2009902 3972835 5333035 5284287 3736358 1271230 -338305
2698 -338305 1493415 7109196 12410938 12173423 5723401 -2514210 -7772722 -8291805 -5016072
2689e016072L940895K71364m528348l956712K919822P845300M294029k005967
2681C764311j128963N374263O494594j019781p906097p133949l396275l274306
2673h226203m881889l746927j619920j944041k437063n7614J653493j331081m427286
2664b7018531j007666N110908M569772j430412j720668O702274J2836837Q327372
2656F369886l99757l192779q73869p24487l447658l708962l13927K674751L486303
2647a30499L808301L091281j112089o620972p093417q12080O294502Q399557N960738
2638A1785322K154570k148247o579227q151933m230635K897223P779224P532939
2630A1039236L649985r08726m068545m784141l227026q92766R45850K450804L567142
$$ plain form
2689 -5016072 -1075177 -803813 -5332161 -9288873 -6369051 1476249 5770278 3764311
2681 3764311 2635348 8009611 14504205 13484424 5578327 -1555622 -4951897 -8226203
2673 -8226203 -13108092 -16855019 -18474939 -20418980 -22856043 -22913657 -21260164 -22591245 -27018531
2664 -27018531 -28026197 -22915289 -18345517 -19775929 -21496597 -14794323 -1957486 6369886
2656 6369886 5970129 2777350 1903481 1178994 -2268664 -5977626 -6291553 -3616802 -130499
2647 -130499 3677802 6769083 5656994 -963978 -8057395 -8869475 -2574973 5824584 11785322
2638 11785322 13939892 11791645 5212418 -2939515 -7170150 -4272927 3506297 11039236
2630 11039236 14689221 13780495 9711950 4927809 1700783 808017 1753867 4204671 7771813
2621G771813K503822j555412n187976l937228Q68390K683809j086420m776920
2613b716122k839708J340227O79439l813560l856386L041369R039891P672753
2605H547903L099950K259301L588635J108938l985433m749898m89298J634172
2597A1014270j690260m891141l251424k78644p76469k642263j163694L003020
2589f76605N894761O830494P180508N390840m79799o921413q082278m370754k004421
2580B761333l471651m174396l44960M628304M859575l6939m655260m312621J32115
2571d614500L685985K646760j463452l790229j892221K080581N333810P522333
2563I509067Q230579N262758q71335m325691j145453L373580J018577o855205
$$ plain form
2621 7771813 10275635 8720223 3532247 -404981 463409 3147218 2060798 -2716122
2613 -2716122 -5555830 -4215603 -3536164 -7349724 -11206110 -8164741 875150 8547903
2605 8547903 11647853 13907154 17495789 18604727 14619294 9869396 9380098 11014270
2597 11014270 9324010 4432869 1181445 902801 126332 -2515931 -3679625 -676605
2589 -676605 5218156 12048650 19229158 24619998 24140199 17218786 9136508 4765754 2761333
2580 2761333 -710318 -4884714 -5229674 -601370 4258205 4221266 -433994 -4746615 -4614500
2571 -4614500 -928515 1718245 254793 -3535436 -5427657 -3347076 1986734 9509067
2563 9509067 17739646 23002404 22131069 17805378 16659925 20033505 21052082 14196877
2555A4196877j0352332m946239K796018N102828J798503l376535q444827j1201615
2547a4427322p780707J280074Q155264O758342J293851J04371L820707N842209
2539E046789K879969j411552l028358j971907N98977M238905O767506M634795
2531A7755124j820055o865165n862628j146157J050235j710649n658681n763360
2523a0021336j411224L353705M566836K505366P37389J577310L681208M303464
2515I292718K618138J39070j181200p06735K57697m49190l193867n641504o127030
2506d991903o502959q442574q512194k467796N750031O702660n07287m782427
2498b3754449J343542J0072079R879577K472652j570711J14207M64614k583785
$$ plain form
2555 14196877 3844545 -1101694 1694324 6797152 8595655 5219120 -3225707 -14427322
2547 -14427322 -22208029 -20927955 -12772691 -6014349 -4720498 -4616127 -795420 5046789
2539 5046789 7926758 6515206 3486848 1514941 2113918 6352823 13120329 17755124
2531 17755124 15935069 9069904 3207276 2061119 3111354 1400705 -4257976 -10021336
2523 -10021336 -11432560 -8078855 -3512019 -1006653 -269264 1308046 4989254 9292718
2515 9292718 11910856 12049926 10868726 10161991 10419688 9970498 6776631 1135127 -4991903
2506 -4991903 -11494862 -19937436 -28449630 -30917426 -25167395 -18464735 -18972022 -23754449
2498 -23754449 -22410907 -12338828 -2459251 13401 -1557310 -1443103 -978489 -3562274
2490c562274k692543K137906M931832J968734n55545K163447M576772M22575o015302
2481C375602o625210j997461J369585K331507M555223P199545N425228j49341
2473A5484678k976763o62980J735684J86395l077051m996192o260405p316967
2465g883601n220512J262996P263015P205358K529638j86574K046404N342211
2457A2358935M581572k33746m295212l634991M17771K738275M04137l713208m542891
2448D080642j323055J521875J93856l864947o130127m294232k33408K550673K507738
2439d990985J193636J083160K360602K757346J047249q66985q86968j83447j224399
2430B89209l360548l547964j355748M738j594708m183389m486545j662539K487530
$$ plain form
2490 -3562274 -6254817 -4116911 814921 2783655 2228110 4391557 8968329 9390904 3375602
2481 3375602 -3249608 -5247069 -3877484 -1545977 3009246 10208791 15634019 15484678
2473 15484678 12507915 11844935 13580619 13767014 10689963 5693771 -566634 -7883601
2465 -7883601 -13104113 -11841117 -4578102 2627256 5156894 4970320 7016724 12358935
2457 12358935 16940507 16706761 12411549 8776558 9194329 11932604 12336741 8623533 4080642
2448 4080642 2757587 4279462 4473318 608371 -5521756 -9815988 -10049396 -7498723 -4990985
2439 -4990985 -3797349 -2714189 -353587 2403759 3451008 2584023 1697055 1513608 289209
2430 289209 -3071339 -6619303 -7975051 -7970313 -9565021 -13748410 -18234955 -19897494 -17409964
2421a7409964N108054L824676r32831m925362m226260o09660O14379j311857j127349
2412b0996174L940586Q884283P767187K235785j329515p69831N51394J29478q40192
2403d26999j013919j077499j432462q32447J500964M471111O517721O794795M734657
2394A9235922K34192n252127r051939r084900n085974R60332N008716L649738
2386F13960j581062m526034j399911M291777O395867L697010k29090k544421k509418
2377B208678O39380O028738Q603834M125092l459889n747602j587306J425132
2369A2236057j269391m875855l964823r19065p37681k697909k970212j647842
2361f846721j256814j169171O04974K246854O67205k313614k236709M40687R82165
$$ plain form
2421 -17409964 -12301910 -8477234 -9410065 -14335427 -18561687 -19171347 -18556968 -19868825 -20996174
2412 -20996174 -17055588 -8171305 -404118 1831667 502152 -267679 283715 413193 -426999
2403 -426999 -1440918 -2518417 -3950879 -4783326 -3282362 1188749 7706470 14501265 19235922
2394 19235922 19470114 14217987 5166048 -3918852 -9004826 -8044494 -3035778 613960
2386 613960 -967102 -5493136 -6893047 -2601270 3794597 7491607 7262517 4718096 2208678
2377 2208678 2848058 8876796 17480630 21605722 18145833 12398231 10810925 12236057
2369 12236057 10966666 6090811 2125988 1206923 469242 -2228667 -5198879 -6846721
2361 -6846721 -8103535 -9272706 -8667732 -6420878 -5753673 -8067287 -10303996 -9863309 -8881144
2352h881144j650067l310706j702843O63700J628997K197069K642031J016339
2344g396624k139953k506296J389936M418028J672160l981347n460368q37348
2336a4841812M860815O536969M186025R51072j159449k415627l539020m030031
$$ plain form
2352 -8881144 -10531211 -13841917 -15544760 -14881060 -13252063 -11054994 -8412963 -7396624
2344 -7396624 -9536577 -12042873 -10652937 -6234909 -4562749 -8544096 -14004464 -14841812
2336 -14841812 -9980997 -3444028 741997 1693069 533620 -1882007 -5421027 -9451058
$$ [...]
##END NTUPLES=NMR SPECTRUM
##END=
