##TITLE=31Pdec_LR-784-R3-CR9
 CDCl3, 24 sc
 3.2.2025
##JCAMPDX= 6.0         $$ Bruker NMR JCAMP-DX V2.0
##DATA TYPE= NMR SPECTRUM
##DATA CLASS= NTUPLES
##ORIGIN= UXNMR, Bruker Analytische Messtechnik GmbH
##OWNER= root
$$ XWIN-NMR		Version 3.5
$$ Mon Feb  3 18:12:07 2025 Russian Standard Time (UT+4h)  she@DPX200
##.OBSERVE FREQUENCY= 81.013821
##.OBSERVE NUCLEUS= ^31P
##.ACQUISITION MODE= SIMULTANEOUS
##.ACQUISITION SCHEME= undefined
##.AVERAGES= 24
##.DIGITISER RES= 17
##SPECTROMETER/DATA SYSTEM= spect
##.PULSE SEQUENCE= zgpg30
##.SOLVENT NAME= CDCl3
##.SHIFT REFERENCE= (INTERNAL, CDCl3, 0, 198.062)
##AUDIT TRAIL= $$ (NUMBER, WHEN, WHO, WHERE, WHAT)
$$ ##TITLE= Audit trail, XWIN-NMR		Version 3.5
$$ ##JCAMPDX= 5.01
$$ ##ORIGIN= Bruker BioSpin GmbH
$$ ##OWNER= she
$$ F:/spectra/data/she/nmr/P31/2/pdata/1/auditp.txt
$$ ##AUDIT TRAIL=  $$ (NUMBER, WHEN, WHO, WHERE, WHAT)
(   1,<2025-02-03 18:09:58.59 +0400>,<she>,<DPX200>,
      <created by zg, POWCHK disabled, PULCHK disabled
       configuration hash MD5:
       00 E9 B6 7A A2 85 ED C7 34 08 36 98 17 FE 4E 26
       data hash MD5: 32K
       63 95 65 74 D2 49 9F 36 59 B0 0F 42 7D 5C BB 28>)
(   2,<2025-02-03 18:11:10.26 +0400>,<she>,<DPX200>,
      <Start of raw data processing
       efp BC_mod = 2 LB = 1.5 FT_mod = 6 PKNL = 1 PHC0 = 1659.924 PHC1 = 256.8909 SI = 64K 
       data hash MD5: 64K
       20 99 F8 BE F1 A7 3B 5E 9F E8 77 38 C8 B3 64 97>)
(   3,<2025-02-03 18:11:27.23 +0400>,<she>,<DPX200>,
      <pk PHC0 = 46.34189 PHC1 = 0 
       data hash MD5: 64K
       71 80 8A D1 68 57 A5 F2 21 FC EE 8E 96 6E C2 15>)
(   4,<2025-02-03 18:11:29.73 +0400>,<she>,<DPX200>,
      <abs ABSG = 5 
       data hash MD5: 64K
       3C 80 E6 34 F6 5D 95 36 12 67 84 2B 70 01 FA 84>)
$$ ##END=
$$ 
$$ hash MD5
$$ 42 61 46 BF 63 B2 CC 8D 34 43 41 CE 1F 99 0D 1B
##$RELAX= 
##$RELAX= 
##$RELAX= 
##$RELAX= 
##$RELAX= 
##$RELAX= 
##$RELAX= 
##$RELAX= 
$$ Bruker specific parameters
$$ --------------------------
##$DU= <F:/spectra>
##$EXPNO= 2
##$NAME= <P31>
##$PROCNO= 1
##$TYPE= <nmr>
##$USER= <she>
##$AMP= (0..31)
100 100 100 100 100 100 100 100 100 100 100 100 100 100 100 100 100 100 
100 100 100 100 100 100 100 100 100 100 100 100 100 100 
##$AQSEQ= 0
##$AQ_mod= 1
##$AUNM= <au_zg>
##$AUTOPOS= <>
##$BF1= 81.014009
##$BF2= 200.13
##$BF3= 200.13
##$BF4= 200.13
##$BF5= 200.13
##$BF6= 200.13
##$BF7= 200.13
##$BF8= 200.13
##$BYTORDA= 1
##$CFDGTYP= 0
##$CFRGTYP= 5
##$CHEMSTR= <none>
##$CNST= (0..31)
1 1 145 1 1 1 1 1 1 1 1 1 1 1 1 1 1 1 1 1 1 1 1 1 1 1 1 1 1 1 1 1 
##$CPDPRG= <waltz16>
##$CPDPRG1= <>
##$CPDPRG2= <waltz16>
##$CPDPRG3= <>
##$CPDPRG4= <mlev>
##$CPDPRG5= <mlev>
##$CPDPRG6= <mlev>
##$CPDPRG7= <mlev>
##$CPDPRG8= <mlev>
##$CPDPRGB= <>
##$CPDPRGT= <>
##$D= (0..31)
0 1 0 0 0 0 0 0 0 0.06 0 0.03 2e-05 3e-06 0 0 0.0002 0 0 0 0 0 0 0 0 0 
0 0 0 0 0 0 
##$DATE= 1738591798
##$DBL= (0..7)
120 120 120 11 120 120 24 19 
##$DBP= (0..7)
150 150 150 150 150 150 150 150 
##$DBP07= 0
##$DBPNAM0= <>
##$DBPNAM1= <>
$$ [...]
##$SUBNAM3= <"">
##$SUBNAM4= <"">
##$SUBNAM5= <"">
##$SUBNAM6= <"">
##$SUBNAM7= <"">
##$SUBNAM8= <"">
##$SUBNAM9= <"">
##$SW= 400.765351723535
##$SWIBOX= (0..15)
0 1 3 0 0 0 0 0 0 0 0 0 0 0 0 0 
##$SW_h= 32467.5324675325
##$TD= 32768
##$TD0= 1
##$TE= 0
##$TE2= 300
##$TE3= 300
##$TEG= 300
##$TL= (0..7)
0 120 53 12 22 120 120 120 
##$TP= (0..7)
150 150 150 150 150 150 150 150 
##$TP07= 0
##$TPNAME0= <>
##$TPNAME1= <>
##$TPNAME2= <>
##$TPNAME3= <>
##$TPNAME4= <>
##$TPNAME5= <>
##$TPNAME6= <>
##$TPNAME7= <>
##$TPOAL= (0..7)
0.5 0.5 0.5 0.5 0.5 0.5 0.5 0.5 
##$TPOFFS= (0..7)
0 0 0 0 0 0 0 0 
##$TUNHIN= 0
##$TUNHOUT= 0
##$TUNXOUT= 0
##$USERA1= <user>
##$USERA2= <user>
##$USERA3= <user>
##$USERA4= <user>
##$USERA5= <user>
##$V9= 5
##$VALIST= <valist>
##$VCLIST= <CCCCCCCCCCCCCCC>
##$VD= 0
##$VDLIST= <DDDDDDDDDDDDDDD>
##$VPLIST= <PPPPPPPPPPPPPPP>
##$VTLIST= <TTTTTTTTTTTTTTT>
##$WBST= 1024
##$WBSW= 4
##$XGAIN= (0..3)
0 0 0 0 
##$XL= 0
##$YL= 0
##$YMAX_a= 5589
##$YMIN_a= -8024
##$ZGOPTNS= <>
##$ZL1= 120
##$ZL2= 120
##$ZL3= 120
##$ZL4= 120
##$ABSF1= 198.0616
##$ABSF2= -202.7028
##$ABSG= 5
##$ABSL= 3
##$ALPHA= 0
##$AQORDER= 0
##$ASSFAC= 0
##$ASSFACI= 0
##$ASSFACX= 0
##$ASSWID= 0
##$AUNMP= <proc_1d>
##$AZFE= 0.1
##$AZFW= 0.5
##$BCFW= 0
##$BC_mod= 2
##$BYTORDP= 0
##$COROFFS= 0
##$CY= -3
##$DATMOD= 1
##$DC= 0
##$DFILT= <>
##$DTYPP= 0
##$F1P= 0
##$F2P= 0
##$FCOR= 1
##$FTSIZE= 65536
##$FT_mod= 6
##$GAMMA= 0
##$GB= 0
##$INTBC= 1
##$INTSCL= 9.790993e-09
##$ISEN= 30
##$LB= 1.5
##$LEV0= 0
##$LPBIN= 0
##$MAXI= 10000
##$MC2= 0
##$MEAN= 0
##$ME_mod= 0
##$MI= 50
##$NCOEF= 0
##$NC_proc= -9
##$NLEV= 6
##$NOISF1= 182.463
##$NOISF2= 159.3651
##$NSP= 0
##$NTH_PI= 0
##$NZP= 0
##$OFFSET= 198.0616
##$PC= 4
##$PHC0= 1706.266
##$PHC1= 256.8909
##$PH_mod= 1
##$PKNL= yes
##$PPARMOD= 0
##$PSCAL= 0
##$PSIGN= 0
##$REVERSE= no
##$SF= 81.0140089999434
##$SI= 65536
##$SIGF1= 159.3651
##$SIGF2= -187.1042
##$SINO= 113.3802
##$SIOLD= 16384
##$SREGLST= <1H.CDCl3>
##$SSB= 0
##$STSI= 65536
##$STSR= 0
##$SW_p= 32467.5324675325
##$SYMM= 0
##$S_DEV= 0
##$TDeff= 32768
##$TDoff= 0
##$TI= <>
##$TILT= no
##$TM1= 0
##$TM2= 0
##$TOPLEV= 0
##$USERP1= <user>
##$USERP2= <user>
##$USERP3= <user>
##$USERP4= <user>
##$USERP5= <user>
##$WDW= 1
##$XDIM= 65536
##$YMAX_p= 534052262
##$YMIN_p= -76226704
$$ End of Bruker specific parameters
$$ ---------------------------------
##NTUPLES= NMR SPECTRUM
##VAR_NAME=  FREQUENCY,     SPECTRUM/REAL,   SPECTRUM/IMAG
##SYMBOL=    X,             R,               I
##VAR_TYPE=  INDEPENDENT,   DEPENDENT,       DEPENDENT
##VAR_FORM=  AFFN,          ASDF,            ASDF
##VAR_DIM=   65536,         65536,           65536
##UNITS=     HZ,            ARBITRARY UNITS, ARBITRARY UNITS
##FACTOR=    0.49542278885378, 1,            1
##FIRST=     16045.7642231865, 0,            0
##LAST=      -16421.768244346, 0,            0
##MIN=       -16421.768244346, -76226704,    0
##MAX=       16045.7642231865, 534052262,    0
$$ Real data points
##PAGE= N=1
##DATA TABLE= (X++(R..R)), XYDATA
$$ [...]
43884H518270j663008L63239J005297p99177k932136l660596l117607j491123
43876c776841J263229L644101L420427R81002o34506J9401Q55751k56758k273490
43867C242316k894067j972607j082306p86719k76402P93263J765387K123466J890667
43858B802998J047988k41126r25934J03022K229053L305887K153925l1732j352355
43849I091726j477081j449514j836571k089956j576161l90264Q24564J239384
43841B336127K92645j402005k010748n91971J033166K47019k452034l649591j781321
43832g978713P44573J599036K069535M000847N482447L345815j149932l353740
43824D759868k003441p45828j871318k767283q71076J582465J190604q98527r86455
$$ y = [8518270, 6855262, 7218501, 8223798, 7424621, 4492485, 831889, -2285718, -3776841, -2513612, 1130489, 4550916, 5531918, 4897412, 4916813, 5772564, 5515806, 3242316, 348249, -1624358, -2706664, -3493383, -3769785, -2976522, -1211135, 912331, 2802998, 3850986, 3609860, 2683926, 2786948, 5016001, 8321888, 10475813, 10444081, 9091726, 7614645, 6165131, 4328560, 2238604, 662443, 272179, 1096743, 2336127, 2628772, 1226767, -783981, -1375952, -342786, -95767, -2547801, -6197392, -7978713, -7234140, -5635104, -3565569, 435278, 5917725, 9263540, 8113608, 4759868, 2756427, 2010599, 139281, -2628002, -3499078, -1916613, -726009, -1624536, -2610991]
43815b610991Q90464J107181j147647j980847J096956M658484L811355q39943
43807D985012m031414l110437j078220j426644k964874k269067O21448K415222
43799f858974K003526J866047L103329K888742o31613m019397k785003J938339
43791b495004M931317M110024K139770J153086J45265j682906k930968k727464
43783B643120k229923k073411j336112k83722r06025l097054l495137k01788M111787
43774f868265N833402M528059J652740j786816m159203l106277O92193K782127
43766d32040J081440m53888J887421M796323K525720l722296o602427k557871
43758c477618L859364O148102K601602l569004p604980o298126n79747M665351
$$ y = [-2610991, -1720527, -613346, -1760993, -3741840, -2644884, 2013600, 5824955, 4985012, 953598, -2156839, -3235059, -4661703, -7626577, -9895644, -9274196, -6858974, -4855448, -2989401, 113928, 3002670, 2371057, -1648340, -4433343, -2495004, 2436313, 6546337, 8686107, 9839193, 9984458, 8301552, 5370584, 2643120, 413197, -1660214, -2996326, -3280048, -4186073, -7283127, -10778264, -10980052, -6868265, -1034863, 3493196, 5145936, 3359120, -800083, -3906360, -3214167, -432040, 649400, 195512, 2082933, 6879256, 9404976, 5682680, -919747, -3477618, 381746, 6529848, 9131450, 5562446, -2042534, -8340660, -8920407, -4255056]
43750d255056N609328L812158L155428L778779K636262q23202l754772m567585
43742E591340m317195l265926m10045K816412K805609o83033l163108j545720
43734b171666J806721L239416K832331K728361K959459J778818j160423m104904
43726G908113n020506l113192N21714L341150L689889K673244K140738J500101
43718A3641251q63780l653651l789447j551700n22548j620416j546539J203138
43710A296308L108574R81057l103040n155231m561522l132401j575251Q9446Q12434
43701a1239626K1243r65922j143116j237551j113587J228471N649264Q100671
43693g00153N906925J800448n39215j751147l814477n142654l444786q09081o51255
$$ y = [-4255056, 1354272, 5166430, 8321858, 12100637, 14736899, 13913697, 10158925, 5591340, 1274145, -1991781, -2401826, 414586, 3220195, 2537162, -625946, -2171666, -364945, 2874471, 5706802, 8435163, 11394622, 13173440, 12013017, 7908113, 2887607, -225585, 296129, 3637279, 7327168, 10000412, 12141150, 13641251, 12777471, 9123820, 5334373, 3782673, 3260125, 1639709, 93170, 1296308, 4404882, 5385939, 2282899, -2872332, -7433854, -10566255, -12141506, -12052060, -11239626, -11218383, -12184305, -13327421, -14564972, -15678559, -14450088, -8800824, -700153, 5206772, 7007220, 6468005, 4716858, 902381, -4240273, -7685059, -8494140, -9145395]
43684i145395j619386p1066K942921L124411M99006o26581Q19631J425650J37742
43675b513067o257J565938J045920k539650m177420o12808L873077L838222O61120
43666A135075p14121K67478M08978p56188o60111Q17693P37563j471556k339749
43657b574938L81491L987518M253749O40547l559148n056754l290385j22731K073836
43648c266815K224404J021409k21865q93771j100047j067546j210102k076083
43640f590416l196623k672715N22673M088275M197438L48863l350642l040967
43632i694114O4789J553633j60768k061167j229020J056914J671877M45122p0970
43623h423704Q33854P54048j594606l540987j956585K059564M428127L277174
$$ y = [-9145395, -10764781, -10835847, -7892926, -4768515, -4269509, -4896090, -4076459, -2650809, -2513067, -2519324, -953386, 92534, -2447116, -6624536, -7237344, -3364267, 473955, 1135075, 420954, 688432, 1097410, 341222, -318889, 498804, 1236367, -235189, -2574938, -2193447, 1794071, 6047820, 6688367, 3129219, -1927535, -5217920, -5340651, -3266815, -1042411, -21002, -242867, -1136638, -2236685, -3304231, -4514333, -6590416, -9787039, -12459754, -11937081, -7848806, -3651368, -3302505, -6653147, -9694114, -9629325, -8075692, -8236460, -10297627, -11526647, -10469733, -8797856, -8352734, -8423704, -7589850, -6835802, -8430408, -11971395, -13927980, -11868416, -7440289, -4163115]
43615d163115N93148j032450j037882m6905J445553K675764K511221Q86330n97961
43606A233703m39951R61336J870160J110189r42108k727890k657315n37820J883164
43597b46532K404501O62032j558318k396976j729769q01852o67273j196529j251256
43588f781972J57666K553626M071167L280411N93068k509062m860605n575514
43580i071215l864873m16064J985408J298274o90652m08667K293591L500724P08438
43571d665036l329813l941925l24491L879078N216637L954466K741368K872865
43563F403149K843572Q02753k300005l435523j723826j30213j326953l387803
43555b254849k302188J833630M360661K395426j288111k164974M48846L457183
$$ y = [-4163115, -3569967, -4602417, -5640299, -5687204, -4241651, -1565887, 945334, 1831664, 1233703, 793752, 1755088, 3625248, 4735437, 3793329, 1065439, -1591876, -2129696, -246532, 2157969, 2820001, 1261683, -1135293, -2865062, -3666914, -4334187, -5530716, -6781972, -6624306, -4070680, 487, 3280898, 3873966, 1364904, -3495701, -9071215, -12936088, -13352152, -11366744, -10068470, -10759122, -11167789, -8874198, -5373474, -4665036, -7994849, -11936774, -12261265, -8382187, -3165550, 788916, 3530284, 6403149, 9246721, 10049474, 7749469, 4313946, 2590120, 2459907, 1132954, -2254849, -4557037, -2723407, 1637254, 4032680, 2744569, 579595, 1028441, 4485624]
43547D485624M109112K295373m19736k564332l706030m182637l809427j575723
43539e367776K176467M365492K527163r56643j389689J242321J898296j554170
43531B941461m489774k571149J362716J777144r95614j779782J107532L625232
43523I77766K345755j178042l345492k717057m32324J221807L43935k301093k893791
43514g978536Q43000N294361M845852o0350l187075j544599P98494Q7330r14217
43505a815740J873529O121276N814031J49156n191266n516464j866853J984063
43497A551732L611580K317608j131903l800644k548886J576766L451701L99954
43489E427908l689759l429039O70081L215902J559835j353320k192355j540049
$$ y = [4485624, 8594736, 10890109, 10470373, 7906041, 4200011, 17374, -3792053, -5367776, -3191309, 1174183, 3701346, 2744703, 1355014, 2597335, 4495631, 2941461, -1548313, -4119462, -2756746, -979602, -1975216, -3754998, -2647466, 977766, 3323521, 2145479, -1200013, -3917070, -4349394, -3127587, -2783652, -5084745, -7978536, -7135536, -1841175, 3004677, 2944327, -242748, -1787347, -988853, -901523, -1815740, 57789, 6179065, 11993096, 12142252, 6950986, 1434522, -432331, 1551732, 5163312, 7480920, 6349017, 2548373, -513, 1576253, 5027954, 5427908, 1738149, -1690890, -1020809, 2195093, 3754928, 2401608, 209253, -1330796]
43481a330796j192176m43811J769934L208960R30101l077117l285612J359000
43473b061517M973129K709435k250688l388495k52402J521839r38589l743081
43465c430369k441335J749388M396720L749708J365726j207265l290840l709726
43457b817993j716940Q62094J105695j102852k922834k582439j173724J30946
43449a0218047J982317M568740N825676M127739J160056k61589j14136m34414
43441F636342j514349j728002r42935r50298j889947j374900J376571L342676
43433B955158J796714j566891l052818j804537L45317K304408L968092M182832
43425I128275J928382r06251j373022L6296L31178n36541M73041L321323L524511
$$ y = [-1330796, -2522972, -2966783, -1196849, 2012111, 2942212, -134905, -3420517, -2061517, 2911612, 5621047, 3370359, -18136, -270538, 1251301, 312712, -3430369, -5871704, -4122316, 274404, 4024112, 5389838, 4182573, 891733, -2817993, -4534933, -3672839, -2567144, -3669996, -6592830, -9175269, -10348993, -10218047, -8235730, -3666990, 2158686, 6286425, 7446481, 7184892, 7070756, 6636342, 5121993, 3393991, 2451056, 1500758, -389189, -1764089, -387518, 2955158, 4751872, 3184981, 132163, -1672374, -1327057, 977351, 4945443, 9128275, 11056657, 10150406, 8777384, 8813680, 9144858, 8608317, 9081358, 12402681, 15927192]
43416A5927192o09371m022084k067943K054195J910287k515890n114902k657724
43408B903760J570187L280475J889287r13209l371319l616733j030061J478176
43400B190563J15570l938669n173174j553281K474810K893438J751317K604881
43392A365455M100654K621977j056507k640020q70697J232283J542061J217934
43384G513140J446938J337203J34783j183542j604927j242369j60539J726531
43376G967218K970379J319980k713078n299850l835719k55638J693530R29701
43368B776523p51599j521463q76238P48280K032696J295408j429720l563222k825982
43359d115317k80974J114114M14990p13106r49106p03626l54966O85382K204439
$$ y = [15927192, 15317821, 11295737, 9227794, 11281989, 13192276, 10676386, 5561484, 2903760, 4473947, 7754422, 9643709, 8730500, 5359181, 1742448, 712387, 2190563, 2306133, -1632536, -6805710, -8358991, -5884181, -2990743, -1239426, 1365455, 5466109, 8088086, 7031579, 4391559, 3520862, 4753145, 6295206, 7513140, 8960078, 10297281, 10432064, 9248522, 7643595, 6401226, 6240687, 7967218, 10937597, 12257577, 9544499, 4244649, 408930, 153292, 1846822, 2776523, 2024924, 503461, -372777, 375503, 2408199, 3703607, 2273887, -1289335, -4115317, -4396291, -3282177, -2867187, -3580293, -4529399, -5233025, -5587991, -4902609, -2698170]
43350b698170K313460j20034l196137l746252j083701K243440L452204K302417
43342e32773O65042Q8598L26018M5685j438604l318209m057677k781900J32185
43333a0871635L428093N531804N145273K208024j506522l500960k794745p24603
43325c085271P70987J169901J256253J544158J594710Q26569n94244j824175k068169
43316d09281j253525j28895M19141K24973j77859l59601k69408K63637J446846
43307b43972K643999K542846Q10660j313918k752440l777133m483428l508827
43299a0082213j32472L389693M034533K200395J110453J945578K420525R93739
43291E880231m43483K03187J757126J792473L27214r31657j642548k515875k933571
$$ y = [-2698170, -384710, -504744, -3700881, -7447133, -8530834, -6287394, -2835190, -532773, 132269, 220867, 546885, 592570, -846034, -4164243, -8221920, -11003820, -10871635, -7443542, -1911738, 3233535, 5441559, 3935037, 434077, -2360668, -3085271, -2314284, -1144383, 111870, 1656028, 3250738, 4077307, 3483063, 1658888, -409281, -1662806, -1791701, -1372560, -1147587, -1325446, -1685047, -1954455, -1690818, -243972, 2400027, 4942873, 5753533, 4439615, 1687175, -2089958, -6573386, -10082213, -10214685, -6824992, -2790459, -590064, 520389, 2465967, 4886492, 5880231, 5436748, 5639935, 7397061, 9189534, 9516748, 8585091, 6942543, 4426668, 1493097]
43282A493097j719333J07028J95383j303095j433491J241333M230222M217869
43274G029013J080367k297432l248981j658606J74900k53509k766839m058690
43266e999777j476789L075128N029994L015275L66694R8131J052079P00365o02354
43257E258746o91995M93525Q02955p34303k672325l396033k881471k000631j384747
43248g206279j189927j072560m23501O74234J178232O51285L73716J611480L418680
43239a984640L783915K595842J678320J899114K044371R14692j012937k476950
43231G441727k706078j547903L18281J144050k75316k444825k475688r0183J728593
43222A092658R71876p64239j299264j172862j750434k137518r75242J71450j153488
$$ y = [1493097, -226236, -119208, 76175, -1226920, -2660411, -1419078, 2811144, 7029013, 8109380, 5811948, 2562967, 904361, 1079261, 825752, -1941087, -5999777, -7476566, -4401438, 628556, 3643831, 4010525, 4108656, 5160735, 5861100, 5258746, 4566751, 5060276, 5863231, 5128928, 2456603, -939430, -3820901, -5821532, -7206279, -8396206, -9468766, -9892267, -9218033, -8039801, -7388516, -7014800, -5403320, -1984640, 1799275, 4395117, 6073437, 7972551, 10016922, 10931614, 9918677, 7441727, 4735649, 3187746, 3506027, 4650077, 4374761, 1929936, -545752, -635935, 1092658, 2064534, 1300295, 1031, -1171831, -2922265, -5059783, -6035025, -5863575, -7017063]
43213g017063l429801k272671K949022P253942O386619K056578j104520j287351
43205C534755R2883J555701K303842J289310j475160l408011j962104J571782
43197C502998L418611K289097M17863l33091n60285r85235q72764K6219L41652
43188G245065o00981j242315j05278J898338K860255K152665J75059k439245m060329
43179E883234k610862J130947K759954n14909n268130n644922j121431K785146
43171b600973J780962k264275m623012l440904n27017J965701L649705M901582
43163a158231N120483K942079j461059m952241l975923Q91885M747878M079731
43155F234602R09658p17832m57275q11909j947403j432499Q61244J727544l42224
$$ y = [-7017063, -10446864, -12719535, -9770513, -2516571, 3870048, 5926626, 4822106, 3534755, 3627638, 5183339, 7487181, 8776491, 7301331, 3893320, 1931216, 3502998, 6921609, 9210706, 9628569, 9295478, 8735193, 7749958, 6877194, 6903413, 7245065, 6644084, 5401769, 5296491, 7194829, 10055084, 12207749, 12382808, 9943563, 5883234, 3272372, 4403319, 7163273, 6648364, 1380234, -4264688, -5386119, -2600973, -820011, -3084286, -7707298, -11148202, -11675219, -9709518, -6059813, -1158231, 3962252, 6904331, 5443272, 491031, -3484892, -2593007, 2154871, 6234602, 7144260, 6426428, 5969153, 5157244, 3209841, 1777342, 2638586, 4366130, 4023906]
43146D023906k638789k488691r88015l60176k11878R76202K544420K623762J312725
43137D793466L71184K99422j15680j491518k772603k545622m22670K670511M823416
43128E609906M307013J355241j579422k126362l67995J387809Q29334k284236
43120G131288n496890n384320j183501L504798M243357Q76236k693305l582756
43112b585093k382405o24801J109827J999297J133080j67533N00856K130054R40265
43103B053547k921989m117456m08174K810363O88072l029962k110311J720751
43095e315159J832715j854987k699149J342202M378446K601475J80858J442937
43087A909338L404338J211201l350723m422788q05875K994814L498402J728582
$$ y = [4023906, 1385117, -1103574, -2091589, -2451765, -2663643, -1687441, 856979, 3480741, 4793466, 5164650, 5464072, 5348392, 3856874, 1084271, -1461351, -1884021, 786490, 5609906, 9916919, 11272160, 9692738, 7566376, 7198381, 8586190, 9415524, 7131288, 1634398, -3749922, -4933423, -1428625, 2814732, 3690968, 997663, -2585093, -4967498, -5592299, -4482472, -2483175, -1350095, -1517628, -1016772, 1113282, 2053547, -868442, -4985898, -5394072, -2583709, -1895637, -4925599, -7035910, -5315159, -3482444, -5337431, -8036580, -6694378, -2315932, 285543, 466401, 1909338, 5313676, 6524877, 3174154, -1248634, -2054509, 940305, 4438707, 6167289]
43079F167289R1084o98673r75647q85675o06785m60815m68746o36829j407128
43070A18075k804498l495129j937681J480320M428920N019133L576760J721596
43062H107496J93479j563851l499620l908150j784109N73706p0687k772299l015734
43053g739769L05235K542037P68692o65586K939610P605998N614782j955646n675819
43044C739534j693028K794707J128409l014423k580223J673672L356298N42177
43036E947123k584714k768106j028369O05829J440292J165466k35274j703178
43028H39069k485871l427239m752679m216191k44678M624216O536077N240006
43020B112710L213933J428172n61364j714113o60339J061895P74966r67840j605678
$$ y = [6167289, 6258373, 5559700, 4584053, 3698378, 3091593, 2630778, 2162032, 1525203, 118075, -2686423, -6181552, -8119233, -6638913, -2209993, 2809140, 6385900, 8107496, 8300975, 6737124, 3237504, -670646, -2454755, -1881049, -1951736, -4724035, -7739769, -7434534, -4892497, -4123805, -4789391, -1849781, 5756217, 11370999, 9415353, 3739534, 2046506, 4841213, 5969622, 2955199, 374976, 2048648, 5404946, 5947123, 3362409, 594303, -434066, 171763, 1612055, 2777521, 2542247, 839069, -1646802, -5074041, -9826720, -14042911, -14287589, -9663373, -3127296, 2112710, 5326643, 6754815, 6193451, 4479338, 3818999, 4880894, 5655860, 4688020, 3082342]
43011C082342j423807k805258m938966m160808k30945K508631J694920K59880
43003f014011J205309L140961L626817L364301L821065L483105J81817m471965
42995H337399o548013n082568k902240k208718j946105k23159K547334M138939
42987c887131L361404J359833K6968j90123l01950q72696j144624m03954Q29849
42978a222424J634021J672905O86874j595778m005562m117326j522193P93402
42970g676081L90837j061541p33123O88460O46097l81314K97568K509353L276824
42961b042920J986835J186830J727861J511598J08690J54065K352142L250063
42953A0235164M10189l654796n177830l792602j310566J140895K539471J559770
$$ y = [3082342, 1658535, -1146723, -6085689, -10246497, -10477442, -7968811, -6273891, -6014011, -4808702, -1667741, 1959076, 5323377, 9144442, 12627547, 12809364, 8337399, 1789386, -3293182, -6195422, -8404140, -10350245, -10573404, -8026070, -3887131, -525727, 834106, 861074, 670951, 369001, -503695, -1648319, -2052273, -1222424, 411597, 2084502, 2771376, 1175598, -2829964, -6947290, -8469483, -7676081, -7285244, -8346785, -9079908, -8391448, -7745351, -8126665, -7829097, -5319744, -2042920, -56085, 1130745, 2858606, 4370204, 4478894, 4632959, 6985101, 10235164, 10645353, 6990557, 1812727, -1979875, -3290441, -2149546, 389925, 1949695]
42945A949695r18914j820837n32050k00033k047440k428395J052505M481668L196597
42936B732796q49258k326175o12451P06838N45868Q64442J557661N17821j383414
42927A754128q68389J656689J700227k424741o691456o772076k801621K236580
42919a2210659N476545M943939J067092j990470l64563L652529M120294L80374
42911E075081j764097P05224L344316J772834j496749j922877j28836O49892P26800
42902F961588K202689L634122K085840r92880j425934P93568J458196r54881l221873
42893A0540435k898044j465191p78415l46093K42757l77754k649242m336665l372218
42884e440430n31100K038262L105921K315587O0622j634162m67634K758150M445892
$$ y = [1949695, 1030781, -790056, -1322106, -1522139, -3569579, -5997974, -4945469, -463801, 2732796, 1883538, -442637, -1055088, -348250, 197618, 1062060, 2619721, 3137542, 1754128, 885739, 2542428, 4242655, 1817914, -4873542, -11645618, -14447239, -12210659, -6734114, -1790175, -723083, -2713553, -3078116, 574413, 4694707, 5075081, 3310984, 4016208, 7360524, 9133358, 7636609, 5713732, 5584896, 6234788, 6961588, 9164277, 12798399, 14884239, 13891359, 12465425, 13258993, 14717189, 13762308, 10540435, 7642391, 6177200, 5398785, 5052692, 5295449, 4917695, 2268453, -2068212, -5440430, -5971530, -3933268, -827347, 1488240, 1548862, -85300, -552934, 2205216, 6651108]
42875F651108K977383N47703r74534k710186n150446n338536j193653L837685
42867a353476M528548Q44294k724017l713071l457736k956612j537039K7940m16110
42858a0757279k043724r66039L631247P088331N437019O93113k611293l073363
42850b601988j694368J271304M906874N797019K246408j536336n27147L084705
42842A0946471K688672k213028m803194j760904J378899p34766m653993l977794
42834c129637K83451J721020j103173l059471j207348J157606Q82258J807J435140
42825c018347L695265L601926J633211P25524J249251J006933k63266j52895J932205
42816A0409807K798236j15959m396237n216175j622678K041572J536112k129736
$$ y = [6651108, 9628491, 10176194, 9201660, 6491474, 1341028, -3997508, -5191161, -1353476, 3175072, 4019366, 1295349, -2417722, -5875458, -8832070, -10369109, -10341169, -10757279, -12801003, -13767042, -10135795, -3047464, 2389555, 3082668, 471375, -2601988, -4296356, -3025052, 1881822, 7678841, 9925249, 8388913, 7861766, 10946471, 13635143, 11422115, 6618921, 4858017, 6236916, 5502150, 848157, -3129637, -2846186, -1125166, -2228339, -5287810, -6495158, -5337552, -4455294, -4453487, -3018347, 676918, 4278844, 5912055, 6637579, 7886830, 8893763, 8630497, 8477602, 10409807, 13208043, 13092084, 8695847, 3479672, 1856994, 3898566, 5434678, 3304942]
42808C304942m265555k429106R13736J935461J45568j670573j477376l51644n17637
42799d412184k150697k989830r47965L272039O286512N096992M14757l544145
42791A025479l398885l98131J298503J180j564222l95955K400048L120477N96074
42782B684568k247334k298589j07909J230699J75881j621759j769372n3166J781006
42773b225975K437511K053721Q87695j351569l926800m279408q74453L605536
42765c673742M363326M47155l608704l505478n93553O30274r66357k189037q93065
42756i989181R13294O21643q50190p28067J200116K379516J506331M78433J533157
42747b934948L918529M696383K392669j193224k979485j881062K26561P29463
$$ y = [3304942, -960613, -3389719, -2475983, -540522, -394954, -2065527, -3542903, -3894547, -4412184, -6562881, -9552711, -10500676, -7228637, -942125, 4154867, 4569624, 1025479, -2373406, -2771537, -1473034, -1471854, -3036076, -3432031, -1031983, 2088494, 2684568, 437234, -1861355, -1969264, -738565, -562684, -2184443, -3953815, -4006981, -2225975, 211536, 2265257, 3152952, 1801383, -2125417, -6404825, -7279278, -3673742, 689584, 1136739, -2471965, -5977443, -6570996, -5940722, -6907079, -9096116, -9989181, -9075887, -8454244, -9304434, -10032501, -8832385, -6452869, -4946538, -4468105, -2934948, 983581, 5679964, 8072633, 6879409, 3899924, 2018862, 2245423, 2974886]
42739B974886q18176k251109j242061K069418N029528M919202J487508k650132
42731I519064m204382k356479K43384L78031j749435k722197p18920J636644J022762
42722A048472j406083j515538J451690L425912J436958k199640l651364k756686
42714d166279j586552j38877K607245M573411K175251l532660o659563m094461
42706a0822485L07054J445029k70674r03138P58327K615444L497684M090056M034196
42697D751493J875537j558519l043063j396277O79270O22931n19948m66346N06244
42688A451322M41529q69358j737057j346466n49724N3577R11629K015495K184355
42679B555302O36961j679505l039013k669057j126714M96421J334491J192407
$$ y = [2974886, 2156710, -94399, -1336460, 732958, 5762486, 10681688, 12169196, 9519064, 5314682, 2958203, 3201587, 3579618, 1830183, -892014, -1610934, 25710, 1048472, -357611, -1873149, -421459, 3004453, 4441411, 2241771, -1409593, -4166279, -5752831, -5891708, -3284463, 1288948, 3464199, -68461, -6728024, -10822485, -10515431, -9070402, -9341076, -10244214, -9485887, -6870443, -3372759, 717297, 4751493, 6627030, 5068511, 2025448, 629171, 1308441, 1931372, 1411424, 945078, 1451322, 1892851, 1023493, -713564, -2060030, -2609754, -2556177, -1644548, 370947, 2555302, 3192263, 1512758, -1526255, -4195312, -5322026, -4825605, -3491114, -2298707]
42671b298707O79291O32919J158526J514444J047284j97932j827717l269415l335344
42662e896651q25015L343101N555905K963719k479813n374509l048016J283114
42654d478165K762003P92617j205667r00417O29873J577630J791876J636508O89579
42645C295837r56302j746380p27635O07855L22487r69846r98427P51126K471502
42636B050217K831589K461438K260978J863186N45418j443691l183363l935794
42628C449978l270099j211464J172719K112324Q06170j570570k957644k269700
42620c738286p1372K090464K797716J686382l52487j952908k212601q70114J729260
42611h93946M181071M301388J228951k904746m746621l274714l92281J926859
$$ y = [-2298707, -1619416, -986497, 172029, 1686473, 2733757, 2535825, 708108, -2561307, -5896651, -6721666, -3378565, 2177340, 5141059, 2661246, -2713263, -5761279, -4478165, -1716162, -923545, -2129212, -3029629, -2399756, -822126, 969750, 2606258, 3295837, 2339535, 593155, -134480, 473375, 795862, -173984, -1172411, -421285, 2050217, 4881806, 7343244, 9604222, 11467408, 12012826, 10569135, 7385772, 3449978, 179879, -1031585, 141134, 2253458, 3059628, 1489058, -1468586, -3738286, -3809658, -1719194, 1078522, 2764904, 2412417, 459509, -1753092, -2623206, -893946, 3287125, 7588513, 8817464, 5912718, 1166097, -2108617, -2500898, -574039]
42603e74039L334079L607039J709444k056367m561857k879890J573933M079391
42595D231733K188290j505820l084118k280726j981433l346952l793543q78275
42587a0450844L548502N245203L085049K07049p11707o90128j485579j914221
42579c166676O2748K994643L065675n15750m203288m669212k150573J272200M051431
42570c258802M871684K714843j087077l062428j751875J58955k58600j944186
42562c617486j839220L04145J800392J095908n21425j188383m32855J145766K450873
42553h02285K133143j54586k659312l069922j220068R62064K066937K371329K379090
42544B006390J676340k40706k856896m743355m475972j789401J684278L480728
$$ y = [-574039, 2760040, 6367079, 8076523, 6020156, 1458299, -1421591, 152342, 4231733, 6420023, 4914203, 1830085, -450641, -2432074, -5779026, -9572569, -10450844, -6902342, -1657139, 1427910, 1634959, 923252, 233124, -1252455, -3166676, -3103928, -109285, 2956390, 2440640, -1762648, -6431860, -8582433, -7310233, -3258802, 1612882, 4327725, 3240648, 178220, -1573655, -1414700, -1673300, -3617486, -5456706, -5152561, -3352169, -2256261, -2777686, -3966069, -4398924, -3253158, -802285, 1330858, 1176272, -1483040, -4552962, -5773030, -4810966, -2744029, -372700, 2006390, 3682730, 3442024, 585128, -4158227, -8634199, -10423600, -8739322, -5258594]
42536e258594K837318J387256N90251k16553j892285l146034k271652j26878J157806
42527f939365J655290K869762L909992K051834k216752m330453j611926K813703
42519a797915M353329K837475J354505R57361j41835k572394m162696l119559
42511b291729p84100L3962j473998l304030l051555n83901J878762K340934J307733
42502e927922Q46131J614499K108884J246564J96995M80065J431171J256583q088
42493C244882n40773K07527M14150j318618l485835l332558l71941K985635M179551
42484A982020K814947J73407k375977l787697l168752n98169K053715K540101
42476c66405R11829l69846L46083J700696J418751l46636j288818j61901J835409
$$ y = [-5258594, -2421276, -1034020, -443769, -660322, -2552607, -5698641, -7970293, -8097171, -6939365, -5284075, -2414313, 1495679, 3547513, 1330761, -2999692, -4611618, -1797915, 2555414, 5392889, 6747394, 7704755, 7562920, 4990526, 827830, -2291729, -3075829, -3041867, -4515865, -7819895, -10871450, -11455351, -9576589, -7235655, -5927922, -5081791, -3467292, -1358408, -111844, 85151, 565216, 1996387, 3252970, 3244882, 2704109, 2911636, 3325786, 2007168, -1478667, -4811225, -5183166, -2197531, 1982020, 4796967, 4970374, 2594397, -1193300, -4362052, -4960221, -2906506, -366405, 545424, 175578, 521661, 2222357, 3641108, 3294472, 2005654, 1843753, 3679162]
42467C679162K903179K490878J131353k88042p74817O1561J144971Q46116q41930
42458A0352431k110929j741206n62279M1790p8368l12025m78981n60073p7962
42449D472398J144461K096841J469400p18071k992114l773027k584896l98954
42441a283962R37127K20876j780302l046498k473247n97066J697313L783356M442407
42432A900004K407161j206050k897582r14645K093281K510173N37423q83467r09135
42423B637163j372280k556564j909573J568482M466684K995539j591490m195310
42415D2651k113781K090649M193612K945054L18643j508605k089204k049807j751082
42406G8130r84818N23195K657687M728879N608663M480507J871647l45202n72134
$$ y = [3679162, 6582341, 9073219, 10204572, 9916530, 9141713, 9203274, 10348245, 11194361, 10352431, 8241502, 6500296, 5938017, 5979807, 5901439, 5589414, 5110433, 4550360, 4472398, 5616859, 7713700, 9183100, 8465029, 5472915, 1699888, -885008, -1283962, -346835, -125959, -1906261, -4952759, -7426006, -8023072, -6325759, -2542403, 1900004, 4307165, 3101115, 203533, -711112, 1382169, 3892342, 4429765, 3546298, 2637163, 1264883, -1291681, -3201254, -1632772, 2833912, 5829451, 4237961, 42651, -2071130, 19519, 4213131, 7158185, 7476828, 5968223, 3879019, 1829212, 78130, -906688, -383493, 2274194, 7003073, 12611736, 17092243, 18963890, 18618688, 18046554]
42397A8046554Q75829K172511J952460L77434j609275l190780l624776k334567
42389A2665390J42320J960967J733993K46736n11542K9863L23226j095826l504656
42380A1990471m718987l595660j214380M75132P69057O60198J238037K040610
42372G644478J481261r84553l619202l962188j679420P65425Q26786j027278j788138
42363b342829K78191L184618L484631M99057k893800l643918j494994J612460
42355a316584L734163L946697K505210Q90145O53743J428205J260746l53183j509672
42346A1239470j145623j074920k709637l898135k033202J404555L055336L091708
42338G929552L994701M672129J289979n248122q385372m906454K27548J407251
$$ y = [18046554, 18922383, 21094894, 23047354, 23424788, 21815513, 18624733, 14999957, 12665390, 12807710, 14768677, 16502670, 16749406, 16237864, 16267727, 16590953, 15495127, 11990471, 7271484, 3675824, 2461444, 2936576, 3705633, 4365831, 5603868, 7644478, 9125739, 8141186, 4521984, 559796, -1119624, -354199, 472587, -554691, -2342829, -2064638, 1119980, 4604611, 5103668, 2209868, -1434050, -2929044, -1316584, 2417579, 6364276, 8869486, 9759631, 10413374, 11841579, 13102325, 12749142, 11239470, 10093847, 9018927, 6309290, 2411155, 377953, 1782508, 4837844, 7929552, 11924253, 16596382, 17886361, 12638239, 4252867, -653587, -426039, 981212]
42330I81212J30022Q15592K785801K093949q97867j742576Q46507L275694K958960
42321A1247294J331865J75490q71615j777132q30885K087073L780039J582365
42313A6724494k731451m781636k468947K070611M695326K900843j985826n881996
42305H541418n709349j984173K503640N385660N375128K239928k022225l823928
42297A0506099k221271p66075k397792m612890l467148l33234L50661j198360
42289d140010o19958K427581L129511n7644k242813o7240L008821K929273J209577
42280E577098O34414k41486l061730m326440k60134N723963O722702K018802k780079
42271A0007110m306534m293350m117937k399740Q92778K883501J954551k21251
$$ y = [981212, 1111234, 1926826, 4712627, 6806576, 5908709, 4166133, 5012640, 8288334, 11247294, 12579159, 12754649, 11883034, 10105902, 9275017, 11362090, 15142129, 16724494, 13993043, 9211407, 6742460, 8813071, 13508397, 16409240, 14423414, 8541418, 2832069, 847896, 3351536, 8737196, 14112324, 16352252, 14330027, 10506099, 8284828, 7518753, 5120961, 508071, -2959077, -3292311, -2941650, -4140010, -4759968, -2332387, 797124, 739480, -1503333, -1570573, 1438248, 4367521, 5577098, 6211512, 5970026, 2908296, -1418144, -1678278, 4045685, 10768387, 12787189, 10007110, 5700576, 1407226, -2710711, -5110451, -4217673, -1334172, 620379, 399128]
42263C99128j809625k466942j388729K145327N404161L927539j644368m814749
42255b48258j743203L443419M788519K266473k46986j559745l097549m215947
42247f13277k625428Q54825K486310J186381N4853J140992K217521Q37002j257126
42238D282053p17500K020041L151218J008194j752203k124256m93705R78948J799865
42229H152655K851629L714828K800534K30604j611015j117270O40464J832644
42221A7495073K050184J548478L4954k178180l177979j644299P21344J010216
42213A5859791r97224k742017k632486j809731j700341j728385o35622J100852
42205D714837J564575j41446k683810l964132l345260j987777j055297l74465
$$ y = [399128, -1410497, -3877439, -5266168, -3120841, 2283320, 6210859, 4566491, -248258, -1991461, 1451958, 6240477, 8506950, 8259964, 6700219, 3602670, -613277, -3238705, -2383880, 102430, 1288811, 1343664, 2484656, 4702177, 5539179, 4282053, 3564553, 5584594, 8735812, 9744006, 7991803, 5867547, 5373842, 6352790, 8152655, 11004284, 14719112, 17519646, 17750250, 16139235, 15021965, 15662429, 17495073, 19545257, 21093735, 21128689, 18950509, 15772530, 14128231, 14849575, 15859791, 14862567, 12120550, 9488064, 7678333, 5977992, 4249607, 3613985, 4714837, 6279412, 6137966, 3454156, -509976, -3855236, -5843013, -6898310, -7272775]
42197g272775M94234P31200o28669k398426k148406K65673K322816K703248K987864
42188b943241M195999M464163K437494L88876R22133K592954K235518R8941j005556
42179A3387281n14082j87154k23172N58307J114212p57007l600738l184822R25525
42170G518350M064571L066763M8232j933382k887771l649661l568864k663710
42162e472k451107k516416j48533M257015N802392K343417j140323L87000M358123
42153A0886096M944570K014100J98944R58074J266292m97475k499435l283528
42145A3987638l345287k832863j448983m52394j170697k042095r10860N07828
42137B292287j135046m592658m975785j232919K297237K745586K245216L019579
$$ y = [-7272775, -6778541, -6047341, -6676010, -9074436, -11222842, -10957169, -8634353, -5931105, -2943241, 1252758, 5716921, 8154415, 8543291, 9465424, 12058378, 14293896, 14392837, 13387281, 12873199, 12686045, 12462873, 13021180, 14135392, 13378385, 9777647, 6592825, 7518350, 11582921, 14649684, 14697916, 12764534, 9876763, 6227102, 2658238, -5472, -2456579, -4972995, -5121528, -864513, 4937879, 7281296, 6140973, 6527973, 10886096, 15830666, 17844766, 18043710, 19001784, 20268076, 19770601, 17271166, 13987638, 10642351, 7809488, 6360505, 5908111, 4737414, 2695319, 1784459, 2292287, 1157241, -3435417, -8411202, -9644121, -7346884, -4601298, -2356082, 663497]
42129F63497L536442J873635q18775k529021k933049j886738J362200N495189
42121D763380O893909M313221R54759j12863K39792j51872j329306k461721l504301
42112I604998l674366j571190J207430M98397l762294n619316j462392L905232
42104h73501M196197Q54585k69288J527002K047416L27746k67950J096945J114212
42095I753364j491363l591085k836042o49397J155640K457401K520041J11462
42087G430021k791892k038036K197598M444286J648936k480759l385873j680116
42079C344165k54004N96282J543785J331449m98285j087064J285550L074021N29341
42070I865240l518212l382266M18508J704938j822359n251012l935110M61044
$$ y = [663497, 4199939, 6073574, 5254799, 2725778, -207271, -2094009, -731809, 4763380, 11657289, 15970510, 16925269, 16812406, 17052198, 16900326, 15571020, 13109299, 9604998, 5930632, 4359442, 5566872, 6065269, 2302975, -3316341, -4778733, -873501, 3322696, 4177281, 3907993, 5434995, 7482411, 7810157, 7542207, 8639152, 9753364, 8262001, 4670916, 1834874, 1185477, 2341117, 4798518, 7318559, 7430021, 4638129, 2600093, 4797691, 9241977, 10890913, 8410154, 5024281, 3344165, 3090161, 3686443, 5230228, 6561677, 6063392, 4976328, 6261878, 9335899, 9865240, 6347028, 2964762, 3383270, 5088208, 3265849, -1985163, -5920273, -5459229]
42062e459229L436054L479508K126311Q37303J4367m63261j065904j802705j467086
42053c64642L98844J235178j619578n646120m970317J145651N965312M093702
42045B38030j277935l645802k399190j868931l178313k708934J253773N434036
42037h153266O553196N428340M202402K830909P52329o14831j2565P33179r24980
42028A0794713l781033l954636o04422K451069K007290j48164l02584J360579
42020G822812J050997k553035n555255l764755J613619N453892M846550J397800
42012A0312625k040225m095471m043975j349327K458722L973414K064916j72902
42004G107777P9270J003367n55282l154718k537655R79700J883947k186507n970193
$$ y = [-5459229, -2023175, 1456333, 3582644, 4419947, 4434314, 3971053, 2905149, 1102444, -364642, 34202, 1269380, -350198, -5996318, -10966635, -9820984, -3855672, 238030, -1039905, -4685707, -7084897, -8953828, -12132141, -14841075, -13587302, -8153266, -1600070, 3828270, 8030672, 10861581, 11613910, 10999079, 10986514, 11719693, 10794713, 7013680, 3059044, 2454622, 4905691, 6912981, 6764817, 6462233, 7822812, 8873809, 6320774, 765519, -2999236, -1385617, 4068275, 8914825, 10312625, 8272400, 4176929, 132954, -1216373, 1242349, 5215763, 7280679, 7107777, 7187047, 8190414, 7635132, 4480414, 1942759, 2922459, 4806406, 2619899, -3350294]
41995c350294l727600K310597M883129J622545k388486k204836P92076K027687
41987c5182L01536j433392p68020J278443K360928J871329Q07556k08892j144063
41978C030243j233653M61388K620166J960086k305373o011748m678943K75446
41970e882388L062919J200675j742951j903028o1866J116905J591159K650062
41962C1487L373685J893308r53993k498036k192852j751963j732472r76369N48348
41953d258857J253993P23597N06969J579599L093656L978060L797252K052079
41945A2726348j058467l265118k346986K28778P46944j314486k521333q45083
41937B350597J703378K905714L108689K571592k9497m037036n507655k591236
$$ y = [-3350294, -7077894, -4767297, 115832, 1738377, -650109, -2854945, -2062869, -35182, 266354, -1167038, -1935058, -656615, 1704313, 3575642, 4383198, 4174306, 3030243, 1796590, 2257978, 4878144, 6838230, 4532857, -1478891, -6157834, -5882388, -2819469, -1618794, -3361745, -5264773, -5326639, -4209734, -2618575, 31487, 3405172, 5298480, 4344487, 1846451, -346401, -2098364, -3830836, -4807205, -4258857, -3004864, -2281267, -1774298, -194699, 2898957, 6877017, 10674269, 12726348, 11667881, 8402763, 6055777, 6284555, 7031499, 5717013, 3195680, 2350597, 4053975, 6959689, 10068378, 12639970, 12610473, 8573437, 3065782, 474546]
41929D74546J077075J746238J072757K302997M029170K699937q52840k727199
41921I822681k383122k372463k612213p31485K068800J614670j943686l385839
41913G7343o32093K027597J287542j83830N71923J311830q23771l400428k345868
41904b109755J383310L585930L067856J564330o12592m010949o440534m884458
41896h456862o19873J948018J450879N64290J035470J833896K397084L548023
41888C700925M585208L411947L95326j640850k046751l009542m645832l912475
41880c162044k41410K198955O42490j809132j183446J333063K148017J122657
41872A049150M42222m9834j730315k981382j081682K307820K574877n93002k244790
$$ y = [474546, 1551621, 3297859, 4370616, 6673613, 10702783, 13402720, 12549880, 9822681, 7439559, 5067096, 2454883, 1723398, 3792198, 5406868, 3463182, 77343, -554750, 1472847, 2760389, 2576559, 3148482, 4460312, 3636541, 236113, -2109755, -726445, 2859485, 5927341, 7491671, 6879079, 2868130, -3572404, -8456862, -9076735, -7128717, -5677838, -5113548, -4078078, -2244182, 152902, 3700925, 8286133, 11698080, 12093406, 10452556, 8405805, 5396263, 750431, -3162044, -3403454, -1204499, -562009, -2371141, -3554587, -2221524, -73507, 1049150, 1491372, 1441538, -288777, -3270159, -4351841, -2044021, 530856, -62146, -2306936]
41863b306936K84183L374066K906493K14132q12142K68245Q82116K27136n7423
41854D979870L91146l94565l231218n620769m572661n13645K981722L188406J061746
41845a729968k08670J035463L280447L993426K556475L88246j166150j906627
41837F242642k014689j531250p29010J02171J290729K955916L600928J388609
41829A1306046k655349m770518l029493N8223J185313P36530J224563K525584
41821F580899J944830r50326k815741j126011K167694L429058K105893N68817
41813A1905113J55707k41232j604920k890416k575886q62763P23648J280821J113487
41804G003559P21772K01575l30843o37840r62798j840559k752209j948004J197738
$$ y = [-2306936, -2022753, 1351313, 4257806, 4471938, 3659796, 3928041, 4810157, 5037293, 4979870, 5371016, 4976451, 1745233, -3875536, -8448197, -8961842, -5980120, -2791714, -1729968, -1938638, -903175, 2377272, 6370698, 8927173, 9315419, 8149269, 6242642, 4227953, 2696703, 1967693, 2069864, 3360593, 6316509, 9917437, 11306046, 8650697, 3880179, 850686, 908909, 2094222, 2830752, 4055315, 6580899, 8525729, 7575403, 4759662, 3633651, 5801345, 9230403, 11336296, 11905113, 12060820, 11819588, 10214668, 7324252, 4748366, 3885603, 4609251, 5890072, 7003559, 7725331, 7926906, 7596063, 6958223, 5995425, 4154866, 1402657, -545347, 652391]
41795F52391M282965M053079N98048k361872k033775K60501J487086P89323o44535
41786G083211k012636k861447j797116J724183M707407L169475k027630n325862
41778B659585l832603j101113j219650k423170l64166M401131O781988M506872
41770I408874Q37868n90712P9357R84941J380905R50957p22750k272970r60214
41761I096256K946167M899197J817533l203671m952147k977460j011297r63893
41753E650685j385227j268086j343446j386968q2271J664984R77261k111532l536189
41744b820789r15719K687859L104785N67239j686638k036156q90355J465886M156791
41735C632903M388278M76902m566567o039551l820315k109334k877117l374831
$$ y = [652391, 4935356, 8988435, 9586483, 7224611, 5190836, 5451337, 6938423, 7727746, 7083211, 5070575, 2209128, 412012, 2136195, 6843602, 10013077, 7985447, 2659585, -1173018, -2274131, -3493781, -5916951, -6281117, -1879986, 4902002, 9408874, 10246742, 9656030, 9735387, 10720328, 12101233, 13052190, 12329440, 10056470, 9096256, 12042423, 16941620, 18759153, 15555482, 10603335, 7625875, 6614578, 5650685, 4265458, 2997372, 1653926, 266958, 184687, 1849671, 2826932, 715400, -2820789, -3736508, -1048649, 2056136, 2623375, 936737, -1099419, -1989774, -523888, 3632903, 8021181, 8498083, 3931516, -2108035, -5928350, -8037684, -10914801, -14289632]
41727a4289632j050768K662353N095116N790413N229760K923372o25186k242759
41719C492669M27915M748682N354033N86096n498528p767150n046325l10627K792207
41710a221028L070832K072265J651213J628059O69407p72746l66179K405495M490172
41701A3627490K998309p95973l203529k672522m56451K055732L996452L809295
41693A9358803N07070l815263n552661m028385j845407o89991K24786J089374
41685E248326L97016j677204k132770M38979L111545K848260J023540Q03501K068906
41676A2130099K287516J002154p0549n63349j539497k427616j440073Q10476J635673
41667A1824834Q23660J319466M028524N289021J821472m149326p212239m857814
$$ y = [-14289632, -15340400, -12678047, -7582931, -1792518, 3437242, 6360614, 5735428, 3492669, 3920584, 8669266, 14023299, 14609395, 9110867, 1343717, -3702608, -4013235, -1221028, 1849804, 3922069, 5573282, 7201341, 7870748, 7098002, 6731823, 9137318, 13627490, 16625799, 15829826, 12626297, 9953775, 9497324, 11553056, 15549508, 19358803, 19865873, 16050610, 10497949, 6469564, 4624157, 3934166, 4158952, 5248326, 5645342, 3968138, 1835368, 2274347, 5385892, 8234152, 9257692, 10061193, 12130099, 14417615, 15419769, 15349220, 14785871, 13246374, 10818758, 9378685, 10189161, 11824834, 12648494, 13967960, 17996484, 23285505, 25106977, 20957651, 13745412, 8887598]
41659H887598O73693N386655O572049M043074L19950j102089O92509K870762K658047
41650C1002248J297719K180921N563890P492915M481787k327356q345731r950600
41642C1395793p318833l608334j779069k046751k445267j650354l04241O37399
41634A2880343J352377K012851J799562O52206N10895K526474M193591K281484
41626B8209783j772952k891032M88308L648075J857139l274450o264759m820536
41618A5179576j550930N49507J350115J961773K306748J674959N34286L04419
41610B2310453J304435J843749J17776l047908m353811j801503K385191M042494
41602B2800876J951537j307221l224235l614000k457001J375450P116893J0376160
$$ y = [8887598, 9561291, 14947946, 21519995, 25563069, 25883019, 24780930, 25473439, 28344201, 31002248, 32299967, 34480888, 40044778, 47537693, 52019480, 49692124, 41346393, 31395793, 24076960, 20468626, 18689557, 16642806, 14197539, 12547185, 12242944, 12880343, 14232720, 16245571, 18045133, 18697339, 19208234, 21734708, 25928299, 28209783, 26436831, 23545799, 24034107, 27682182, 29539321, 26264871, 20000112, 15179576, 13628646, 14178153, 15528268, 17490041, 19796789, 21471748, 22006034, 22310453, 23614888, 25458637, 25576413, 22528505, 18174694, 16373191, 18758382, 22800876, 24752413, 23445192, 20220957, 16606957, 14149956, 15525406, 22642299, 33018459]
41594C3018459P647584J354337k692476k242821q3222R23175Q53204M84489m87333
41585C8775396j661713j091913K074671N997203Q485904R255969Q983800Q269327
41577G9088644Q552913J1481072J5801653J7668870J6310026J6596789K2689536
41570A88189503L1302167L5265378L2370355K6154943J8493019O817214r681898
41563C28910681k5669205l4683138l6018745l3776941l0895447k7052205k1519406
41556A19295594j5222265r776125o315267n506698p280169j0043209j1057259
41549E4094602q383516k751052K429317L520563J29789m048684n015506k892950
41541C7082563j027258r46224p28163J017817K483142J760421J47881m9119R36617
$$ y = [33018459, 40666043, 42020380, 39327904, 37085083, 37001861, 37925036, 38778240, 39262729, 38775396, 37113683, 36021770, 38096441, 44093644, 52579548, 61835517, 70819317, 79088644, 87641557, 99122629, 114924282, 132593152, 148903178, 165499967, 188189503, 219491670, 254757048, 287127403, 313282346, 331775365, 338592579, 328910681, 303241476, 268558338, 232539593, 198762652, 167867205, 140815000, 119295594, 104073329, 94297204, 87981937, 82475239, 75195070, 65151861, 54094602, 45711086, 42960034, 45389351, 48909914, 49039703, 44991019, 39975513, 37082563, 36055305, 35109081, 34380918, 35398735, 37881877, 39642298, 39790179, 39741060, 40677677]
41532D0677677J678704K717805N111196O986285N316333J008133j376742L84291
41524F2503682L528339M553772L421062K487661L607458P199498J1902952J4378154
41516A13582578J1987264O562733K729629J483603j125438p122595j2297949j2097645
41508A03702180q703701p829638j0261016j1338019q375867m019077j501230n26562
41500E1147070N10809J231179M09917j264726j630648J75070K525718L054540
41492E6158929J525549O97486L239525P524419Q487040L983200j949931m403235
41484G5262982l837967l801988m646959m117116k873347l827805n877074m232599
41476D2048127J427959M822310J914625l058873m057207j493759K20356n0815
$$ y = [40677677, 42356381, 45074186, 50185382, 57171667, 62488000, 63496133, 62119391, 62503682, 66032021, 70585793, 74006855, 76494516, 80101974, 87301472, 99204424, 113582578, 125569842, 132132575, 134862204, 136345807, 135220369, 128097774, 115799825, 103702180, 94998479, 87168841, 76907825, 65569806, 57193939, 53174862, 51673632, 51147070, 51657879, 52889058, 53298975, 52034249, 50403601, 50578671, 53104389, 56158929, 57684478, 58381964, 61621489, 69145908, 77632948, 81616148, 79666217, 75262982, 71425015, 67623027, 62976068, 58858952, 55985605, 52157800, 46280726, 42048127, 43476086, 48298396, 50213021, 47154148, 43096941, 41603182, 41823538, 41772723]
41468D1772723j01324P22040J147974J068914J127695O72447l05641R25151N922608
41459E2952587J0843929J0768332O935170M713370N211061M317601J07590m302566
41451I1547074o293565p141150q315303q768542p683432o097868m255282j140252
41443D1851680J897143J223161l359407o918749n745136j795989J370043L164432
41435C1687178L868306K103056k029914m752130l452855r14162r06387k247569
41427B3355523j328425J719572L622946L050868J230352q87308k416828j451469
41419B6895231J843881L161851l32757m232028k052348N021884R218592O645298
41411D6169604J140090k461136l345750k316057J72313K186848J383918p78899
$$ y = [41772723, 41671399, 42393439, 43541413, 44610327, 45738022, 46410469, 46104828, 47029979, 52952587, 63796516, 74564848, 81500018, 86213388, 91424449, 95742050, 95849640, 91547074, 85253509, 78112359, 69797056, 61028514, 53345082, 47247214, 42991932, 41851680, 43748823, 44971984, 41612577, 34693828, 28948692, 27152703, 28522746, 31687178, 35555484, 37658540, 35628626, 30876496, 27423641, 26509479, 25603092, 23355523, 22027098, 23746670, 27369616, 30420484, 31650836, 30763528, 28346700, 26895231, 28739112, 31900963, 31568206, 27336178, 25283830, 30305714, 39524306, 46169604, 47309694, 44848558, 41502808, 39186751, 39359064, 41545912, 42929830, 42150931]
41403D2150931n12417J760207J706832r13031r07105L291114N904434L087874
41395E5568839l91903R41639M254291L796845Q50040P33404K870814K080904j345789
41386F9359084j149621M514414R716530R987048Q395287R187674J0917430J0257542
41378A31185388Q689787J0475049J5851277K0507465K1412020K0267616K1165114
41371B49553716K6497761L4888771M2039327M4243584M1749370L7477720L1929059
41364E08379308K1592260M080694j7007820l4566624m4197970m6225743m3197163
41357C48856942l8066081l3752458l1284610k8423917k2840903j6513146j3776369
41350A64199458j4656374j3975142q805861l163318k166174m341435l969463L26558
$$ y = [42150931, 41638514, 43398721, 45105553, 44192522, 43285417, 46576531, 52480965, 55568839, 55176936, 56118575, 60372866, 64169711, 65019751, 65753155, 68623969, 70704873, 69359084, 68209463, 72723877, 82440407, 92427455, 100822742, 110010416, 120927846, 131185388, 139875175, 150350224, 166201501, 186708966, 208120986, 228388602, 249553716, 276051477, 310940248, 352979575, 397223159, 438972529, 476450249, 508379308, 529971568, 534052262, 517044442, 482477818, 438279848, 392054105, 348856942, 310790861, 277038403, 245753793, 217329876, 194488973, 177975827, 164199458, 149543084, 135567942, 126762081, 123598763, 121432589, 117091154, 113121691, 113448249]
41342A13448249M083596M238509L227578M190645O009223N964379M622334M762894
41334A50547407O903031Q886888R075898P300308L412757k232329p058643p746364
41326A69088953l820653K106660P487445J1216147J2443812J0815789P933540
41319B17271693N836207L804472n74739o996921j2253662j4892534j6566489j7931651
41311A57696376j7149527j4059781j1825959j2059203j2061239r718300p368413
41304G3453954p315113p170213m098328n87824p71997l222630l069442m9445J342683
41295D8511645n85441k620299k489947j532386o89197J075508L121600K849839
41287D7641322O87094N07917L089582M055016R96766k155762j383685J152146
$$ y = [113448249, 117531845, 121770354, 124997932, 129188577, 135197800, 141162179, 145784513, 150547407, 157450438, 166337326, 175413224, 182713532, 186126289, 183893960, 176835317, 169088953, 165268300, 167374960, 174862405, 186078552, 198522364, 209338153, 217271693, 223107900, 226912372, 226337633, 219340712, 207087050, 192194516, 175628027, 157696376, 140546849, 126487068, 114661109, 102601906, 90540667, 80822367, 73453954, 66138841, 58968628, 54870300, 54282476, 53510479, 50287849, 47218407, 47168962, 48511645, 47926204, 45305905, 42815958, 41283572, 40594375, 41669883, 44791483, 47641322, 48328416, 48836333, 51925915, 55980931, 56977697, 54821935, 53438250, 54590396]
41279E4590396J347586P3082J021931M190995O457441P058903P742464Q395980
41271I0878778P148084M564331L422936L965381L259809O8158l122690m077011
41263A06107776l836597m340563n462175o091041o416021p387567q753232q899781
41255E4920799o504364k087961J806766K495164J11347j924956p29817K334436
41247E0421414L472602J569462o25231n72283R13216J350508j79692k411922l492022
41238E0446052k629662r22101n69396k276942l754607k374783Q97793K400960
41230D1217314R10698o42740K17560J617062K79344l156209m516727j550390L307925
41221C7683837O049423N182442K001954j601671m148778m276812j444270K591515
$$ y = [54590396, 55937982, 56011064, 57032995, 61223990, 67681431, 74740334, 82482798, 90878778, 98026862, 102591193, 106014129, 109979510, 113239319, 113307477, 110184787, 106107776, 102271179, 97930616, 92468441, 86377400, 79961379, 72573812, 63820580, 54920799, 48416435, 46328474, 48135240, 50630404, 50741751, 48816795, 48086978, 50421414, 53894016, 55463478, 54838247, 54265964, 55179180, 56529688, 56349996, 53938074, 50446052, 47816390, 46894289, 46324893, 44047951, 40293344, 37918561, 38816354, 41217314, 42128012, 41485272, 41702832, 43319894, 43599238, 40443029, 35926302, 34375912, 37683837, 43733260, 48915702, 50917656, 49315985, 45167207, 40890395, 39446125, 42037640]
41213D2037640M501066K905736N20493J272216N406032R160243R703977Q418960
41205H3926363P973041P992112O074825K264599l37153J92386K085659K527036
41197A12698868R55292j393704l623287n366473o010289n448635n058074o288362
41189H0465336q288532q256597m565915J132405N186740N024827J159514l306228
41181F8551550n252315m193379k449269k402693l852725m615471l431743j338473
41173D1015482m1920J03328n5422P4475L15583K95451k78839j769725m168789
41164C5489624o410957o977390n544796l371420j683120m20254Q76736J764568
41156A3722991J451184K06611p68955p39579J2250P43828P23840l25962j493999
$$ y = [42037640, 46538706, 49444442, 49964935, 51237151, 56643183, 65803426, 75507403, 83926363, 91899404, 99891516, 105966341, 108230940, 107893787, 108086173, 110171832, 112698868, 113654160, 112260456, 108637169, 103270696, 97260407, 91811772, 86753698, 80465336, 72176804, 63920207, 59354292, 60486697, 65673437, 70698264, 71857778, 68551550, 63299235, 59105856, 56656587, 54253894, 50401169, 45785698, 42353955, 41015482, 40973562, 41076890, 41021468, 41095943, 41411526, 41706977, 41428138, 39658413, 35489624, 29078667, 22101277, 16556481, 13185061, 11501941, 11081687, 11958423, 13722991, 15174175, 15380786, 14611831, 13872252, 13884502, 14628330, 15352170, 15026208, 13532209]
41147A3532209j187153N22758J109962j087196l709053l035012O15008L113822
41139I875345K438941J122585J695273K886605K378137O50489m91217j235056
41131A9321102k862091m861097n492142m350164k332834j04116J562998J359752
41123B241408n03403j359008M00222K470443J978264o2769q05792l42339n93407
41114C423619r09780P03085K870714K368716J27987L61662L182458L777999M42235
41105A6348695k335648j386439N2100j574162l880195k990350k77873M73547l84636
41096D045039m6414P80811o89967l185017k494835J368459L593327J868750p29733
41087D510420j429120j532704k339707j653243K257070O182593N318333j86676
$$ y = [13532209, 12345056, 12867814, 13977776, 12890580, 9181527, 6146515, 6761523, 9875345, 12314286, 13436871, 15132144, 18018749, 20396886, 21047375, 20556158, 19321102, 16459011, 11597914, 6105772, 1755608, -577226, -681342, 881656, 2241408, 1738005, 378997, 779219, 3249662, 5227926, 5165157, 4359365, 4017026, 3423619, 2513839, 3216924, 6087638, 8456354, 8584341, 8946003, 12128461, 15906460, 16348695, 14013047, 12626608, 12678708, 11104546, 7224351, 4234001, 3956128, 4429675, 4045039, 3998625, 4779436, 4089469, 904452, -1590383, -221924, 3371403, 5240153, 4510420, 3081300, 1548596, -791111, -2444354, -187284, 5995309, 11313642, 11126966]
41079A1126966n189553n620304k130164K068624M577189M543229K087150j616024
41071I847113m571563n586786n426194n283015m294644l14969O011987R842279
41063B24208P137339K70481m233660l637893j471345j176530j064209J678600
41055b273009N049835M545987J54570l250470k652160l36865L22401o17617j011100
41046f8428k50558L87151p0745j239836k083436j907643r54392k06714k08120
41037f602721l06757K37899Q25827K30396j548121l177290l460508k034383P63765
41028a5071893L622768M634360L281846J302432L30604j07291p40993n31300J036700
41019b242767J474822j382998m809057m048630P62426M863490N878133N749041
$$ y = [11126966, 5937413, 317109, -1813055, 255569, 4832758, 9375987, 11463137, 9847113, 5275550, -311236, -5737430, -11020445, -15315089, -15630058, -9618071, 224208, 7361547, 7632028, 3398368, -239525, -1710870, -2887400, -3951609, -2273009, 2776826, 7322813, 7477383, 4226913, 1574753, 1237888, 1560289, 942672, -68428, -318986, 68165, -2580, -1242416, -3325852, -5233495, -6187887, -6394601, -6602721, -6909478, -6671579, -5845752, -5615356, -7163477, -10340767, -13801275, -15835658, -15071893, -11449125, -6814765, -3532919, -2230487, -1899883, -2007174, -2748167, -3279467, -2242767, -767945, -2150943, -6960000, -11008630, -10246204, -5382714, 495419, 6244460]
41011F244460N363931K860172j188116k732502j145784j392453n417284p130650
41003d538226j623805N571629N716013k0390k925458n34701J000165j232435k066047
40994f53255J576750M174233P74505m002513l139237J263027J606140k536548
40986i36898l854612N05710M286107K262308j670907j060347L125730M574991
40978G232082J345407j945985j367065J398156K375941L82185k659252m469924
40970B291545m250560k952886k302986k605809j854868J269209M127725K802277
40962c476353j715230l630847k00147M054930L700072o5222j932673l89027J356461
40953b298036J369455J220297J916655J953233P04765J25136J288296K201460
$$ y = [6244460, 11608391, 14468563, 13280447, 10547945, 9402161, 8009708, 2592424, -4538226, -6162031, -590402, 5125611, 5105221, 2179763, 1645062, 2645227, 1412792, -653255, 923495, 5097728, 5872233, 1869720, -1269517, -6490, 1599650, -936898, -4791510, -4285800, 307, 2262615, 591708, -468639, 2657091, 7232082, 8577489, 6631504, 5264439, 6662595, 9038536, 9420721, 6761469, 2291545, -1959015, -4911901, -7214887, -9820696, -11675564, -10406355, -6278630, -3476353, -5191583, -8822430, -9022577, -4967647, -1267575, -1332797, -3265470, -3654497, -2298036, -928581, 291716, 2208371, 4161604, 4866369, 4991505, 6279801, 8481261]
40945H481261J042252q08268r55228O41690K211532K487259J113593j565094l895565
40936H753432l912966k058179q32842p86232L19146K835299L214024m99224m267323
40927B765135l046467J911999M849114L237582l66355l276920n115244n449585
40919d490741l328283M8289J728727R79948r7956l55142p41060j208790j95486
40910g660494J738079J565115j153685k484794K11261L979175M483989J930662
40902B609308l49712j160962j874539k875879k951532j831160n93264L83048J695135
40893f949557L239924M033940L482734J447014k122975n898867o661196k639074
40885a2068057L091721N221549K416700j370906k126338r0325J756044J484399
$$ y = [8481261, 9523513, 8715245, 7760017, 8401707, 10613239, 13100498, 14214091, 12648997, 8753432, 4840466, 2782287, 1949445, 1163213, 1482359, 4317658, 7531682, 7032458, 2765135, -281332, 1630667, 6479781, 9717363, 9351008, 6074088, 958844, -4490741, -7819024, -7770735, -6042008, -5062060, -5160016, -5515158, -6256218, -7465008, -7660494, -5922415, -4357300, -5510985, -7995779, -7784518, -3805343, 678646, 2609308, 2259596, 1098634, -775905, -3651784, -6603316, -8434476, -9027740, -8644692, -6949557, -3709633, 324307, 3807041, 5254055, 3131080, -2767787, -9428983, -12068057, -8976336, -3754787, -1338087, -2708993, -4835331, -4925656, -3169612, -1685213]
40877a685213m99662k483598k805000j178209Q07385J433256J171080J941500
40869c298461L976321N118559L745262P92770j754423k865295k360864n85828
40861B768041Q85884K4228k802700m285055k082345J978981M294986L929237K750293
40852G461550K035688J237184m4328r88475r53256n56648q79154k309400m095521
40843I07640m460561j957808K231530M480890K904645K04891m4724J142537j16525
40834E292515l690842m598079l95092M631550N215883J812431j493244k949795
40826C825327l326749k396670L49596K650528J641598j276080k048767l80293
40818i61510J40700j181596n57232L216168N362709K283644k297828k864090m13024
$$ y = [-1685213, -2184875, -4668473, -7473473, -8651682, -7844297, -6411041, -5239961, -3298461, 677860, 5796419, 9541681, 10334451, 8580028, 5714733, 3353869, 2768041, 3653925, 3678153, 875453, -3409602, -5491947, -3512966, 782020, 4711257, 7461550, 9497238, 10734422, 10690094, 9701619, 8748363, 8191715, 7312561, 5003161, 907640, -3552921, -5510729, -3279199, 1201691, 4106336, 4311227, 4266503, 5409040, 5292515, 1601673, -2996406, -3391498, 1240052, 6455935, 8268366, 6775122, 3825327, 498578, -1898092, -1548496, 1102032, 2743630, 1467550, -581217, -961510, -820810, -2002406, -2559638, 656530, 6019239, 8302883, 6005055, 3140965, 2727941]
40809B727941K6197k061006k569036n26978J66991k133278l458185n47416L711559
40800d663211M489082J709824r06317j457432r49620L0930K022519M081535L766497
40791H123807O78466k412530l225142k838099l370904m320328l318634Q0688L594603
40782g008073N407895O117185O568908N679859K276827k072062m379804l990762
40774H599973k719988j466928M42948K118454Q38125l232854n349218k262367
40766c031855K544988L438747N34359j411735p96370n28529j479027m35816L346441
40757B181203M917104P01205n180240o211814k525299J51895q09169k229640j158130
40748a0162885Q39134Q55169r74697k130994j138542R92416K001670O56687j604313
$$ y = [2727941, 2754138, 693132, -1875904, -2402882, -2235891, -4369169, -7827354, -8374770, -4663211, -174129, 1535695, 629378, -828054, -1777674, -1746744, 275775, 4357310, 8123807, 8802273, 6389743, 3164601, 326502, -3044402, -7364730, -10683364, -10602676, -7008073, -1600178, 4517007, 11085915, 16765774, 19042601, 16970539, 12590735, 8599973, 5879985, 4413057, 4856005, 6974459, 7812584, 4579730, -769488, -3031855, -486867, 2951880, 3486239, 2074504, 1278134, 749605, -729422, -1165238, 2181203, 7098307, 7799512, 2619272, -3592542, -6117841, -5965946, -6775115, -9004755, -10162885, -9323751, -8468582, -9443279, -11574273, -12712815, -11720399, -9718729, -9062042, -10666355]
40739a0666355j801793P56487K819105J277302k096839k804034j35582J833230
40731a0818479M06954j959987j765460M86565J799897J364496R75628J627531
40723g882855K177206J430516j49970j112580n05096J258823K526218J915016
40715c42722J51924n44662M55184J119820m5560j280544j31358K296780K341499
40706D020361r86452m359495m477532j933715L93241J030580M85333n51185j739755
40697h118619k417599k048865j231666r30095p84801M17242K423432L196497J684224
40688g810250l36970m48664J084912J682028O8029j940035j852437L92023K678700
40679f482664L372238K567761R61042j172486l351852m195342k450701J207110
$$ y = [-10666355, -12468148, -11711661, -8892556, -7615254, -9712093, -12516127, -12651709, -10818479, -10411525, -12371512, -14136972, -13650407, -11850510, -10486014, -9510386, -7882855, -5705649, -4275133, -4425103, -5537683, -6042779, -4783956, -2257738, -342722, -190798, -735460, -280276, 839544, 793984, -486560, -617918, 1678862, 4020361, 3033909, -1325586, -5803118, -7736833, -7343592, -6313012, -5827679, -6378864, -8118619, -10536218, -12585083, -13816749, -14746844, -15531645, -15114403, -12690971, -9494474, -7810250, -8147220, -8595884, -7510972, -5828944, -5760915, -7700950, -9553387, -9161364, -6482664, -3110426, -542665, 418377, -754109, -4105961, -8301303, -10752004, -9544894]
40671i544894M096622L865051J015773j329995p51421J556434K124551k42444
40663G89677k530582j302717K575399M921331L669064J062907o3112J56660J28326
40654I406953k59598l90053j106411l363686n307872l713254J219346N083836
40646A569261M352416L23770l059323l605823j934874K07929J226103M93896p65418
40637a192063n09371J211847J944408O43352l70831O50134J325461j134696m403971
40628a835730l685094N96815K640446k61489l808274l308417N4462K494499L350256
40619c762526L749573K710881p89455l937329l206147k44368K62621j956191k595616
40610i768557j66135J955744J981063K566986M860753N095322Q85855l572729
$$ y = [-9544894, -5448272, -1583221, -567448, -1897443, -2648864, -1092430, 1032121, 789677, -1740905, -3043622, -468223, 4453108, 8122172, 9185079, 9121967, 9278627, 9406953, 9147355, 8757302, 7650891, 4287205, -1020667, -4733921, -3514575, 1569261, 5921677, 6245447, 3186124, -419699, -2354573, -2146644, -920541, -426645, -1192063, -1701434, -489587, 1454821, 2098173, 1727342, 2377476, 3702937, 2568241, -1835730, -5520824, -4924009, -2283563, -2545052, -6353326, -9661743, -9607281, -7112782, -3762526, -12953, 2697928, 1908473, -2028856, -5235003, -5479371, -5216750, -7172941, -9768557, -9934692, -7978948, -5997885, -3430899, 1429854, 6525176, 7411031, 3838302]
40602C838302l266358M2557J013741r38968j876250m03553R80855J121683J483462
40593A995471J937127M23354k182896j820720K314958N453899L723012p66168
40585A1078037l741488m254472l678291k435729p97853k73809j145651j052075
40577f301331J036395K186920K74384j564290L34155L521670K944013n88730j563229
40568B79957J111037K646627Q46125n45759Q59337J703542o50522k775946j018842
40559B455556J746000P17403k627406k878414N61564L023742K286067J107182
40551F391694J582677K031450Q14335r44553k045535l119307m284020m057150
40543c630409k232466r64267j275258j104993J355136M654115O119368M924190
$$ y = [3838302, 571944, 614501, 1628242, 689274, -1186976, -1590529, -609674, 512009, 1995471, 3932598, 4355952, 2173056, 352336, 2667294, 8121193, 11844205, 11078037, 7336549, 3082077, -596214, -3031943, -3829796, -4103605, -5249256, -6301331, -5264936, -3078016, -2803632, -4367922, -4033767, -512097, 2431916, 1843186, 279957, 1390994, 4037621, 4883746, 4337987, 5197324, 6900866, 6250344, 3474398, 2455556, 4201556, 4918959, 2291553, -586861, -25297, 2998445, 5284512, 6391694, 7974371, 10005821, 10820156, 9875603, 7830068, 4710761, 426741, -3630409, -5862875, -6827142, -8102400, -9207393, -7852257, -3198142, 2921226, 7845416]
40535G845416J806053k042425m484658l358587M57079L241127L207106K437869
40527I108980K536861J799132q30286k624379j477305k16993k138544m945273
40519A212193m327199j585676j663747m346701l952391J299042N817132M950099
40511b597248J523599O51871K025088J455257k229943n675819n522195j790172
40503a2159562K828305N412073M934954K788196P44612j190536l345945l767241
40495c755144k97922M809905O401072L459427M72394K79893K27157k013822l656627
40486E926333j833067P86858M07015j132636L69511L709946L802437j08006l566193
40477H362198l969942l033070k057727k29180J624388R61646j356127r64230L035721
$$ y = [7845416, 9651469, 7609044, 3124386, -234201, 222878, 3464005, 6671111, 9108980, 11645841, 13444973, 12614687, 9990308, 8513003, 8296010, 6157466, 1212193, -3115006, -4700682, -6364429, -10711130, -14663521, -13364479, -7547347, -2597248, -1073649, -421778, 1603310, 3058567, 828624, -4847195, -10369390, -12159562, -9331257, -3919184, 1015770, 3803966, 4548578, 3358042, 12097, -3755144, -4053066, 756839, 7157911, 10617338, 11089732, 11369625, 11596782, 9582960, 5926333, 4093266, 4880124, 5287139, 4154503, 4524014, 8233960, 12036397, 11928391, 8362198, 4392256, 1359186, -698541, -927721, 696667, 1658313, 302186, -662044, 2373677]
40468B373677N782946L780873j38982j899678k067305l048076l934979k442119
40460a593643L53230J424341N84190J38499O91025P58550Q9306J80616J410402
40451D036516K183366J227273r88513l054469l536142j741522J062787K230781
40443A420077J049781L4385R92932J714502m24892l249573k425144J221487J935338
40434B268893k282316n938894l753154J657059L719523J193605j074936J6553
40426d193667J941122J591726J88064M84865J745276J009884j667775k844863
40418a745368r05272J474353J394494k22904n65923R62907K798797L987907M453843
40409A1632834L486117O81494k129921k723857k021876k746734m493579l762497
$$ y = [2373677, 8156623, 11937496, 11798514, 9898836, 7831531, 4783455, 848476, -1593643, -1240413, 183928, 768118, 906617, 1597642, 2356192, 2445498, 2626114, 4036516, 6219882, 7447155, 6458642, 3404173, -131969, -1873491, -810704, 1420077, 2469858, 2504243, 3497175, 5211677, 4786785, 1537212, -887932, 333555, 2268893, -13423, -5952317, -9705471, -8048412, -4328889, -3135284, -4210220, -4193667, -2252545, -660819, -472755, 12110, 1757386, 2767270, 1099495, -1745368, -2650640, -1176287, 218207, -4697, -570620, 392287, 3191084, 7178991, 11632834, 15118951, 15800445, 13670524, 10946667, 8924791, 6178057, 1684478, -2078019]
40401b078019J61794L163710K160754l66717n41694J010485R35236j099845k238797
40392A106907j108887Q48722K273559K822673J493166k428393o322812n704194
40384g019259j33443N132665N166973R60465k728902l266916j793651k45690P88257
40375c139501J240603N63653j408600l232113k558052J303783N712396O607985
40367E090154K844940k045890l481156q49482K197498K221114n01434k963687
40359B512057k726046p044K632409K637498K04376j716855j123549J69388q59567
40350A722667l616925m346468j658850J325601J663754P08625J267333K740631
40342a93632K293809L2843n03650K264564M988354L668762q65900m056994l443555
$$ y = [-2078019, -1916225, 1247485, 3408239, 3041522, 2499828, 3510313, 4445549, 3345704, 1106907, -1980, 846742, 3120301, 5942974, 7436140, 5007747, -1315065, -7019259, -7152702, -2020037, 3146936, 4107401, 1378499, -1888417, -3682068, -3927758, -3139501, -1898898, -1335245, -2743845, -5975958, -8534010, -7230227, -1517831, 5090154, 7935094, 5889204, 2408048, 1558566, 3756064, 5977178, 5475744, 2512057, -213989, -221033, 2411376, 5048874, 5253250, 3536395, 2412846, 2582234, 1722667, -1894258, -6240726, -7899576, -6573975, -4910221, -4201596, -2934263, -193632, 2100177, 2133020, 1629370, 3893934, 8882288, 12551050, 11685150, 7628156, 4184601]
40333D184601r55910P88127J856841L089977K900051r46365o690402q974110n215273
40324i962463P05569L059781J048937j145967j22546L172975N334899M086673
40316F177858N1394l614991l652826j30059L106607K807661Q9672k044622l327981
40307e37287n116422n865515k433625L653339O258109L024567q02777p3164K883473
40298I90698K936068Q37497J354270M256566L748723k207893p820016p336402
40290c240489k592278P04951R31137P38431J337417J107398m01880j119010r246
40281b543569J131668Q17897K75620R72771J877085J380744L21686M06957O40753
40272E281612j508999n412276o972880m003159Q51595L946956M735834M131991
$$ y = [4184601, 3228691, 4016818, 5873659, 8963636, 11863687, 10917322, 4226920, -4747190, -9962463, -9256894, -6197113, -5148176, -6294143, -6416689, -3243714, 2091185, 6177858, 6229252, 2614261, -1038565, -1168624, 1937983, 4745644, 4835316, 2790694, -537287, -5653709, -11519224, -13952849, -10299510, -4041401, -1016834, -1819611, -1892775, 990698, 3926766, 4764263, 6118533, 10375099, 14123822, 11915929, 4095913, -3240489, -5832767, -5127816, -4196679, -3458248, -2120831, -1013433, -1415313, -2534323, -2543569, -1411901, -594004, -318384, 654387, 2531472, 3912216, 4233902, 4640859, 5281612, 3772613, -1639663, -8612543, -12615702, -11764107, -7817151, -3081317, 1050674]
40264A050674J621279k733604n366877k538330L698234O812259L846009j173869
40256E215775l003080j248546R79692J615651M50228k434068o168765q129888
40248a2723001o130110j367707K661995L958855L254129K013785J026953Q61221
40240f443880J927690L565996M156246K714319j7647k151296k121164K2011K380301
40231D032576K758507R28430j101324j390157p699J540556J887478N15580j897482
40222G266465l385213k325123K37857J464012N76737j64797O04990R53628q72514
40213D356042k986468k682655p80829J84428O21694K800861N821871N902515K011911
40204A5249370k610013n185656n921222n082034j880507K008043K262117j739601
$$ y = [1050674, 2671953, -61651, -5428528, -7966858, -4268624, 2543635, 6389644, 5215775, 2212695, 964149, 1943841, 3559492, 4009720, 1575652, -4593113, -12723001, -18853111, -20220818, -17558823, -13599968, -10345839, -8332054, -7305101, -6443880, -4516190, -950194, 3206052, 5920371, 5902724, 3751428, 1630264, 1652275, 4032576, 6791083, 7719513, 6618189, 5228032, 5220333, 6760889, 8648367, 9163947, 7266465, 3881252, 1556129, 1793986, 3257998, 3834735, 3669938, 4274928, 5228556, 4356042, 1369574, -1313081, -2093910, -1909482, -1287788, 1513073, 7334944, 13237459, 15249370, 12639357, 7453701, 1532479, -3549555, -5430062, -3422019, -1159902, -2899503]
40196b899503m192435m42893N650996O638925J907183k047823j311603Q78735
40188D181582M85258j227330q00035J464402K215949K96151j896844k057233o24688
40179B037212N60773O22616J5948n71883r89523j357685j270318K22542L075110
40170B344792M998218L373763r72413l647261j812409J961103K980305N40003
40162I766101j864704k008874j454199j923113k295476j037399P83778J202530
40154A168644L53730n07674j418514k590554k354074N78429L669197K999700r05019
40145I93865l329478j957326M69353J152723J044247J607910J398616j001030
40137C78880l309674k432453N85117J949362N31942j269882j485012l81823J365573
$$ y = [-2899503, -7091938, -7534831, -1883835, 4755090, 6662273, 4614450, 3302847, 4181582, 4666840, 3439510, 2639475, 4103877, 6319826, 6615977, 4719133, 2661900, 2037212, 2597985, 3220601, 3236549, 2664666, 1675143, 317458, -952860, -730318, 2344792, 7343010, 10716773, 9744360, 6097099, 4284690, 6245793, 9226098, 9766101, 7901397, 5892523, 4438324, 2515211, 219735, -817664, -33886, 1168644, 1522374, 1014700, -403814, -2994368, -5348442, -4770013, -1100816, 1898884, 993865, -2335613, -4292939, -3823586, -2670863, -1626616, -18706, 1379910, 378880, -2930794, -5363247, -4778130, -2828768, -2296826, -3566708, -5051720, -5433543, -4067970]
40128d067970L469367M935826M634101L042172J401711m24183k912171m386285
40120E692568k638870J092885L013006J941797L76889j30494j087768l342243
40112D917770m793279l840431k163709j758203j684079j91386K046313L251850
40104d215154L215796K361470J99661k712781l481974q39519J483850o36343m870310
40095i495304m744969J138270O686162O344834J694375j943603k340644j250753
40087c911632o03273n42328m20599J55596R23407Q41140o67088j986736p25438
40078f936951K374741L430640Q93163j701274j001408P98648l57878l341626l390615
40069i232560m5783J982626P63158K91820L066305M729799O27666n964602p584419
$$ y = [-4067970, -598603, 4337223, 8971324, 12013496, 13415207, 12991024, 10078853, 5692568, 3053698, 4146583, 7159589, 9101386, 9478275, 9347781, 8260013, 4917770, 124491, -3715940, -5879649, -7637852, -9321931, -9513317, -7467004, -4215154, -999358, 1362112, 1561773, -1151008, -4632982, -5472501, -3988651, -4624994, -9495304, -14240273, -13102003, -6415841, -71007, 1623368, -320235, -2660879, -3911632, -4514905, -5057233, -5477832, -5322236, -4398829, -3557689, -4224777, -6211513, -6936951, -4562210, -1131570, -238407, -1939681, -2941089, -2142441, -2500319, -5841945, -9232560, -9278343, -7295717, -6532559, -6240739, -3174434, 1555365, 2183031, -3781571, -11365990]
40060a1365990k673211L280427N724362N019656K741331n16800k753102j256400
40052a799727K339805K400183k709969p226473n795637q35669J785123J153423
40044a0688941Q27381K296236L837083M637767N336556M996023J987927k143436
40036A1086596l822693k664579j691785k141256k153470j174969j258426k638739
40028f459321k267967J137183M320424M284738K624537K193876K214199O6682
40020H114351l812763o098010m841887j186789K454285M039579K747041J31910
40012A547717n41599J889621M240371K675803j945742m732776k865129R62612
40004A230878K036490o09938l195186k054291J576368L144289J115787p37266
$$ y = [-11365990, -14039201, -10758774, -5034412, -14756, 2726575, 2209775, -543327, -1799727, 540078, 2940261, 230292, -6996181, -12791818, -13627487, -11842364, -10688941, -9861560, -7565324, -3728241, 909526, 6246082, 11242105, 13230032, 11086596, 7263903, 4599324, 2907539, 766283, -1387187, -2562156, -3820582, -6459321, -8727288, -7590105, -3269681, 1015057, 3639594, 5833470, 8047669, 8114351, 4301588, -1796422, -6638309, -7825098, -5370813, -1331234, 1415807, 1547717, 1006118, 2895739, 7136110, 9811913, 7866171, 3133395, 268266, 1230878, 3267368, 2657430, -537756, -2592047, -1015679, 2128610, 3244397, 2507131]
39996B507131J010578M071918L978193J020585q33133r01784k148001m396195
39988D309292l443804J206515L920106J495973j547651n01271K011434J290431
39980H741025j337931j843580j065958k116405l226353o85819L065217K230551
39972C760747k311429l869544r66709Q00904q20844j030524K435221M206588M44705
39963B649115l914578k945741P58901Q89767k272122l188877l72137K225019K281445
39954c889208J745656K149781K125336N94789j144502j627713j029899j15468
39946a191228O73506Q49646K71873k31459j27257l99514j708264k247406J05565
39937d004538L942647N309100K812243n85300j563070l26520N10984l79266j678283
$$ y = [2507131, 3517709, 7589627, 11567820, 12588405, 11755272, 10853488, 8705487, 4309292, 865488, 2072003, 5992109, 7488082, 5940431, 5439160, 7450594, 8741025, 7403094, 5559514, 4493556, 2377151, -849202, -1535021, 1530196, 3760747, 1449318, -2420226, -3386935, -2586031, -3406875, -4437399, -2002178, 2204410, 2649115, -1265463, -4211204, -3452303, -2562536, -4834658, -8023535, -8395672, -6170653, -3889208, -2143552, 6229, 2131565, 2726354, 1581852, -45861, -1075760, -1191228, -517722, 331924, 603797, 372338, 245081, -154433, -1862697, -4110103, -4004538, -61891, 5247209, 8059452, 7474152, 5911082, 5584562, 6095546, 5716280, 4037997]
39928D037997j417301L94874J524726J42565k663591m028895k991864j537911
39920f539400j411218j602005k59797K306560M137264M182070K855553Q06450
39912D475477j391840k843332k930582k087130j257148j046879j654824k559844
39904a1296102k100421Q78939M474780N036731J977724j147790j591300o07327
39896d374766m0266Q37476K285262J455726k946475o165223k901456M155441O993904
39887g00377L204209j422523j942289k68758j02472q98747k45214J277937J299180
39878B00946k47050j265016o71239O82887J437288Q13998o81133j024321J228685
39869D75045M172244M164487Q94447j879344j698376m43765m23295p05808K45088
$$ y = [4037997, 2620696, 3015570, 4540296, 4682861, 2019270, -2009625, -5001489, -6539400, -7950618, -9552623, -9812420, -7505860, -3368596, 813474, 3669027, 4475477, 3083637, 240305, -2690277, -4777407, -6034555, -7081434, -8736258, -11296102, -13396523, -12517584, -8042804, -3006073, -1028349, -2176139, -3767439, -4374766, -4415032, -3577556, -1292294, 163432, -2783043, -8948266, -11849722, -7694281, -700377, 2503832, 1081309, -860980, -1129738, -1232210, -2130957, -2376171, -1098234, 200946, -46104, -1311120, -1982359, -1299472, 137816, 951814, 270681, -753640, 475045, 4647289, 8811776, 9706223, 7826879, 6128503, 5684738, 5261443, 4555635, 4800723]
39860D800723J284766Q73566Q3871K13058j46135k152899l219440o93848K788446
39851C832108K423600j318491l384105j923660j20084K23569J353079M087429
39843E173445M952997J772962k213995l332999k909861l777385m521580k008074
39835f864490K357110L978455J943447j56045j85438K72267R7641N58336J742047
39826C743330J301531j169720k292123q0138K391578J746616j56128N96800L341625
39817I423371L892488J224372j515654k635500l929129o091145o426269l231587
39809i289053R30020K797041K609027K332864K128420J290801O26904R21347P62845
39800E110216r53533j970444J27601K771807R74634m873784q381167n672675l87357
$$ y = [4800723, 6085489, 6959055, 7042926, 7255984, 7109849, 4956950, 1737510, 1043662, 3832108, 6255708, 4937217, 1553112, -370548, -490632, -267063, 1086016, 5173445, 10126442, 11899404, 9685409, 6352410, 3442549, -334836, -4856416, -6864490, -4507380, -528925, 1414522, 1258477, 1073039, 1345306, 1442947, 2001283, 3743330, 5044861, 3875141, 1583018, 1502880, 3894458, 5641074, 5484946, 6081746, 9423371, 13315859, 14540231, 13024577, 10389077, 6459948, 368803, -6057466, -9289053, -8359033, -5561992, -2952965, -620101, 1508319, 2799120, 3426024, 4347371, 5110216, 4156683, 2186239, 2313840, 5085647, 6060281, 1186497, -7194670, -12867345, -13254702]
39791a3254702K086862J687071J711900K593542J921821l60335j055488J307652
39783c361677L789935K886022q71363l759512l303918m93313J986326K531400
39775e96100J494139P7651r79125j585535j723515j357334r09514j071683j764582
39766h415598j926926r08985M74011J040558R95979J603499L120069M068454L084699
39757C135760R00741k77958O40300K319826K705661J600385N87099L24252o56871
39748A1279195l316599n446604l870488P29689L602930J610384k828900n078232
39740c318625l977390k008475q04662O74044L230513N245298M734183K124180
39732E899066m46522j863054k807911m020556m807084l671441k50652L595127
$$ y = [-13254702, -11167840, -9480769, -7768869, -5175327, -3253506, -3613841, -4669329, -3361677, 428258, 3314280, 2442917, -1316595, -4620513, -5113826, -3127500, -596100, 898039, 975690, -3435, -1588970, -3312485, -4669819, -5579333, -6651016, -8415598, -10342524, -11251509, -10777498, -9736940, -8740961, -7137462, -4017393, 51061, 3135760, 4036501, 3758543, 4398843, 6718669, 9424330, 11024715, 11611814, 11936066, 11279195, 7962596, 2515992, -1354496, -624807, 2978123, 4588507, 1759607, -3318625, -7296015, -9304490, -10109152, -9435108, -6204595, -959297, 3774886, 5899066, 5452544, 3589490, 781579, -3238977, -8046061, -11717502, -11968154, -8373027]
39724h373027N053480L192569K29971q06328M57773J618810Q35049j089498k471461
39715a352662l079835l431975k924162n99328K496467L710586K118617m2097k45763
39706c350152J094017J532939J52821j269046q53572P81171J320482k52595k253752
39697c097687k137153N48475L441266L799396J457476j066559j440783Q0218J455250
39688C039899J437546O02157J62594P56007K342891M166175M516825J814832l168190
39679A5670736p078439p153759m136928r33261J040474K562776L880001L466203
39671G317803N60017k656171l152988p63821J702989J906448K10516j559591k254653
39662A310549j856445r35642l60480o98533j203806k82128K080647L278531J046890
$$ y = [-8373027, -3319547, -126978, 102993, -703335, -245562, 1373248, 2208297, 1118799, -1352662, -4432497, -7864472, -10788634, -11387962, -8891495, -5180909, -3062292, -3104389, -3350152, -2256135, -723196, -570375, -1839421, -2692993, -1911822, -591340, -843935, -3097687, -5234840, -4686365, -1245099, 2554297, 4011773, 2945214, 1504431, 1584649, 3039899, 4477445, 5079602, 5242196, 5998203, 8341094, 12507269, 17024094, 18838926, 15670736, 8592297, 1438538, -2698390, -3631651, -2591177, -28401, 3851600, 7317803, 7877820, 5221649, 2068661, 1304840, 3007829, 4914277, 5124793, 3565202, 1310549, -545896, -1481538, -1842018, -2540551, -3744357, -4026485, -1945838, 1332693, 2379583]
39653B379583k964487m546264k187979R85599J535372Q0102m99558J93469j23836
39644e147999k065460k934366o06707L030325M337360K512547J15267n75508o1388
39635a395929k18820j525781k389030j052390K135959M666329M390824J827267
39627F438429p05684j915852k361356k664983k613222k302260k214588j530054
39619i869570J245390M725162M597953l55681m860182l525960J220196K332871
39611d489821j441633l911887j218610K439513J973733m63352O10353M795273
39603a706431O115397J975061l214719m415786k103193j68116l99626j304747
39595e222160r32392J140477L953648N765330M908852J381616k474825l971015
$$ y = [2379583, -584904, -5131168, -7319147, -6333548, -4798176, -4718074, -5217632, -5024163, -5147999, -7213459, -10147825, -10754532, -7724207, -3386847, -874300, -759033, -1334541, -1395929, -1614749, -3140530, -5529560, -6581950, -4445991, 220338, 4611162, 6438429, 5732745, 3816893, 1455537, -1209446, -3822668, -6124928, -8339516, -9869570, -8624180, -3899018, 698935, 343254, -4516928, -8042888, -6822692, -4489821, -5931454, -9843341, -11061951, -8622438, -6648705, -7112057, -6501704, -1706431, 4408966, 6384027, 3169308, -1246478, -3349671, -3517787, -3917413, -5222160, -6154552, -5014075, -1060427, 4704903, 9613755, 10995371, 8520546, 4549531]
39587D549531k955982j853380k425648l322253j812386K320269N873894N723571
39579F097616K242974j571490l454674l114003j034104J881954L588628K146035
39571F782936j476306l700971k559697n4316Q72701J37155l09498K21403O57361
39562E70768K91740m08140q70566r20640m92616O1086j01515j018839j400850
39553d289572o84847n23790k343998m311855l194948R19888M233178M018126J663097
39544d514721J13196J07955K53809k55333l83714J293190M375630O234973M513327
39535A1738312K62428k637584k084311l39396n34808k219846k710524j462556
39527A1715k8713J361624L445203M499268J623752l810429o349036l719160J73397
$$ y = [4549531, 1593549, -259831, -2685479, -6007732, -7820118, -5499849, 374045, 6097616, 8340590, 6769100, 3314426, 200423, -833681, 1048273, 4636901, 6782936, 5306630, 1605659, -954038, -1008354, -135653, 1502, -307996, -86593, 570768, 862508, 454368, -416198, -1336838, -1829454, -1768368, -1869883, -2888722, -4289572, -4974419, -5498209, -7842207, -12154062, -15349010, -14429122, -10195944, -6177818, -4514721, -4401525, -4293570, -4039761, -4295094, -4678808, -3385618, 990012, 7224985, 11738312, 12000740, 9363156, 7278845, 6939449, 6404641, 4184795, 1474271, 11715, -16998, 1344626, 4789829, 9289097, 10912849, 7102420, 753384, -2965776, -2792379]
39518b792379J575181J903227L378634L924814R75805k824572l062087p05238
39510B373385k77277j989396j598892J832202L987936K387406r7244r16464j770024
39501C931632l776218l623371J045426O131761O062052J839712j040136j038467
39493I532391j339170k813576k288925J033875K995023Q52727k243330k402760
39485C326255r76042j513771l516166l725545k085148j605667k547285j491038
39477a4134407K617753N645190L884641m49035k283627m70486J584601J337323
39469b268047Q2846K6403Q18315M69341j501727l398351l613968k428430j230212
39460a3043830o72316k49331N30177J284641J282155L29575j066818j916533j047311
$$ y = [-2792379, -1217198, 686029, 4064663, 7989477, 8965282, 6140710, 3078623, 2373385, 2096108, 106712, -1492180, 340022, 4327958, 6715364, 6618120, 5701656, 3931632, 155414, -3467957, -2422531, 3709230, 9771282, 11610994, 10570858, 9532391, 8193221, 5379645, 3090720, 4124595, 7119618, 7972345, 5729015, 3326255, 2350213, 836442, -2679724, -6405269, -8490417, -10096084, -12643369, -14134407, -11516654, -5871464, -1986823, -2435858, -4719485, -5189971, -3605370, -2268047, -2185201, -2158798, -1340483, -871142, -2372869, -5771220, -9385188, -11813618, -13043830, -13716146, -13965477, -13435300, -12150659, -10868504, -10538929, -11605747, -13522280, -14569591]
39451a4569591J765487M459144L912720l8298l017200q30204M665625P110488
39443C458171L515891k064743l979101j697945Q84324J079493j80574p95737n3189
39434A66590J271071J786297M63844k094306l629280k635674m43798L81458n63539
39425e297337j133442K98299K596910L098898N61380l239543m831029k548943
39417a0494807J222471K494796O32246r49878R4163J539802K31503k734199l372130
39408a1336033m15509L284478M660037L314513P64776r74145l59941J964081K879949
39399C782206M04145l119605l877451j704315N66254J789536K811710K851691
39391C504171J66459l496679l901128p47624J555987Q99965L65770K104388L374773
$$ y = [-14569591, -12804104, -8344960, -4432240, -4470538, -7487738, -8317942, -3652317, 3458171, 6974062, 4909319, 930218, -767727, 116597, 1196090, 1015516, 219779, 166590, 1437661, 3223958, 3687802, 1593496, -2035784, -4671458, -5115256, -4733798, -5297337, -6430779, -6132480, -3535570, -436672, 124708, -3114835, -7945864, -10494807, -9272336, -6777540, -6145294, -7095172, -7001009, -5461207, -5229704, -7963903, -11336033, -11751542, -8467064, -3807027, -492514, 272262, -701883, -1061824, 902257, 3782206, 4186351, 1066746, -2810705, -4515020, -3948766, -2159230, 652480, 3504171, 3670630, 173951, -3727177, -4474801, -2918814, -2018849, -1653079, 451309, 3826082]
39382C826082J736456m42342m13101J09578j312291k915136k063413k65267r6501
39373a835935j39292J778606L087908K64095l932177l651406N68040K346098m56111
39364a970174k998814j844444N39526J628800K872143M913333M556730M43686
39356H140786l021566j851816J242403J360442r34434j427642M77800J445481
39348E431454J53442j198783j226035j083478j463037j415035q67113j212153
39340b880738k435604k411221l26665J521834R47295q69564j127009O64286K300649
39331d616737K104654R28885N12937Q51393J95893k316545m880042m674964j214128
39322a3108654K761575M041417K062967r87842k586806j945787j68905J082922
$$ y = [3826082, 5562538, 5120196, 4707095, 4816673, 3504382, 589246, -1474167, -1739434, -1835935, -1975227, -196621, 2891287, 3155382, -776795, -4428201, -3860161, -1514063, -1970174, -4968988, -6813432, -6273906, -4645106, -1772963, 3140370, 7697100, 8140786, 5119220, 3267404, 4509807, 5870249, 4935815, 3508173, 3985973, 5431454, 5584896, 4386113, 3160078, 2076600, 613563, -801472, -1668585, -2880738, -5316342, -7727563, -8054228, -6532394, -5585099, -6454663, -7581672, -6917386, -4616737, -2512083, -1583198, -1070261, -218868, -22975, -2339520, -7219562, -11894526, -13108654, -10347079, -6305662, -4242695, -5230537, -7817343, -9763130, -9932035, -8849113]
39314h849113J139160O74582M78176L19729k88707p09962Q5792J476840J615630
39305d057873M51717M72165L071966N713656M781940N76792k832921k920329j676781
39296C580332k186722l967472l825551q45160J914285J656881j51092p6241K041310
39287a859430K957792J271526l07794O01179K138258J284565j228708k326520
39279B530868j598175j293497j913912j696462o36308r13552k276751j153844
39271h951633L462854O888633M660543r61937l858395j900646J353332K091754
39263B784505L63244j295630j052361Q68083K706916K797729J205573o39262k042530
39254E696267l441302m395538l338807m00120J833493J973542J906059L221384
$$ y = [-8849113, -7709953, -7035371, -6557195, -6237466, -6526173, -7236135, -7150343, -5673503, -4057873, -3606156, -3133991, -62025, 5651631, 10433571, 11010363, 8177442, 5257113, 3580332, 1393610, -2573862, -6399413, -7244573, -5330288, -3673407, -3824499, -3900740, -1859430, 1098362, 2369888, 2062094, 2663273, 4801531, 6086096, 4857388, 2530868, 932693, -360804, -2274716, -3971178, -4607486, -5521038, -7797789, -8951633, -5488779, 1399854, 6060397, 5098460, 1240065, -660581, 692751, 2784505, 3147749, 1852119, 799758, 1667841, 4374757, 7172486, 8378059, 7738797, 5696267, 2254965, -2140573, -5479380, -5879500, -4046007, -2072465, -166406, 3054978]
39246C054978M113636K584533L67596J86659R78254j90327k725537l328288j623981
39237C417523n95024j311097j530549k66254L09946j203389l083207l407719k296581
39228i966351k01576K812257N037381L940390M46552j205073M09912J732405K63833
39219C269730j442070q54289k60537k213572l891710j465806K478322K153622
39211b226310j855953k790821J846221O158393M395095j316705m840343l946453
39203d576876j064549J216227K061422J447237J85234j09427Q72164J345272N40513
39194A917217N85370K714808L763293L04910m956893n687946j070685K444891
39186A4965L81518l277109k312182K358160M258078Q70192l334747l727824j102092
$$ y = [3054978, 7168614, 9753147, 10120743, 10307402, 11285656, 11095329, 8369792, 5041504, 3417523, 2822499, 1511402, -19147, -285401, 24545, -1178844, -4262051, -7669770, -9966351, -10167927, -7355670, -2318289, 1622101, 2068653, 863580, 1273492, 3005897, 3269730, 1827660, 973371, 712834, -1500738, -5392448, -6858254, -4379932, -2226310, -4082263, -6873084, -5026863, 1131530, 5526625, 4209920, -630423, -4576876, -5641425, -4425198, -2363776, -916539, -731305, -840732, 31432, 1376704, 1917217, 2502587, 5217395, 8980688, 9285598, 4328705, -1359241, -2429926, 14965, 396483, -2880626, -5192808, -2834648, 1423430, 2293622, -1041125, -4768949, -5871041]
39177e871041J104320J740901J788409J640053J089666O28410N11793m02995k784143
39168e54627m745047l924032j033031J031959J332019J657439L010768L860149
39160F35597K774574P64921j73061N55073K095604L166275K417932o76073m320424
39151G240418n300592k670266O78371J454267r4981j103449k9153J918211K776561
39142D869387J791371l81425k233034k353135q13842O48894O79039N3442M03053
39133B663750J700044K281477J169059q47925k458057l095788k809864j764591
39125c161895k87695R51673J148844O6239j117237k66371L047219N596911L427824
39116I405512k632252o903421n784232k135201l77331L3176K329360N495929M806929
$$ y = [-5871041, -4766721, -3025820, -1237411, 402642, 1492308, 2120718, 2632511, 2229516, -554627, -5299674, -9223706, -10256737, -9224778, -7892759, -6235320, -3224552, 635597, 3410171, 4175092, 4002031, 4557104, 6652708, 9818983, 12236915, 11560842, 7240418, 1939826, -730440, -52069, 1402198, 1307217, 203768, 174615, 2092826, 4869387, 6660758, 6279333, 4046299, 1693164, 879322, 1528216, 2207255, 2260697, 2663750, 4363794, 6645271, 7814330, 6966405, 4508348, 1412560, -1397304, -3161895, -3449590, -2497917, -1349073, -1282834, -2400071, -2666442, 380777, 5977688, 9405512, 6773260, -130161, -5914393, -8049594, -8426925, -8393749, -6064389, -568460, 4238469]
39107D238469n43443n289708n155720j995116K67737J245797K764785M618186
39099A50987M877154L031252L61754j709965k010044q3379K087652J161799k670062
39090E197148m629159k067687P83109j001278m676947l311537L443801Q261832
39082A999282O430552J378746j806349k862103l507175k994812m23646K059710
39074B74205K343794J928171K753174L127716Q33731k130000k463406j365086
39066E302299k440547m975140m662828r14763J860010J034464j090139k120798
39058h007442k711062l054183j058016L212411N556391L529751O60278R46494
39050i25378K419593P81418k977990l815260l99742L356815M375365L387925J478000
$$ y = [4238469, 3695026, -1594682, -6750402, -8745518, -8477781, -7231984, -4467199, 150987, 5028141, 8059393, 8421147, 6711182, 4701138, 4617759, 6705411, 7867210, 5197148, 567989, -1499698, -716589, -1717867, -6394814, -9706351, -6262550, 1999282, 8429834, 9808580, 8002231, 5140128, 1632953, -1361859, -1785505, 274205, 2617999, 4546170, 7299344, 10427060, 11260791, 9130791, 6667385, 5302299, 2861752, -2113388, -6776216, -7690979, -5830969, -4796505, -5886644, -8007442, -10718504, -13772687, -14830703, -11618292, -6061901, -2532150, -1871872, -925378, 1494215, 2275633, -702357, -4517617, -4917359, -1560544, 2814821, 6202746, 7680746]
39041G680746j712115m918790m526620O74837O721532Q679936N756049P80069
39033A9135644l163095l974772q94909L917542N842906K432478l313299o349061
39025A3633434n303432k760300r56450Q6489N24047l19851k245764l595440l323596
39016d260863k202324j271195m58337N39508J299889J442495J276961R49343J13106
39007b571417p43974j10278K031036K896659K86324l482972l699162M39590M266482
38998f87712L527285m49182l248885l121248j654473O7798K586720N081049M551745
38989F653097j98519n766388p434924m357308J30436K565061K102238j17483k348998
38980h772788k877235r78942K050553L767820L004957Q53733r11531j595349j457967
$$ y = [7680746, 5968631, 1049841, -3476779, -2801942, 3919590, 12599526, 18355575, 19135644, 15972549, 11997777, 11102868, 15020410, 20863316, 23295794, 19982495, 13633434, 8330002, 5569702, 4613252, 4699741, 5223788, 4903937, 2658173, -937267, -4260863, -6463187, -7734382, -8192719, -7653211, -6353322, -4910827, -3633866, -2684523, -2571417, -3315391, -3425669, -1394633, 1502026, 1788350, -1694622, -5393784, -4954194, -687712, 2839573, 2390391, -858494, -3979742, -5634215, -5566417, -2979697, 2101352, 6653097, 6454578, 688190, -6746734, -11104042, -10973606, -8408545, -6306307, -6423790, -8772788, -11650023, -12628965, -10578412, -6810592, -3805635, -2951902, -3863433, -5458782, -6916749]
38971f916749o63312Q67796K735219L820447L132464Q86764j530219k903723l226636
38962c797949k976501j826485Q39059M134410N710024M145554M15428l333461
38954C310079n362587m574931j034150K881602L738076R23616k233167k633710
38946d985172r96375L74997J317992K761309L736161K712665Q99810Q26288K171213
38937H818888K404314J255826Q54691J274909p2525l627362o009542m811814j925377
38928a837992k66817O3527M47100J006307J218457J389747J851394K286474K842375
38919I000572L894202M056062J262078l166587m884862k576066j38969o68197
38911F778233j917772p32860J468345J423146n47174j912780k552594l832948
$$ y = [-6916749, -7580061, -6712265, -3977046, -156599, 2975865, 3862629, 2332410, -571313, -3797949, -6774450, -8600935, -7761876, -3627466, 2082558, 6228112, 6643540, 3310079, -2052508, -6627439, -7661589, -4779987, -1041911, -118295, -2351462, -4985172, -5981547, -5606550, -4288558, -1527249, 2208912, 4921577, 5821387, 6647675, 8818888, 11223202, 12479028, 13333719, 14608628, 14536103, 10908741, 4899199, 87385, -1837992, -2104809, -2041282, -1594182, -587875, 630582, 2020329, 3871723, 6158197, 9000572, 12894774, 16950836, 18212914, 15046327, 10161465, 7585399, 7446430, 6778233, 4860461, 4127601, 5595946, 7019092, 6471918, 4559138, 2006544, -1826404]
38903a826404m809407l597599j312262n39346q20100L41658K711030L563958K303648
38894c984824J096175J151998J769746K560487L183151J697732k867858o975436
38886b368829n971916q55130K721359K272991Q53816J272352K568414L159465
38878C652522L155023K401573K35809j808462j060531J617503K369424L44463
38870A0907324j352626j469335k138545l416329k251249R15437Q23180l936206
38862a918349p037277l715168J686060K869763J206214J758289L815909K750518
38854A415959j217185l496986l128627l246716l941061j636705L540650O178179
38846e532492L389559q78380j709990N91802K443052J914792l37752k585679k811609
$$ y = [-1826404, -6635811, -10233410, -11545672, -12085018, -12905118, -12563460, -9852430, -6288472, -3984824, -2888649, -1736651, 33095, 2593582, 5776733, 7474465, 4606607, -2368829, -8340745, -9195875, -6474516, -4201525, -3347709, -2075357, 493057, 3652522, 6807545, 9209118, 9444927, 7636465, 6575934, 8193437, 10562861, 10907324, 9554698, 8085363, 5946818, 2530489, 279240, 1194677, 2017857, -1918349, -8955626, -12670794, -10984734, -8114971, -6908757, -5150468, -1334559, 1415959, 198774, -3298212, -6426839, -9673555, -13614616, -15251321, -11710671, -5532492, -2142933, -3021313, -4731303, -4139501, -1696449, 218343, -119409, -2705088, -5516697]
38837e516697q8508L560996M552930J912562j607588l003575j817900O26809K633984
38828A253013K587747K44888k107480j850343M66681J873846J081956n41364j906191
38819A102753l264791m084060k784540N33059L445286M081079K765771O07413
38811B401970j401533j881903k43844J419510K77821l017716m708978k987015
$$ y = [-5516697, -5605205, -2044209, 2508721, 4421283, 2813695, -189880, -2007780, -1380971, 1253013, 3840760, 4085648, 1978168, 127825, 594506, 2468352, 3550308, 3008944, 1102753, -2162038, -6246098, -9030638, -8497579, -5052293, -971214, 1794557, 2401970, 1000437, -881466, -1125310, 294200, 572021, -2445695, -7154673, -10141688]
$$ [...]
##END NTUPLES=NMR SPECTRUM
##END=
