##TITLE=31Pdec_LR-784-R3-CR8
 CDCl3, 24 sc
 3.2.2025
##JCAMPDX= 6.0         $$ Bruker NMR JCAMP-DX V2.0
##DATA TYPE= NMR SPECTRUM
##DATA CLASS= NTUPLES
##ORIGIN= UXNMR, Bruker Analytische Messtechnik GmbH
##OWNER= root
$$ XWIN-NMR		Version 3.5
$$ Mon Feb  3 18:22:37 2025 Russian Standard Time (UT+4h)  she@DPX200
##.OBSERVE FREQUENCY= 81.013821
##.OBSERVE NUCLEUS= ^31P
##.ACQUISITION MODE= SIMULTANEOUS
##.ACQUISITION SCHEME= undefined
##.AVERAGES= 24
##.DIGITISER RES= 17
##SPECTROMETER/DATA SYSTEM= spect
##.PULSE SEQUENCE= zgpg30
##.SOLVENT NAME= CDCl3
##.SHIFT REFERENCE= (INTERNAL, CDCl3, 0, 198.062)
##AUDIT TRAIL= $$ (NUMBER, WHEN, WHO, WHERE, WHAT)
$$ ##TITLE= Audit trail, XWIN-NMR		Version 3.5
$$ ##JCAMPDX= 5.01
$$ ##ORIGIN= Bruker BioSpin GmbH
$$ ##OWNER= she
$$ F:/spectra/data/she/nmr/P31/2/pdata/1/auditp.txt
$$ ##AUDIT TRAIL=  $$ (NUMBER, WHEN, WHO, WHERE, WHAT)
(   1,<2025-02-03 18:21:33.70 +0400>,<she>,<DPX200>,
      <created by zg, POWCHK disabled, PULCHK disabled
       configuration hash MD5:
       00 E9 B6 7A A2 85 ED C7 34 08 36 98 17 FE 4E 26
       data hash MD5: 32K
       53 2C 28 E6 2C 68 D5 F0 CA C3 C8 53 F6 A8 53 37>)
(   2,<2025-02-03 18:21:36.32 +0400>,<she>,<DPX200>,
      <Start of raw data processing
       efp BC_mod = 2 LB = 1.5 FT_mod = 6 PKNL = 1 PHC0 = 1706.266 PHC1 = 256.8909 SI = 64K 
       data hash MD5: 64K
       CC 8B 21 15 E1 BF 70 81 02 28 38 DC 82 4D E1 AD>)
(   3,<2025-02-03 18:21:55.70 +0400>,<she>,<DPX200>,
      <pk PHC0 = 40.12947 PHC1 = -109 
       data hash MD5: 64K
       BD E4 11 B9 AE 51 F1 4C 65 A9 7E 2F F9 5A 29 EE>)
(   4,<2025-02-03 18:22:01.40 +0400>,<she>,<DPX200>,
      <abs ABSG = 5 
       data hash MD5: 64K
       3B 97 58 68 7F 14 9E 12 04 15 0E EA 8F AF 0B 6F>)
$$ ##END=
$$ 
$$ hash MD5
$$ 84 EE 5D 12 06 2E CD 0D DF 0E 41 E2 8F 20 3A 74
##$RELAX= 
##$RELAX= 
##$RELAX= 
##$RELAX= 
##$RELAX= 
##$RELAX= 
##$RELAX= 
##$RELAX= 
$$ Bruker specific parameters
$$ --------------------------
##$DU= <F:/spectra>
##$EXPNO= 2
##$NAME= <P31>
##$PROCNO= 1
##$TYPE= <nmr>
##$USER= <she>
##$AMP= (0..31)
100 100 100 100 100 100 100 100 100 100 100 100 100 100 100 100 100 100 
100 100 100 100 100 100 100 100 100 100 100 100 100 100 
##$AQSEQ= 0
##$AQ_mod= 1
##$AUNM= <au_zg>
##$AUTOPOS= <>
##$BF1= 81.014009
##$BF2= 200.13
##$BF3= 200.13
##$BF4= 200.13
##$BF5= 200.13
##$BF6= 200.13
##$BF7= 200.13
##$BF8= 200.13
##$BYTORDA= 1
##$CFDGTYP= 0
##$CFRGTYP= 5
##$CHEMSTR= <none>
##$CNST= (0..31)
1 1 145 1 1 1 1 1 1 1 1 1 1 1 1 1 1 1 1 1 1 1 1 1 1 1 1 1 1 1 1 1 
##$CPDPRG= <waltz16>
##$CPDPRG1= <>
##$CPDPRG2= <waltz16>
##$CPDPRG3= <>
##$CPDPRG4= <mlev>
##$CPDPRG5= <mlev>
##$CPDPRG6= <mlev>
##$CPDPRG7= <mlev>
##$CPDPRG8= <mlev>
##$CPDPRGB= <>
##$CPDPRGT= <>
##$D= (0..31)
0 1 0 0 0 0 0 0 0 0.06 0 0.03 2e-05 3e-06 0 0 0.0002 0 0 0 0 0 0 0 0 0 
0 0 0 0 0 0 
##$DATE= 1738592493
##$DBL= (0..7)
120 120 120 11 120 120 24 19 
##$DBP= (0..7)
150 150 150 150 150 150 150 150 
##$DBP07= 0
##$DBPNAM0= <>
##$DBPNAM1= <>
$$ [...]
##$SUBNAM3= <"">
##$SUBNAM4= <"">
##$SUBNAM5= <"">
##$SUBNAM6= <"">
##$SUBNAM7= <"">
##$SUBNAM8= <"">
##$SUBNAM9= <"">
##$SW= 400.765351723535
##$SWIBOX= (0..15)
0 1 3 0 0 0 0 0 0 0 0 0 0 0 0 0 
##$SW_h= 32467.5324675325
##$TD= 32768
##$TD0= 1
##$TE= 0
##$TE2= 300
##$TE3= 300
##$TEG= 300
##$TL= (0..7)
0 120 53 12 22 120 120 120 
##$TP= (0..7)
150 150 150 150 150 150 150 150 
##$TP07= 0
##$TPNAME0= <>
##$TPNAME1= <>
##$TPNAME2= <>
##$TPNAME3= <>
##$TPNAME4= <>
##$TPNAME5= <>
##$TPNAME6= <>
##$TPNAME7= <>
##$TPOAL= (0..7)
0.5 0.5 0.5 0.5 0.5 0.5 0.5 0.5 
##$TPOFFS= (0..7)
0 0 0 0 0 0 0 0 
##$TUNHIN= 0
##$TUNHOUT= 0
##$TUNXOUT= 0
##$USERA1= <user>
##$USERA2= <user>
##$USERA3= <user>
##$USERA4= <user>
##$USERA5= <user>
##$V9= 5
##$VALIST= <valist>
##$VCLIST= <CCCCCCCCCCCCCCC>
##$VD= 0
##$VDLIST= <DDDDDDDDDDDDDDD>
##$VPLIST= <PPPPPPPPPPPPPPP>
##$VTLIST= <TTTTTTTTTTTTTTT>
##$WBST= 1024
##$WBSW= 4
##$XGAIN= (0..3)
0 0 0 0 
##$XL= 0
##$YL= 0
##$YMAX_a= 9820
##$YMIN_a= -4425
##$ZGOPTNS= <>
##$ZL1= 120
##$ZL2= 120
##$ZL3= 120
##$ZL4= 120
##$ABSF1= 198.0616
##$ABSF2= -202.7028
##$ABSG= 5
##$ABSL= 3
##$ALPHA= 0
##$AQORDER= 0
##$ASSFAC= 0
##$ASSFACI= 0
##$ASSFACX= 0
##$ASSWID= 0
##$AUNMP= <proc_1d>
##$AZFE= 0.1
##$AZFW= 0.5
##$BCFW= 0
##$BC_mod= 2
##$BYTORDP= 0
##$COROFFS= 0
##$CY= -3
##$DATMOD= 1
##$DC= 0
##$DFILT= <>
##$DTYPP= 0
##$F1P= 0
##$F2P= 0
##$FCOR= 1
##$FTSIZE= 65536
##$FT_mod= 6
##$GAMMA= 0
##$GB= 0
##$INTBC= 1
##$INTSCL= 9.790993e-09
##$ISEN= 30
##$LB= 1.5
##$LEV0= 0
##$LPBIN= 0
##$MAXI= 10000
##$MC2= 0
##$MEAN= 0
##$ME_mod= 0
##$MI= 50
##$NCOEF= 0
##$NC_proc= -9
##$NLEV= 6
##$NOISF1= 182.463
##$NOISF2= 159.3651
##$NSP= 0
##$NTH_PI= 0
##$NZP= 0
##$OFFSET= 198.0616
##$PC= 4
##$PHC0= 1746.396
##$PHC1= 147.8909
##$PH_mod= 1
##$PKNL= yes
##$PPARMOD= 0
##$PSCAL= 0
##$PSIGN= 0
##$REVERSE= no
##$SF= 81.0140089999434
##$SI= 65536
##$SIGF1= 159.3651
##$SIGF2= -187.1042
##$SINO= 113.3802
##$SIOLD= 16384
##$SREGLST= <1H.CDCl3>
##$SSB= 0
##$STSI= 65536
##$STSR= 0
##$SW_p= 32467.5324675325
##$SYMM= 0
##$S_DEV= 0
##$TDeff= 32768
##$TDoff= 0
##$TI= <>
##$TILT= no
##$TM1= 0
##$TM2= 0
##$TOPLEV= 0
##$USERP1= <user>
##$USERP2= <user>
##$USERP3= <user>
##$USERP4= <user>
##$USERP5= <user>
##$WDW= 1
##$XDIM= 65536
##$YMAX_p= 382898001
##$YMIN_p= -168682934
$$ End of Bruker specific parameters
$$ ---------------------------------
##NTUPLES= NMR SPECTRUM
##VAR_NAME=  FREQUENCY,     SPECTRUM/REAL,   SPECTRUM/IMAG
##SYMBOL=    X,             R,               I
##VAR_TYPE=  INDEPENDENT,   DEPENDENT,       DEPENDENT
##VAR_FORM=  AFFN,          ASDF,            ASDF
##VAR_DIM=   65536,         65536,           65536
##UNITS=     HZ,            ARBITRARY UNITS, ARBITRARY UNITS
##FACTOR=    0.49542278885378, 1,            1
##FIRST=     16045.7642231865, 0,            0
##LAST=      -16421.768244346, 0,            0
##MIN=       -16421.768244346, -168682934,   0
##MAX=       16045.7642231865, 382898001,    0
$$ Real data points
##PAGE= N=1
##DATA TABLE= (X++(R..R)), XYDATA
$$ [...]
44003H275503Q75623M92485N87844j34594j975262k356545m7988J698215n2145
$$ 8275503 9151126 9643611 10231455 10096861 8121599 5765054 5717066 7415281 7363136
43994G363136k691415k020479O32025J84291m139066p305168n360145M9268M700813
$$ 7363136 4671721 2651242 3283267 3467558 -671508 -7976676 -13336821 -13287553 -8586740
43985h586740O157956M382621P79208k345769l281840k529116j611466n89969
$$ -8586740 -2428784 1953837 2733045 387276 -2894564 -5423680 -7035146 -7625115
43977g625115J406318L614897L957645J972097o96656k753868m065685m071824
$$ -7625115 -6218797 -2603900 1353745 3325842 2629186 -124682 -4190367 -8262191
43969h262191j943062J166677K446941R55668j157113j822312j441406j025202
$$ -8262191 -10205253 -9038576 -6591635 -5635967 -6793080 -8615392 -10056798 -11082000
43961a1082000q2950J800866K912779J361334j544484k308066N0756K431159J912930
$$ -11082000 -11164950 -9364084 -6451305 -5089971 -6634455 -8942521 -8891765 -6460606 -4547676
43952d547676n9828K49506L247206M964690K477217j747742k947969m51720J514179
$$ -4547676 -4607504 -4357998 -1110792 3853898 6331115 4583373 1635404 1183684 2697863
43943B697863m77276m709264o594541l925400J139621M597668M398618K005361
$$ 2697863 2220587 -2488677 -9083218 -13008618 -11868997 -7271329 -2872711 -867350
43935h67350L06079J175q68052l097156l976948j089881L107105L995673J491227
$$ -867350 -561271 -560096 -1428148 -4525304 -8502252 -9592133 -6485028 -2489355 -998128
43926i98128N641J465071K757416J420583n43623q27165p37171j940313k835422
$$ -998128 -992487 472584 3230000 4650583 4106960 3279795 2542624 602311 -2233111
43917b233111j698592l98417j096700j868546J38176L282476L701597J508683
$$ -2233111 -3931703 -4330120 -5426820 -7295366 -7157190 -3874714 -173117 1335566
43909A335566J27756M43608K85584p54282p29272L15890k3021j904463k575273
$$ 1335566 1463322 1906930 2192514 1438232 708960 1024850 1001829 -902634 -3477907
43900c477907j266005n62579j496855j367279J399707L764809K227134k031267
$$ -3477907 -4743912 -5306491 -6803346 -8170625 -6770918 -3006109 -778975 -2810242
43892b810242m859445m324287j854943N46021K067553K669672K575706K190149
$$ -2810242 -7669687 -11993974 -13848917 -13302896 -11235343 -8565671 -5989965 -3799816
43884c799816J875158J878223K223479K087248J69187k924180l854573n69999
$$ -3799816 -1924658 -46435 2177044 4264292 4433479 1509299 -2345274 -2915273
43876b915273L696425L755744l02220k986057j310975J191539L60519k371859
$$ -2915273 781152 4536896 4234676 1248619 -62356 1129183 1489702 -882157
43868h82157k832389o48314P88204k04962j585512j081219Q77346K300020K102777
$$ -882157 -3714546 -4362860 -3574656 -3779618 -5365130 -6446349 -5569003 -3268983 -1166206
43859a166206Q67219L7717O45770K312830L473508K841002M90890k459619m646807
$$ -1166206 -298987 -261270 384500 2697330 6170838 9011840 9502730 7043111 2396304
43850B396304m950296l137654l85382J526152J806463R90830p3737p79260o68884
$$ 2396304 -2553992 -5691646 -6077028 -4550876 -2744413 -1753583 -1827320 -2606580 -3275464
43841c275464R8147N19409J26088k5624P73704R23366j257393l893685l174806
$$ -3275464 -3177317 -2657908 -2531820 -2557444 -1783740 -860374 -2117767 -6011452 -9186258
43832i186258J048879M331995L392642J47682j473206m65444J189923J564552
$$ -9186258 -8137379 -3805384 -412742 -265060 -1738266 -2203710 -1013787 550765
43824E50765J92825k108124l381054j822766J799949M320007L795646J526735
$$ 550765 743590 -1364534 -4745588 -6568354 -4768405 -448398 3347248 4873983
43816D873983m25531j818932l054050l449113k545968j552989j544557j534034
$$ 4873983 4448452 2629520 -424530 -3873643 -6419611 -7972600 -9517157 -11051191
43808a1051191l17197R12090L2536k443934l373336p57206L698115O048016L791775
$$ -11051191 -11368388 -10456298 -10423762 -12867696 -16241032 -16998238 -13300123 -7252107 -3460332
43799c460332j518189n227695m065425J67937K660383J459599n54173q1504K396825
$$ -3460332 -4978521 -10206216 -14271641 -14103704 -11443321 -9983722 -10537895 -10619399 -8222574
43790h222574M068135L555582J684616j10721p25693J17646J198349P73133j018426
$$ -8222574 -4154439 -598857 1085759 975038 249345 366991 1565340 2338473 1320047
43781A320047k163401j719998q05018p4774J204483K554596J759271j308766l309918
$$ 1320047 -843354 -2563352 -3368370 -3443144 -2238661 315935 2075206 766440 -2543478
43772b543478k196484m93844j017918k055141l64824L134579M649221L190981
$$ -2543478 -4739962 -5233806 -6251724 -8306865 -8671689 -5537110 -887889 2303092
43764B303092J120323k17671j620844k972602k546594J45606L331673N048030
$$ 2303092 3423415 3205744 1584900 -1387702 -3934296 -3788690 -457017 4591013
43756D591013M347289J011698l666312o482561n262072j809812L76648O45437
$$ 4591013 8938302 9950000 6283688 -198873 -5460945 -7270757 -6894109 -6248672
43748f248672R36576J854618K045172J150373M10734L07514J49488j75227m12543
$$ -6248672 -5312096 -3457478 -1412306 -261933 148801 456315 605803 430576 18033
43739A8033j289395k997853l229228K0611M359660N353875K644802m5133p69624
$$ 18033 -1271362 -4269215 -7498443 -7477832 -3118172 2235703 4880505 4835372 4065748
43730D065748r95188j248352J02071K569772K649229q53609m501914n279512m287707
$$ 4065748 3070560 1822208 1924279 4494051 7143280 6289671 1787757 -3491755 -7779462
43721g779462l309126j542180J486445L309981K178365M89063J137560K843392
$$ -7779462 -11088588 -12630768 -11144323 -7834342 -5655977 -5166914 -4029354 -1185962
43713a185962K617659P87233k04250l65805j491986k874734j867795J194106K461474
$$ -1185962 1431697 2218930 2014680 1648875 156889 -2717845 -4585640 -3391534 -930060
43704i30060m2602l430557l739815p01648K642953L747273K679682J094686J42231
$$ -930060 -972662 -4403219 -8143034 -8844682 -6201729 -2454456 225226 1319912 1462143
43695A462143m48920j412739k421464k250163o75784P76136P07035l62103r64570
$$ 1462143 1013223 -399516 -2820980 -5071143 -5746927 -4970791 -4263756 -4625859 -5590429
43686e590429p18109l37320j77773R7372O44455J168687J383091J031734k82528
$$ -5590429 -6308538 -6645858 -6823631 -6726259 -6081804 -4913117 -3530026 -2498292 -2780820
43677b780820k503563m424651m285812j375106K973336N947828N216708J093217
$$ -2780820 -5284383 -9709034 -13994846 -15369952 -12396616 -6448788 -1232080 -138863
43669a38863l218371m380372k235672K52239N31382q28219j273394N48140L205028
$$ -138863 -3357234 -7737606 -9973278 -9721039 -9189657 -10017876 -11291270 -10743130 -7538102
43660g538102L864531J212983k831902m685035k729882J115332L749753L810200
$$ -7538102 -3673571 -2460588 -5292490 -9977525 -12707407 -11592075 -7842322 -4032122
43652d032122J810716r24832k296541l86440L606861N274077K422800j267195
$$ -4032122 -2221406 -3146238 -5442779 -5829219 -2222358 3051719 5474519 4207324
43644D207324j263760J058528J027728j426603k045559j17314K07141k301435
$$ 4207324 2943564 4002092 5029820 3603217 1557658 1440344 1647485 -653950
43636f53950l238891l46311K019512K29151k083655j0794M203429M605588P68915
$$ -653950 -3892841 -4239152 -2219640 -1990489 -4074144 -4084938 118491 4724079 5492994
43627E492994k259917j774380K84749K093839L856514M877404L269763o75291
$$ 5492994 3233077 1458697 1743446 3837285 7693799 12571203 15840966 15165675
43619A5165675m182325n425407m573492j938961J714290L615017J481021k416730
$$ 15165675 10983350 5557943 984451 -954510 759780 4374797 5855818 3439088
43611C439088l240063N6811L562953L838488J354817j694484l761138l675985
$$ 3439088 199025 255836 3818789 7657277 9012094 7317610 3556472 -119513
43603a19513j134695J911512K998770K479844K422965K530761O15082k932834
$$ -119513 -1254208 657304 3656074 6135918 8558883 11089644 11704726 8771892
43595H771892n029681m599815l436330k014781R77728M078202L266388j188367
$$ 8771892 3742211 -857604 -4293934 -6308715 -5330987 -1252785 2013603 825236
43587H25236l276348K09348M418954L735942O9765j084206N56120J045681j25310
$$ 825236 -2451112 -2241764 2177190 5913132 5982897 4898691 5454811 6500492 6375182
43578F375182K81820K351708K011181j826918m428778k030466K488288L693418
$$ 6375182 6657002 9008710 11019891 9192973 4764195 2733729 5222017 8915435
43570H915435O41278l174855n070659n251991m559323l197603j889903j765186
$$ 8915435 9556713 6381858 1311199 -3940792 -8500115 -11697718 -13587621 -15352807
43562a5352807k250557j091897K190169M507692K877041j079037k839303j080921
$$ -15352807 -17603364 -18695261 -16505092 -11997400 -9120359 -10199396 -13038699 -14119620
43554a4119620Q40715L99083k74889J610950M389189M418003K074690R89528J784532
$$ -14119620 -13278905 -12879822 -13154711 -11543761 -7154572 -2736569 -661879 327649 2112181
43545B112181J217227j716653l498698j864368L46926L6577j027394L78876L132734
$$ 2112181 3329408 1612755 -1885943 -3750311 -3403385 -3366808 -4394202 -4015326 -882592
43536h82592L589608J469441l94776j197828k604422m220392l148856R38401M240868
$$ -882592 2707016 4176457 3781681 2583853 -20569 -4240961 -7389817 -6451416 -2210548
43527b210548M061399K323135J749787J437441q35116l806953l749082L6653L721849
$$ -2210548 1850851 4173986 5923773 7361214 6526098 2719145 -1029937 -993284 2728565
43518B728565L761007J136309n36515J04245R49926o8683k058650k795093k083173
$$ 2728565 6489572 7625881 7089366 7193611 8143537 8074854 6016204 3221111 1137938
43509A137938j619629j797162j014650J005033J640427q00134l487282k341570
$$ 1137938 -481691 -2278853 -3293503 -2288470 -648043 -1448177 -4935459 -7277029
43501g277029J833841L898769J482961j732520j298240K181603M671349M130385
$$ -7277029 -5443188 -1544419 -61458 -1793978 -3092218 -910615 3760734 7891119
43493G891119J814868n10207k012930k112906q76084R6866o37243k001583j970273
$$ 7891119 9705987 9195780 7182850 5069944 4193860 4290726 3653483 1651900 -318373
43484c18373j125175j707281l056926j750630K432402M665523J980819j488919
$$ -318373 -1443548 -3150829 -6207755 -7958385 -5525983 -860460 1120359 -368560
43476c68560l16117L736441M333103N24121k000872l49347J110572j436904m442967
$$ -368560 -684677 3051764 7384867 7908988 5908116 5558769 6669341 5232437 789470
43467G89470k715821J842660K958891m10109l075193k060269m55993j338066k541979
$$ 789470 -1926351 -83691 2875200 2465091 -610102 -2670371 -3126364 -4464430 -7006409
43458g006409m44106L980520O160333L857258m22723k796051k174226p00030o46012
$$ -7006409 -7450515 -3469995 2690338 6547596 6124873 3328822 1154596 454566 -191446
43449a91446j522318r89808J397325L059697K119642L30670O7541J89379j771465
$$ -191446 -1713764 -2703572 -1306247 1753450 3873092 4203762 4271303 4460682 2689217
43440B689217m516707m341859j369975L31947k87375O90896M863697P218856L162177
$$ 2689217 -1827490 -6169349 -7539324 -7207377 -7494752 -6803856 -1940159 5278697 8440874
43431H440874l799356o261063k751387J438494K242704Q67335l19570j480810
$$ 8440874 4641518 -1619545 -4370932 -2932438 -689734 177601 -141969 -1622779
43423a622779l250343m105858k189347J468005L352073J202775l128538m918181
$$ -1622779 -4873122 -8978980 -11168327 -9700322 -6348249 -5145474 -8274012 -13192193
43415a3192193j359988M796751P647790M707245m52657k977937k176732o27875
$$ -13192193 -14552181 -9755430 -2107640 2599605 2146948 -830989 -3007721 -3635596
43407c635596J08875L87726L81296j61980n54993J39662J369078J927988J983233
$$ -3635596 -3526721 -3138995 -2757699 -2919679 -3474672 -3335010 -1965932 -37944 1945289
43398A945289K350477K463218J240793n81025j301458j094991j627560k857552
$$ 1945289 4295766 6758984 7999777 7418752 6117294 5022303 3394743 537191
43390E37191k542947N30716M475001O017169L551459j262149m365608k859298
$$ 537191 -2005756 -1475040 2999961 9017130 12568589 11306440 6940832 4081534
43382D081534J377737L147831K00320m006765n394156m390609l435123k355086
$$ 4081534 5459271 8607102 8807422 4800657 -593499 -4984108 -8419231 -10774317
43374a0774317p5000J554904L44209j543161n23492K010167J668504j289797k213761
$$ -10774317 -10849317 -9294413 -8950204 -10493365 -11016857 -9006690 -7338186 -8627983 -10841744
43365a0841744K2198J519941N53793L31J059612Q46149j417200j911928J027892
$$ -10841744 -10819546 -9299605 -8745812 -8745481 -7685869 -6839720 -8256920 -10168848 -9140956
43356i140956L444794K508423J097377J664350J276268k173242m156120k00235
$$ -9140956 -5696162 -3187739 -2090362 -426012 850256 -1322986 -5479106 -5679341
43348e679341N690730O043927O49941m060298m351627j892377J140491L646702
$$ -5679341 11389 6055316 6705257 2644959 -1706668 -3599045 -2458554 1188148
43340A188148L534201q0991l447446k427539Q09250R38869j815610k436331J08623
$$ 1188148 4722349 4641358 1193912 -1233627 -424377 514492 -1301118 -3737449 -3628826
43331c628826J739819J114108J399150L025205J989572k177849l778351K2443
$$ -3628826 -1889007 -774899 624251 3649456 5639028 3461179 -317172 -294729
43323b94729L677441J432238l897668n388411j597610L225291N721538N465247
$$ -294729 3382712 4814950 917282 -4471129 -6068739 -2843448 2878090 8343337
43315H343337K540708k171022n331816l928371M94521L372302K571942j0580j615618
$$ 8343337 10884045 8713023 3381207 -547164 -52643 3319659 5891601 5881021 4265403
43306D265403j171601O68495K108833J444936q44850k209605j375137k0199J78435
$$ 4265403 3093802 3762297 5871130 7316066 6471216 4261611 2886474 2866275 3044710
43297C044710P6265P91652J147982o5251j140128K35195K883204L367270Q56011
$$ 3044710 3120975 3912627 5060609 4995358 3855230 4090425 6973629 10340899 11196910
43288A1196910j779401j697756Q45095L075636K403493p95511k761030m87182
$$ 11196910 9417509 7719753 8564848 11640484 14043977 13248466 10487436 10000254
43280A0000254L386273K950528k474879o311064l943636L23277J3367l532017
$$ 10000254 13386527 16337055 13862176 7551112 3607476 3930753 3944120 412103
43272D12103l941572k70719K223624J154131q6820O54296R03170p79530j623255
$$ 412103 -3529469 -3800188 -1576564 -422433 -509253 145043 1048213 268683 -1354572
43263a354572n700J152916k42571j258091R37374L655789K982922M41764L23695
$$ -1354572 -1360272 -207356 -449927 -1708018 -770644 2885145 5868067 6309831 6633526
43254F633526K337687K238816q56259k922646j512891N82557j01195k759640m220993
$$ 6633526 8971213 11210029 10353770 7431124 5918233 6500790 6399595 3639955 -581038
43245e81038l594734k431389j313642R44349M274555N799700L163903j466176
$$ -581038 -4175772 -6607161 -7920803 -6976454 -2701899 3097801 6261704 4795528
43237D795528l174525o10620J908839L90463k943379k902857Q08362L161233J460670
$$ 4795528 1621003 1010383 2919222 3309685 366306 -2536551 -1728189 1433044 2893714
43228B893714r58046m47392J416348R57287j739801l520179l035065j633976k91417
$$ 2893714 1935668 1488276 2904624 3861911 2122110 -1398069 -4433134 -6067110 -6358527
43219f358527J341946L043502L580988K348178N0283j953237k171231l4194K563551
$$ -6358527 -5016581 -1973079 1607909 3956087 4006370 2053133 -118098 -152292 2411259
43210B411259K540729j71715j908382n77335J027311n0832j817075q96769J260532
$$ 2411259 4951988 4780273 2871891 2294556 3321867 3271035 1453960 557191 1817723
43201A817723P80007j624145j793294K09330k02606l913751n777580k750860J250657
$$ 1817723 2597730 973585 -819709 -610379 -812985 -4726736 -10504316 -13255176 -12004519
43192a2004519J863008P57151J575714L381651K868983M16987p72150l4727M20780
$$ -12004519 -10141511 -9384360 -7808646 -4426995 -1558012 -1141025 -1913175 -1947902 -1527122
43183a527122l91420j355097j746588j596607m65250J302363J321153j660920
$$ -1527122 -1918542 -3273639 -5020227 -6616834 -7082084 -5779721 -4458568 -6119488
43175f119488m533694l370538O66530K905329K225111K173410M500199N982911
$$ -6119488 -10653182 -14023720 -13357190 -10451861 -8226750 -6053340 -1553141 4429770
43167D429770L584706o13411k183834r1959K544624K429061o84241m196535n345273
$$ 4429770 8014476 7401065 5217231 5125272 7669896 10098957 9414716 5218181 -127092
43158a27092l970145k404087k090592j553141O98776K836786K158417k06662p13345
$$ -127092 -4097237 -6501324 -8591916 -10145057 -9446281 -6609495 -4451078 -4657740 -5371085
43149e371085Q08777R52463j188878k223400k83678J687483R60173n25775Q9685
$$ -5371085 -4562308 -3609845 -4798723 -7022123 -7305801 -5618318 -4658145 -5183920 -5094235
43140e094235J591434J114103q24994j455861k37310J211434K157218K429670
$$ -5094235 -3502801 -2388698 -3213692 -4669553 -4906863 -3695429 -1538211 891459
43132H91459O46736l519613o536017m505988J063304M809924M531950K860821
$$ 891459 1538195 -1981418 -8517435 -13023423 -11960119 -7150195 -2618245 242576
43124B42576K058744J264257m28390j943241k399254k174158j010530J677596
$$ 242576 2301320 3565577 3137187 1193946 -1205308 -3379466 -4389996 -2712400
43116b712400L930000K508113j672378l381980l91942K916988K008104j325058
$$ -2712400 1217600 3725713 2053335 -1328645 -1720587 1196401 3204505 1879447
43108A879447k445683q81148L24386K19664M04529Q29025m45749l132776m154963
$$ 1879447 -566236 -1447384 -1122998 -903334 -498805 330220 -115529 -3248305 -7403268
43099g403268k034245J077403K670425K765039K568205K295313J494394K27816
$$ -7403268 -9437513 -8360110 -5689685 -2924646 -356441 1938872 3433266 3661082
43091C661082r10578j182677n7475J823702K382910K62049l029340m716170m190108
$$ 3661082 2750504 1567827 1510352 3334054 5716964 5979013 2949673 -1766497 -5956605
43082e956605l058676k209499j133827l4143P9184k43062P86182K727901K733805
$$ -5956605 -9015281 -11224780 -12358607 -12392750 -12313566 -12556628 -11770446 -9042545 -6308740
43073f308740K02812j357433O52442L582517L125237m86487l073192k413937m20148
$$ -6308740 -6105928 -7463361 -6810919 -3228402 -103165 -589652 -3662844 -6076781 -6496929
43064f496929M46413J09853j95883K53947J434348K490228J865167o52416k266619
$$ -6496929 -6050516 -5940663 -6136546 -5882599 -4448251 -1958023 -92856 -745272 -3011891
43055c011891j07165M030116N034953J626669j252762N44582M082525L663895
$$ -3011891 -3119056 911060 5946013 7572682 6319920 6864502 10947027 14610922
43047A4610922o73224l532920k390285n44430r07607j577078j87946J184929o47860
$$ 14610922 13937698 10404778 8014493 7470063 6562456 4985378 4797432 5982361 5334501
43038E334501m173060n023671k616835p15097j411813k584231k097080p91885
$$ 5334501 1161441 -3862230 -6479065 -7194162 -8605975 -11190206 -13287286 -14079171
43030a4079171J67302J547284L609868M328735K503045L22940K67806J445328
$$ -14079171 -13911869 -12364585 -8754717 -4425982 -1922937 -1599997 -1332191 113137
43022A13137J615585Q87787M76602l40827k571895m346197l306211j076971j034563
$$ 113137 1728722 2616509 3093111 2752284 180389 -4165808 -7472019 -8548990 -9583553
43013i583553k222044m54029M111227N830802J892801l005972l287222j016J815698
$$ -9583553 -11805597 -12259626 -8148399 -2317597 -424796 -3430768 -6717990 -6719006 -4903308
43004d903308M72215j444790j725514o12812R36192K275859K744200K120242Q53906
$$ -4903308 -4431093 -5875883 -7601397 -8214209 -7278017 -5002158 -2257958 -137716 716190
42995G16190j004725l539043n011742l034542R58781K040706j026266k966883
$$ 716190 -288535 -3827578 -8839320 -11873862 -10915081 -8874375 -9900641 -12867524
42987a2867524O6833L933110L027990l90070k61050K401602R90309m713738o807595
$$ -12867524 -12800691 -8867581 -5839591 -6229661 -6490711 -4089109 -3098800 -7812538 -14620133
42978a4620133j591894M352796M225194M06940j016453M26397J352907J370375
$$ -14620133 -16212027 -11859231 -7634037 -7227097 -8243550 -7817153 -6464246 -5093871
42970e093871K209219K893919J508363k16262N11407J976163M93119k572999k199760
$$ -5093871 -2884652 9267 1517630 1301368 1812775 3788938 4282057 1709058 -490702
42961d90702J919097M236395J740497j840106k318543r13519q95990k015034j831591
$$ -490702 1428395 5664790 7405287 5565181 3246638 2333119 1437129 -577905 -2409496
42952b409496l23608L81754k27608o24156k61852m53574j879449l110303k426653
$$ -2409496 -2733104 -2351350 -2578958 -3203114 -3464966 -3918540 -5797989 -8908292 -11334945
42943a1334945r2146J974153K411384J715505J328652J893589K808166L288780
$$ -11334945 -11427091 -9452938 -7041554 -5326049 -3997397 -2103808 704358 3993138
42935C993138L182755K633620J730024P62120k9237j225016l521720n750905n299690
$$ 3993138 7175893 9809513 11539537 12301657 12272420 11047404 7525684 1774779 -3524911
42926c524911j737665J634293J724672j85372m61619J700737L709598L670401
$$ -3524911 -5262576 -3628283 -1903611 -2088983 -2550602 -849865 2859733 6530134
42918F530134K268361N19653j593503l585020l949543k245621l7277J016437O91628
$$ 6530134 8798495 9318148 7724645 4139625 190082 -2055539 -2092816 -1076379 -384751
42909c84751l91425j304220p68484J468376L275838K534005Q36883J662532M312185
$$ -384751 -776176 -2080396 -2848880 -1380504 1895334 4429339 5266222 6928754 11240939
42900A1240939L546964k756689r131126q888915k578082L381710M898467L391707
$$ 11240939 14787903 12031214 2900088 -5988827 -8566909 -5185199 -286732 3104975
42892C104975J615056K10381r85369j321637m98233M06572L25922l47920n22333
$$ 3104975 4720031 4930412 3945043 2623406 2125173 2531745 2857667 2509747 1987414
42883A987414K5663M17071k16924j543800k027661o50168J319593J424004n49811
$$ 1987414 2013077 2430148 2213224 669424 -1358237 -2008405 -688812 735192 185381
42874A85381j665154L51457L581778M016434O59325l219394l924497j137385K181477
$$ 185381 -1479773 -1128316 2453462 6469896 7129221 3909827 -14670 -1152055 1029422
42865A029422K814692L50525k203525j434884K339567N082912L989528Q16884
$$ 1029422 3844114 4194639 1991114 556230 2895797 7978709 11968237 12785121
42857A2785121j179460j798975k957592m596574m697414k952533j288969n37075
$$ 12785121 11605661 9806686 6849094 2252520 -2444894 -5397427 -6686396 -7223471
42849g223471N09379K204546L071389K582942K218394K545957J809733j009272
$$ -7223471 -6714092 -4509546 -1438157 1144785 3363179 5909136 7718869 6709597
42841F709597l998051m984131m417275l631694k102542J135051M629103N713455
$$ 6709597 2711546 -2272585 -6689860 -10321554 -12424096 -11289045 -6659942 -946487
42833i46487M081729J938953P91134N4237j115034k364689k855600k186501m24174
$$ -946487 3135242 5074195 5865329 5919566 4804532 2439843 -415757 -2602258 -3026432
42824c026432J800380L243344L058710J777797M30734r35801k720914m110118
$$ -3026432 -1226052 2017292 5076002 6853799 7284533 6348732 3627818 -482300
42816d82300l499685p85224K073628L183247K405017O31685j453238l203469l501072
$$ -482300 -3981985 -4767209 -2693581 489666 2894683 3526368 2073130 -1130339 -4631411
42807d631411j530196J907338M419464L845895M39764k769081k518394J182768
$$ -4631411 -6161607 -4254269 165195 4011090 4450854 1681773 -836621 346147
42799C46147M613649M134087l8647m558496o636924n701894k227719K728195O537095
$$ 346147 4959796 9093883 9055236 4496740 -2140184 -7842078 -10069797 -7341602 -804507
42790h04507O050550J279472l397480l546643L66698L807730L523953N12882k248880
$$ -804507 5246043 6525515 3128035 -418608 -51910 3755820 7279773 7792655 5543775
42781E543775l276993l033707k203021r35154L62634O80609m82634k073986k314933
$$ 5543775 2266782 -766925 -2969946 -3905100 -3542466 -2861857 -3344491 -5418477 -7733410
42772g733410p20615J300702K205022K034781J745194J548415J201642J470052
$$ -7733410 -8454025 -7153323 -4948301 -2913520 -1168326 380089 1581731 3051783
42764C051783L313758N259484L885805j531644o689110o896352k992247L9410
$$ 3051783 6365541 11625025 15510830 13979186 7290076 393724 -2598523 -2559113
42756b559113j17275q46247L42005J888039J301889m70938p77344J95352l1487
$$ -2559113 -2676388 -3522635 -3180630 -1292591 9298 -461640 -1238984 -1043632 -1075119
42747a075119j598048j701705P19423K885129K383028Q40059R75399J958011R38641
$$ -1075119 -2673167 -4374872 -3655449 -770320 1612708 2452767 3428166 5386177 6324818
42738F324818j591502j644039K245832N939550M641086r95673n937605o797599
$$ 6324818 4733316 3089277 5335109 11274659 15915745 14920072 8982467 2184868
42730B184868m523871j751619M0423O59099P62860J793771M338690O083309L770029
$$ 2184868 -2339003 -4090622 -4050199 -3391100 -2628240 -834469 3504221 9587530 13357559
42721A3357559j830284n549673m254102j114664q01348k702879k642913J64045
$$ 13357559 11527275 5977602 1723500 608836 -192512 -2895391 -5538304 -5374259
42713e374259K404276K523772K390264K371929m9052m578218o035894j694391
$$ -5374259 -2969983 -446211 1944053 4315982 4266930 -311288 -6347182 -8041573
42705h041573L423169L314534q7408m13784K717265L358538o75037l934908j725520
$$ -8041573 -4618404 -1303870 -1391278 -1805062 912203 4270741 3595704 -339204 -2064724
42696b064724K912786L997205P98709k336441k184508M73692K849570K575687
$$ -2064724 848062 4845267 5643976 3307535 1123027 1596719 4446289 7021976
42688G021976q12364m894421n953742l181054m581L68906q79896n73345J380211
$$ 7021976 6209612 1315191 -4638551 -7819605 -7824186 -7455280 -8335176 -8908521 -7528310
42679g528310K075295L17998j384261j26504L629305O289180M690556n54273n181290
$$ -7528310 -5453015 -5135017 -6519278 -6645782 -3016477 3272703 7963259 7408986 2227696
42670B227696n360770j702016J824261K734496J964745R86452k41908j518558
$$ 2227696 -3133074 -4835090 -3010829 -276333 1688412 2674864 2432956 914398
42662I14398j508455l02862k15072k088724l528349k979505k448927l291906k740206
$$ 914398 -594057 -896919 -1111991 -3200715 -6729064 -9708569 -12157496 -15449402 -18189608
42653a8189608J268594M936285L605920k97991m64262L289982M887320K042615
$$ -18189608 -16921014 -11984729 -8378809 -8676800 -9141062 -5851080 -963760 1078855
42645A078855n03945N15647J881839N45203o77508J416811L904496K057674k765407
$$ 1078855 574910 1090557 2972396 3517599 2840091 4256902 8161398 10219072 7453665
42636G453665m841624k164701J837225L866213L872166K799973R35800r85754
$$ 7453665 2612041 447340 2284565 6150778 10022944 12822917 13758717 12772963
42628A2772963j826166j827375k336643l440433l679738k424913r58102p37663
$$ 12772963 10946797 9119422 6782779 3342346 -337392 -2762305 -3720407 -4458070
42620d458070j640744k271247j462474N42495K224245K484939K057904K224507
$$ -4458070 -6098814 -8370061 -9832535 -9290040 -7065795 -4580856 -2522952 -298445
42612b98445K461037J253944p31367r21333R67946J892184J31296j884528j504413
$$ -298445 2162592 3416536 2685169 1763836 2731782 4623966 4755262 2870734 1366321
42603A366321Q1107K95447p52124j570740k378159l585548l312147k20778K888288
$$ 1366321 1447428 1742875 990751 -579989 -2958148 -6543696 -9855843 -10076621 -7188333
42594g188333K479212n7283o12543Q04740N27265j782478k222114L38174J879911
$$ -7188333 -4709121 -4766404 -5378947 -4574207 -4046942 -5829420 -8051534 -7713360 -5833449
42585e833449J5718j875719m34007J954574J116794k233857l907078k470147k62083
$$ -5833449 -5817731 -7693450 -8127457 -6172883 -5056089 -7289946 -11197024 -13667171 -13929254
42576a3929254P47395P49247L68835R6088J060842L722024N994729N186479J868081
$$ -13929254 -13181859 -12432612 -12063777 -11967689 -10906847 -7184823 -1190094 3996385 5864466
42567E864466m37509K55701K101128K021684q61163m652166o302987l863521J517717
$$ 5864466 5426957 5682658 7783786 9805470 8944307 4292141 -2010846 -5874367 -4356650
42558d356650N909742O290680L739882J489577L93701j270662l616004m039739
$$ -4356650 1553092 7843772 11583654 13073231 13466932 12196270 8580266 4540527
42550D540527j628151L74232r65180l535224l154146L8961J898591P17763o12399
$$ 4540527 2912376 3286608 2321428 -1213796 -4367942 -4328981 -2430390 -1712627 -2325026
42541b325026J81351J213841K22079j418714j496706j174046k605105m139080
$$ -2325026 -2143675 -929834 -707755 -2126469 -3623175 -4797221 -7402326 -11541406
42533a1541406k367953J716239L375583J389920p6119J658352L671467K763147
$$ -11541406 -13909359 -12193120 -8817537 -7427617 -7503736 -5845384 -2173917 589230
42525E89230P19066O33404J355921J1910k292451k111522K35157J013966p74572
$$ 589230 1308296 1941700 3297621 3309531 1017080 -1094442 -859285 154681 -619891
42516f19891k173832j582201r31478j451064j207728J315774M308925N245623
$$ -619891 -2793723 -4375924 -5307402 -6758466 -7966194 -6650420 -2341495 2904128
42508B904128M025809J951053j43662j329564o07055R07903L28997k533719l629255
$$ 2904128 6929937 8880990 8737328 7407764 6800709 7708612 8037609 5503890 1874635
42499A874635k75038L818324K642761l804446q730628o530499Q74714O585592
$$ 1874635 1599597 5417921 8060682 4256236 -4474392 -11004891 -10130177 -3544585
42491c544585O092003J194876k586636j702509K243971M660685K893064j498044
$$ -3544585 2547418 3742294 1155658 -546851 1697120 6357805 9250869 7752825
42483G752825n050602n848636m428164k464734j293076r75882k88940J758783
$$ 7752825 2702223 -3146413 -7574577 -10039311 -11332387 -12308269 -12597209 -10838426
42475a0838426M223603M987548L371680Q09443j228697k417332k350580k07593
$$ -10838426 -6614823 -1627275 1744405 2553848 1325151 -1092181 -3442761 -3650354
42467c650354L185415M778491K588633j428368l393802j810208J314477K994963
$$ -3650354 -464939 4313552 6902185 5473817 2080015 269807 1584284 4579247
42459D579247J907769p87299k359832j023938J745328K553491N28672j254170
$$ 4579247 6487016 5699717 3339885 2315947 4061275 6614766 7143438 5889268
42451E889268k46342J470988O1949m040813n984645k745788K881364N661149L765114
$$ 5889268 5642926 7113914 7175863 3135050 -2849595 -5595383 -2714019 2947130 6712244
42442F712244l874j980975j301375K14876Q53293Q32232J275732K190752K429657
$$ 6712244 6708370 4727395 3426020 3640896 4494189 5326421 6602153 8792905 11222562
42433A1222562J515842M01487M2410R1618m36440j766995l094383l394785k378992
$$ 11222562 12738404 13139891 13182301 13273919 12837479 11070484 7976101 4581316 2202324
42424B202324r27306l39029p36231q64243j80514J6127j044634j479934O15363
$$ 2202324 1275018 935989 199758 -664485 -844999 -828872 -1873506 -3353440 -2738077
42415b738077L462395L674225J537335M76133J077916m42l835910o338576m135131
$$ -2738077 724318 4398543 5935878 6412011 7489927 7489485 3653575 -2685001 -6820132
42406f820132K57846K267616J401695L07876R5022m1275k99933m14432p88303
$$ -6820132 -6562286 -4294670 -2892975 -2585099 -2490077 -2531352 -2831285 -3245717 -4034020
42397d034020j075460L00279K827107K969250l66808k703019m34901K884195K020945
$$ -4034020 -5109480 -4809201 -1982094 987156 620348 -2082671 -2517572 366623 2387568
42388B387568j056914m90563K978462K671445k545176n412769j438645M024160
$$ 2387568 1330654 840091 3818553 6489998 3944822 -1467947 -2906592 1117568
42380A117568L863220r98628m549746m520561l359871k757079j820250R2067K111257
$$ 1117568 4980788 3982160 -567586 -5088147 -8448018 -11205097 -13025347 -12933280 -10822023
42371a0822023L225383K935869J243241o04314n64081J582985L420222L061335
$$ -10822023 -7596640 -4660771 -3417530 -4021844 -4585925 -3002940 417282 3478617
42363C478617J653297J325741K148588K615922J851077L5208k111069l294652
$$ 3478617 5131914 6457655 8606243 11222165 13073242 13108450 10997381 7702729
42355G702729k565334j075629j162221k916340l823973k686477j276301q17435
$$ 7702729 5137395 4061766 2899545 -16795 -3840768 -6527245 -7803546 -8620981
42347h620981J90513K628984M192429K916035P85591O65563J690952J281397J77950
$$ -8620981 -8430468 -5801484 -1609055 1306980 2092571 2758134 4449086 5730483 5908433
42338E908433J356775M384676M951306Q87523m469398o335622l870920j78495
$$ 5908433 7265208 11649884 16601190 17488713 13019315 6683693 2812773 2634278
42330B634278J700834J417057M74486n3189m49601j188644j754799j532591j203333
$$ 2634278 4335112 5752169 6226655 6173466 5723865 4535221 2780422 1247831 44498
42321D4498j683304k075892q22569J202032J470806P2750l6318J851953K429402
$$ 44498 -1638806 -3714698 -4537267 -3335235 -1864429 -1791679 -1827997 23956 2453358
42312B453358k40562l120015k903079j087533p44946j149663r325J299626j31644
$$ 2453358 2212796 -907219 -3810298 -4897831 -5642777 -6792440 -6801765 -5502139 -5633783
42303e633783k726639k012641K018255M462517L013694Q50949P69289J329978
$$ -5633783 -8360422 -10373063 -8354808 -3892291 -878597 -27648 741641 2071619
42295B071619R72740J445343M015440N761164L296711j926917n329467m883993
$$ 2071619 3044359 4489702 8505142 14266306 17563017 15636100 10306633 5422640
42287E422640k384570j47590R58695Q38584j46907r35549p95022l71288n42949
$$ 5422640 3038070 2890480 3849175 4687759 4540852 3605303 2810281 2438993 1896044
42278A896044q48217l90270K86503k16218j864887k903419k072978j65135J001031
$$ 1896044 1047827 657557 944060 727842 -1137045 -4040464 -6113442 -6278577 -5277546
42269e277546O69865j04177K07220J638561K558498J829467M41166K0820L80448
$$ -5277546 -4607681 -4711858 -4504638 -2866077 -307579 1521888 1963054 1983874 2364322
42260B364322J32771n93501j46541J655469K741973J915474P16504Q08287J295366
$$ 2364322 2497093 1903592 1757051 3412520 6154493 8069967 8786471 9594758 10890124
42251A0890124L89323j651355l141989l471377l056947j716470P22363K708052
$$ 10890124 11279447 9628092 6486103 3014726 -42221 -1758691 -1036328 1671724
42243A671724K248985K1923r96850M48716K182308J783167j91699j441736j186529
$$ 1671724 3920709 3942632 2945782 3394498 5576806 7359973 7168274 5726538 4540009
42234D540009p16053j232155k455734l304773l044126j741212k29256L86440l01532
$$ 4540009 3823956 2591801 136067 -3168706 -6212832 -7954044 -8183300 -7796860 -8098392
42225h098392j540196k231759j918970n73966J919964N025995O716449N018329
$$ -8098392 -9638588 -11870347 -13789317 -14363283 -12443319 -7417324 -700875 4317454
42217D317454Q38665k201460j703329Q27018K298218J924924J230518J000250
$$ 4317454 5156119 2954659 1251330 2078348 4376566 6301490 7532008 8532258
42209H532258M13395p52632j200833j75026J222329J771765J803974J941215J406815
$$ 8532258 8945653 8193021 6992188 6817162 8039491 9811256 11615230 13556445 14963260
42200A4963260p64534l389264l689255m99593L954344N897743L515934j232615
$$ 14963260 14198726 10809462 7120207 6620614 10574958 16472701 19988635 18756020
42192A8756020m286871l383117k38498J767115J693680J394845J853732J425557
$$ 18756020 14469149 11086032 10847534 12614649 14308329 15703174 17556906 18982463
42184A8982463j147657m010483m496091k913580j821001k128864k172903p32266
$$ 18982463 17834806 13824323 9328232 6414652 4593651 2464787 291884 -440382
42176d40382J004786J200684q8837r36493J99296K515131L323229R93007k664387
$$ -440382 564404 1765088 1676251 739758 939054 3454185 6777414 7770421 5106034
42167E106034m129315k543212o90742q37370j594321n93372J513550K168246R84985
$$ 5106034 976719 -1566493 -2257235 -3094605 -4688926 -5282298 -3768748 -1600502 -615517
42158f15517J10489P82372J822452J778836Q51832L01528Q41057J572322L39048
$$ -615517 -505028 277344 2099796 3878632 4730464 5031992 5873049 7445371 7784419
42149G784419l604372o958773m981543J815712O645983M836369J53810j111352
$$ 7784419 4180047 -2778726 -7760269 -5944557 701426 5537795 5691605 4580253
42141D580253O19506L26301k365935k913071n48092L4953k702719l789812j81044
$$ 4580253 5199759 5526060 3160125 247054 -301038 -266085 -2968804 -6758616 -6939660
42132f939660L596462K621816o01802o29943K397217M111291L151855J709576
$$ -6939660 -3343198 -721382 -1323184 -1953127 444090 4555381 7707236 9416812
42124I416812N89865j113700k431068j478207M33059K02893j610047j197240K166376
$$ 9416812 10006677 8892977 6461909 4983702 5416761 5619654 4009607 2812367 4978743
42115D978743M436500K612526j387542m100938m585475l459002q09046K666662
$$ 4978743 9415243 12027769 10640227 6539289 1953814 -1505188 -2314234 352428
42107C52428M521017L048048j04653j768997j076143J59848L78769j17808n72104
$$ 352428 4873445 7921493 7816840 6047843 4971700 5131548 5510317 5392509 4820405
42098D820405j151758k012936k054688k19858K120296K085248m71311j722016
$$ 4820405 3668647 1655711 -398977 -618835 1501461 3586709 3115398 1393382
42090A393382R17086M070694K520269k630250m573144o13770L556129K248337
$$ 1393382 2310468 6381162 8901431 6271181 1698037 1084267 4640396 6888733
42082F888733j954152k733490L86645K473253J541569O36381J534886J849677
$$ 6888733 4934581 2201091 2587736 5060989 6602558 7238939 8773825 10623502
42074A0623502j47882k325334k482529j851000k327582k818206j014526K625579
$$ 10623502 10475620 8150286 5667757 3816757 1489175 -1329031 -2343557 282022
42066B82022M910076L490858n94977l546911k074984K762978N564504K537485
$$ 282022 5192098 8682956 8087979 4541068 2466084 5229062 10793566 13331051
42058A3331051l090103m690597j169117J814632O03379j241333N38825L451308
$$ 13331051 10240948 5550351 4381234 6195866 6799245 5557912 6096737 9548045
42050I548045K238680k222586l802068m86661K711687J605312j208664j096337
$$ 9548045 11786725 9564139 5762071 5275410 7987097 9592409 8383745 7287408
42042G287408J420031K131969P3738j193752O24089K977406K214555j325533m011043
$$ 7287408 8707439 10839408 10913146 9719394 10343483 13320889 15535444 14209911 10198868
42033A0198868l697144j862101j081091j889105k647399j770277L96041J856763
$$ 10198868 6501724 4639623 3558532 1669427 -977972 -2748249 -2352208 -495445
42025d95445J286518n0914K51192J979881J775556k014219n738632m699006j02262
$$ -495445 791073 740159 991351 2971232 4746788 2732569 -3006063 -7705069 -7807331
42016g807331K073541n18988l433450k208269J589961L672000L027865J429333
$$ -7807331 -5733790 -6252778 -9686228 -11894497 -10304536 -6632536 -3604671 -2175338
42008b175338k37823j534975q20446J937389K866811o82307m505226k443264M020065
$$ -2175338 -2413161 -3948136 -4768582 -2831193 35618 -646689 -5151915 -7595179 -3575114
41999c575114P093981L863453j33400q0528J540360O47286j521797j498990K78150
$$ -3575114 3518867 7382320 7248920 7168392 8708752 9356038 7834241 6335251 6613401
41990F613401R92253M58156L07797J44217j346008k867724k136085j56498o9078
$$ 6613401 7605654 8063810 8371607 8515824 7169816 4302092 2166007 2009509 1940431
41981A940431k063915k966649j036091J826574L002260J829858q23616l413887
$$ 1940431 -123484 -3090133 -4126224 -2299650 702610 2532468 1708852 -1705035
41973a705035m066304k255759j60637j87510j298503l43379K840404M586702K572019
$$ -1705035 -5771339 -8027098 -8187735 -8375245 -9673748 -10017127 -7176723 -2590021 -18002
41964a8002q60034k123263j010105Q3761N8030m4328N12248J014896Q73612P19173
$$ -18002 -878036 -3001299 -4011404 -3927643 -3869613 -3913941 -3401693 -2386797 -1513185 -794012
41954g94012J190547J664385J172289L9485n17922l22522m88798j382051j760855
$$ -794012 396535 2060920 3233209 3272694 2754772 2432250 1943452 561401 -1199454
41945a199454j012924q80953l100272o135809o538381l336532J141193M635344
$$ -1199454 -2212378 -3093331 -6193603 -12329412 -18867793 -22204325 -21063132 -16427788
41937a6427788O501258N930885K194612k256370k650019J881968O103026N428768
$$ -16427788 -9926530 -3995645 -1801033 -4057403 -6707422 -4825454 1277572 6706340
41929F706340J924312K32713L97328p76696l174748l466384j211983L36697J37676
$$ 6706340 8630652 8863365 9260693 8483997 5309249 1842865 630882 967579 1105255
41920A105255J166587M709605P114078M763972o93558m547361m358902j281315
$$ 1105255 2271842 6981447 14095525 18859497 18165939 13618578 9259676 7978361
41912G978361J913778K509087l81646m108772m607135j657626M23286r43148k642177
$$ 7978361 9892139 12401226 12019580 7910808 3303673 1646047 2069333 1126185 -1515992
41903a515992r83015K031654J647995j995780l811944j347499J891968J972233
$$ -1515992 -2499007 -467353 1180642 -815138 -4627082 -5974581 -4082613 -2110380
41895b110380j19939q09701P44497K175029J643198j79932j688009k254922k213373
$$ -2110380 -2230319 -3040020 -2295523 -120494 1522704 1342772 -345237 -2600159 -4813532
41886d813532j864406j110576Q3698J225444J623484J310820J234763K058590
$$ -4813532 -6677938 -7788514 -7704816 -6479372 -4855888 -3545068 -2310305 -251715
41878b51715L081950L039925J828972O17938J61325j52475j201173k719840l509311
$$ -251715 2830235 5870160 7699132 8317070 8478395 8325920 7124747 4404907 895596
41869H95596k779964j017849K77033k51071k371477l921035k705219Q43725L684835
$$ 895596 -1884368 -2902217 -2625184 -2876255 -5247732 -9168767 -11873986 -11030261 -7345426
41860g345426L512051J361913n9225M9643K21578k69511q6548J589170K926167
$$ -7345426 -3833375 -2471462 -2530687 -2481044 -2259466 -2528977 -2615525 -1026355 1899812
41851A899812J724836j072446k301790r56278M52591m00872k374301k576492k28595
$$ 1899812 3624648 2552202 250412 -705866 -253275 -654147 -3028448 -5604940 -5833535
41842e833535K650560L868789L089302J458587K31143k87516j025615l000991
$$ -5833535 -3182975 685814 3775116 5233703 5464846 5177330 4151715 1150724
41834A150724n366537n513113k256143J978560L875323L541267L799916N140924
$$ 1150724 -4215813 -9728926 -11985069 -10006509 -6131186 -2589919 1209997 6350921
41826F350921M293350n85237n675668n412476K2062M132614J953550l738049n941223
$$ 6350921 10644271 10059034 4383366 -1029110 -1007048 3125566 5079116 1341067 -4600156
41817d600156k136658K879153L298547n93708l380062j656297K141609L528997
$$ -4600156 -6736814 -3857661 -559114 -1152822 -4532884 -6189181 -4047572 -518575
41809e18575J485999j348828k622319k292265j147188N25483K289018L133277
$$ -518575 967424 -381404 -3003723 -5295988 -6443176 -5917693 -3628675 -495398
41801d95398K496601Q46405j103082k797581l334399j974965K70842J079111j00176
$$ -495398 2001203 2847608 1744526 -1053055 -4387454 -6362419 -6091577 -5012466 -5112642
41792e112642o92238J731168N648225O877843L644228j187650l428478k075559
$$ -5112642 -5804880 -4073712 1574513 8452356 12096584 10908934 7480456 5404897
41784E404897K11495O19607o96764j311472K9908J568754Q44379j758332l273049
$$ 5404897 5616392 6235999 5539235 4227763 4257671 5826425 6670804 4912472 1639423
41775A639423k167458l58484j21706n06500J199678N078766P826928O667310K367825
$$ 1639423 -528035 -886519 -1008225 -1514725 -315047 4763719 12590647 19257957 21625782
41766B1625782k109159m552757m560511l060562j637515j268653j013616Q50355
$$ 21625782 19516623 14963866 10403355 7342793 5705278 4436625 3423009 4273364
41758D273364L652595M025088M23778l612056l368809N63657K877939R42866j820858
$$ 4273364 7925959 11951047 12374825 8762769 5393960 5957617 8835556 9778422 7957564
41749G957564j614303l2283q12715k871140j207393N013531R688310P316084L49129
$$ 7957564 6343261 6310978 5498263 2627123 1419730 6433261 16121571 23437655 23786784
41740B3786784m037983k918541n9820J72041k006805l713214l783380l065992
$$ 23786784 19748801 16830260 16770440 16942481 14935676 11222462 7439082 4373090
41732D373090j742712R60320M191281M869019J207689m098993o028915k781857
$$ 4373090 2630378 3590698 7781979 12650998 13858687 9759694 3730779 948922
41724I48922K154561M078580K062697j048566k494996j872528j78707J445615
$$ 948922 3103483 7182063 9244760 8196194 5701198 3828670 3649963 5095578
41716E095578J901468Q24889m54076j34518J530792K553212K304076K144117K365333
$$ 5095578 6997046 7821935 7367859 7233341 8764133 11317345 13621421 15765538 18130871
41707A8130871J213694j597211l250106k075552p86552k208506m066000k333913
$$ 18130871 19344565 17747354 14497248 12421696 11635144 9426638 5360638 3026725
41699C026725J596281K232109j510773m416629l024826n27612p90959j845717
$$ 3026725 4623006 6855115 5344342 927713 -2097113 -2624725 -3415684 -5261401
41691e261401M34217M991342O724695L915577J52738j264268j109715j494860
$$ -5261401 -4827184 164158 6888853 10804430 10957168 9692900 8583185 7088325
41683G088325k370824k391193j314391J83651J987327M181180N599656M305853
$$ 7088325 4717501 2326308 1011917 1195568 3182895 7364075 12963731 17269584
41675A7269584J65337l836635m050225k27986L882314M852758L450144K662392
$$ 17269584 17434921 13598286 9548061 9320075 13202389 18055147 21505291 24167683
41667B4167683K883509J834508q00808k213892j325331j269112m228890o750327
$$ 24167683 27051192 28885700 28084892 25871000 24545669 23276557 19047667 12297340
41659A2297340m310713J129398K962065p70716m646869l732091N8256J987906
$$ 12297340 7986627 9116025 12078090 11307374 6660505 2928414 2986670 4974576
41651D974576J504031J548669K699876K144757j292466m422538l598775L93304
$$ 4974576 6478607 8027276 10727152 12871909 11579443 7156905 3558130 3951434
41643C951434L207067K264226k92251m79107K509687N195314L864132j077628
$$ 3951434 7158501 9422727 9130476 8651369 11161056 16356370 20220502 19142874
41635A9142874n459105n706935k165347J802302L315534K412059J367048J759168
$$ 19142874 13683769 7976834 5811487 7613789 10929323 13341382 14708430 16467598
41627A6467598K389007P57911l212371o124105m846025m65779K992748L356454
$$ 16467598 18856605 19614516 16402145 10278040 5432015 4966236 7958984 11315438
41619A1315438K115364J520075J739759J536079L50335j133174j711380n90097
$$ 11315438 13430802 14950877 16690636 18226715 18577050 17443876 15732496 15142399
41611A5142399J564861K548156R68007j264174p00889K822650N292967L706830
$$ 15142399 16707260 19255416 20223423 18959249 18258360 21081010 26373977 30080807
41603C0080807J25685j341110R9262K024544L102207M332183O127219O982528
$$ 30080807 30206492 28865382 28964644 30989188 34091395 38423578 44550797 51533325
41595E1533325N867222L922785K854448L130188M490774O764088R376393J1473680
$$ 51533325 57400547 61323332 64177780 67307968 71798742 78562830 87939223 99412903
41587I9412903J3427412J6830768K1935073K6501138K8667779K9764585L2253276
$$ 99412903 112840315 129671083 151606156 178107294 206775073 236539658 268792934
41580B68792934L5214646L3787924K3687140N603623j4773394l0480780l7663837
$$ 268792934 304007580 337795504 361482644 367086267 352312873 321832093 284168256
41573B84168256l7658644l4961389l2615023k9994965k5539423k0120974j5871603
$$ 284168256 246509612 211548223 178933200 148938235 123398812 103277838 87406235
41566H7406235j2759046r037314m926255k906595l661718m503316l171081p72239
$$ 87406235 74647189 65609875 60683620 57777025 54115307 49611991 46440910 45668671
41558D5668671O70710J212812J425056J19824l483047o906914o963263m341420
$$ 45668671 46339381 47552193 48977249 49097073 45614026 38707112 31743849 27402429
41550B7402429k571187k875748l203424k264949j214146p96193M0842J693089
$$ 27402429 24831242 21955494 18752070 16487121 15272975 14476782 14517624 16210713
41542A6210713K790648K625102K165647J633941k23904l149092m481184l013346
$$ 16210713 19001361 21626463 23792110 25426051 25202147 22053055 17571871 14558525
41534A4558525j061572o56700l63400J588343L577148L142790J187738J76575
$$ 14558525 13496953 12840253 12476853 14065196 17642344 20785134 21972872 22149447
41526B2149447j76036j635218l148983k087977P04116J507619l05131j231484
$$ 22149447 21973411 20338193 17189210 15101233 15805349 17312968 17007837 15776353
41518A5776353L85563J588672J5000j864967o08633K787310M490395L168709Q09454
$$ 15776353 16161916 17750588 17765588 15900621 15291988 18079298 22569693 25738402 26547856
41509B6547856p08870j187704r24323m07498q33938k680203l944222k078027K115745
$$ 26547856 25838986 24651282 23726959 23319461 22485523 19805320 15861098 13783071 15898816
41500A5898816M704700L470447O72730j67274J230046K244246J456414N21872
$$ 15898816 20603516 24073963 24746693 24579419 25809465 28053711 29510125 30031997
41492C0031997J588485M243899O120512N992942N044658M873801N313904N033947
$$ 30031997 31620482 35864381 41984893 47977835 53022493 57896294 63210198 68244145
41484F8244145L737241K738191L324630N315446P518256R180798J0725040J3202485
$$ 68244145 71981386 74719577 78044207 83359653 90877909 100058707 110783747 123986232
41476A23986232J7090918K1613551K5467074K8255830L0663956L2908722L3651224
$$ 123986232 141077150 162690701 188157775 216413605 247077561 279986283 313637507
41469C13637507L0993591K4097034J3485747O84122j1726839k0840762k5637279
$$ 313637507 344631098 368728132 382213879 382898001 371171162 350330400 324693121
41462C24693121k7890133k9675362l0762460k9895228k7577675k5344200k2906724
$$ 324693121 296802988 267127626 236365166 206469938 178892263 153548063 130641339
41455A30641339j8783409j3780226j0860819j0779067j0716594q606743o046415
$$ 130641339 111857930 98077704 87216885 76437818 65721224 57114481 51068066
41448E1068066m943332l893719q39976K462087K229284j542134m452671l535175
$$ 51068066 46124734 42231015 41391039 43853126 46082410 44540276 40087605 36552430
41440C6552430r77673o85777l062930m922672l634292J61505L624701M327308
$$ 36552430 35574757 34888980 31826050 26903378 23269086 23430591 27055292 31382600
41432C1382600J866457k081931m941103n116303l312740j828250k123152l204560
$$ 31382600 33249057 31167126 26226023 21109720 17796980 15968730 13845578 10641018
41424A0641018k861125l58776K776539M640830M643356L099838M86375k049818
$$ 10641018 7779893 7421117 10197656 14838486 19481842 22581680 23068055 21018237
41416B1018237k755940j259059N12886R15037R59087K106756K943911J114119
$$ 21018237 18262297 17003238 17516124 18431161 19390248 21497004 24440915 25555034
41408B5555034j934914j857725K256358O046168N830575L013503N07871j819578
$$ 25555034 23620120 21762395 24018753 30064921 35895496 38908999 39416870 37597292
41400C7597292n005404p117506n634525k197760q30291j899505j725220J612675
$$ 37597292 32591888 25474382 19839857 17642097 16811806 14912301 13187081 14799756
41392A4799756N630056P291658O355230L908657N56111k483777l042463o34320
$$ 14799756 20429812 27721470 34076700 37985357 38541468 36057691 33015228 32380908
41384C2380908K370109L782139M165931M928137N689179N496501N064623N389122
$$ 32380908 34751017 38533156 42699087 47627224 53316403 58812904 63877527 69266649
41376F9266649N136892K112431k848561n966841n036829j923185J15434j42992
$$ 69266649 74403541 76515972 73667411 67700570 62663741 60740556 60855990 60712998
41368F0712998j964299m367858o213465n850013k727433R47571K010808R8633
$$ 60712998 58748699 54380841 48167376 42317363 39589930 40537501 42548309 42646942
41360D2646942j780096q44967K476720N564543O244897L789178j085970n800600
$$ 42646942 40866846 40021879 42498599 48063142 54308039 58097217 57011247 51210647
41352E1210647o814401l043191K068444L881187J960471K70627J774498M919664
$$ 51210647 44396246 41353055 43421499 47302686 49263157 49533784 51308282 56227946
41344E6227946O400617N611422M800145N770278P984141R720492J0040760R503281
$$ 56227946 62628563 68239985 73040130 78810408 86794549 96515041 106555801 116059082
41336A16059082R469064J0854151J3471296J6401554J8392491J7678361J2706217
$$ 116059082 125528146 136382297 149853593 166255147 184647638 202325999 215032216
41329B15032216M346131l649163q249743j0481603j3063368j5694750j5894819
$$ 215032216 219378347 215729184 207479441 196997838 183934470 168239720 152344901
41322A52344901j4142203j3982079j6022382j6142661j1933518o946546n281552
$$ 152344901 138202698 124220619 108198237 92055576 80122058 73175512 67893960
41315F7893960n419320l672476j108562j849596n598321p147720l827697R58859
$$ 67893960 62474640 58802164 57693602 55844006 50245685 43097965 39270268 40229127
41307D0229127K881467J876298O47011O62254J335213J458258K36116j876949
$$ 40229127 43110594 44986892 45633903 46296157 47631370 49089628 49325744 47448795
41299D7448795k813082o72182L791205P619624Q520180O207785J784670k353337
$$ 47448795 44635713 43963531 47754736 55374360 63894540 70102325 71886995 69533658
41291F9533658l000508P93995N593459P176861N817307N067329N952626O174108
$$ 69533658 66533150 67327145 72920604 80097465 85914772 90982101 96934727 103108835
41283A03108835M964451M280577M338582K593768j107368k968665j490958r10464
$$ 103108835 108073286 112353863 116692445 119286213 118178845 115210180 113719222 112808758
41275A12808758m731782r586788j0098027p003570n196417n453963m021818l46237
$$ 112808758 108076976 98490188 88392161 81388591 76192174 70738211 66716393 66370156
41267F6370156P28779l450025q174900p223865j280597L046720J635455k931994
$$ 66370156 67098935 63648910 55474010 48250145 46969548 50016268 51651723 48719729
41259D8719729n837445n968325n659522n981081n012734j425530K443824L124303
$$ 48719729 42882284 36913959 31254437 25273356 20260622 18835092 21278916 24403219
41251B4403219N93985j984773k754190k774026k865964j820980Q14271K699860
$$ 24403219 24997204 23012431 20258241 17484215 14618251 12797271 13611542 16311402
41243A6311402J634475j172479k917757k909074k220631q82003J897925N181110
$$ 16311402 17945877 16773398 13855641 10946567 8725936 7843933 9741858 14922968
41235A4922968O559644N160679K456936j6048j924933l047277k917779k097497
$$ 14922968 21482612 26643291 29100227 29084179 27159246 24111969 21194190 19096693
41227A9096693k059265l009261l212718j377327J414689L105102L098925K286710
$$ 19096693 17037428 14028167 10815449 9438122 10852811 13957913 17056838 19343548
41219A9343548J336665K23614q15419j231787j302557j922113k507203o98846
$$ 19343548 20680213 20903827 20088408 18856621 17554064 15631951 13124748 12425902
41211A2425902L949101P135051L906020m016099q625700n342623R86792L018769
$$ 12425902 16375003 23510054 27416074 23399975 14774275 9431652 10418444 13437213
41203A3437213Q30492P8113K124342K267645j772051n719668n313610k005945
$$ 13437213 14267705 14345818 16470160 18737805 16965754 11246086 5932476 3926531
41195C926531O90474K190444L055266K264578j47032j274400J60504R70291r63828
$$ 3926531 4617005 6807449 9862715 12127293 11980261 10705861 10866365 11836656 10872828
41186A0872828k174573N02112L286943R49112l903241m264666N0987K405121M64561
$$ 10872828 8698255 9200367 12487310 13436422 9533181 5268515 5319502 7724623 8189184
41177H189184o53403K057906M415149K693673k32068n47381J48915j141534k831518
$$ 8189184 7535781 9593687 14008836 16702509 16470441 15923060 16071975 14930441 12098923
41168A2098923j863964M09002N31931j120449j563609q02217j439869l367303
$$ 12098923 10234959 10643961 11175892 10055443 8491834 7689617 6249748 2882445
41160B882445l319334r8568L297847L615001R84339j987839l013951j686736M46602
$$ 2882445 -436889 -535457 2762390 6377391 7361730 5373891 2359940 673204 1119806
41151A119806J349654Q11860N55313J259542J071289j386784m200982m537741
$$ 1119806 2469460 3281320 3836633 5096175 6167464 4780680 579698 -3958043
41143c958043k531903m99280N55835J121131R22785n97195k102344j573371M52150
$$ -3958043 -6489946 -6989226 -6433391 -5312260 -4389475 -4986670 -7089014 -8662385 -8210235
41134h210235J530273J058874O34896P80116L91798k82833N14354K344252K103861
$$ -8210235 -6679962 -5621088 -4986192 -4206076 -3814278 -4097111 -3582757 -1238505 865356
41125H65356j042626l359135j620369J903067K484905n38237l342866l084931
$$ 865356 -177270 -3536405 -5156774 -3253707 -768802 -1307039 -4649905 -7734836
41117g734836r12466O65638R92399R80114J231046J558525J717179J847810K257321
$$ -7734836 -8647302 -7981664 -6989265 -6009151 -4778105 -3219580 -1502401 345409 2602730
41108B602730K830198K652046P79129k160053l849691k701036Q0635J832202J410934
$$ 2602730 5432928 8084974 8864103 6704050 2854359 153323 233958 2066160 3477094
41099C477094k36636j884314k785747j979024R49844L980283L887842O49423j477380
$$ 3477094 3240458 1356144 -1429603 -3408627 -2458783 1521500 5409342 6058765 4581385
41090D581385P05140M527282M615922J4564m785655n883013m052250k076253r02125
$$ 4581385 5286525 9813807 14429729 14444293 9658638 3775625 -276625 -2352878 -3255003
41081c255003j24913j0664p91822j356929q04444l28570j476016l244948l047033
$$ -3255003 -3379916 -3390580 -4182402 -5539331 -6343775 -6672345 -8148361 -11393309 -14440342
41072a4440342k16181L363456N851046O773612O042176L815561J489150P46991
$$ -14440342 -14656523 -11293067 -5442021 1331591 7373767 11189328 12678478 13425469
41064A3425469J201313P98842j053542k688463k990928k928269l355566l229980
$$ 13425469 14626782 15425624 14372082 11683619 8692691 5764422 2408856 -821124
41056h21124j352855J471332L220272K659652K2221k981977l535275j62164M445014
$$ -821124 -2173979 -702647 2517625 5177277 5199498 2217521 -1317754 -1479918 2965096
41047B965096N477536K164320q18317o8823J365462j124607n952948p032994k563432
$$ 2965096 8442632 10606952 9788635 9719812 11085274 9960667 4007719 -3025275 -5588707
41038e588707K504786L493750J362136n77253j668939l011881m109649l556366
$$ -5588707 -3083921 409829 1771965 1194712 -474227 -3486108 -7595757 -11152123
41030a1152123j852092p85113n19428L77878K185919L420130L149834K091144
$$ -11152123 -13004215 -13789328 -14308756 -13930878 -11744959 -8324829 -5174995 -3083851
41022c083851J007320k42439j342642q75681J589639L823135L103196r7827k183624
$$ -3083851 -2076531 -2318970 -3661612 -4537293 -2947654 875481 3978677 3880850 1697226
41013A697226p45246K299743K883864k92132m050618m248757m27604L628068L937503
$$ 1697226 951980 3251723 6135587 5843455 1792837 -2455920 -2883524 744544 4682047
41004D682047L97054l589126n155619m619410l719620k522845K03909L811729
$$ 4682047 5079101 1489975 -3665644 -8285054 -12004674 -14527519 -14323610 -10511881
40996a0511881N168521K398237k195870m524190l260668m49333J821522L334664
$$ -10511881 -5343360 -2945123 -5140993 -9665183 -12925851 -13375184 -11553662 -8218998
40988h218998M202011L497279O89125k609040l753184j957245O98995J544546
$$ -8218998 -4016987 -519708 169417 -2439623 -6192807 -8150052 -7451057 -5906511
40980e906511M12597j82035J479399L390441K125060j829526l603867l63581M213446
$$ -5906511 -5493914 -5675949 -4196550 -806109 1318951 -510575 -4114442 -4478023 -264577
40971b64577M646379J066542j707425j555084j158087k427171l373477k254256
$$ -264577 4381802 5448344 3740919 2185835 1027748 -1399423 -4772900 -7027156
40963g027156q98600j293751j939878n78818J767378K513888J558946P76553Q50596
$$ -7027156 -7925756 -9219507 -11159385 -11738203 -9970825 -7456937 -5897991 -5121438 -4270842
40954d270842J246270K035748L169840L208106J396605k82963J29993J196940
$$ -4270842 -3024572 -988824 2181016 5389122 6785727 6502764 6632757 7829697
40946G829697N75766n80242L98745K311797J271042k673296m830603k915113l16102
$$ 7829697 8405463 7825221 8223966 10535763 11806805 9133509 4302906 1387793 1071691
40937A071691l19463j186064j8327J813443J048662j656082k518871o72939N70250
$$ 1071691 752228 -433836 -452163 1361280 2409942 753860 -1765011 -2437950 -1867700
40928a867700p25315j686608J092578N830383P033910K582290l272001n246768
$$ -1867700 -2593015 -4279623 -3187045 2643338 9677248 12259538 8987537 3740769
40920C740769l390536j711605j654135o35235K340894L697936N97093l864359
$$ 3740769 350233 -1361372 -3015507 -3650742 -1309848 2388088 2985181 -879178
40912h79178m561045j491070J202186K090180L388169N134604L899228r84312
$$ -879178 -5440223 -6931293 -5729107 -3638927 -250758 4883846 8783074 7798762
40904G798762m661984l176797Q79285K373949O44806q76246j95530J418601K116638
$$ 7798762 3136778 -40019 839266 3213215 3858021 2981775 2786245 4204846 6321484
40895F321484J163499j330137m051048m658642k494045k22647n33612k126705
$$ 6321484 7484983 6154846 2103798 -2554844 -5048889 -5271536 -5805148 -7931853
40887g931853j522373J757168M522562M316443J966785m65711k008669k531732
$$ -7931853 -9454226 -7697058 -3174496 1141947 3108732 2643021 634352 -1897380
40879a897380k057120r89742J41881J271214K066708J313214j170253k767901
$$ -1897380 -3954500 -4944242 -4802361 -3531147 -1464439 -151225 -1321478 -4089379
40871d089379q89891K670652L384031N01021j566497J48622K729248K240017k2995
$$ -4089379 -4979270 -2308618 1075413 1576434 9937 158559 2887807 5127824 5104829
40862E104829n9973J996832K292953O7186q57126J453857L571904K161246q10298
$$ 5104829 5044856 7041688 9334641 9401827 8544701 9998558 13570462 15731708 14921410
40853A4921410j704189j172330k273978m478082m393337j956364q72378k170913
$$ 14921410 13217221 12044891 9770913 5292831 899494 -1056870 -1929248 -4100161
40845d100161k239103Q36085L545467K559294J33739J17884J730668J754814N41921
$$ -4100161 -6339264 -5503179 -1957712 601582 735321 853205 2583873 4338687 4880608
40836D880608Q53441K200722J637689l82760m24969J356405P24979l102511n001276
$$ 4880608 5734049 7934771 9572460 9189700 8764731 10121136 10846115 7743604 2742328
40827B742328j853029J938685Q58305l394436m665764j400346J748462R37586
$$ 2742328 889299 2827984 3686289 291853 -4373911 -5774257 -4025795 -3088209
40819c088209k107858l134094p56848K302877K617039J77487j371855M82742L018269
$$ -3088209 -5196067 -8330161 -9087009 -6784132 -4167093 -3989606 -5361461 -4878719 -1860450
40810a860450J538703l460164o177167l707709j86915j56569j735020l71093L551492
$$ -1860450 -321747 -3781911 -9959078 -13666787 -13853702 -14010271 -15745291 -16116384 -12564892
40801a2564892N627693M308740K141632Q14970n98121k385452l099886k231347
$$ -12564892 -6937199 -2628459 -486827 328143 -269978 -2655430 -5755316 -7986663
40793g986663q26484P83550K841029L776578J447625k768192m587808k523333
$$ -7986663 -8813147 -8029597 -5188568 -1411990 35635 -2732557 -7320365 -9843698
40785i843698J76641N21922k76833M18553K498481L887267L842158L295967K671400
$$ -9843698 -9667057 -9145135 -9421968 -9003415 -6504934 -2617667 1224491 4520458 7191858
40776G191858J198208j432901l712247l363320j38671K931741K510530p09240
$$ 7191858 8390066 6957165 3244918 -118402 -257073 2674668 5185198 4475958
40768D475958k707778j830627q97139j985288k594819j86614K679539K152014
$$ 4475958 1768180 -62447 -959586 -2944874 -5539693 -5726307 -3046768 -894754
40760h94754n33753j605575j500104k955395l946368L5719O635990P580890Q84720
$$ -894754 -1428507 -3034082 -4534186 -7489581 -11435949 -11400230 -4764240 2816650 3701370
40751C701370n426417m877940p36083J346265J895664L391908L685909N07940
$$ 3701370 -1725047 -6602987 -7339070 -5992805 -4097141 -705233 2980676 3488616
40743C488616k058754R56683O473125P166035K365744j819883k220197j614931
$$ 3488616 1429862 2386545 8859670 16025705 18391449 16571566 14351369 12736438
40735A2736438k174508k385915j424791j039423j778084j928439j241160j478531
$$ 12736438 10561930 8176015 6751224 5711801 3933717 2005278 764118 -714413
40727g14413k480692j930372J75601J079247J27753k28069P77615R66053r4638
$$ -714413 -3195105 -5125477 -4949876 -3870629 -3742876 -3970945 -3193330 -2227277 -2321915
40718b321915K0406J329873K22974l855540n553021j296473M398397M961216J002568
$$ -2321915 -2301509 -971636 -748662 -4604202 -10157223 -11453696 -7055299 -2094083 -1091515
40709a091515j470000n1618J979349J841098O80073K67581J36386o15575j245494
$$ -1091515 -2561515 -2613133 -633784 1207314 1887387 2154968 2291354 1675779 430285
40700D30285o05598Q92376J632127O23723j327081k157772p34658J366675J406688
$$ 430285 -175313 717063 2349190 2972913 1645832 -511940 -1246598 120077 1526765
40691A526765q01884k395720j543001J969k8438q56985m84718O49013P57097L70817
$$ 1526765 724881 -1670839 -3213840 -3211871 -3240309 -4097294 -4582012 -3932999 -3175902 -2805085
40681b805085J611602M033839M523398K047408l64566K30291K661570L414699
$$ -2805085 -1193483 2840356 7363754 9411162 9046596 9276887 11938457 15353156
40673A5353156J096013k442392m684311m712251l099711q02544J302859K297618
$$ 15353156 16449169 14006777 9322466 4610215 1510504 707960 2010819 4308437
40665D308437J532477m34347j695315p89131J374136K502121J955705J292036
$$ 4308437 5840914 5406567 3711252 2922121 4296257 6798378 8754083 10046119
40657A0046119J312051N40924k015332m432968m242715j961851K848J025045K303161
$$ 10046119 11358170 11899094 9883762 5450794 1208079 -753772 -750924 274121 2577282
40648B577282L758818L642784J476627r46117k020060j957627j643185j580221
$$ 2577282 6336100 9978884 11455511 10509394 8489334 6531707 4888522 3308301
40640C308301k115266k950145k524946L5951K521154J773036j586073l464500
$$ 3308301 1193035 -1757110 -4282056 -4246105 -1724951 48085 -1537988 -5002488
40632e002488j924973N82385J552040J555552J395339k59609l664132n544040
$$ -5002488 -6927461 -6345076 -4793036 -3237484 -1842145 -2101754 -5765886 -11309926
40624a1309926l332741M96422K056680K019203L671501O358794N880075J535457
$$ -11309926 -14642667 -14146245 -12089565 -10070362 -6398861 -40067 5840008 7375465
40616G375465k036161j415757J173844J917471O12763m63274l62919K99737J155434
$$ 7375465 5339304 3923547 5097391 7014862 7627625 7164351 6801432 7101169 8256603
40607H256603J888597J538657q6797j400120j097559j25525k1497n35331o56318
$$ 8256603 10145200 11683857 11597060 10196940 9099381 8973856 8952359 8417028 7760710
40598G760710p62153j634037k307614j294850N86172J094399J90451K25420J994599
$$ 7760710 6998557 5364520 3056906 1762056 2348228 3442627 3633078 3858498 5853097
40589E853097L009043R21821l109234n953200o162024m571702k149802Q78100
$$ 5853097 8862140 9783961 6674727 721527 -5440497 -10012199 -12162001 -11283901
40581a1283901L743950M651065K572572r96885k976479j586562J996459M975064
$$ -11283901 -7539951 -2888886 -316314 -1313199 -4289678 -5876240 -3879781 1095283
40573A095283N586712M152689J908030l34901k150589k975243k402064q14224
$$ 1095283 6681995 10834684 12742714 12407813 10257224 7281981 4879917 4065693
40565D065693P85289J548868J253876L15424n13372r02211j519935l145592n037313
$$ 4065693 4850982 6399850 7653726 7969150 7455778 6553567 5033632 1888040 -3149273
40556c149273n313887l563983j780498j568353j701406j96182K194739K935315
$$ -3149273 -8463160 -12027143 -13807641 -15375994 -17077400 -17273582 -15078843 -12143528
40548a2143528J813513J377654K679031L199718N94851l408378m911975k681828
$$ -12143528 -10330015 -8952361 -6273330 -3073612 -2478761 -5887139 -10799114 -13480942
40540a3480942P82624K535956J906854J61415r57161j66881K508963N261773N747586
$$ -13480942 -12698318 -10162362 -8255508 -8094093 -9051254 -9218135 -6709172 -1447399 4300187
40531D300187L483516N63423n41780L10899Q97700o51967l496306m915766l510681
$$ 4300187 7783703 8347126 7805346 8116245 9013945 8361978 4865672 -50094 -3560775
40522c560775r19338J19962j191958l449537n216374o029004n407615k766437
$$ -3560775 -4480113 -4360151 -5552109 -9001646 -14218020 -20247024 -25654639 -28421076
40514b8421076J024071L683118M254786M381080N535903O450091N185600K644316
$$ -28421076 -27397005 -23713887 -19459101 -15078021 -9542118 -3092027 2093573 4737889
40506D737889J549762K282794K257998j68706l388826m918525m215253k191728
$$ 4737889 6287651 8570445 10828443 10659737 7270911 2352386 -1862867 -4054595
40498d054595L16232K349296K633843J177456q868O45458J929546J558167m28283
$$ -4054595 -3738363 -1389067 1244776 2422232 2413364 3058822 4988368 6546535 6118252
40489F118252j729797r66100R21473K404937K843858K095034L71642j055454o53983
$$ 6118252 4388455 3422355 4343828 6748765 9592623 11687657 12059299 11003845 10349862
40480A0349862J150448K025246Q24979q55003j238797q78553j126707j643861
$$ 10349862 11500310 13525556 14350535 13495532 12256735 11378182 10251475 8607614
40472H607614j470873j327174k236773k650815j49022L877747M716482P48926
$$ 8607614 7136741 5809567 3572794 921979 772957 4650704 9367186 10116112
40464A0116112l737811m179185j482873M81927P89708J300586K037801R20387
$$ 10116112 6378301 2199116 716243 1198170 1987878 3288464 5326265 6246652
40456F246652j887399l282522j871908Q064L33001L83723J720905K890154J792281
$$ 6246652 4359253 1076731 -795177 -787113 -454112 -70389 1650516 4540670 6332951
40447F332951o42947k024737k294216k853270k895209k74499L781723M502813
$$ 6332951 5690004 3665267 1371051 -1482219 -4377428 -4651927 -870204 3632609
40439C632609k43247o186706p327168k973858K023225L366343J467847n97023
$$ 3632609 3389362 -2797344 -10124512 -13098370 -11075145 -7708802 -6240955 -6837978
40431f837978j247043j192733j087287l09805J360295K273477O96090k290417
$$ -6837978 -8085021 -9277754 -10365041 -10674846 -9314551 -7041074 -6344984 -8635401
40423h635401l457915j498300J173318J699045M32908k04576O18925J642657K033433
$$ -8635401 -12093316 -13591616 -12418298 -10719253 -10286345 -10490921 -9871996 -8229339 -6195906
40414f195906K139147J765274P8068k114410k188147Q04990M012362L844620M55656
$$ -6195906 -4056759 -2291485 -2213417 -4327827 -6515974 -5710984 -1698622 2145998 2601654
40405B601654k293895j213292K782053N624452M129447p52601m723602m616114
$$ 2601654 307759 -905533 1876520 7500972 11630419 10877818 6154216 1538102
40397A538102j722183L45162M98993P53473J882088J539247j554790m191731k491221
$$ 1538102 -184081 161081 660074 1413547 3295635 4834882 3280092 -911639 -3402860
40388c402860K205838M592189K304153j500548k904382j732123k28636L59010
$$ -3402860 -1197022 3395167 5699320 4198772 1294390 -437733 -666369 -307359
40380c07359L01289J43146M32127J448315K027770R9268m147761p052024n402878
$$ -307359 -6070 137076 569203 2017518 4045288 4144556 -3205 -7055229 -12458107
40371a2458107o84197K642315K550727J003316L11065M15759M76241R26421K353195
$$ -12458107 -13142304 -10499989 -7949262 -6945946 -6634881 -6219122 -5742881 -4816460 -2463265
40362b463265L628323L017800Q01822q17598o86032k39242j180731k488891j400423
$$ -2463265 1165058 4182858 4984680 4167082 3481050 3241808 2061077 -427814 -1828237
40353a828237K316748M810273K517961k789783n653198l656141L2393J645255
$$ -1828237 488511 5298784 7816745 5026962 -626236 -4282377 -4249984 -2604729
40345b604729J452687J457963J280321l06126j641176j87688K520310K451420
$$ -2604729 -1152042 305921 1586242 1280116 -361060 -548748 1971562 4422982
40337D422982k66392j040635J669604L441121R35745k674835k929752r46977o26840
$$ 4422982 4156590 3115955 4785559 8226680 9162425 6487590 3557838 2610861 1984021
40328A984021j799369j160877J559629L289310K704870J113194j197098m813095
$$ 1984021 184652 -976225 583404 3872714 6577584 7690778 6493680 1680585
40320A680585p548354n865960o52684L031484L028156K399799L348939L640509
$$ 1680585 -5867769 -11733729 -12386413 -9354929 -6326773 -3926974 -578035 3062474
40312C062474J412738r32634q62458r3721j314400l424654l678901k331617j565447
$$ 3062474 4475212 3542578 2680120 2586399 1271999 -2152655 -5831556 -8163173 -9728620
40303i728620j435002k74134J907214L315485K941715J184651j004598j983001
$$ -9728620 -11163622 -11437756 -9530542 -6215057 -3273342 -2088691 -3093289 -5076290
40295e076290j61163L363961M989348L208472N39608r35510k475190m480047l626535
$$ -5076290 -5237453 -1873492 3115856 6324328 6863936 5928426 3453236 -1026811 -4653346
40286d653346J478916N599160L459489j771857k844802P43058L065760J739417
$$ -4653346 -3174430 2424730 5884219 4112362 1267560 2010618 5076378 6815795
40278F815795K34228K58066o06567k477329j816202J287118J676483j848745l090946
$$ 6815795 7050023 7308089 6701522 4224193 2407991 3695109 5371592 3522847 431901
40269D31901J530924N964321L313931l516694o564253m432339k198116k043144
$$ 431901 1962825 7927146 11241077 7724383 1160130 -3272209 -5470325 -7513469
40261g513469j190358J345361K563972J022824o80938m80965K76641J32594J39985
$$ -7513469 -8703827 -7358466 -4794494 -3771670 -4452608 -4933573 -4656932 -4524338 -4384353
40252d384353J273548K041212Q73547r99829j228992R4502M81186j443774l848085
$$ -4384353 -3110805 -1069593 -196046 -1195875 -2424867 -2330365 -1849179 -3292953 -7141038
40243g141038l770205p90555K353656L149482K171989J362647N68452j809695
$$ -7141038 -10911243 -11701798 -9348142 -6198660 -4026671 -2664024 -2095572 -3905267
40235c905267n008515n765865k908879N71688J489740L64058j00075J465193M309514
$$ -3905267 -8913782 -14679647 -17588526 -17016838 -15527098 -15163040 -15263115 -13797922 -9488408
40226i488408O372601N018565m74668o148993o276793o42013M453905M368683
$$ -9488408 -3115807 1902758 1428090 -4720903 -10997696 -11639709 -7185804 -2817121
40218b817121J433105m12632j674585l858338m266868k7387N450725O186021K293170
$$ -2817121 -1384016 -1796648 -3471233 -7329571 -11596439 -11623826 -6173101 12920 2306090
40209B306090q37000r36513n88868j169942j093473k63963n20681j165372K70139
$$ 2306090 1469090 532577 -56291 -1226233 -2319706 -2583669 -3104350 -4269722 -3999583
40200c999583K224882K71150m655725n768905o54362M382210L815794Q86459J284667
$$ -3999583 -1774701 -1503551 -6159276 -11928181 -12582543 -8200333 -4384539 -3498080 -2213413
40191b213413L779871L130171p58530k826674r39200J414910Q54653j438479k061394
$$ -2213413 1566458 4696629 3938099 1111425 172225 1587135 2441788 1003309 -1058085
40182a058085J40195K892415K979691j27711l235372l224281j469255j819418
$$ -1058085 -917890 1974525 4954216 4826505 1591133 -1633148 -3102403 -4921821
40174d921821m198930m233195m79048K615902J707255l0144J442438L956731L031854
$$ -4921821 -9120751 -13353946 -13832994 -11217092 -9509837 -9539981 -8097543 -4140812 -1108958
40165a108958j25978o81014J407007J561823j035326j811629J211623L865825
$$ -1108958 -1234936 -1915950 -508943 1052880 17554 -1794075 -582452 3283373
40157C283373K775535N99883Q15373J546327q61791m838148n152132p26113L440391
$$ 3283373 6058908 6658791 7474164 9020491 8158700 3320552 -1831580 -2557693 882698
40148H82698K771658j592500n087873n015759k167082J243595L534559L972790
$$ 882698 3654356 2061856 -3026017 -8041776 -10208858 -8965263 -5430704 -1457914
40140a457914K701644O32380j100110j845618j661245j152579j204122k173585
$$ -1457914 1243730 1876110 776000 -1069618 -2730863 -3883442 -5087564 -7261149
40132g261149k796254q21961L835620P234221N100675j171770n010560k813681
$$ -7261149 -10057403 -10879364 -7043744 190477 5291152 4119382 -891178 -3704859
40124c704859J105072O74157l088152l850345J69705L410992J459446k378625
$$ -3704859 -2599787 -1925630 -5013782 -8864127 -8694422 -5283430 -3823984 -6202609
40116f202609k116587K456011O010792M757129N6581m261957n550469l642696
$$ -6202609 -8319196 -5863185 147607 4904736 4961317 699360 -4851109 -8493805
40108h493805n88305R86445N00878r8306O90280J774642J572498P26478Q50904
$$ -8493805 -9082110 -8095665 -7594787 -7693093 -7002813 -5228171 -3655673 -2929195 -2078291
40099b078291J730913J765810M51696j291069k574821k911893k034504o69603
$$ -2078291 -347378 1418432 1870128 579059 -1995762 -4907655 -6942159 -7611762
40091g611762l48161j156248j182824L75622J552828R92215P06035K646802M553157
$$ -7611762 -7959923 -9116171 -10298995 -9923373 -8370545 -7378330 -6672295 -4025493 527664
40082E27664K871406j328044l213390p62242K905450L940976J690057j897904
$$ 527664 3399070 2071026 -1142364 -1904606 1000844 4941820 6631877 4733973
40074D733973m238091l546191o70426R09571o84488k460263o24926L150829L719214
$$ 4733973 495882 -3050309 -3720735 -2811164 -3495652 -5955915 -6580841 -3430012 289202
40065B89202M09258j803558k0011K387714J455800j421485k197455j73592J736459
$$ 289202 698460 -1105098 -1125109 1262605 2718405 1296920 -900535 -1074127 662332
40056F62332J338674n84144j683305m63852K030893K684442j85139l861994l916990
$$ 662332 2001006 1416862 -266443 -730295 1300598 3985040 3799901 -62093 -3979083
40047c979083l8783L306586K554804j128915m273279m704442k064076K430599
$$ -3979083 -4017866 -711280 1843524 714609 -3558670 -8263112 -10327188 -7896589
40039g896589N785346N456552K633079O88522J12266j483201l908197l626969
$$ -7896589 -2111243 3345309 5978388 6666910 6779176 5295975 1387778 -2239191
40031b239191l4675K355516P11723j612466p52901J609697J826468K53892o90335
$$ -2239191 -2273866 81650 793373 -819093 -1571994 37703 1864171 2118063 1427728
40022A427728j206255k234956j882352J239822L716147J892184j395617o91568
$$ 1427728 221473 -2013483 -3895835 -2656013 1060134 2952318 1556701 865133
40014H65133K926074L130175j551044n556788n030221k409307n59832J667081
$$ 865133 3791207 6921382 5370338 -186450 -5216671 -7625978 -8185810 -6518729
40006f518729N103748O589156L516576j318313l067037q91257K111502L231841
$$ -6518729 -1414981 5174175 8690751 7372438 4305401 3414144 5525646 8757487
39998H757487K068672l25346k271870k623479k206519k654108l380549k128156
$$ 8757487 10826159 10500813 8228943 5605464 3398945 744837 -2635712 -4763868
39990d763868Q63379K382143J240453L63525J836653L231062J798801o01095n27009
$$ -4763868 -3900489 -1518346 -277893 85632 1922285 5153347 6952148 6351053 5824044
39981E824044J081395J54460l959446p070433n750752j473518J749804J920307
$$ 5824044 6905439 7059899 3100453 -3969980 -9720732 -11194250 -9444446 -7524139
39973g524139L37558m67729O61219K511072K863019R04122k006462l806857l225671
$$ -7524139 -7186581 -7654310 -6993091 -4482019 -1619000 -714878 -2721340 -6528197 -9753868
39964i753868k88717L149499L872896P23676k543596j041611M055311O025903
$$ -9753868 -10042585 -6893086 -3020190 -2296514 -4840110 -5881721 -1826410 4199493
39956D199493J913960l025283l135143k88861M36447p29715o3095J656297m5367
$$ 4199493 6113453 3088170 -46973 -335834 100613 -629102 -692197 964100 918733
39947I18733m781420o381495k014032L573574N196150L578499J845500K46974
$$ 918733 -3862687 -10244182 -12258214 -8684640 -3488490 90009 1935509 2182483
39939B182483k101788l759428l002552r57890L99353J209308K035433J737350
$$ 2182483 80695 -3678733 -6681285 -7639175 -7239822 -6030514 -3995081 -2257731
39931b257731K613n36541J868921M411781L578086O06192r23367j008168k035725
$$ -2257731 -2255118 -2791659 -922738 3489043 7067129 7673321 6749954 5741786 3706061
39922C706061l156070j348312K270046K998602K04593j293662P06129J964729
$$ 3706061 549991 -798321 1471725 4470327 4674920 3381258 4087387 6052116
39914F052116q76940m290980l628928q45678r38016l195703k213561K890624O300627
$$ 6052116 5175176 884196 -2744732 -3590410 -4528426 -7724129 -9937690 -7047066 -746439
39905g46439L982800n85079j891101r733Q33149p14852j592541K44112K413390
$$ -746439 3236361 2651282 760181 750448 1583597 868745 -723796 -479684 1933706
39896A933706J828081l92438m28407K348676L897354J117145l320125m203963
$$ 1933706 3761787 3369349 2940942 5289618 9186972 10304117 6983992 2780029
39888B780029p75185K466927J997924o70934k145042j583337k01444J317212K516316
$$ 2780029 2004844 4471771 6469695 5798761 3653719 2070382 1868938 3186150 5702466
39879E702466K004192o59812k965952k102501R40124K558239J543457J80385K17883
$$ 5702466 7706658 7046846 4080894 1978393 2918517 5476756 7020213 7200598 7418481
39870G418481N29074l77938j820281k130406q58406J133835K585870K376190M79442
$$ 7418481 7947555 7569617 5749336 3618930 2760524 3894359 6480229 8856419 9335861
39861I335861j293346j001186P22680J375139K63153n84613J69982J035860J43664
$$ 9335861 8042515 7041329 7764009 9139148 9402301 8817688 8987670 10023530 10167194
39852A0167194j992589l462551l221831j344105J336810K851145J372877j766166
$$ 10167194 8174605 4712054 1490223 146118 1482928 4334073 5706950 3940784
39844C940784k501869O54947L841182K812389j143341l322469k403218j531854
$$ 3940784 1438915 2093862 5935044 8747433 7604092 4281623 1878405 346551
39836C46551k752822l935008k456557O24003J929720J55455k362638k350280O23591
$$ 346551 -2406271 -6341279 -8797836 -8173833 -6244113 -6088658 -8451296 -10801576 -10177985
39827a0177985L315548K406219j006748k197588Q12225L829887K046878k643551
$$ -10177985 -6862437 -4456218 -5462966 -7660554 -6848329 -3018442 -971564 -3615115
39819c615115l819019K53117M046563K875347n72829q47944K112282L576145J479653
$$ -3615115 -7434134 -7181017 -3134454 -259107 -831936 -1679880 432402 4008547 5488200
39810E488200j067126j214973n12850j661992l748936l578082p42997J528730
$$ 5488200 4421074 3206101 2693251 1031259 -2717677 -6295759 -7038756 -5510026
39802e510026R31529r24266j322114m12784l38744j361846j409562L72080K070860
$$ -5510026 -4578497 -5502763 -6824877 -7237661 -7576405 -8938251 -10347813 -9975733 -7904873
39793g904873K034836J354210J674818K190063J024058j308693k219403o94354
$$ -7904873 -5870037 -4515827 -2841009 -650946 373112 -935581 -3154984 -3849338
39785c849338J421963K032647J006157m85235j315586p54300J126464K978151
$$ -3849338 -2427375 -394728 611429 126194 -1189392 -1943692 -817228 2160923
39777B160923L276259K105300P18649m88306j906086k775163j681985N00876P96914
$$ 2160923 5437182 7542482 8261131 7772825 5866739 3091576 1409591 1910467 2707381
39768B707381j412252k614141j0891L920717M577356J653348q52317o53456K59434
$$ 2707381 1295129 -1319012 -1329903 2590814 7168170 8821518 7969201 7315745 7575179
39759G575179l02742j431480j628144j795788l030754l369658k50491M379245
$$ 7575179 7272437 5840957 4212813 2417025 -613729 -3983387 -4233878 145367
39751A45367N178700N56189m533334m858325j421571R23262M01041o06014n14674
$$ 145367 5324067 5880256 1346922 -3511403 -4932974 -4009712 -3608671 -4214685 -4729359
39742d729359o24197j695630k009995l56099J844995L096336L948923M690652
$$ -4729359 -5353556 -7049186 -9059181 -9415280 -7570285 -4473949 -525026 4165626
39734D165626L585431R510l004859k539776k76153K87708m31820O95379L384644
$$ 4165626 7751057 7760567 4755708 2215932 1939779 2227487 1795667 2491046 5875690
39725E875690L737670O93153j815757q04287J357439P16472k819483o039696o419503
$$ 5875690 9613360 10306513 8490756 7686469 9043908 9760380 6940897 901201 -5518302
39716e518302l714681O22813M002429M347043K540037J512510J959372J411351
$$ -5518302 -9232983 -8610170 -4607741 -260698 2279339 3791849 5751221 7162572
39708G162572j113479k590254n89261K234159J560014k306242m943162l839386
$$ 7162572 6049093 3458839 2869578 5103737 6663751 4357509 -585653 -4425039
39700d425039q62870J048200J025354n7927j014884j088973m20007L04934J094197
$$ -4425039 -5287909 -4239709 -3214355 -3272282 -4287166 -5376139 -5796146 -5491212 -4397015
39691d397015K375465K988908Q04481l211403m426759p42699L311931K399616
$$ -4397015 -2021550 967358 1771839 -1439564 -5866323 -6609022 -3297091 -897475
39683h97475j830079l231075n2933L667716N021119N062028M290086J037663l751652
$$ -897475 -2727554 -5958629 -6011562 -2343846 2677273 7739301 12029387 13067050 9315398
39674I315398n396530k124355J451179Q61926j943035k606069j273028r60733
$$ 9315398 3918868 1794513 3245692 4107618 2164583 -441486 -1714514 -2675247
39666b675247j469156m0914K953211L926232J795550m48772n85083J28589J39902
$$ -2675247 -4144403 -4185317 -1232106 2694126 4489676 4040904 3455821 3584410 3724312
39657C724312J42194Q37051R45090n11594j900094j056052J455006K910954J669284
$$ 3724312 3866506 4703557 5648647 5137053 3236959 2180907 3635913 6546867 8216151
39648H216151j362631l937878m280371k357784j73580j36975k370525m302384
$$ 8216151 6853520 2915642 -1364729 -3722513 -3896093 -4033068 -6403593 -10705977
39640a0705977l710687j475616l43646j423525k919627k269955J121090N260637
$$ -10705977 -14416664 -15892280 -16235926 -17659451 -20579078 -22849033 -21727943 -16467306
39632a6467306P329790O227542L505335J456832M41782r78428l215594m461431
$$ -16467306 -9137516 -2909974 595361 2052193 2493975 1515547 -1700047 -6161478
39624f161478l168268m69429J167852R10196p3239n41846k00956O57521J302732
$$ -6161478 -9329746 -9799175 -8631323 -7721127 -7794366 -8336212 -8537168 -7879647 -6576915
39615f576915R48062J39416P49588L008295L865291Q33238l530651m289763r69884
$$ -6576915 -5628853 -5489437 -4739849 -1731554 2133737 2966975 -563676 -4853439 -5823323
39606e823323K064892K460186K644353M138691L887322k30513m161278k817657
$$ -5823323 -3758431 -1298245 1346108 5484799 9372121 9141608 4980330 2162673
39598B162673J971499L936591J589003n16647K41802Q23595j666746n088197n778793
$$ 2162673 4134172 8070763 9659766 9143119 9384921 10208516 8541770 3453573 -2325220
39589b325220l707765j484832m96991l33511l81115j08616R43152K179828K276843
$$ -2325220 -6032985 -7517817 -8014808 -8348319 -8729434 -8838050 -7894898 -5715070 -3438227
39580c438227J209382K95410j35922q07993r43444J170064M222033M242822O17511
$$ -3438227 -2228845 -1933435 -2069357 -2877350 -3820794 -2650730 1571303 5814125 6431636
39571F431636k151190j121411O16743n66574k805703k617996j431382k715185
$$ 6431636 4280446 3159035 3775778 3209204 403501 -2214495 -3645877 -6361062
39563f361062m872838l240296J588064L679593O74285k863346k654540l58377
$$ -6361062 -11233900 -14474196 -12886132 -9206539 -8532254 -11395600 -14050140 -14408517
39555a4408517M74922K04365J692428N280202P850401O230969N79912m894754
$$ -14408517 -13933595 -13729230 -12036802 -6756600 1093801 7324770 7904682 3009928
39547C009928n056630N04457N736560M741045p17882l900185k570787r30247j712160
$$ 3009928 -2046702 -1542245 4194315 8935360 8217478 4317293 1746506 816259 -895901
39538h95901k077689L34499K517215R98314k299271l232260j575438O8607J132482
$$ -895901 -2973590 -2639091 -121876 876438 -1422833 -4655093 -6230531 -6161924 -5029442
39529e029442K645894L622463K152186o87636j780170m87361R38019J060307M10111
$$ -5029442 -2383548 1238915 3391101 2703465 923295 435934 1373953 2434260 2844371
39520B844371o68979k336430l583250l030976j326489j95932N52724K245318L863618
$$ 2844371 2175392 -161038 -3744288 -6775264 -8101753 -8297685 -7744961 -5499643 -1636025
39511a636025K751101p52135k758031j115774J671147K363814J193597J41083
$$ -1636025 1115076 362941 -2395090 -3510864 -1839717 524097 1717694 1858777
39503A858777p20654k430291l941178k732261J245102M595030M431529J842347
$$ 1858777 1138123 -1292168 -5233346 -7965607 -6720505 -2125475 2306054 4148401
39495D148401J28861M07235O25942q88968k610298j839783J372123M134916M387771
$$ 4148401 4277262 4684497 5310439 4421471 1811173 -28610 1343513 5478429 9866200
39486I866200K824396Q69566j246731l394298m309150l095890j004597k92032
$$ 9866200 12690596 13560162 12313431 8919133 4609983 1514093 509496 217464
39478B17464j806707m424245o008082m511585K53397N134291N927341K479470
$$ 217464 -1589243 -6013488 -12021570 -16533155 -16279758 -11145467 -5218126 -2738656
39470b738656o07241j4832K057809K097574R15951J306781K217364J93773m072141
$$ -2738656 -3345897 -3360729 -1302920 794654 1710605 3017386 5234750 5428523 1356382
39461A356382n796088l279511k72471J70327k80636O15123J625439J001934Q8623
$$ 1356382 -4439706 -7719217 -7991688 -7821361 -8101997 -7486874 -5861435 -4859501 -4770878
39452d770878P76179K056173K350820K834904M844204O049185L379415j431497
$$ -4770878 -3994699 -1938526 412294 3247198 8091402 14140587 17520002 16088505
39444A6088505l525243j831094k14007j392455l569116m040164k666226m82539
$$ 16088505 12563262 10732168 10518161 9125706 5556590 1516426 -1149800 -1632339
39436a632339J904536L028120R38624l076908m287039p05511L369422L273845
$$ -1632339 272197 3300317 4238941 1162033 -3125006 -3830517 -461095 2812750
39428B812750P42751M56477J906065L32997m563707o908800l296274K134530M073010
$$ 2812750 3555501 4011978 5918043 6251040 1687333 -5221467 -8517741 -6383211 -2310201
39419b310201K956352J951183J079222r85619k311245l27247K678123K171632
$$ -2310201 646151 2597334 3676556 2690937 379692 52445 2730568 4902200
39411D902200j317731k918445j168252O13659J036399K512958M921267L843670
$$ 4902200 3584469 666024 -502228 111431 1147830 3660788 8582055 12425725
39403A2425725j742097n882016m076354k97945m84694l266633l180539l5890J495689
$$ 12425725 10683628 4801612 725258 427313 -57381 -3324014 -6504553 -6540443 -5044754
39394e044754j6523j488223j541372j955009k794174j790738P32697J598424L61590
$$ -5044754 -5061277 -6549500 -8090872 -10045881 -12840055 -14630793 -13898096 -12299672 -11938082
39385a1938082J08605J657844K218881J211472J756214M131951L644975j422003
$$ -11938082 -11829477 -10171633 -7952752 -6741280 -4985066 -853115 2791860 1369857
39377A369857n263699k839943J881371J914224j856579k630583R98089K889013
$$ 1369857 -3893842 -6733785 -4852414 -2938190 -4794769 -7425352 -6427263 -3538250
39369c538250p15020n440619n564119j901529N35529o7313q26357J085279M948028
$$ -3538250 -4253270 -9693889 -15258008 -17159537 -16624008 -16691321 -17517678 -16432399 -11484371
39360a1484371P578809O272751J039047m717292o301450k290338L079665L984775
$$ -11484371 -3905562 2367189 3406236 -1311056 -7612506 -9902844 -6823179 -2838404
39352b838404m9054l337000j467750K619655K816828j167947l204732J60566M381256
$$ -2838404 -2887458 -6224458 -7692208 -5072553 -2255725 -3423672 -6628404 -6467838 -2086582
39343b086582L437922j733235n316455m878997k939533j392788O15811L027299
$$ -2086582 1351340 -381895 -5698350 -10577347 -13516880 -14909668 -14293857 -11266558
39335a1266558L833610K901264K757578M125458M487560K670182R33489N11888
$$ -11266558 -7432948 -4531684 -1774106 2351352 6838912 9509094 10442583 10954471
39327A0954471q38673m064630n501653k104238L001886M305610J216890k253235
$$ 10954471 10115798 6051168 549515 -1554723 1447163 5752773 6969663 4716428
39319D716428l452409k897985j370469R59590L002455L514586K980641K270372
$$ 4716428 1264019 -1633966 -3004435 -2044845 957610 4472196 7452837 9723209
39311I723209N48404k737169n215318m262780j182500P31902J237732K508433
$$ 9723209 10271613 7534444 2319126 -1943654 -3126154 -2394252 -1156520 1351913
39303A351913M382502M456117K576738R95303K0963k114700m655459m160526j26691
$$ 1351913 5734415 10190532 12767270 13762573 13783536 11668836 7013377 2852851 2726160
39294B726160L443690L633280J847900j45882l193932p249835q767921n116151
$$ 2726160 6169850 9803130 11651030 11505148 8311216 1061381 -7706540 -12822691
39286a2822691R39964M484364M405623L196700K351963J000013j540275m259333
$$ -12822691 -11882727 -7398363 -2992740 203960 2555923 3555936 2015661 -2243672
39278b243672n418861l864319j29256L049593K834851j67692k283072j659131
$$ -2243672 -7662533 -11526852 -11656108 -8606515 -5771664 -5939356 -8222428 -9881559
39270i881559m90144j073250k437339k897689l022054l236869j327252L863181
$$ -9881559 -10371703 -11444953 -13882292 -16779981 -19802035 -23038904 -24366156 -20502975
39262b0502975Q411507P497522K476663p70893o8784J205909P07004M43387J913956
$$ -20502975 -12091468 -4593946 -2117283 -2888176 -2956960 -1751051 -1044047 -600660 1313296
39253A313296K622214M04794k250540j725396J147002K492826J011623j121257
$$ 1313296 3935510 4340304 2089764 364368 1511370 4004196 5015819 3894562
39245C894562k221202k753980l061778k384948q42454k1245n60397r90773j26758
$$ 3894562 1673360 -1080620 -4142398 -6527346 -7369800 -7391045 -7951442 -8942215 -9068973
39236i068973R40873O10924o87386j308513r23013m71014n526J393036L301502
$$ -9068973 -8128100 -7517176 -8204562 -9513075 -10436088 -10907102 -10912628 -9519592 -6218090
39227f218090L628320J671746k33495J40797J379890M18959k366121k942135O18304
$$ -6218090 -2589770 -918024 -1151519 -1010722 369168 788127 -1577994 -4520129 -3901825
39218c901825M754030M863565J445119r01319N0363J629876P35807j883412l404903
$$ -3901825 852205 5715770 7160889 6259570 6309933 7939809 8675616 6792204 3387301
39209C387301l063325k306875j809860p40265R79252J806786P42426j092001j933040
$$ 3387301 323976 -1982899 -3792759 -4533024 -3553772 -1746986 -1004560 -2096561 -4029601
39200d029601j438705n12735k2421m89347k017851l445737k601416R92231M323159
$$ -4029601 -5468306 -5981041 -6003462 -6492809 -8510660 -11956397 -14557813 -13565582 -9242423
39191i242423L777763j47072k952194j539740K199186M199749L170438J209282
$$ -9242423 -5464660 -5611732 -8563926 -10103666 -7904480 -3704731 -534293 674989
39183F74989L07979P0290q22701k167021k310189o19210R91739J2015l137443
$$ 674989 982968 1053258 230557 -1936464 -4246653 -4865863 -3874124 -3862109 -6999552
39174f999552m887028k829127R85985K806356K262918K180748L643570M351969
$$ -6999552 -11886580 -14715707 -13729722 -10923366 -8660448 -6479700 -2836130 1515839
39166A515839K613718m5335j677456k560953l223957k525153j59450J299489j93083
$$ 1515839 4129557 4084222 2406766 -154187 -3378144 -5903297 -6062747 -4763258 -4956341
39157d956341k590754k695733r54155J26716Q21779L319588O788535P759805N615480
$$ -4956341 -7547095 -10242828 -11196983 -11070267 -10248488 -6928900 -140365 7619440 13234920
39148A3234920L469231K824645J443234k066875n282524n588631l780721k035699
$$ 13234920 16704151 19528796 20972030 18905155 13622631 8034000 4253279 2217580
39140B217580q31674J68512M48122k15313q32973r61603j380347j787944m05619
$$ 2217580 1385906 1554418 2002540 1787227 954254 -7349 -1387696 -3175640 -3581259
39131c581259K478133L400650N21638k977980l071072m43930J004168l94977k972399
$$ -3581259 -1103126 2297524 2819162 -158818 -3229890 -3673820 -2669652 -3064629 -6037028
39122f037028m687887m439208j691470K386891M586133L292053J256641J683046
$$ -6037028 -10724915 -15164123 -16855593 -14468702 -9882569 -6590516 -5333875 -3650829
39114c650829K915798R90150l228275m172873L02415N261728N269687J360961
$$ -3650829 -735031 255119 -2973156 -7146029 -6843614 -1581886 3687801 5048762
39106E048762j305854n98213Q42073K22841j749725k404132p44843J482996K070914
$$ 5048762 3742908 3144695 3986768 4209609 2459884 55752 -689091 793905 2864819
39097B864819Q50176o45741j577800k557766l689295l507436j204894J347114
$$ 2864819 3714995 3069254 1491454 -1066312 -4755607 -8263043 -9467937 -8120823
39089h120823J678204J70866m44260J226657L727114M703248K898430j238237
$$ -8120823 -6442619 -6271753 -6716013 -5489356 -1762242 2941006 5839436 4601199
39081D601199n134727n056455j04247M978567M157968k011878o063626k897633
$$ 4601199 -533528 -5589983 -5694230 -715663 3442305 1430427 -4633199 -7530832
39073g530832L459860N122259L75871n081667o252231m256290k513063r93087
$$ -7530832 -4070972 1051287 1427158 -3654509 -9906740 -14163030 -16676093 -17669180
39065a7669180K525392O956800P665731K789770l149548m331158o72488K933699
$$ -17669180 -15143788 -8186988 -521257 2268513 -881035 -5212193 -5884681 -2950982
39057b950982L426533K278574J397690J57145j949396l029375j751043j23692
$$ -2950982 475551 2754125 4151815 4308960 2359564 -669811 -2420854 -2544546
39049b544546m08887j238593j53868J511721L17474l172886m203966o44696L651908
$$ -2544546 -2953433 -4192026 -4345894 -2834173 -2516699 -5689585 -9893551 -10538247 -6886339
39040f886339M123557J429220j95447J120402L010505K604649L13759q67113N75661
$$ -6886339 -2762782 -1333562 -1529009 -408607 2601898 5206547 5520306 4653193 5228854
39031E228854K220587M68933m196245o660344l383742K507869M830623K099331
$$ 5228854 7449441 7918374 3722129 -2938215 -6321957 -3814088 1016535 3115866
39023C115866j319436j692591k92380j98386j453079j500982Q03914L535100L983117
$$ 3115866 1796430 103839 -188541 -386927 -1840006 -3340988 -2537074 998026 4981143
39014D981143J721322r48325j731978j208783j782999l576642l533382j02049
$$ 4981143 6702465 5754140 4022162 2813379 1030380 -2546262 -6079644 -6181693
39006f181693L463466L197063J34230j417226k40458R51415O38959L89391J150757
$$ -6181693 -2718227 478836 613066 -804160 -1044618 -93203 545756 935147 2085904
38997B085904J500588P09371K14110P29360Q53007j15478o79618K13402J446358
$$ 2085904 3586492 4295863 4509973 5239333 6092340 5976862 5297244 5510646 6957004
38988F957004J696511Q55363j029397l549773m437696j672148K434904L170663
$$ 6957004 8653515 9508878 8479481 4929708 492012 -1180136 1254768 4425431
38980D425431K61922j571641q9144J477366R42934J139088L872689N180912J531375
$$ 4425431 4687353 3115712 3026568 4503934 5446868 6585956 10458645 15639557 17170932
38971A7170932l395981l713077j66535J670120N721j961824k285434k410379l358276
$$ 17170932 13774951 10061874 9895339 11565459 11571180 9609356 7323922 4913543 1555267
38962A555267m204079m302693l516594q82989L490691O250614M269592o40688
$$ 1555267 -2648812 -6951505 -10468099 -11351088 -7860397 -1609783 2659809 2019121
38954B019121m080853m800632m258799k320283J689763N057491M424251J787518
$$ 2019121 -2061732 -6862364 -11121163 -13441446 -11751683 -6694192 -2269941 -482423
38946d82423J938274M169271K970716k311506n335262k467597J650834J586772
$$ -482423 1455851 5625122 8595838 6284332 949070 -1518527 132307 1719079
38938A719079j134331j769314K82107K073659K166278J315047J89308o32291l12111
$$ 1719079 584748 -1184566 -902459 1171200 3337478 4652525 4841833 4209542 3897431
$$ [...]
##END NTUPLES=NMR SPECTRUM
##END=
