##TITLE=31Pdec_LR-784-R3-CR7
 CDCl3, 24 sc
 3.2.2025
##JCAMPDX= 6.0         $$ Bruker NMR JCAMP-DX V2.0
##DATA TYPE= NMR SPECTRUM
##DATA CLASS= NTUPLES
##ORIGIN= UXNMR, Bruker Analytische Messtechnik GmbH
##OWNER= root
$$ XWIN-NMR		Version 3.5
$$ Mon Feb  3 18:29:13 2025 Russian Standard Time (UT+4h)  she@DPX200
##.OBSERVE FREQUENCY= 81.013821
##.OBSERVE NUCLEUS= ^31P
##.ACQUISITION MODE= SIMULTANEOUS
##.ACQUISITION SCHEME= undefined
##.AVERAGES= 24
##.DIGITISER RES= 17
##SPECTROMETER/DATA SYSTEM= spect
##.PULSE SEQUENCE= zgpg30
##.SOLVENT NAME= CDCl3
##.SHIFT REFERENCE= (INTERNAL, CDCl3, 0, 198.062)
##AUDIT TRAIL= $$ (NUMBER, WHEN, WHO, WHERE, WHAT)
$$ ##TITLE= Audit trail, XWIN-NMR		Version 3.5
$$ ##JCAMPDX= 5.01
$$ ##ORIGIN= Bruker BioSpin GmbH
$$ ##OWNER= she
$$ F:/spectra/data/she/nmr/P31/2/pdata/1/auditp.txt
$$ ##AUDIT TRAIL=  $$ (NUMBER, WHEN, WHO, WHERE, WHAT)
(   1,<2025-02-03 18:28:12.39 +0400>,<she>,<DPX200>,
      <created by zg, POWCHK disabled, PULCHK disabled
       configuration hash MD5:
       00 E9 B6 7A A2 85 ED C7 34 08 36 98 17 FE 4E 26
       data hash MD5: 32K
       EF 3F F6 02 89 BF 35 D6 08 CF 31 F7 2C B4 4B 94>)
(   2,<2025-02-03 18:28:14.70 +0400>,<she>,<DPX200>,
      <Start of raw data processing
       efp BC_mod = 2 LB = 1.5 FT_mod = 6 PKNL = 1 PHC0 = 1746.396 PHC1 = 147.8909 SI = 64K 
       data hash MD5: 64K
       67 80 7F 17 67 0C 8A E9 CA 6D 15 5E 12 54 01 56>)
(   3,<2025-02-03 18:28:32.35 +0400>,<she>,<DPX200>,
      <pk PHC0 = -11.4724 PHC1 = 29.4 
       data hash MD5: 64K
       AE C8 A1 93 20 13 65 41 76 08 63 1F 0A 75 6F B3>)
(   4,<2025-02-03 18:28:44.17 +0400>,<she>,<DPX200>,
      <abs ABSG = 5 
       data hash MD5: 64K
       1A 41 35 6E 8B 57 53 EB 23 E7 E4 5D EC 32 85 BF>)
$$ ##END=
$$ 
$$ hash MD5
$$ AA 38 02 D0 13 E2 FB 08 0A 99 BB A0 F9 3D 00 E0
##$RELAX= 
##$RELAX= 
##$RELAX= 
##$RELAX= 
##$RELAX= 
##$RELAX= 
##$RELAX= 
##$RELAX= 
$$ Bruker specific parameters
$$ --------------------------
##$DU= <F:/spectra>
##$EXPNO= 2
##$NAME= <P31>
##$PROCNO= 1
##$TYPE= <nmr>
##$USER= <she>
##$AMP= (0..31)
100 100 100 100 100 100 100 100 100 100 100 100 100 100 100 100 100 100 
100 100 100 100 100 100 100 100 100 100 100 100 100 100 
##$AQSEQ= 0
##$AQ_mod= 1
##$AUNM= <au_zg>
##$AUTOPOS= <>
##$BF1= 81.014009
##$BF2= 200.13
##$BF3= 200.13
##$BF4= 200.13
##$BF5= 200.13
##$BF6= 200.13
##$BF7= 200.13
##$BF8= 200.13
##$BYTORDA= 1
##$CFDGTYP= 0
##$CFRGTYP= 5
##$CHEMSTR= <none>
##$CNST= (0..31)
1 1 145 1 1 1 1 1 1 1 1 1 1 1 1 1 1 1 1 1 1 1 1 1 1 1 1 1 1 1 1 1 
##$CPDPRG= <waltz16>
##$CPDPRG1= <>
##$CPDPRG2= <waltz16>
##$CPDPRG3= <>
##$CPDPRG4= <mlev>
##$CPDPRG5= <mlev>
##$CPDPRG6= <mlev>
##$CPDPRG7= <mlev>
##$CPDPRG8= <mlev>
##$CPDPRGB= <>
##$CPDPRGT= <>
##$D= (0..31)
0 1 0 0 0 0 0 0 0 0.06 0 0.03 2e-05 3e-06 0 0 0.0002 0 0 0 0 0 0 0 0 0 
0 0 0 0 0 0 
##$DATE= 1738592891
##$DBL= (0..7)
120 120 120 11 120 120 24 19 
##$DBP= (0..7)
150 150 150 150 150 150 150 150 
##$DBP07= 0
##$DBPNAM0= <>
##$DBPNAM1= <>
$$ [...]
##$SUBNAM3= <"">
##$SUBNAM4= <"">
##$SUBNAM5= <"">
##$SUBNAM6= <"">
##$SUBNAM7= <"">
##$SUBNAM8= <"">
##$SUBNAM9= <"">
##$SW= 400.765351723535
##$SWIBOX= (0..15)
0 1 3 0 0 0 0 0 0 0 0 0 0 0 0 0 
##$SW_h= 32467.5324675325
##$TD= 32768
##$TD0= 1
##$TE= 0
##$TE2= 300
##$TE3= 300
##$TEG= 300
##$TL= (0..7)
0 120 53 12 22 120 120 120 
##$TP= (0..7)
150 150 150 150 150 150 150 150 
##$TP07= 0
##$TPNAME0= <>
##$TPNAME1= <>
##$TPNAME2= <>
##$TPNAME3= <>
##$TPNAME4= <>
##$TPNAME5= <>
##$TPNAME6= <>
##$TPNAME7= <>
##$TPOAL= (0..7)
0.5 0.5 0.5 0.5 0.5 0.5 0.5 0.5 
##$TPOFFS= (0..7)
0 0 0 0 0 0 0 0 
##$TUNHIN= 0
##$TUNHOUT= 0
##$TUNXOUT= 0
##$USERA1= <user>
##$USERA2= <user>
##$USERA3= <user>
##$USERA4= <user>
##$USERA5= <user>
##$V9= 5
##$VALIST= <valist>
##$VCLIST= <CCCCCCCCCCCCCCC>
##$VD= 0
##$VDLIST= <DDDDDDDDDDDDDDD>
##$VPLIST= <PPPPPPPPPPPPPPP>
##$VTLIST= <TTTTTTTTTTTTTTT>
##$WBST= 1024
##$WBSW= 4
##$XGAIN= (0..3)
0 0 0 0 
##$XL= 0
##$YL= 0
##$YMAX_a= 3001
##$YMIN_a= -9319
##$ZGOPTNS= <>
##$ZL1= 120
##$ZL2= 120
##$ZL3= 120
##$ZL4= 120
##$ABSF1= 198.0616
##$ABSF2= -202.7028
##$ABSG= 5
##$ABSL= 3
##$ALPHA= 0
##$AQORDER= 0
##$ASSFAC= 0
##$ASSFACI= 0
##$ASSFACX= 0
##$ASSWID= 0
##$AUNMP= <proc_1d>
##$AZFE= 0.1
##$AZFW= 0.5
##$BCFW= 0
##$BC_mod= 2
##$BYTORDP= 0
##$COROFFS= 0
##$CY= -3
##$DATMOD= 1
##$DC= 0
##$DFILT= <>
##$DTYPP= 0
##$F1P= 0
##$F2P= 0
##$FCOR= 1
##$FTSIZE= 65536
##$FT_mod= 6
##$GAMMA= 0
##$GB= 0
##$INTBC= 1
##$INTSCL= 9.790993e-09
##$ISEN= 30
##$LB= 1.5
##$LEV0= 0
##$LPBIN= 0
##$MAXI= 10000
##$MC2= 0
##$MEAN= 0
##$ME_mod= 0
##$MI= 50
##$NCOEF= 0
##$NC_proc= -7
##$NLEV= 6
##$NOISF1= 182.463
##$NOISF2= 159.3651
##$NSP= 0
##$NTH_PI= 0
##$NZP= 0
##$OFFSET= 198.0616
##$PC= 4
##$PHC0= 1734.924
##$PHC1= 177.2909
##$PH_mod= 1
##$PKNL= yes
##$PPARMOD= 0
##$PSCAL= 0
##$PSIGN= 0
##$REVERSE= no
##$SF= 81.0140089999434
##$SI= 65536
##$SIGF1= 159.3651
##$SIGF2= -187.1042
##$SINO= 113.3802
##$SIOLD= 16384
##$SREGLST= <1H.CDCl3>
##$SSB= 0
##$STSI= 65536
##$STSR= 0
##$SW_p= 32467.5324675325
##$SYMM= 0
##$S_DEV= 0
##$TDeff= 32768
##$TDoff= 0
##$TI= <>
##$TILT= no
##$TM1= 0
##$TM2= 0
##$TOPLEV= 0
##$USERP1= <user>
##$USERP2= <user>
##$USERP3= <user>
##$USERP4= <user>
##$USERP5= <user>
##$WDW= 1
##$XDIM= 65536
##$YMAX_p= 288755732
##$YMIN_p= -6798603
$$ End of Bruker specific parameters
$$ ---------------------------------
##NTUPLES= NMR SPECTRUM
##VAR_NAME=  FREQUENCY,     SPECTRUM/REAL,   SPECTRUM/IMAG
##SYMBOL=    X,             R,               I
##VAR_TYPE=  INDEPENDENT,   DEPENDENT,       DEPENDENT
##VAR_FORM=  AFFN,          ASDF,            ASDF
##VAR_DIM=   65536,         65536,           65536
##UNITS=     HZ,            ARBITRARY UNITS, ARBITRARY UNITS
##FACTOR=    0.49542278885378, 1,            1
##FIRST=     16045.7642231865, 0,            0
##LAST=      -16421.768244346, 0,            0
##MIN=       -16421.768244346, -6798603,     0
##MAX=       16045.7642231865, 288755732,    0
$$ Real data points
##PAGE= N=1
##DATA TABLE= (X++(R..R)), XYDATA
$$ [...]
##PAGE= N=2
##DATA TABLE= (X++(I..I)), XYDATA
39722b483861N14370R69125Q76072M55473q5031n03515m35297J49104O84488O45800
39712G86728K07845p4703J8808K91782M64005K90998l28778j077771j387859j136670
39702a945615p81429n88476k79734K49868N19826K46468r0442k9288J46150R7907
39692b454765J73729O29902P64233r8638j194068j095569K39368J339779J178047
39683e17982K48544m18847m05717Q5781N53944M03664m23506j028779o00523K06985
39673a896436K1343j073937j408824j58103J371216J591376O93172l6427j00467
39664i97087J1626m8973j42344j34531K691L45000P08624N48638k62122r44662
39654i13140p28122R8932O62756O66404M36225J81580o4134p1162K45509L52982
$$ y = [-2483861, -1969491, -1000366, -124294, 331179, 246148, -257367, -692664, -543560, 140928, 786728, 994573, 919870, 938678, 1230460, 1694465, 1985463, 1656685, 578914, -808945, -1945615, -2727044, -3315520, -3595254, -3345386, -2825560, -2579092, -2669534, -2698822, -2552672, -2454765, -2281036, -1651134, -886901, -985539, -2179607, -3275176, -3035808, -1696029, -517982, -269438, -688285, -1094002, -1008221, -454277, -50613, -474119, -1502898, -2103421, -1896436, -1875093, -2949030, -4357854, -4515957, -3144741, -1553365, -860193, -896620, -997087, -985461, -1034434, -1176778, -1311309, -1308618, -963618, -254994, 293644, 31522, -913140, -1641262, -1542330, -879574, -213170, 223055, 404635, 340501, 269339, 514848, 867830]
39644H67830k29086r68921r02524j01285L61120O766m05899j57992L45897L35065
39634h49029n7977O963P86360J454990J067415k49253j330288j259319m17018
39625h47156N5704k45492n70389k60613K65617L21039J64070N47137J331240J505959
39615B267116O26725n83632j196842r37411j7217J071414J453273N05806j027063
39606B162169j482824m06650O62839L02007p66828q61241P1092M68468l79108
39597b30076j332311j212887l69994K11218L81459N65466P44533O52877N47931
39588d1784Q23094J092577O24812l73447q61480m67331K5890n2063l95683n30081
39578a55496o06066p88772o38225J10942P72271N93282o0449l30560k45954m11432
$$ y = [867830, 638744, -330177, -1232701, -1333986, -972866, -966100, -1371999, -1529991, -1184094, -849029, -907006, -900043, -113683, 1341307, 2408722, 2159469, 829181, -430138, -847156, -791452, -1036944, -1607333, -1867946, -1602329, -1281290, -1117220, -570083, 761157, 2267116, 2893841, 2310209, 1113367, 175956, 158739, 1230153, 2683426, 3189232, 2162169, 679345, 272695, 935534, 1237541, 470713, -390528, -319436, 149032, -230076, -1562387, -2775274, -3145268, -2934050, -2552591, -1987125, -1242592, -589715, -41784, 781310, 1873887, 2498699, 2125252, 1263772, 796441, 822331, 770268, 374585, -155496, -761562, -1550334, -2188559, -2077617, -1305346, -712064, -772513, -1103073, -1349027, -1760459]
39568a760459o31176r9894J057571J698155J307880N58467l7960p54891j483264
39559a45571j309676q5426Q06155L28621n84906n22171J84271K16521l49177j45477
39549a606836J096946J919115J270032n0551o73629l92212L7440J08685q0902
39540A628088k83788m00645m82746o28409p28760m24652L25550Q47193N11213
39531C63044k54009m40840J13771O10086O10021N20946N46731J82238p39334j380833
39521A31821r87088j3485N21970L49124k4198j86644q6402K71550P53515Q98792
39511A628955L61758n06571r41382n99491J48969O49635M84212k41434r25038
39502E9613r93303n49041k20503k70257k83345Q2532N59913P90024Q49805Q54576
$$ y = [-1760459, -2391635, -2491529, -1433958, 264197, 1572077, 2130544, 2092584, 1337693, -145571, -1455247, -1540673, -734518, -405897, -990803, -1512974, -1328703, -1112182, -1461359, -1606836, -509890, 1409225, 2679257, 2628706, 1955077, 1562865, 1600305, 1708990, 1628088, 1344300, 943655, 460909, -167500, -896260, -1320912, -995362, -148169, 363044, 109035, -331805, -218034, 392052, 1002073, 1523019, 2069750, 2251988, 1512654, 131821, -855267, -868752, -346782, 2342, -21856, -208500, -294902, -23352, 730163, 1628955, 1990713, 1484142, 542760, -56731, 92238, 741873, 1226085, 984651, 59613, -933690, -1482731, -1703234, -1973491, -2256836, -2174304, -1614391, -824367, 25438, 880014]
39492H80014N49649j82518q43038r08993n52548k44791m4383J27164m6657p42777
39482b008878j266569p90741K95008P39251K10603k33751K35617J008892R89328
39473h21240J18038p20349r42577p29821l60348K67352J222216K028314J952806
39464B014391Q34539n82385j308074j054711l81094M7157P4916p9187j96572j08029
39454g39049K66356O34347M45062l09313p41701q8198J122802J568789P66405
39445B925500m29312j027849r56942o96670m75562k52102j00218j64284m03884
39436a581323o60077q04490o58017n7348P58235J148417Q02902K12958L1982J99647
39426f07114J82651n6797O3199P85250J450809J228660J44816r21402j174317
$$ y = [880014, 1429663, 1247145, 404107, -504886, -1057434, -1302225, -1346608, -1219444, -1266101, -2008878, -3275447, -4066188, -3771180, -3031929, -2821326, -3055077, -2819460, -1810568, -821240, -703202, -1423551, -2366128, -3095949, -3456297, -3188945, -1966729, 61585, 2014391, 2848930, 2266545, 958471, -96240, -477334, -430177, -355261, -434448, -631020, -739049, -472693, 161654, 606716, 297403, -444298, -532496, 590306, 2159095, 2925500, 2496188, 1468339, 511397, -185273, -660835, -912937, -1013155, -1177439, -1581323, -2241400, -3045890, -3703907, -3761255, -3003020, -1854603, -1051701, -838743, -806761, -607114, -424463, -481260, -418061, 367189, 1817998, 3046658, 3191474, 2270072, 1095755]
39417A095755o43589n3845p4740o45166j001677m93323O17648J363067J117478
39408A281608J88969o88652j068015q23340O982R59323J178275L92211m35216
39399I92145k29975O05817P28765k7040l04585N84679J395299P78526o45246j259093
39389B619292p99217l64585m57861m66110p2440J95916R3168J26542M97377O11658
39379A983740J23864m35447n62314m88536n13083m23920r7446Q2835o2263r0455
39369d83025K57119N56333N05032M40508N11113K13789n56902r20350l53491K38941
39359D09067j38463q97399p43301K95571R81883P18012R2053k71577l33591k05533
39349i3278l9100k08087p26878p74853K16138J354663J348479M75749J32926N62435
$$ y = [1095755, 452166, 398321, 323581, -321585, -1323262, -1816585, -1198937, 164130, 1281608, 1470577, 781925, -286090, -1109430, -1102448, -143125, 1035150, 1427361, 992145, 762170, 1367987, 2096752, 2069712, 1765127, 2349806, 3745105, 4523631, 3878385, 2619292, 1820075, 1455490, 997629, 531519, 459079, 654995, 748163, 874705, 1372082, 1983740, 2107604, 1672157, 1109843, 621307, 108224, -315696, -413142, -330307, -392570, -483025, -225906, 330427, 835459, 1275967, 1787080, 2000869, 1443967, 523617, 170126, 409067, 270604, -626795, -1370096, -1074525, -92642, 625370, 717423, 445846, 112255, -93278, -132378, -340465, -1067343, -1842196, -1626058, -271395, 1077084, 1552833, 1685759, 2248194]
39339B248194N81546k77026r53786o88446k22431m51238j062575j308246j135498
39330c269506p71698r3393P80322J095329N33905k8736K63270Q79705P09281j98322
39320i9843o90666j54670P61264J113078P14141Q5624k44469k17218j32730j58380
39310I76131j32465l1917k79096j026758j447475o37657Q45450J419321O06245
39301B91779m13907p10803p74029j116258j026519J55288J520210J675636P17686
39292C19083j42892m19079n09026m10816K67429J078099R35319k04987j078498
39283a65368r05283l73574l34253m96469j58421M68683N37037j34166p74504o76968
39273c013286L31N54308N57622J94483r1459p5151J81686N31347P40929M24368
$$ y = [2248194, 2829740, 2552714, 1598928, 910482, 688051, 236813, -825762, -2134008, -3269506, -4041204, -4134597, -3354275, -2258946, -1725041, -1753777, -1490507, -610802, 98479, -99843, -790509, -945179, -183915, 929163, 1643304, 1728928, 1484459, 1267241, 1134511, 976131, 843666, 811749, 532653, -494105, -1941580, -2579237, -1733787, -314466, 291779, -122128, -832931, -1606960, -2723218, -3749737, -3594449, -2074239, -398603, 319083, 176191, -242888, -751914, -1162730, -895301, 182798, 1118117, 913130, -165368, -1070651, -1444225, -1778478, -2274947, -2433368, -1964685, -1427648, -1561814, -2336318, -3013286, -3012955, -2458647, -1901025, -1706542, -1798001, -1873152, -1691466, -1160119, -419190, 5178]
39263E178n51857j535706j538104m96937M69680N06894J41620L05989P75581N64303
39253a353359l24759o61021K46446J469187J682747Q41541o999k13770j32738
39244A547275k83319n50266n17981k29779j35031l27451l32666J09054M70201
39235b49963J27208o12202p73889J9236J107869J640023J294287J86382j206750
39226A532201j939505j296378Q8940O72982k8785q19454o80520j89466k31988
39217b891973l50499L43672J332912J259040L9175r86694r92330m81240p1608
39208b799545L18875P77556R29993O00092J84318L8393Q9770K06273L31953K26998
39198I04676k30578n32931j72704K75424k36900j437865j755748n37255R09462
$$ y = [5178, -546679, -2082385, -3620489, -4117426, -3647746, -3140852, -2999232, -2693243, -1917662, -1353359, -1678118, -2339139, -2092693, -623506, 1059241, 1900782, 1893783, 1680013, 1547275, 1263956, 713690, 195709, -34070, -169101, -496552, -829218, -720164, -249963, -122755, -734957, -1508846, -1489610, -381741, 1258282, 2552569, 2738951, 1532201, -407304, -1703682, -1614742, -941760, -970545, -1789999, -2470519, -2659985, -2891973, -3242472, -2898800, -1565888, -306848, -267673, -1254367, -2246697, -2727937, -2799545, -2480670, -1703114, -773121, -173029, 11289, 49682, 139452, 345725, 677678, 904676, 674098, 141167, -31537, 243887, 6987, -1430878, -3186626, -3723881, -2814419]
39189b814419J146252M76486J36787M01382M99235J6156n51038n78240m2801N42845
39179g67355O11807N5946n67725n65524M4209N45680M93428K19489J93803L52381
39169F16139L38975L9450l67661n96614l90152J82531N73042L56239r5792j48552
39159E07605J6879k84836q89222q34876o96M86341n008n85342l05188L81298N46169
39148i66876L14534L74439O10037L92831j48358k67951J60024N22692N03639L76813
39138A871824L04559J30332j03760j20965M7734N3742j89826l90888l57302k12060
39128A033390j62376l35045p00233r35886o62465n5131K14966l6774j52515K90200
39118a501869O92115L69783l32491o53574n94657o12461o24585k91622J18910
$$ y = [-2814419, -1668167, -1191681, -1054894, -653512, -154277, -138121, -689159, -1267399, -1310200, -767355, -155548, -99602, -667327, -1232851, -1188642, -642962, -149534, 69955, 263758, 616139, 955114, 994564, 626903, 30289, -359863, -177332, 395710, 751949, 656157, 507605, 524484, 239648, -649574, -1484450, -1485146, -998805, -1003813, -1589155, -1894343, -1513045, -966876, -652342, -277903, 332134, 724965, 576607, 308656, 468680, 991372, 1495011, 1871824, 2176383, 2306715, 2202955, 2081990, 2129724, 2183466, 1993640, 1602752, 1245450, 1033390, 871014, 535969, -164264, -1100150, -1762615, -1817746, -1602780, -1639554, -1792069, -1501869, -809754, -439971, -772462, -1426036, -2020693, -2633154, -3257739, -3549361, -3430451]
39109c430451J76843K24186P50153J174069N56443o37055r07401M4522Q69112
39100a179579O64850J52795K16971N33166M17657K0303j71627k23966l44319k53674
39090a67423K44098O33915L98326j17513k75263j52963k53988n53845n79114k29996
39080a053766J27586K55270J93409k5691l30871m41023j82511J97032M06296N20385
39070c33884O04182L23564m73309j144546r83110l34987j41542m53456l68112
39061c305200L94122Q67353L07092n63796n58293K71793Q25167N75473Q5370r6621
39051a197540j40891k62747j54898L69978P66050M58032k13454m47433j51567
39042i74470O3211p6676k44156k66330l14594k45429L38211J093052R70889k27363
$$ y = [-3430451, -3253608, -3029422, -2279269, -1105200, -548757, -1185812, -2093213, -2048691, -1179579, -514729, -361934, -144963, 388203, 805860, 826163, 654536, 430570, 86251, -167423, 76675, 710590, 1108916, 991403, 716140, 563177, 309189, -244656, -823770, -1053766, -926180, -670910, -477501, -503192, -834063, -1275086, -1457597, -1260565, -854269, -333884, 270298, 593862, 120553, -1023993, -2007103, -2342090, -2483632, -2937088, -3305200, -2911078, -2043725, -1736633, -2300429, -2858722, -2586929, -1761762, -1186289, -1100919, -1197540, -1338431, -1601178, -1756076, -1386098, -620048, -162016, -375470, -822903, -974470, -911259, -987935, -1232091, -1498421, -1813015, -2058444, -1720233, -627181, 343708, 116345]
39032A16345j239419j005162j24716K29297R8119L03279P91584P59159K10861
39023A39347M4604N12331Q50374O81472N94195R05952R45511J92002p45041r76318
39013C144429n17910m410K32012K03708j29825o91702j050206q70539l70725L1212
39003b3956K35320L08718J55861k85798p54864q81192n63395k3788L32618J76729
38993a323747k99659l52303M08577J280994J314411O71648K60707K04423j45964
38984B019087p03219n85201J67991L64821k86819n06163L12606Q19279n5699j102544
38974D44139p19340M52477O85273J786k43284K6085l05834j072359p80573O81117
38964h30513J469376N89842o09569o39590N0040K46302r3899k49466j09641m4028
$$ y = [116345, -1123074, -2128236, -2252952, -2023655, -1925536, -1622257, -830673, -71514, 139347, 183951, 696282, 1546656, 2228128, 2822323, 3728275, 4673786, 4865788, 4120747, 3144429, 2626519, 2622109, 2854121, 3057829, 2928004, 2236302, 1186096, 315557, -55168, -23956, 211364, 520082, 675943, 390145, -364719, -1245911, -1809306, -1833094, -1500476, -1323747, -1623406, -1975709, -1567132, -286138, 1028273, 1699921, 1960628, 2165051, 2019087, 1315868, 730667, 898658, 1263479, 976660, 470497, 783103, 1602382, 1546683, 444139, -275201, 177276, 862549, 864335, 621051, 647136, 341302, -731057, -1511630, -830513, 638863, 1228705, 619136, -20454, 29586, 275888, 181989, -67477, -177118, -221146]
38954b21146p7822j04999l51358q54043j022031m32689M02835O98831L97084r154
38944a574492k12855j87429K9435K56672K93117L46852P66165J168095O46436
38935A531996q08030j954383j846834r22642o7141N16372R21373R62976P31878
38926i34435Q60265J445252J556789O49428m30267p62209o99147q02924n05997
38917C76755O97783J656235R71525n71177r50952j8785M14472l31752q08771j04266
38907A331067N58828k8836j014287r76261k12645j1395m69758n93778j64085l8814
38897a619964n93112j057471o92569K16586Q88850J010786Q31762O43107N06366
38888A34341M02940L93813N00198N06135J44615m01219n10108N3158O65990O81554
$$ y = [-221146, -298968, -403967, -755325, -1609368, -2631399, -3064088, -2661253, -1962422, -1565338, -1574492, -1787347, -1974776, -1945341, -1688669, -1395552, -1048700, -282535, 885560, 1531996, 723966, -1230417, -3077251, -3999893, -4067034, -3550662, -2629289, -1666313, -934435, -74170, 1371082, 2927871, 3577299, 3147032, 2384823, 1685676, 882752, 376755, 1074538, 2730773, 3702298, 3131121, 2180169, 2161384, 2575856, 2244104, 1435333, 1331067, 1889895, 1861059, 846772, -129489, -342134, -353529, -823287, -1417065, -1581150, -1619964, -2213076, -3270547, -3963116, -3746530, -2857680, -1846894, -1015132, -372025, 134341, 537281, 931094, 1431292, 1937427, 2082042, 1680823, 1170715, 1223873, 1889863, 2571417]
38878B571417L78038L82569M86755K9865o92078o42780J62761M27376l52297r17718
38868A833908k42969O99869M06685q08650j359898p74512p7796K1887p6086j1802
38858c89364j41784o59037r84027n51838L70615J020512R16402J85158m95666
38849g29029l39790O49496J344289P19865o73179j271336n59808L34204L32309
38840a92979k29672m07015o0243K00965M7685k16687j68647K65672P70518R07154
38830I16751N53750Q2601j21473j76376l56858m82517k86957j70826o73879j259236
38820a975020p64513P02468J544998R07372o4637l9840N11845L22753n07625p63945
38810a26144j23546M92566N12301L74253M16922K33668m54450j130264j165489
$$ y = [2571417, 2949455, 3332024, 3818779, 3848644, 3156566, 2513786, 2676547, 3103923, 2751626, 1833908, 1590939, 2290808, 2697493, 1888843, 528945, -245567, -323363, -301476, -377562, -389364, -531148, -1190185, -2174212, -2726050, -2355435, -1334923, -418521, -233363, -729029, -1068819, -419323, 924966, 1644831, 971652, -299684, -859492, -525288, -192979, -422651, -829666, -889909, -688944, -641259, -857946, -1026593, -760921, 9597, 916751, 1470501, 1553102, 1431629, 1255253, 898395, 415878, 128921, -41905, -715784, -1975020, -2739533, -2037065, -492067, 415305, 350668, 310828, 822673, 1145426, 637801, -126144, -249690, 242876, 755177, 1129430, 1546352, 1780020, 1325570, 195306, -970183]
38801i70183o23580j6693L26399M02591L82911M56193N45650K37064o17744j369841
38791a247233j224673l65186K26447Q9720k60858k89798r6277J09519M40637Q62729
38781a754973R31094M62773m3543j24045l2991k24304n48274n10956p6028L11038
38771a610209L65188K09503P2287P5296K58218N55507P97803Q73649P75800M49460
38761B822502j28004o43247o29022j50417J17077k00544o00183m44838P8564K48856
38751D70744j77347p56802j029757r10476m63324K41208R66835J329988J096932
38742G68001L62667m95081r53818o77216O7849N48983L83228j3278o5432J54254
38732H0157J40677k54728o79934p78423m61312J29263N68801L37602m85626j018086
$$ y = [-970183, -1593763, -1610456, -1284057, -881466, -498555, -42362, 503288, 740352, 122608, -1247233, -2471906, -2837092, -2610645, -2520925, -2781783, -3071581, -3167858, -3058339, -2617702, -1754973, -823879, -361106, -404649, -528694, -561685, -785989, -1334263, -1845219, -1921247, -1610209, -1245021, -1035518, -963231, -887935, -629717, -74210, 723593, 1597242, 2373042, 2822502, 2694498, 2051251, 1422229, 1271812, 1388889, 1188345, 588162, 143324, 221888, 470744, 293397, -463405, -1493162, -2403638, -2866962, -2625754, -1658919, -328931, 768001, 1130668, 635587, -318231, -995447, -927598, -378615, 4613, -8665, -74097, 80157, 220834, -33894, -713828, -1492251, -1953563, -1824300, -1255499, -917897, -1403523, -2421609]
38722b421609o22982J42093L29140O3676K76718J077149J472439R12014O5211
38713A293849l51397n44103q45213q46164j42299P34200J005908P74879O05146
38704A684806M59002J6909l25905Q2348Q41384Q27850p2627p09476m38278m1641
38694B324372l52118r29704q40274k4284Q44193J273454J054948P6874j190825
38685B236636j643075q90571j09958m80456j284584r08672N70239J409786Q99173
38676b01482L09034O08838R24370K93664n06173l11967L44991J78351n41954m41253
38666F56419M74695O74442l32811j040180k42044J121421J381996M15210n21990
38657B587158n86719l7215M94168N94560J36564n96209r56221n83136J00351L95015
$$ y = [-2421609, -3044591, -2902498, -2573358, -2509682, -2232964, -1155815, 316624, 1228638, 1293849, 942452, 398349, -446864, -1293028, -1435327, -701127, 304781, 1079660, 1684806, 2143808, 2160717, 1834812, 1917160, 2758544, 3586394, 3513767, 2804291, 2366013, 2324372, 1972254, 1042550, 202276, 177992, 1022185, 2295639, 3350587, 3427461, 2236636, 593561, -297010, -406968, -887424, -2172008, -3080680, -2510441, -1100655, -201482, 107552, 716390, 1640760, 1934424, 1428251, 1116284, 1461275, 1639626, 1097672, 656419, 1131114, 1805556, 1472745, 432565, 190521, 1311942, 2693938, 3109148, 2587158, 2000439, 1963224, 2457392, 3051952, 3188516, 2592307, 1636086, 1052950, 1153301, 1548316]
38647A548316J57872j88175k86672j80868j52266m26512q85739j013974m27050
38638a855068N09222J007315Q33798M23622J6679n45428j021919p66328L7598
38629a360509J67978q45973j662524q83212Q56209J731327J167550J86717l76880
38620a019317o72930q56098n92601J38403P27493P82291N61538L29345j4447m31677
38610a048000n45331k09650K41736M80785M65248K39100k8840P9596O81986J089242
38600A445872O29512k01879l76513P675j22195r27347j237368m14232N97838P11368
38590A12731J40329k76552k83860o5329K61730L69599j93154j007330q60283M20117
38580a382002J271231N34639p35469q53830l456L46555j08621l19840J08055L95664
$$ y = [1548316, 1706188, 1518013, 1231341, 1050473, 898207, 471695, -414044, -1428018, -1855068, -1345846, -338531, 495267, 918889, 935568, 390140, -631779, -1398107, -1360509, -1192531, -2038504, -3701028, -4584240, -3728031, -1996704, -829154, -642437, -1019317, -1692247, -2548345, -3140946, -3002543, -2275050, -1492759, -931221, -601876, -616323, -1048000, -1593331, -1802981, -1561245, -1080460, -615212, -376112, -404952, -325356, 356630, 1445872, 2075384, 1873505, 1496992, 1504667, 1382472, 455125, -782243, -1196475, -598637, 112731, 253060, -23492, -307352, -372681, -110951, 258648, 65494, -941836, -1802119, -1382002, -110771, 423868, -311601, -1165431, -1168887, -822332, -930953, -1250793, -1142738, -747074]
38570g47074J87762J44757N53114O55796n1694q81669r48829l56872J81904L45534
38560i17271L20961L26544L95028L84982Q4495m20618n90620j19409L96683J64717
38550B5492n49354p19094j07158M46738M30253K94704L39828O7968p02981j078049
38540a551653l54780O66443O61041l69602j208156j126758n40590m7005K87126
38531c583934N52381O38722M94356K67253M1576j77034j83680K49899Q53026J008922
38521A61487N87848J69666K30114N40568O39463M74386K08803k32906r22315j453486
38511D03628j280148m91426K57964O19946Q22127R61890O84792n6235n27568j57813
38501A237157M50920K77282n39911q28168j75246M22154J39556l87008j32399
$$ y = [-747074, -559312, -414555, 138559, 794355, 742661, -139008, -1087837, -1444709, -1262805, -917271, -596310, -269766, 125262, 510244, 594739, 174121, -416499, -535908, -139225, 25492, -523862, -1242956, -1350114, -903376, -473123, -178419, 161409, 229377, -473604, -1551653, -1906433, -1239990, -578949, -948551, -2156707, -3283465, -3824055, -3871060, -3583934, -3031553, -2392831, -1898475, -1631222, -1589646, -1766680, -1950360, -1700461, -847435, 161487, 749335, 919001, 1149115, 1689683, 2329146, 2803532, 3012335, 2779429, 1857114, 403628, -876520, -1367946, -1109982, -490036, 332091, 1293981, 1978773, 1922538, 1394970, 1237157, 1688077, 1965359, 1425448, 597280, 422034, 844188, 983744, 596736, 464337]
38492D64337O57186Q84789L31351r7631J64261N98395N47064J20201k13536l63704
38482C092713n30376p45195q44344o90373k58381K72075M80470J18821l95431
38473D99979l47611L04099Q12519O67919K13697m2866j93705n46324q91837p28539
38463b52669l9085O39829Q60700O15392J09897m61267r03280j051432q94298n78380
38453a954593l00063j98604k30026j44658K06105N46169M70749J08746O6116N29029
38443i01030Q74611N15845k36855n90518k89149K31937N39867N85799M52706J62500
38433A345713j83697l64702k57574P315J19160j88481q19651j194073p55361K54138
38423b037213Q89946O25414m474k14309j1410N8977j45658k98651k54653j23614
$$ y = [464337, 1121523, 2006312, 2337663, 2240032, 2404293, 3002688, 3549752, 3669953, 3456417, 3092713, 2562337, 1817142, 972798, 282425, 24044, 296119, 776589, 895410, 499979, 152368, 456467, 1268986, 1936905, 2150602, 2107736, 1914031, 1367707, 475870, -252669, -291754, 348075, 1208775, 1824167, 1934064, 1472797, 569517, -481915, -1376213, -1954593, -2254656, -2453260, -2683286, -2827944, -2621839, -2075670, -1604921, -1496175, -1430059, -901030, -26419, 489426, 252571, -337947, -627096, -395159, 144708, 730507, 1183213, 1345713, 1162016, 797314, 539740, 547055, 666215, 477734, -341917, -1535990, -2291351, -2037213, -1147267, -521853, -526327, -740636, -752046, -693069, -838727, -1137378, -1392031, -1515645]
38413a515645J47445N85004P05443K5411r31119j029861j44575N35618K44257
38404a378022k30574J21486Q50627P51785j72622o60947j15244N66922M59477
38395A92888o9436j77999M0131j04362n34719m59291J81530L83289l46287r87958
38385a882214m51899N78512M45174r24048j576639k05638J844848K287669R40540
38376A056305k44790l7273N93149K58476q02870j347220j000920m50054j37815
38367b113012J61513N26557O16766L75904J79813N0379m54357j196297j165132
38358c017866R3744J442109J436112K56538n88767l07725M04426O60585M58557
38349H37713J79912q4010j99126K72382J318811J971732J294271l57519j666845
$$ y = [-1515645, -1368200, -783196, -77753, -52342, -983461, -2013322, -2157897, -1622279, -1378022, -1608596, -1487110, -636483, 115302, -57320, -718267, -833511, -266589, 192888, 123452, -54547, -14416, -118778, -653497, -1112788, -931258, -547969, -894256, -1882214, -2334113, -1755601, -1310427, -2234475, -3811114, -4016752, -2171904, 115765, 1056305, 811515, 774242, 1367391, 1625867, 822997, -524223, -1525143, -1975197, -2113012, -1951499, -1424942, -808176, -432272, -252459, -202080, -656437, -1852734, -3017866, -2924122, -1482013, -45901, 210637, -378130, -685855, -281429, 379156, 837713, 1017625, 933615, 734489, 1006871, 2325682, 4297414, 5591685, 5234166, 3567321]
38340C567321j803227j051318j81157K78546K34169j6182k8050K66834M13010
38331A679946J00957l01841l14857j08618j28714k56101n7850L35337M15129K46490
38321A609878L37114N57133J86398p57517j245052p02979J45762M30644K85285
38312H46666K29496J82898j32613m29437l07615J8310K15576N44576J200014J431036
38302C798907M27352j144670j676424p76967J82780j250q38474j068124l93623
38293a490493L79292N57056K71120M8668J26634L23228M00875L62046L07204J45679
38283A431309k35480n20443j90546N64678P52456r3121j034215r52173k20001
38274d97536j33100q55752j152378l81562M49275K52534m82295n03829L37013
$$ y = [3567321, 1764094, 712776, 531619, 810165, 1044334, 1028152, 1000102, 1266936, 1679946, 1780903, 1479062, 1164205, 1055587, 926873, 670772, 612922, 948259, 1363388, 1609878, 1946992, 2504125, 2690523, 1933006, 687954, -15025, 130737, 561381, 846666, 1076162, 1259060, 1126447, 697010, 389395, 407705, 623281, 1167857, 2367871, 3798907, 4226259, 3081589, 1405165, 628198, 810978, 809728, -28746, -1096870, -1490493, -1111201, -554145, -283025, -234357, -107723, 215505, 616380, 978426, 1285630, 1431309, 1195829, 675386, 484840, 1049518, 1801974, 1708853, 674638, -277535, -497536, -630636, -1486388, -2638766, -3020328, -2571053, -2318519, -2800814, -3304643, -2967630]
38265b967630J023019R09180M09045J42390J76083K98841M37930N00524K39591
38256A168973l70889r13148j022589q95823r12179q97161l09634P49860J327296
38247b075294Q30070k2766j23009M49897O36649J26074j74271K79824O91678K73032
38237H91884l34346o9522P17187P34896j72016p51472k88204M10989M12692k00
38227A551888l2885L32196M87209J99929j72821k54595j1250K92300K73086k04517
38217B460540p43673q34229n92018n83839q54909p90115j52302M54288N14883
38208a121374L04134J96113k6368n47947q28439l30411M74188O47867J07982l63613
38198a487868l01810o586J78103L28828N37545O07761M01432J14949k3991r1901
$$ y = [-2967630, -1944611, -1035431, -626386, -483996, -307913, -9072, 428858, 929382, 1168973, 798084, -115064, -1137653, -2033476, -2945655, -3842816, -4152450, -3402590, -2075294, -1245224, -1267990, -1390999, -941102, -304453, -178379, -352650, -72826, 618852, 891884, 557538, 488016, 1205203, 1940099, 1768083, 1016611, 728407, 1139396, 1552088, 1551888, 1519003, 1851199, 2338408, 2538337, 2365516, 2110921, 2099671, 2391971, 2665057, 2460540, 1716867, 882638, 290620, -293219, -1148128, -1938243, -2090545, -1636257, -1121374, -817240, -621127, -647495, -1195442, -2023881, -2354292, -1880104, -1232237, -1124255, -1487868, -1789678, -1796264, -1618161, -1289333, -751788, -144027, 257405, 372354, 348363, 256462]
38188B56462k87388n38038n08614q2437K82723k7127q71045j236164m68616O94719
38178b785525J009934M42782Q3195L46856M03312k42290p72444l94264L48759
38169a559685N38556L33874M10211O34958M66038J48795K78732N40679J70821
38160A962979n52707o26429o9142L3769o10725r76338m57394J24965j10351p61186
38150b042559q99385l94533K16972N81462O28652L27432j18575k63098l3733Q9691
38140a907674j35646k91325p0943J04338k14421o70022n77740O9236O32897P04171
38130b357129N14497N54020J014004J516477J386811M61216m82690o02677j84677
38121A819852j97442o63116n14169O01024J485639J060782r0181p40676p88475
$$ y = [256462, -30926, -568964, -1077578, -1160015, -877292, -904419, -1775464, -3011628, -3480244, -2785525, -1775591, -1332809, -1249614, -902758, -499446, -741736, -1514180, -1908444, -1559685, -1021129, -687255, -277044, 357914, 823952, 972747, 1251479, 1792158, 1962979, 1410272, 783843, 714701, 748470, 137745, -838593, -1295987, -1171022, -1281373, -2042559, -2941944, -3336477, -3119505, -2538043, -1909391, -1581959, -1700534, -1963632, -1997365, -1907674, -2043320, -2334645, -2405588, -2301250, -2515671, -3185693, -3763433, -3694197, -3061300, -2357129, -1842632, -1288612, -274608, 1241869, 2628680, 3089896, 2607206, 2004529, 1819852, 1622410, 959294, 445125, 1046149, 2531788, 3592570, 3502389, 2761713, 1973238]
38112A973238r29280j144953p52741K32033R08496P50667K05977q8677k1753J64615
38102A297622K24897J8825l43483n22897m14796l27452l68095j38826M32810N80924
38092D39529j57372q71497m64131N04380N11882n18135j007770j71785Q06519
38083i28380O74516r8734l31455O7249L42687K56649J57908J15979n4356j61011
38073D1052J07759M56290L10636k18230m66319k90751k42819n58835p22385l21219
38063a904821K82899N53373N65308O79308P53586L16654n16880r28162m49798
38054f48533L04325L93077k08182o30194l28290K75656N32265M31255L83034N27378
38044A031791O97716Q12650Q61440O78779J32422o22453j380026k062393k306894
$$ y = [1973238, 1043958, -100995, -853736, -621703, 286793, 1037460, 1243437, 1154760, 1133007, 1297622, 1522519, 1541344, 1197861, 674964, 260168, -67284, -435379, -574205, -141395, 439529, 282157, -589340, -1053471, -549091, -37209, -555344, -1563114, -1734899, -928380, -253864, -352598, -684053, -616804, -274117, -17468, 140440, 256419, 202063, 41052, 148811, 605101, 915737, 697507, 231188, -59563, -302382, -861217, -1583602, -1904821, -1621922, -1068549, -503241, 176067, 929653, 1246307, 729427, -198735, -648533, -344208, 48869, -159313, -789507, -1117797, -842141, -309876, 121379, 504413, 1031791, 1729507, 2542157, 3403597, 4082376, 4214798, 3592345, 2212319, 149926, -2156968]
38035b156968j415807N73901K236131K165021Q23179p6315P8777L07415L89o3669
38025B472054P34505J562062J332629L04423m76667o57611o01624n03109l52106
38016C814556l11876l67747j19252L59395J56839j057398j999528j363772J38275
38007g50508P15059P8446m32587j56108J02077k08571m30107j5107M86698M39018
37997a71690R9882n9337j60413m44304p23518p96498p16510l24716O24175J539138
37987a133791J264226j67595j134311n52896N83719P19365j02412o61612m52389
37978a637696k869K47208L18173K05602r8662l39285m13988o30748r26705n28316
37968c807286P48947J635873R95267l78135q43101k38504L23577N04998Q73592
$$ y = [-2156968, -3572775, -2998874, -762743, 1402278, 2225457, 2149142, 2227919, 2535334, 2535723, 2472054, 3206559, 4768621, 6101250, 6405673, 5929006, 5271395, 4669771, 4166662, 3814556, 3502680, 3134933, 3015681, 3375076, 3531915, 2474517, 474989, -888783, -750508, -35449, 42997, -389590, -545698, -443621, -652192, -1082299, -1097406, -610708, -171690, -71808, -131145, -291558, -735862, -1459380, -2255878, -2972388, -3297104, -2672929, -1133791, 130435, -37160, -1171471, -1724367, -1140648, -421283, -523695, -1185307, -1637696, -1640565, -1393357, -1075184, -869582, -968244, -1307529, -1721517, -2352265, -3278970, -3807286, -3058339, -1422466, -427199, -805334, -1648435, -1886939, -1563362, -1058364, -184772]
37959a84772J219144O23049o33941j069739l22717K74817P857j39823M33726O01144
37949H08745m59879j447890q16045O57808R75753j05684r75406o80825J39855
37940a903568P49829J165513J342887R00911L1346m36993k69804j46323l90188
37931A043610l81650K41224P11058K05162q43012j293640p90007K4490N65509
37922e17256Q63771J038557Q65228K07246m61367m35863K76806P61676K37036
37913B835834q92094j454657r76704j90689J03900Q0850L10118O66013N69186
37904A051757O7491j61650J01082L12959J39529O179L12211O75673M65594k65245
37894B705580q61882q85408m44522J52624O71150Q87624O15911n1576o80404q16003
$$ y = [-184772, 1034372, 1657421, 1023480, -46259, -368976, -94159, -86302, -226125, 207601, 808745, 348866, -1099024, -1915069, -1257261, -281508, -387192, -1362598, -2043423, -1903568, -1153739, 11774, 1354661, 2255572, 2286918, 1849925, 1580121, 1433798, 1043610, 661960, 903184, 1614242, 1819404, 976392, -317248, -1107255, -1082765, -517256, 346515, 1385072, 2250300, 2457546, 1996179, 1560316, 1837122, 2598798, 2835834, 1943740, 489083, -487621, -678310, -574410, -493560, -183442, 482571, 1051757, 1119248, 957598, 1058680, 1371639, 1511168, 1517347, 1829558, 2505231, 2970825, 2705580, 1843698, 958290, 513768, 666392, 1337542, 2225166, 2841077, 2789501, 2109097, 1293094]
37884A293094l83272K52165O35452O40473M95304L85808J87074k56090p10083
37875B539925p18321k40363J58089l0297n49030o35691k7325N90540M19095l30465
37865A176157o29535n3652N61262L33566l06514k80363L93740O02110j143l12686
37855A482942M71634J476161J427311N21247j07649k46426o46838j401084j597870
37846A379428q23656Q7690K37559k17844n72414n47011l13972k8949K53643N00246
37836d5280P57474J021082J020649N46156k9378r6270K93031M73476J87604r6824
37826D031720k5319J55250J35401q3117n25634j233413j701162j156774K08196
37817a94852J079666O10714m91876r65733m39336N85299J476826J638123O74525
$$ y = [1293094, 909822, 1161987, 1797439, 2437912, 2933216, 3319024, 3506098, 3250008, 2539925, 1821604, 1581241, 1739330, 1709033, 1160003, 524312, 496987, 1087527, 1506622, 1176157, 546622, 492970, 1054232, 1387798, 1081284, 800921, 1194661, 1796771, 1795628, 1482942, 1954576, 3430737, 4858048, 5379295, 5271646, 5025220, 4378382, 2977298, 1379428, 555772, 643462, 881021, 663177, 90763, -456248, -770220, -799169, -545526, -45280, 712194, 1733276, 2753925, 3300081, 3270703, 3174433, 3467464, 3940940, 4128544, 4031720, 4006401, 4161651, 4297052, 4213935, 3688301, 2454888, 753726, -403048, -194852, 884814, 1495528, 1003652, 37919, -401417, 183882, 1660708, 3298831, 3973356]
37808C973356q75158j618644r02696K35396M86007L3109k9970M89350Q00048N90094
37798C180892M06526N47738N82444J63546m60352r34921j169036j092090o29603
37789E95144l9347K34552J19236j02746l17086o02837q21921p34088m74966l81547
37779b525606l99495k13822J06740J98030R1143J90947N52061P79394O93052N23670
37769c886M03004K07324n1229j88968k12023k35719j32628K13282M65496K72360
37759G37013m5442L0870K71319R8357k56109o6320M65474L30539n58311j034069
37749b6679n03981J11797q2175n85575m88108R6822M75701N00219L68804k9028
37739a62203o65735q57897j40630P98171R78793N38946L63916O31179O91274K48428
$$ y = [3973356, 3098198, 1479554, 576858, 812254, 1298261, 1331370, 1301400, 1790750, 2590798, 3180892, 3587418, 4135156, 4717600, 4881146, 4420794, 3485873, 2316837, 1224747, 595144, 555797, 790349, 909585, 806839, 489753, -113084, -935005, -1669093, -2144059, -2525606, -2925101, -3138923, -3032183, -2834153, -2743010, -2552063, -2000002, -1220608, -527556, -3886, 399118, 606442, 555213, 366245, 154222, -81497, -214125, -843, 464653, 737013, 691571, 722441, 993760, 1092117, 836008, 769688, 1235162, 1565701, 1007390, -26679, -530660, -418863, -501038, -1086613, -1574721, -1477899, -1002198, -501979, -133175, -162203, -827938, -1685835, -1826465, -1028294, -49501, 489445, 853361, 1484540, 2175814, 2424242]
37729B424242k36880l13478j324M61036P29958L83095n25082j130177o91944K85864
37719A385310N97621j01713r92820j271710r08458k68780K99738M91271L08962
37710d60579K83563P91313J289044R97304K02396p4731L10949M28854j43749o74836
37700B949528o16628m80941p49708r36071n76363k76545p12087j229830o61283
37691c289928P82290J649211J273405N19875K55569J25490n62866j494406j682424
37682b423784q32511L27413J024472J193143J162653J051880P44919K35037k89380
37673B193842o35636o97406m30941M1609L55111K14199j73470k77705K6651K43461
37663H59715j8947m47100m94544j65386J24800K50914L93803M79513K45401j03126
$$ y = [2424242, 2187362, 1873884, 1872560, 2333596, 3063554, 3446649, 2921567, 1791390, 1099446, 1385310, 1982931, 1881218, 888398, -383312, -1291770, -1560550, -1260812, -769541, -460579, -177016, 614297, 1903341, 2900645, 3103041, 3028310, 3339259, 3768113, 3624364, 2949528, 2332900, 1851959, 1102251, 166180, -410183, -686728, -1398815, -2628645, -3289928, -2507638, -858427, 414978, 934853, 1190422, 1315912, 753046, -741360, -2423784, -3256295, -2928882, -1904410, -711267, 451386, 1503266, 2248185, 2483222, 2193842, 1558206, 860800, 429859, 471468, 826579, 1040778, 867308, 589603, 616254, 859715, 840768, 393668, -100876, -266262, -141462, 109452, 503255, 982768, 1228169, 1125043]
37653A125043J5184N84095P41147q6485j260686j622969q21729M61935J371860
37644E07395J531310J002397O3084q94671j478608j429596p30080K36795P23984
37635d67990K55405o66267r66510l36136L63009L72474J23185M51721J215797
37626C44688J485493Q82792m0995o55887p59860l46572L25057M70499m71946j685282
37616d52013j573601P8640J514489J224516r4665o87082j60188L82480K92335
37607E24911J71982N57362R20511N41780l39650q74410p02743j71473K82534M62319
37597A373123K71029k58925p56623p05355M426Q91480J341680J146436N80371
37588C887642R8404l691K09870L44169J1522p29866j334945j300710o98810l9466
$$ y = [1125043, 1140227, 1724322, 2465469, 2378984, 1118298, -504671, -1326400, -864465, 507395, 2038705, 3041102, 3104186, 2209515, 730907, -698689, -1428769, -1191974, -467990, -212585, -878852, -1845362, -2181498, -1818489, -1446015, -1322830, -871109, 344688, 1830181, 2712973, 2671978, 2016091, 1256231, 909659, 1234716, 1705215, 1233269, -452013, -2025614, -1946974, -432485, 792031, 697366, 10284, -149904, 232576, 524911, 696893, 1254255, 2174766, 2716546, 2376896, 1502486, 799743, 628270, 910804, 1373123, 1644152, 1385227, 628604, -76751, -72325, 819155, 2160835, 3307271, 3887642, 3986046, 3982355, 4192225, 4536394, 4547916, 3818050, 2483105, 1182395, 483585, 444119]
37578D44119L46845N55862P15964O91079M03189J46230J71151J44837m33855j288224
37568A897197j462049o11872L54340L78469l96216r06504n73036J38976N02201
37559f78494L59900R1657J00626M36361P42765O17818J67133k7671K51413M09472
37549B470980q1977o99870n02563M21701J020888Q46677O21699R46401J335021
37540F378957J071033K91559m14392r00618j285735j381026j026358o21644n99312
37531A512464o82615m05031n6687k42289o81174m44384N38905J190704Q29107
37522A559000J55380J58734O80850P80478J96514l00637o6273M72016L53192o41059
37512C348195j629457j669482q79294j79651m1948l5968K42132M26504N6269m75030
$$ y = [444119, 790964, 1346826, 2062790, 2753869, 3157058, 3303288, 3474439, 3619276, 3185421, 1897197, 435148, -176724, 177616, 556085, 159869, -746635, -1319671, -1180695, -678494, -318594, -226937, -126311, 310050, 1052815, 1670633, 1837766, 1810095, 2061508, 2470980, 2389003, 1689133, 1186570, 1608271, 2629159, 3475836, 4097535, 5043936, 6378957, 7449990, 7741549, 7327157, 6426539, 5140804, 3759778, 2733420, 2111776, 1512464, 829849, 424818, 368131, 125842, -555332, -999716, -460811, 729893, 1559000, 1714380, 1873114, 2553964, 3334442, 3530956, 3230319, 3164046, 3636062, 3989254, 3348195, 1718738, 49256, -830038, -1009689, -1051637, -1087605, -845473, -418969, -362700, -837730]
37502h37730l53774M34446R95411O77000j97440q41649q46400m10254k5478N926
37492a399942j06948Q3858N68311Q05747N75737L81073N75221O95589L17997o5855
37482B430788O7601J33448n90774j313876o02076J181355J972233Q63845o98564
37473C443980j148324p24125l56206l8223N56040R34999N34644j42428k66436
37464B793921N1830K41494L78780P60147R68727M87888k44054m96198m92375q48284
37454C601876j220031q18255K2089J69712m75471q28975l99023O8723l795j54190
37444c7340J57730O86105R61914R42827P21749K91109q8863K0486M77507N53971
37434D687195k6950o75195p95033m26470J53857P37426Q71467R1177j136713j515832
$$ y = [-837730, -1191504, -757058, 238353, 915353, 717913, -123736, -970136, -1380390, -1405868, -1399942, -1506890, -1423032, -854721, -48974, 526763, 907836, 1483057, 2178646, 2496643, 2430788, 2498389, 2631837, 2041063, 727187, 125111, 1306466, 3278699, 4142544, 3443980, 2295656, 1571531, 1215325, 1177102, 1733142, 2668141, 3202785, 3060357, 2793921, 2845751, 3087245, 3466025, 4226172, 5194899, 5682787, 5438733, 4942535, 4450160, 3601876, 2381845, 1563590, 1585679, 1755391, 1279920, 450945, 51922, 120645, 116850, -37340, 120390, 806495, 1768409, 2711236, 3432985, 3724094, 3635231, 3655717, 4133224, 4687195, 4660245, 3985050, 3190017, 2763547, 2917404, 3654830, 4526297, 4617474, 3480761, 1964929]
37424A964929n20229P82811J096399M69001j45723l47989m88141p08233o52245
37415A450580j81471K65007K50545q2642k55127j10431r212l10486q02250q95433
37405f80920m10530J67704L96263M31287N52191N89871L60518K18058M33689M14069
37395B472200m92696j632782j635984m13398O17221N68128J53813K38324M90632
37386C65458K94622J3135L04906Q47270Q19837K63820p0207j7539j45975o06984
37376B068343p46292j06589Q31455J230435Q18643j6123p50161j082759r49732
37367A297220m60473J30188N22462N87123M88484M54136M01682N2099m64534n06577
37357B501810K10535R77534Q54848j22297j038142j221320p15931J49605R64378
$$ y = [1964929, 1444700, 2227511, 3323910, 3792911, 3647188, 3299199, 2811058, 2102825, 1450580, 1269109, 1534116, 1784661, 1702019, 1446892, 1336461, 1327249, 1016763, 214513, -680920, -1091450, -923746, -527483, -96196, 455995, 1045866, 1406384, 1624442, 2058131, 2472200, 1979504, 346722, -1289262, -1702660, -1085439, -517311, -363498, -125174, 365458, 660080, 673215, 978121, 1825391, 2645228, 2909048, 2838841, 2821302, 2675327, 2068343, 1322051, 1215462, 2046917, 3277352, 4095995, 4079872, 3329711, 2246952, 1297220, 836747, 966935, 1489397, 2076520, 2565004, 3019140, 3420822, 3472921, 3008387, 2501810, 2712345, 3689879, 4544727, 4422430, 3384288, 2162968, 1447037, 1596642, 2561020]
37348B561020J167348N71123j16975r5932L03848J13020o39614q97846k80482
37339B685510L94013N67325O83292J000522R09284J36519m88275l11927O1734
37330E637997j52838o30701o32999k44833j8103l7788j66492n45766j055079r90744
37320A162654j19327O74819O34083K41372K21959L23414J16002Q0917O62522J081640
37310E080055M86205m37278m80814Q9316J27719l38870l60096J5610j28222o77851
37300C375774n38289L59377Q42003M72545O2374m8420n02310j293299j337364
37291A392391l26620N51151N08126L10791O73932Q93626J65834q64489j029265
37282B275477k91963N26410R59939R39148L24635o76047j202421p18004J74452
$$ y = [2561020, 3728368, 4299491, 4182516, 4086584, 4390432, 4503452, 3863838, 2965992, 2685510, 3079523, 3646848, 4330140, 5330662, 6239946, 6376465, 5888190, 5576263, 5637997, 5485159, 4854458, 4221459, 3976626, 3958523, 3920735, 3754243, 3208477, 2153398, 1162654, 1043327, 1718146, 2352229, 2593601, 2815560, 3138974, 3254976, 3335893, 3998415, 5080055, 5566260, 5128982, 4648168, 4737484, 4865203, 4526333, 4166237, 4181847, 4053625, 3375774, 2837485, 3196862, 4038865, 4511410, 4573784, 4525364, 4023054, 2729755, 1392391, 1065771, 1616922, 2125048, 2435839, 3109771, 4003397, 4169231, 3304742, 2275477, 1983514, 2509924, 3469863, 4409011, 4733646, 4057599, 2855178, 2137174, 2311626]
37273B311626O12301O37822P58714Q93762N94519n3650n30052o40699n66748l98690
37263C618905j60487m9236j65165k21540R0187O66597J171626J338264R50348
37254G239499K2884q12922p28392J97992R12296P28264O2129m86504r39719j313896
37244D881631j079775n0550Q83146Q14779J47495k1462M89933Q09950L25292n99616
37234F600823j179181r70474j56995N73241O12536J53354j3280L50993N41318
37225F512335O4961m71795k86032L21183M46569q985k74570L6361L55184k0226
37215F674985r83649j659779j271406l6403Q47584M80955n15954p03590J75054
37206C007797Q04465K87571m93693k84536O46074J071560O90468K84218K70020
$$ y = [2311626, 2923927, 3561749, 4320463, 5214225, 5808744, 5755094, 5225042, 4584343, 4017595, 3618905, 3458418, 3409182, 3244017, 3022477, 3112664, 3779261, 4950887, 6289151, 7239499, 7262383, 6449461, 5721069, 5919061, 6831357, 7559621, 7621750, 7135246, 6195527, 4881631, 3801856, 3751306, 4634452, 5449231, 5596726, 5575264, 6065197, 6875147, 7200439, 6600823, 5421642, 4451168, 4294173, 4867414, 5479950, 5633304, 5620024, 5971017, 6512335, 6577296, 6105501, 5819469, 6140652, 6587221, 6578236, 6303666, 6340027, 6695211, 6674985, 5691336, 4031557, 2760151, 2723748, 3571332, 4052287, 3536333, 2832743, 3007797, 3812262, 4099833, 3606140, 3321604, 3967678, 5039238, 5729706, 6013924, 6283944]
37197F283944K24643j37398m62445m22451j90575n1237j6156K7993J08355J46346
37187E511019l2469n33200j072783j104216m71033L76887R79865J246826J114080
37178F014976M67441l54734p14992o43395q11944j199296q76695K77124R13447
37169C071932K60022l98023L42964J628656J605619L39561m05677K1795M76085
37160F942934J75441k44887j78925K9485J09753M35184R86661R36800q1025j249025
37150G862396j683660j436201r06095j33679P52538J137294O13718l68141r64507
37141D873663p21689K05365J148208J268300M19288m17668k74447M17864N12256
37132G431140K93n5699N81961R40167O02289L66743O26588N89247j15422n04478
$$ y = [6283944, 6508587, 6371189, 5908744, 5486293, 5295718, 5244481, 5228325, 5256318, 5364673, 5511019, 5478550, 4945350, 3872567, 2768351, 2297318, 2674205, 3654070, 4900896, 6014976, 6482417, 6127683, 5412691, 4769296, 3957352, 2758056, 1881361, 2158485, 3071932, 3331954, 2933931, 3276895, 4905551, 6511170, 6850731, 6445054, 6466849, 6942934, 7118375, 6873488, 6694563, 6724048, 6833801, 7268985, 8255646, 9192446, 9111421, 7862396, 6178736, 4742535, 3836440, 3702761, 4455299, 5592593, 6206311, 5838170, 4873663, 4151974, 4357339, 5505547, 6773847, 7193135, 6775467, 6501020, 6918884, 7431140, 7431433, 7375734, 7957695, 8897862, 9500151, 9866894, 10493482, 11082729, 10967307, 10462829]
37122A0462829L3459M21910l64420j362869j006452L31773Q87328K06091m14733
37113I194916j65442K28180M6490k59027j01747J47680o2598l78817j36725M32922
37103H945832N08129j2925l82321k36881j26967m70074o95181r4625Q89176J057519
37093I381682Q1474j035392j277129p10846L610N24899Q27757Q71720P81073Q86736
37083A0335584J125689R12009J01762n12468l01899K12712K39692j7145J04401
37074A2200337M42769L34039j57035m23744m40742n71181n21245K43205J154649
37065A2261052R72560l24818j334507j152337l53250K15769M93346O80445O78276
37056A2136536N04244M78215O54154P19413N77843L55529q8216q22226j199651
$$ y = [10462829, 10496288, 10918198, 10553778, 9190909, 8184457, 8516230, 9403558, 9609649, 9194916, 9029474, 9257654, 9304144, 9045117, 8943370, 9091050, 9028452, 8649635, 8512910, 8945832, 9453961, 9441036, 9058715, 8821834, 8694867, 8224793, 7529612, 7434987, 8324163, 9381682, 9463156, 8427764, 7150635, 6439789, 6443399, 6968298, 7796055, 8667775, 9448848, 10335584, 11461273, 12373282, 12475044, 11962576, 11660677, 11873389, 12113081, 12095936, 12200337, 12643106, 12977145, 12820110, 12396366, 11955624, 11384443, 10863198, 11106403, 12261052, 13233612, 12908794, 11574287, 10421950, 10068700, 10284469, 10777815, 11458260, 12136536, 12640780, 13118995, 13773149, 14492562, 15070405, 15425934, 15337718, 14515492, 13315841]
37047A3315841n72962N15061R79550Q35706R17371J165348P23032k86849p04426
37038A6887672k14088K82566L58139N27499Q30720O31103R1067J30773O43740
37029B0169191N63286k1426J89516J262702J663877Q82949K44973M48461N58788
37020B5962317K14581M48471J357157J379904L1830j002983o52011N5822L50500
37011B8145588R73787J958098J997005J252114J677023L220451L233189J258670
37003D3715925M63545K261082L796873L266258L045836M500388M840450K965672
36995F8856029K850649O369948Q770015P127095O658764J1089452J4007191R848239
36987A35577382N694718P684444K072245k9450886p4791433r4199700o7434903
$$ y = [13315841, 12742879, 13257940, 14237490, 15073196, 15990567, 17155915, 17878947, 17592098, 16887672, 16673584, 16956150, 17314289, 17841788, 18672508, 19303611, 19394678, 19525451, 20169191, 20732477, 20711051, 20900567, 22163269, 23827146, 24710095, 24955068, 25403529, 25962317, 26176898, 26625369, 27982526, 29362430, 29394260, 28391277, 27739266, 27795088, 28145588, 29119375, 31077473, 33074478, 34326592, 36003615, 39224066, 42457255, 43715925, 44179470, 46440552, 50237425, 53503683, 56549519, 61049907, 65890357, 68856029, 71706678, 78076626, 86846641, 93973736, 100632500, 111721952, 125729143, 135577382, 141272100, 148956544, 151028789, 121577903, 46786470, -47413230, -114848133]
36980a14848133k0451018P695122R707649O166358R309792J1897813Q014544M077018
36972g8430855N469719P477308N305060K233716K235797L009162J653567M03937
36964e0642589J743338L416641K849914J823225K626593L681653K830511J390320
36956c0280394J367472J796577J120283L30579O96889J039440J50411n49020M78099
36947b3849664J989515K136644J389586R71110N66693j57111k8496J328745J952279
36938a3700699O72481n09911L14567J627966J180880j41518k05212M74879l0855
36929a0317422j338241j465648k95903O21360R04606J247450J296774K97389q37826
36920i887461o36696M27654R08644R90028J637517K123536J162469k97258l09139
$$ y = [-114848133, -135299151, -127604029, -117896380, -111730022, -102420230, -90522417, -82507873, -78430855, -72961136, -65483828, -60178768, -57945052, -55709255, -52700093, -51046526, -50642589, -48899251, -45482610, -42632696, -40809471, -38182878, -34501225, -31670714, -30280394, -28912922, -27116345, -25996062, -25665483, -24968594, -23929154, -23778743, -24327763, -23849664, -21860149, -19723505, -18333919, -17362809, -16796116, -16953227, -16981723, -15652978, -13700699, -13028218, -13538129, -13223562, -11595596, -10414716, -10556234, -10761446, -10286567, -10317422, -11655663, -13121311, -13417214, -12795854, -11891248, -10643798, -9347024, -9049635, -9887461, -10524157, -10096503, -9187859, -8197831, -6560314, -4436778, -3274309, -3571567, -3880706]
36911c880706P07957Q11649J48848N36214J781853J792131L85913l21266L50222
36902B312815P63642K88232K76026J038498J042638K9811j60769J080351K012880
36893H684124J829852J952691K880920L049886K212053K431108M039742M463255
36885C1543631L119569K906621L561649j345858j5071099k8947994l0248102j7841576
36877e2323159l364294L410047L799303L537306L785974K739278J209019J435009
36869c5771517K688679K471541R37116M97379J650576K381866J613516N80294
36861b2950550N10341J043843J354886J253078Q43224L13654J97510Q01768J444451
36852a5187795J267846N77897K93510M09808K80792R2927N19272J019072J93456
$$ y = [-3880706, -3172749, -2361100, -2212252, -1676038, 105815, 1897946, 2283859, 1962593, 2312815, 3076457, 3364689, 3640715, 4679213, 5721851, 5751662, 5590893, 6671244, 8684124, 10513976, 12466667, 15347587, 18397473, 20609526, 23040634, 27080376, 31543631, 34663200, 37569821, 41131470, 39785612, 24714513, -4233481, -34481583, -52323159, -55687453, -52277406, -48478103, -44940797, -41154823, -38415545, -37206526, -35771517, -33082838, -30611297, -29674181, -29176802, -27526226, -25144360, -23530844, -22950550, -22440209, -21396366, -20041480, -18788402, -17945178, -17631524, -17434014, -16632246, -15187795, -13919949, -13342052, -13048542, -12638734, -12357942, -12265015, -11745743, -10726671, -10533215]
36843a0533215j885214l320549k923488j653319q45011l98304L00062Q76535O78353
36834a9704150J87720M00531J181089J424050P21570j56634m81283l89528l14622
36825a7131257k81760q5240K38899M10145K48858n7597j8534O56406J512750J631747
36815a2875583P46322k25145j96515P09632J279441O76153o23368j439308j138849
36806a3087220j49855O16523P11620M47918K59149N7110l87034o50936k6829J183187
36796a1026367J620672O42153o30158p87460k7372L93815J28086k4502L20687
36787i390446N81475M06894K81343M95153M86175j82304r42939r97476m26652
36778i688777R6875K73060K71965K41415K85799O22075J200421J435480Q74375
$$ y = [-10533215, -12418429, -15738978, -18662466, -20315785, -21160796, -21559100, -21259038, -20382503, -19704150, -19516430, -19115899, -17934810, -16510760, -15789190, -15945824, -16427107, -16816635, -17131257, -17413017, -17498257, -17259358, -16849213, -16600355, -16657952, -16676486, -16020080, -14507330, -12875583, -12129261, -12354406, -12550921, -11841289, -10561848, -9885695, -10509063, -11948371, -13087220, -13237075, -12620552, -11908932, -11461014, -11201865, -11144755, -11531789, -12182725, -12209554, -11026367, -9405695, -8763542, -9393700, -10181160, -10208532, -9814717, -9686631, -9711133, -9390446, -8808971, -8402077, -8120734, -7625581, -7139406, -7321710, -8264649, -9262125, -9688777, -9591902, -9318842, -9046877, -8805462, -8519663, -7897588, -6697167, -5261687, -4387312]
36769d387312o6277n60641m14616j53264k20374n91302j050626j329754j061617
36760i835783j62546P41349Q18316N4191o93409p50602k74851K54270O65062R48994
36750h235009R24627M41646k87247q51623j008964p24649p8819O44414J009541
36741h166083Q78872O57750P70127R94809P00794k46869j193804j443447r83260
36732h031111k67589M05755R34207J047830M82136l97114o96746q6809O08614
36723f000827M24908l86582o75339m0946N82526K84177n47145q71025m63396L974
36713g689675J57083L54033P73195Q42332R7571q54447r17119L4962Q79156O09835
36703e713074m62106j201907j042559m15939R9230M69704Q29997R28414M61292
$$ y = [-4387312, -4453589, -5014230, -5428846, -5582110, -5802484, -6393786, -7444412, -8774166, -9835783, -9998329, -9256980, -8438664, -8384473, -9077882, -9828484, -10103335, -9849065, -9184003, -8235009, -7310382, -6868736, -7155983, -8007606, -9016570, -9741219, -9820038, -9175624, -8166083, -7287211, -6629461, -5859334, -4864525, -4163731, -4410600, -5604404, -7047851, -8031111, -8298700, -7892945, -6958738, -5910908, -5428772, -5825886, -6522632, -6609441, -6000827, -5575919, -5962501, -6637840, -6678786, -6096260, -5812083, -6359228, -7230253, -7693649, -7689675, -7532592, -7178559, -6405364, -5563032, -5465461, -6319908, -7237027, -7202065, -6322909, -5713074, -6175180, -7377087, -8419646, -8835585, -8736355, -8266651, -7436654, -6508240, -6046948]
36694f046948k77379o26470l79002J13170N91326J039692J147918L95314r91131
36685e033510j873752j550733o87690k59949j28035M47412J279199J378930N74613
36676e853515j25564n0804K65180J76563n6404J3012R6652j93700m17067J7500
36666f128147O49024N04770l09619o36646J5631Q02875R09008O41019O18705O75505
36656b257875L36691j59627k15214J3449k44204j097357j671783j306763m23621
36647g026304J68191L22534M43164O67530P17835M55674R1472k10032n44952r39836
36637e854724j070082n31981O45069J835715K194326J333897k03858j259290j099170
36628d010098j51075N26682M51499N3627j75066l43986p16825j069871r75717
$$ y = [-6046948, -6324327, -6950797, -7329799, -7216629, -6625303, -5585611, -4437693, -4042379, -5033510, -6907262, -8457995, -9145685, -9405634, -9533669, -9086257, -7807058, -6428128, -5853515, -5979079, -6029883, -5764703, -5588140, -5644544, -5631532, -5534880, -5728580, -6145647, -6128147, -5479123, -4974353, -5283972, -5920618, -5904987, -5102112, -4193104, -3552085, -2933380, -2257875, -1921184, -2080811, -2296025, -2282576, -2526780, -3624137, -5295920, -6602683, -7026304, -6858113, -6535579, -6092415, -5424885, -4707050, -4251376, -4159904, -4369936, -4914888, -5854724, -6924806, -7456787, -6811718, -4976003, -2781677, -1447780, -1651638, -2910928, -4010098, -4161173, -3634491, -3182992, -3129365, -3304431, -3648417, -4365242, -5435113, -6410830]
36619f410830m67938P0360N05815R02214R88026L72798n82041q31241r208Q29762
36609d632283M54393q67579j627173r59560L77514J073605P60784R5044k51068
36600e576323j62354K14017P69024J225781J027707r1450j447750j787295o44822
36591f473465R20041J388929N39855l79685l76132J3161l06600j202386j398081
36582g274363l57324Q25506Q77535M3450l70868J65248P99856N64708l98483j158091
36572f282826j124221n02538J70151N70740O67752N36640K83775J02940K13502
36563e364085N87654Q10836M61387l09540q45918p92209n29817n19024n23610
36554g024326r539Q48594J222366P75578J23497r5195n461L3681J72319O62501
$$ y = [-6410830, -6878768, -6808408, -6302593, -5400379, -4412353, -4039555, -4621596, -5452837, -5462045, -4632283, -4177890, -5045469, -6672642, -7632202, -7254688, -6181083, -5420299, -5325255, -5576323, -5738677, -5524660, -4755636, -3529855, -2502148, -2593598, -4041348, -5828643, -6473465, -5553424, -4164495, -3624640, -4004325, -4380457, -4367296, -4673896, -5876282, -7274363, -7631687, -6806181, -5928646, -5885196, -6256064, -6090816, -5290960, -4726252, -5124735, -6282826, -7407047, -7909585, -7739434, -7168694, -6500942, -5964302, -5680527, -5577587, -5364085, -4776431, -3965595, -3504208, -3813748, -4659666, -5451875, -5981692, -6500716, -7024326, -7033865, -6185271, -4962905, -4187327, -4063830, -4159025, -4164486, -4130805, -3958486, -3295985]
36544c295985J089913P72132j67420q20093o69527j54467J10122J18590J81976
36535b834759L03287K65947Q6531l7354j21191l71364p69435r67856o93090j01028
36525e240312L47020L01269j87556p14342q41458m55257J41721N03207M23458
36516e722250N9480k96842m99763n55308m21339j870N56992P71860L26508l76626
36506f159158n34573P5908P66546P81297J72488m16220n38889j74334N44193J318741
36496d164001J548089P90812n31470j355232j091747k15213L98062M07370J06827
36487d106503j41259k94964n06219p65475p76441l12868L15491M94642K10036
36478e883560K90529J258737K290824K072744N85146p93139j074769p28571o43496
$$ y = [-3295985, -2206072, -1433940, -1601360, -2421453, -3090980, -3245447, -3135325, -3016735, -2834759, -2531472, -2265525, -2178994, -2216348, -2337539, -2708903, -3478338, -4446194, -5139284, -5240312, -4893292, -4592023, -4779579, -5493921, -6335379, -6790636, -6648915, -6145708, -5722250, -5662770, -5959612, -6459375, -7014683, -7436022, -7437892, -6880900, -6109040, -5782532, -6159158, -6693731, -6617823, -5851277, -5069980, -4897492, -5313712, -5852601, -6026935, -5482742, -4164001, -2615912, -1825100, -2356570, -3711802, -4803549, -5018762, -4620700, -4213330, -4106503, -4247762, -4542726, -5048945, -5814420, -6590861, -6903729, -6588238, -6093596, -5883560, -5593031, -4334294, -2043470, 29274, 614420, -178719, -1253488, -1982059, -2625555]
36469b625555q23885p02188k08655J52276P4852k05653k60692J10245O61631P83500
36459c044124R8826r10445j287522p52912K0694M38843O46047Q77326Q94875N59161
36449b459231K65004K21232j7130o18947q15635n5695Q53413Q35579K23285J03154
36439a464971M07417J18114p62834j031829l13387K40147j67159p37359n06254
36430d218115J43534L54430K51921M37317O73544K39140p10259j186507p34811
36421d749806O6269N16868N50361M71361M38976L63365O0175n08036j010230r61356
36411d762053l54807K12327L20744K81455N23091Q01597N74874p7661n22694m73270
36401c476397k63770k32918l31771l92084l55722j73726J65061M74147N66614
$$ y = [-2625555, -3449440, -4151628, -4360283, -4208007, -4133155, -4338808, -4599500, -4489255, -3827624, -3044124, -2945298, -3855743, -5143265, -5896177, -5875483, -5436640, -4790593, -3913267, -3018392, -2459231, -2194227, -1972995, -1990125, -2609072, -3424707, -3480402, -2626989, -1791410, -1568125, -1464971, -1057554, -939440, -1702274, -2734103, -3047490, -2807343, -2974502, -3711861, -4218115, -4074581, -3720151, -3468230, -3030913, -2357369, -2118229, -2828488, -4014995, -4749806, -4683537, -4166669, -3616308, -3144947, -2705971, -2342606, -2282431, -2790467, -3800697, -4762053, -5116860, -4904533, -4583789, -4302334, -3779243, -2977646, -2402772, -2480433, -3003127, -3476397, -3740167, -3973085, -4304856, -4696940, -5052662, -5226388, -5061327, -4587180, -4020566]
36392d020566N93193Q27819J150856J150914P30977J78649l59740r43421j305625
36383a996944r16675R3982O79022J11218q95522r76813J16370J230217J339214
36374a215931O71315P479m89815j100975j570129j187979R996Q86239N31883n00162
36364c958079q86971k32296N73470O80539L08997J79799M18056N02570J23528
36355b290387l55412l66621J58757O91185O81336J81899j94963r20M86512O03145
36345d05469J21964n17025q04339p13381n61230n45538n75829m53114j10303K87504
36335d276760M85424M24349K77426J17497k13740o65896o99511Q2091J163629
36326c305491J542264R48990J30064j78179m7555K5047j74654m80454n99293l00521
$$ y = [-4020566, -3427373, -2599554, -1448698, -297784, 433193, 611842, 252102, -691319, -1996944, -2913619, -2819637, -2140615, -2029397, -2924919, -3901732, -3785362, -2555145, -1215931, -544616, -537137, -1026952, -2127927, -3698056, -4886035, -4876039, -3989800, -3457917, -3958079, -4845050, -5077346, -4503876, -3823337, -3514340, -3334541, -2916485, -2413915, -2290387, -2645799, -3012420, -2853663, -2162478, -1481142, -1299243, -1494206, -1495126, -1008614, -405469, -283505, -800530, -1604869, -2318250, -2879480, -3425018, -4000847, -4453961, -4564264, -4276760, -3791336, -3366987, -3089561, -2972064, -3185804, -3851700, -4551211, -4469120, -3305491, -1763227, -814237, -684173, -862352, -909907, -884860, -1059514, -1539968, -2139261, -2439782]
36316b439782L29950P62844N23070j81499p51314j008839j118009q45385J72727
36307d556237J366425J543968O30571k1170L52230P40398Q6147q70207p47316
36298a475191K09638M84396l86654j257076j178461n34229r3394O7584K64149
36289c899238N06169N39621K53545j65859l28487K5480O00952P49014L36465n5586
36279a437924j26241l56451r80489j289922p85523j71705j47134r8556O27248
36270d766697J042201m6893j537495j193850Q26615J977923J169627J86645M86885
36261a855039R73219L07358o55919n35872R1876j56004r88644j051336k31632
36252d101993M52808O84285Q70011Q26713J05663p22409p02081j25784L478j95099
$$ y = [-2439782, -2109832, -1346988, -823918, -1005417, -1756731, -2765570, -3883579, -4728964, -4556237, -3189812, -1645844, -1015273, -1036443, -684213, 56185, 142332, -727875, -1475191, -1265553, -781157, -1167811, -2424887, -3603348, -4137577, -4230971, -4163387, -3899238, -3393069, -2853448, -2599903, -2765762, -3094249, -3068769, -2467817, -1718803, -1382338, -1437924, -1564165, -1920616, -2901105, -4191027, -4976550, -5148255, -5295389, -5393945, -4766697, -3724496, -3771389, -5308884, -6502734, -5676119, -3698196, -2528569, -2341924, -1855039, -881820, -574462, -1230381, -1766253, -1674377, -1830381, -2819025, -3870361, -4101993, -3649185, -2964900, -2094889, -1268176, -1162513, -1884922, -2587003, -2712787, -2709309, -2904408]
36242b904408J38487O55705J36905j182809j595830o02804L07596K13857K04931
36233d628370J196851J989869J038572r69793j957323j286990k45043P0717j7673
36224d809183K40140Q86615J460525J628933J264171L61251p76101j528725j463662
36215b736036q15937k88391k84711m25794l0433Q95883J486454J073148Q7681
36206a038136n18979m74615k42726j11121M4225J46070j22865n99749o31878m7299
36196c597073N24383N85968L97267L48734L26285Q5261k75817n85305q59845j002584
36186d052726p76391l50189k50407m71330l62082K21949N03100P4673k84464J22037
36176e625830O68281M45898j72774k13986J89713J37314k84602p1949Q17394J126348
$$ y = [-2904408, -2765921, -2110216, -1973311, -3156120, -4751950, -5354754, -5047158, -4833301, -4628370, -3431519, -1441650, -403078, -1372871, -3330194, -4617184, -4862227, -4791510, -4809183, -4569043, -3682428, -2221903, -592970, 671201, 1032452, 256351, -1272374, -2736036, -3551973, -3840364, -4125075, -4550869, -4581302, -3685419, -2198965, -1125817, -1038136, -1557115, -2031730, -2274456, -2385577, -2341352, -2195282, -2318147, -2917896, -3549774, -3597073, -3072690, -2486722, -2089455, -1740721, -1414436, -1329175, -1604992, -2190297, -3050142, -4052726, -4829117, -5179306, -5429713, -5901043, -6263125, -6041176, -5538076, -5463403, -5747867, -5625830, -4957549, -4511651, -4684425, -4898411, -4708698, -4571384, -4855986, -4927935, -4110541, -2984193]
36166b984193K54638p32739p14054r3123L3745m70211q35149o31978j77694Q2137
36156f268621m976l42986n95924l10179N63610J387891J414153N70672n14651
36147d101011j113481q74220Q461Q51105R66137L65664k22233k47246L6929R1041
36137d238854j12239k09860j04587j3689J7465J63576L64900K58737k74257p69165
36127d917973n94959L41760J398249J736187J130234K34910r5230K34943N06363
36118b5516J61163m77214o89975l21206Q2040q492n27969r59112q65986k96666
36108c928933K53902L40705N3101j49498q2238j9864j64570l17312k87318k38166
36098d540191l08448k35379K50084R12904J269074J118402N34808l01616r01755
$$ y = [-2984193, -2729555, -3462294, -4176348, -4269471, -4235726, -4705937, -5541086, -6173064, -6350758, -6268621, -6273597, -6616583, -7212507, -7522686, -6959076, -5571185, -4157032, -3586360, -4101011, -5214492, -6088712, -6080251, -5229146, -4263009, -3897345, -4119578, -4366824, -4329895, -4238854, -4351093, -4560953, -4665540, -4679229, -4661764, -4498188, -4133288, -3874551, -4148808, -4917973, -5512932, -5171172, -3772923, -2036736, -906502, -671592, -766822, -531879, -25516, 135647, -341567, -1031542, -1352748, -1270708, -1279200, -1807169, -2766281, -3632267, -3928933, -3675031, -3334326, -3281225, -3430723, -3512961, -3532825, -3697395, -4014707, -4302025, -4540191, -4848639, -5084018, -4833934, -3921030, -2651956, -1533554, -998746, -1300362, -2202117]
36089b202117o09529M64157J139250N81153l95416l96279M89040Q70473K16630
36080A57362n10135o12798o50560j043784r99993J20892J337463J203161j06315
36071a104707j063916q74109j73174K50511L69027M06773K97275n1501m99622
36062b443443q56065r26136m51355M84961J132067Q29571L4549j69947L61691
36053b004107O07868n5369q99974r27402k37159K79795J65871k85840o67157q32669
36043d856143p16048k25535N68332J314818J532110R58062q8385p93686o15425
36034b921900P1816M65226M12767M74768Q66887J017826M79979l12986o33277
36025g8894l48236J97369P34105J016461O60835l35658j204905j192615n79391
$$ y = [-2202117, -2811646, -2347489, -1208239, -627086, -1022502, -1418781, -929741, -59268, 157362, -352773, -965571, -1616131, -2659915, -3659908, -3539016, -2201553, -998392, -1104707, -2168623, -3042732, -3215906, -2965395, -2596368, -2189595, -1892320, -1943821, -2443443, -3299508, -4225644, -4676999, -4192038, -3059971, -2230400, -2195851, -2365798, -2004107, -1396239, -1451608, -2351582, -3278984, -3516143, -3236348, -3070477, -3356317, -4023474, -4856143, -5572191, -5797726, -5229394, -3914576, -2382466, -1424404, -1512789, -2306475, -2921900, -2850084, -2384858, -1972091, -1497323, -630436, 387390, 867369, 554383, -78894, -427130, -229761, 504344, 1520805, 2181640, 1845982, 641077, -551538, -1130929]
36016a130929l02861o58559j010910q07388k57940J40006K22183Q5054j71369
36007c892713l64593k29227K21814N68218M70888J13311q7114n6837o2850j94933
35997c514036j92672J00325M04843M01208K60819L56060M84334j1036j070931
35988b781086j510353m52364J231397J806588Q82867k27949m49689j74289j64366
35979a839244k89574j17640Q3214j02014k79415J06686N63392J00976j142096
35970b915715j888092j401432k68482O13248R55999Q24997L32956r4210R1192
35961c749539P16636Q86086K11145n45842m94797K21590P47197N88345o0495p27872
35951b207546r89119o42053P2738O07480O94606N64581M20647Q3510n42493j007926
$$ y = [-1130929, -1433790, -2092349, -3103259, -3910647, -4168587, -4028581, -3806398, -3721344, -3892713, -4257306, -4486533, -4264719, -3696501, -3225613, -3112302, -3199416, -3256253, -3319103, -3514036, -3706708, -3606383, -3201540, -2800332, -2539513, -2183453, -1699119, -1710155, -2781086, -4291439, -4743803, -3512406, -1705818, -822951, -1050900, -1500589, -1674878, -1839244, -2128818, -2246458, -2163244, -2265258, -2544673, -2437987, -1874595, -1773619, -2915715, -4803807, -6205239, -6473721, -5860473, -4904474, -4079477, -3746521, -3840731, -3749539, -3032903, -2146817, -1935672, -2481514, -2976311, -2754721, -2007524, -1419179, -1479674, -2207546, -3196665, -3838718, -3765980, -3158500, -2463894, -1899313, -1478666, -1395156, -1937649, -2945575]
35941b945575p56208J21728R03528R71213L80708k28007k50031K21164M16945
35932a164535j76322j063601j341995q96710l66935L70N96592J383080J546325
35923a483731P30673k19160m33052k29370l51345o02180k51073N41853P83641
35914a513744J20075o76779q64940o29043n44403p02244p08603k70265M35541
35905e354405Q78485O93047J74964J6438L51885M84444m1901n98141l71685L01397
35895c465472M08095j54638m99405k72787j67084o11653r77811o22574J33854
35886f229475P09195J170097J673471J666222O26214p81995j317474q06340k23813
35877c513898j36693o8534L38399N28758O323o43790n08259K99351Q50312P63249
$$ y = [-2945575, -3701783, -3580055, -2676527, -1705314, -1324606, -1552613, -1802644, -1581480, -1164535, -1340857, -2404458, -3746453, -4643163, -5010098, -5009728, -4413136, -3030056, -1483731, -753058, -972218, -1405270, -1634640, -1985985, -2588165, -2839238, -2297385, -1513744, -1393669, -2070448, -2935388, -3564431, -4108834, -4811078, -5519681, -5789946, -5354405, -4475920, -3782873, -3607909, -3591471, -3239586, -2755142, -2797043, -3395184, -3766869, -3465472, -3057377, -3212015, -3711420, -3984207, -4151291, -4762944, -5740755, -6363329, -6229475, -5520280, -4350183, -2676712, -1010490, -384276, -1166271, -2483745, -3290085, -3513898, -3650591, -3719125, -3380726, -2851968, -2845645, -3489435, -3997694, -3698343, -2848031, -2084782]
35867b084782N39917N47826M77184M1566m67109o88392p06359o59338l62654J97929
35857c164212M97143K03362j46701Q7549N87174O10271K75007K71511M53766l1378
35847c56508j068323j382415n46135J29735m04573j178028o47751Q98120J772308
35838b783570J300528M24533J2192j24498l46826m55777k48208r380n5451l18222
35828b604679n99316p64612o18145j01859L66262L09743p2482j74879Q5427K67897
35818c906643K40611K51466K35020j06635n44505n34855j91420q9927j31060K57249
35808d520699P51277L65489o78279q89240Q5522O34380k54211j198331o06937
35799f311029P21973R70617K47424J24390Q00435Q85446l3898o75559l00137J49956
$$ y = [-2084782, -1544865, -997039, -519855, -478289, -945398, -1633790, -2340149, -2999487, -3362141, -3164212, -2667069, -2463707, -2610408, -2522859, -1935685, -1325414, -1050407, -778896, -325130, -356508, -1424831, -2807246, -3353381, -3223646, -3628219, -4806247, -5453998, -4555878, -2783570, -1483042, -1058509, -1046317, -1170815, -1517641, -1973418, -2221626, -2231006, -2286457, -2604679, -3203995, -3968607, -4586752, -4688611, -4322349, -4012606, -4085088, -4259967, -4174540, -3906643, -3666032, -3414566, -3179546, -3286181, -3830686, -4365541, -4556961, -4646888, -4777948, -4520699, -3769422, -3403933, -4082212, -4971452, -4885930, -4251550, -4505761, -5704092, -6311029, -5589056, -4618439, -4371015, -4246625, -3446190, -2560744, -2594642, -3270201, -3570338, -3420382]
35789c420382j56596n41732j20567P02718J038514R10462Q49863P45439J05996
35780A13715q67227j340941r11208l7545N55230N78323L55389M42146Q99500R91798
35770G79180O0905j306007j685778o36663O25213Q13149J62419j77196K14887
35761a149891P54671Q82266N79423j5569p86487j368622j269214m48166N30664
35752b290925J027017Q27788J89438l91644n20536k35983N0944O0867r7001k78179
35742a658214n48155q02328n61418L58649J273624J327301O00787q7823l88949
35733d86526p06494j213696j373576q04089J4681M27648N43417Q56364J212898
35724a529373R13943j09561r26927p52219K2879M04013J01609k91106l09459j67550
$$ y = [-3420382, -3576978, -4118710, -4239277, -3536559, -2498045, -1587583, -737720, 7719, 113715, -753512, -2094453, -3005661, -3043206, -2487976, -1909653, -1554264, -1112118, -212618, 779180, 840085, -465922, -2151700, -2788363, -2163150, -1350001, -1187582, -1364778, -1149891, -395220, 487046, 1066469, 1050900, 264413, -1104209, -2373423, -2821589, -2290925, -1263908, -436120, -246682, -638326, -1158862, -1394845, -1343901, -1283034, -1380035, -1658214, -2206369, -3008697, -3570115, -3211466, -1937842, -610541, -9754, -97577, -486526, -1193020, -2406716, -3780292, -4584381, -4569700, -4142052, -3598635, -2742271, -1529373, -615430, -724991, -1651918, -2404137, -2381258, -1977245, -1875636, -2166742, -2476201, -2643751]
35714b643751j56652j00307K09297M96271M27043K09258J92025J53222l06268
35705a519862q31852o33051K40118Q42395P54548O05013P80915O44579k46373
35696F36430j065048q66486j07040J45420j0017L37520J056065R83281q9076r25950
35686I5099q05667n99326j129484j643269j015486L39566R75216M37623l16974
35677c662702m03768K4843L38583K25498j76968m30041o1751Q57960J488633J064902
35667g34811j01302r74748j070545q01268n97827l65196L1218L55199L94298L41144
35657c523838M61548O60678O40989L13508j10056l00614n8333M21084N52959n9940
35647a002015j032781j498774j063759j68083N33474Q06042P76150O09077M26350
$$ y = [-2643751, -2800403, -2900710, -2691413, -2195142, -1768099, -1558841, -1366816, -1213594, -1519862, -2351714, -2984765, -2744647, -1902252, -1147704, -542691, 238224, 882803, 636430, -428618, -1295104, -1402144, -1256724, -1266741, -929221, 126844, 1110125, 1021049, 95099, -710568, -1309894, -2439378, -4082647, -5098133, -4758567, -3783351, -3345728, -3662702, -4066470, -4041627, -3703044, -3477546, -3654514, -4084555, -4146306, -3288346, -1799713, -734811, -836113, -1810861, -2881406, -3682674, -4280501, -4645697, -4614479, -4259280, -3864982, -3523838, -3062290, -2401612, -1760623, -1447115, -1557171, -1857785, -1916118, -1495034, -942075, -1002015, -2034796, -3533570, -4597329, -4765412, -4231938, -3425896, -2649746, -2040669, -1614319]
35638a614319L09151K49605K29812L03905M01586K25922k84288n87324j78992
35629i44942N30350O62576J66308j40233O7093J33029l46917p42262m54303L0358
35619a038943m7610m71330n09788j92534j61396m66795m54464J34225P35107P64949
35609a708579K80075k60947m57959j97725K06931K24762k01063m48719j27632
35600b690856K51425J43592o448M72987J114014Q90834j2390l47101J88270M70742
35590D75069j13660o14041j20243P32185Q06344J35240m44056o57115p92836q28463
35580a421576n31603j30533l3051j20633n5143J0198k26371m74712k69460J23302
35570c129582O6032l51571m31813m280L93952M52310L89047K96571q926l92043
$$ y = [-1614319, -1305168, -1055563, -825751, -521846, -120260, 105662, -178626, -765950, -944942, -414592, 247984, 414292, 274059, 341152, 474181, 127264, -614998, -1069301, -1038943, -1086553, -1557883, -2067671, -2260205, -2421601, -2888396, -3342860, -3208635, -2473528, -1708579, -1428504, -1689451, -2147410, -2345135, -2138204, -1913442, -2114505, -2563224, -2690856, -2439431, -2295839, -2302287, -1829300, -715286, 175548, 163158, -183943, 4327, 475069, 361409, -252632, -372875, 359310, 1165654, 1300894, 856838, 199723, -593113, -1421576, -1953179, -2083712, -2116763, -2237396, -2292539, -2282341, -2508712, -2983424, -3252884, -3129582, -3063550, -3415121, -3846934, -3851214, -3457262, -3004952, -2615905, -2319334, -2328260, -2720303]
35560b720303m17394r0413J34582J66983L13764L96167k28328j419938j945603
35551e810483j015343N39069J263987P86662o4608m40425j74961M14888Q72702
35542c628512Q59155M56149J20917J20936K35302J96480P5837j8393k10373m76041
35532b268543m15051J41662O61252N73832J24232q703K58562L74673O8333k93324
35522g83075l40202k11962k56168m96100n53530l9471R07815J458038Q17875o56430
35512a53210j533760r42402L02896Q15802M48108J18894J42196r8504p13293p86878
35502b400151J55157J171547J174066M14908j41805l08233n43952p77289m84564
35493a740316J77223M09246N1366j72805O5704J49725l23827p34735m37112J68747
$$ y = [-2720303, -3137697, -3228110, -3093528, -2926545, -2612781, -2216614, -2444942, -3864880, -5810483, -6825826, -6286757, -5022770, -4236108, -4300716, -4741141, -4916102, -4501214, -3628512, -2769357, -2313208, -2192291, -2071355, -1836053, -1639573, -1563736, -1582129, -1792502, -2268543, -2683594, -2541932, -1880680, -1306848, -1182616, -1191319, -932757, -558084, -489751, -783075, -1123277, -1335239, -1591407, -2087507, -2641037, -2680508, -1772693, -314655, 503220, -153210, -1686970, -2629372, -2326476, -1510674, -1062566, -943672, -801476, -899980, -1613273, -2400151, -2244994, -1073447, 100619, 515527, 373722, 65489, -478463, -1255752, -1740316, -1563093, -1153847, -1102481, -1275286, -1209582, -1059857, -1383684, -2118419, -2555531, -2386784]
35483b386784L35345J60691K07345L60196P1130m57191m10674K36349N09214l7415
35473a411794n22184n8476Q67321J093253L85486m38944p45426o81868n89970
35464b102602m84715k66560K62J92490K56331J82143M4873m880l355k34259p04128
35453c124400q15054q1856R91084J399622R85301N75682O40188N73478k66160
35444H77885j424650j850282j181384k0096Q41770J015934N49618j57471n57081
35435a905757m41785j47966j4900J17523N00316Q39808O25549k0746m10673k35662
35425a094293R0381J49681P6499J77155M08742N19070M33405K64589J29339R7118
35415A251686J24882j4394m50710q26383o12352N0813L54182k8662l51138R3933
$$ y = [-2386784, -2051439, -1890748, -1683403, -1323207, -1252077, -1709268, -2119942, -1883593, -1374379, -1411794, -1933978, -1992454, -1125133, -31880, 353606, -85338, -830764, -1512632, -2102602, -2587317, -2853877, -2853615, -2661125, -2404794, -2222651, -2177778, -2182658, -2186013, -2420272, -3124400, -3939454, -4021310, -3030226, -1630604, -645303, -69621, 570567, 1144045, 877885, -546765, -2397047, -3578431, -3598527, -2756757, -1740823, -1191205, -1348676, -1905757, -2347542, -2495508, -2510408, -2392885, -1892569, -1052761, -427212, -447958, -858631, -1094293, -1003912, -854231, -777732, -600577, -191835, 327235, 760640, 1025229, 1154568, 1251686, 1376568, 1362174, 911464, 85081, -527271, -476458, -122276, -150938, -502076, -408143]
35405d08143P40515M47133p43109j458852q25850L34466N91831l20706j360952
35396c003667j519381p74311K09111Q61317J053570R09088N01226j45099p47617
35387b655763p46605K4739P97005O23046k29474m22275N22898J284114N44816
35378b57499r47960j325724k78921O00406K80906l22027j3290Q55136J169538
35369b39435P79935L53935R0338k97354o45171m92382n4467k0677l76442m09113
35359a310833N722J23397l68191p10404k56724M73257N92229J68594J4280L93012
35349h75661O27858O4647r97540j540134r13144L83267J109989N86755n67283
35340b121246j193562q73659r5154N90500R71515Q79179K58195l80329l38506
$$ y = [-408143, 332372, 779505, 36396, -1422456, -2248306, -1913840, -1322009, -1642715, -3003667, -4523048, -5297359, -5088248, -4226931, -3173361, -2264273, -1763047, -1908146, -2655763, -3402368, -3377629, -2580624, -1957578, -2187052, -2609327, -2086429, -802315, -257499, -1205459, -2531183, -2810104, -2209698, -1928792, -2250819, -2264109, -1408973, -239435, 540500, 894435, 984773, 687419, 42248, -450134, -504601, -525278, -901720, -1310833, -1305111, -1181714, -1549905, -2260309, -2517033, -2043776, -1451547, -1282953, -1268673, -875661, -247803, -183156, -1180696, -2720830, -3633974, -3250707, -2140718, -1553963, -2121246, -3314808, -4188467, -4283621, -3693121, -2721606, -1842427, -1584232, -1964561, -2303067]
35331b303067K15870L21555l35068q16557k59588Q78079J503171J269018O33975
35322A107388P359m76918o77880n96654n54231o65612m57103L95249J285458J331000
35312F98056N56774k61670o91208q25924o06674J31856R42893R94108K05014n79125
35302E64100p56476o15182n64280m33482K5196M88494M49672l6520m39793m44903
35292a763174k35468j36346j75675o7527L31062N90885O6219j108997j809745
35283d308766j223686l3220M28958J5274j44380N66033J348618J255732M87395
35274a608042j71422n25190q29400r33244m14342N29591J039294N99645l19828
35265b632938p75794l00811O94032J331857J108340L84167o1063L8672K30501
$$ y = [-2303067, -2087197, -1765642, -2100710, -2917267, -3176855, -2298776, -795605, 473413, 1107388, 1114747, 637829, -40051, -636705, -1190936, -1856548, -2313651, -1918402, -632944, 698056, 1254830, 993160, 301952, -523972, -1130646, -998790, -55897, 938211, 1143225, 564100, -192376, -807558, -1371838, -1805320, -1780124, -1291630, -841958, -878478, -1318271, -1763174, -1998642, -2134988, -2310663, -2378190, -2047128, -1456243, -1390024, -2499021, -4308766, -5532452, -5565672, -5136714, -5121440, -5265820, -4699787, -3351169, -2095437, -1608042, -1779464, -2304654, -3134054, -4067298, -4481640, -3952049, -2912755, -2313110, -2632938, -3408732, -3709543, -3015511, -1683654, -575314, -191147, -252210, -213538, 16963]
35256A6963J35792J635J41593K31878k64798j122519j423225p38684K48243N94234
35246b178888K29705j46816j17450K3301m8039j00182J75196M85357L41859j8001
35236a353958J34569P69836R10860Q9218p98714p55168j31707N9077k43115k98654
35226a617756j8065k7443l24142j59485M91944O22936j27406o77886j73154N77841
35216a432616L45627o00464r63187l63277L18120L76063M4721k01293k50545j23881
35206b850732J69776L79632J72788k98864m71742j59801J59262L4296l18142k85887
35196c469414L79645J203676J373306N67096n54702r17622k30302O71732Q77137
35187i9448M21444o0167k80603l80908l74868j46573J27259J37243l3412p0224
$$ y = [16963, 152755, 154390, 295983, 527861, 263063, -859456, -2282681, -3021365, -2773122, -2178888, -1949183, -2095999, -2213449, -2190148, -2238187, -2338369, -2163173, -1677816, -1335957, -1353958, -1219389, -449553, 461307, 550525, -248189, -1003357, -1135064, -1075987, -1319102, -1617756, -1635821, -1663264, -1987406, -2146891, -1654947, -1032011, -1159417, -1837303, -2010457, -1432616, -1086989, -1687453, -2650640, -3013917, -2695797, -2319734, -2275013, -2476306, -2726851, -2850732, -2680956, -2301324, -2128536, -2427400, -2899142, -3058943, -2899681, -2865385, -3183527, -3469414, -3089769, -1886093, -512787, 54309, -500393, -1418015, -1648317, -976585, -99448, 321996, 261829, -18774, -399682, -774550, -921123, -793864, -656621, -690033, -760257]
35177g60257m1640k84466p02533p89564m24237m9077Q9098K84974O97348Q67299
35167a113055L39488n66294j036250o84626J03260O68637O95136L70776J08940
35158a113988J35050K95947K56750j56131q20910j407369j526928r84295o7125
35149e388999N69558N54582K42268K66441P36425J126036R15190J24921p37790
35140a591368j089845p22666l1166L22991J47770n8395J89628P09975R99097R39317
35130a84662P46900M65260K9830l17940k58901k247q8804n15815o00014Q5387
35120f41006J045000J368840O70468n94787j530373j475788n36357M89744Q63531
35111c40728N48203q424m80506p43932o20681n4061N56333O86337L41706k4429
$$ y = [-760257, -801897, -1086363, -1788896, -2578460, -3002697, -3051774, -2962676, -2677702, -1980354, -1113055, -773567, -1339861, -2376111, -3060737, -2957477, -2288840, -1593704, -1222928, -1113988, -978938, -682991, -426241, -582372, -1403282, -2810651, -4337579, -5321874, -5388999, -4819441, -4264859, -4022591, -3756150, -3019725, -1893689, -978499, -853578, -1591368, -2681213, -3403879, -3435045, -3112054, -2964284, -3022679, -2833051, -2123076, -1123979, -184662, 562238, 1027498, 1057328, 739388, 480487, 478240, 389436, -126379, -726393, -641006, 403994, 1772834, 2443302, 1848515, 318142, -1157646, -1694003, -1204259, -340728, 207475, 199051, -281455, -1025387, -1646068, -1700129, -1143796, -457459, -115753, -140182]
35101a40182j79588k64363l58263l66272k91977j88199N5068M14631M43918j07129
35091i82356o08454k89486M61101M88268l78102r87932n63707K59453N38470K63022
35081a799723q3981l85732o11537l75486M19080J002055O19249l34350p94731
35072b345156m06589K25602M66571K39216j54837k90768J24516P97679R15687
35063d28079J79016n42446k38875P80643J220279N45166l77948n66454j80016
35054C91286j00848o50850j178091q80871J93113J092459R59281J1700p07090
35045h69911o02823j85983k25843o40966p02129j38776M93369N68505Q6403m99184
35035b717338q19497p74639l82207L00931J057286J446552J094466J66885o26201
$$ y = [-140182, -319770, -584133, -942396, -1308668, -1600645, -1788844, -1733776, -1319145, -875227, -982356, -1590810, -1880296, -1419195, -930927, -1309029, -2296961, -2860668, -2601215, -2062745, -1799723, -1883704, -2269436, -2880973, -3256459, -2837379, -1835324, -1216075, -1550425, -2345156, -2751745, -2526143, -2059572, -1820356, -1975193, -2265961, -2141445, -1343766, -428079, -249063, -791509, -1030384, -249741, 970538, 1515704, 1137756, 571302, 391286, 290438, -360412, -1538503, -2419374, -2226261, -1133802, -174521, -162821, -869911, -1472734, -1658717, -1884560, -2525526, -3227655, -3366431, -2873062, -2304557, -2218154, -2717338, -3536835, -4311474, -4693681, -4392750, -3335464, -1888912, -794446, -627561, -1253762]
35026a253762p43323l89434q2174J60484O77923J289275J247962K87239q58052
35017C36138j285009q58284r8290L99868K32229n81382j340185j170342j08329
35008d473586Q38854R87531P08316N48405L86973j3550l43234k92999j47151j65805
34998a966246q95N54356Q69873L52132n54195j049558j053766p58833J03629J419558
34988b083945J899864O29568j097486j169831L20233J186741L51071q48863r56668
34979a769316k96896J75874M50780Q73154J092066O56393p7616n05699o37178
34970c8438p06663n60502j00072K66497K47992J56621J88081j19665j017604j748610
34960c432363j421050k77576O16280O67355K03652p1634L23611J219587J678108
$$ y = [-1253762, -1997085, -2386519, -2468693, -2308209, -1630286, -341011, 906951, 1194190, 336138, -948871, -1807155, -1905445, -1505577, -1273348, -1854730, -3194915, -4365257, -4473586, -3634732, -2647201, -1938885, -1390480, -1003507, -1017057, -1360291, -1653290, -1800441, -1966246, -1967141, -1412785, -542912, -190780, -744975, -1794533, -2848299, -3607132, -3503503, -2083945, -184081, 445487, -651999, -1821830, -1501597, -314856, 36215, -812648, -1769316, -2066212, -1890338, -1439558, -566404, 525662, 1182055, 1104439, 598740, -38438, -745101, -1305603, -1405675, -1139178, -891186, -734565, -546484, -666149, -1683753, -3432363, -4853413, -5130989, -4514709, -3847354, -3643702, -3715336, -3391725, -2172138, -494030]
34951d94030Q70602o46781j301941n49682L70644L03722k29117j88858K33183
34942a632258K33626j7007K05568O83361O08381J24988Q1119L84847R9447p45440
34932B6632r38709m2619Q08973O41676j1770j96816L0414O0744j58039k99974
34922g9488l90779n97208p00492m48388r8369k5318r4683L4372K75149L10066
34912a815138J52181j3407l06328r18735j567248j701825j181614l22888N79508
34903g095494J319720J536456R91336J03246l30647o2360L78089M62060K36484
34894b461110O034r6549j2692L32440P15427N90694k05244r83038q94612R797
34884b998853Q24550Q38962J82944n21266p51055l39343M21830Q73261O17893
$$ y = [-494030, 376572, -270209, -1572150, -2121832, -1751188, -1447466, -1676583, -1865441, -1632258, -1398632, -1415639, -1210071, -526710, 81671, 206659, 287778, 672625, 772072, 26632, -912077, -954696, -145723, 495953, 484183, 287367, 317781, 378525, 220486, -79488, -470267, -1067475, -1767967, -2216355, -2314724, -2340042, -2434725, -2400353, -2125204, -1815138, -1662957, -1676364, -1982692, -2901427, -4468675, -6170500, -7352114, -7675002, -7095494, -5775774, -4239318, -3247982, -3144736, -3475383, -3537743, -3159654, -2697594, -2461110, -2455076, -2551625, -2564317, -2231877, -1516450, -925756, -1131000, -2114038, -3008650, -2998853, -2174303, -1335341, -1152397, -1673663, -2424718, -2764061, -2342231, -1468970, -851077]
34875h51077J24954J91918O95068N74071n79636j670697j521090n23655O1950
34866c498194L1438K59156R01502R44628l6178q91363n09112M63452N52909l83482
34856b165244j028357n19161M91711Q98477N29301P9812P6236L34754L82629J46534
34846g73308M8023L75089P56103N78331j26338o67425o52356m32577l83774l34140
34836a612372r5432L6216j22062q5969N20173J080329P67316q1761l75616L2930
34826F3752J47170m86832r70472m52644N18200P68341P6695p51609j044694p83153
34816b915246j46999P15252J389200J293075L78230o29366r97243p69713m77171
34807b159981k63914K05794R32456J235664O20124l80738p83600l98811J12751
$$ y = [-851077, -726123, -534205, 160863, 734934, 155298, -1515399, -3036489, -3560144, -3498194, -3466756, -3207600, -2306098, -1361470, -1397648, -2289011, -2798123, -2334671, -1781762, -2165244, -3193601, -3712762, -3221051, -2322574, -1793273, -1713461, -1637225, -1302471, -919842, -773308, -725285, -350196, 405907, 984238, 857900, 190475, -461881, -894458, -1278232, -1612372, -1707804, -1671588, -1793650, -1879619, -1359446, -279117, 488199, 406438, 30822, 63752, 210922, -275910, -1246382, -1699026, -1180826, -412485, -335790, -1087399, -2132093, -2915246, -3062245, -2346993, -957793, 335282, 713512, 84146, -913097, -1682810, -2159981, -2423895, -2218101, -1285645, -49981, 570143, 189405, -594195, -993006, -880255]
34798h80255L28231M47802N04655Q3544p53118j070949k75952Q62153J134031
34789C80142M11171m59887q77944q42555m44257J56160M49419P8322n24435o89120
34779b362984m51109k14844J40759Q72958J428951J033956M9426m64908m45214
34770d13009p45343j362825j284271l97825M6675m85370q02699N0918J199865
34761d193884J395488Q82188N87966M86894J15104j34974L06420Q34148M69214
34752G48564m06048n64023P4331L92074p0107n93922o70514n91676m73980N4429
34742b100872Q57657J103156N04178j86219l27117j70085j04714M514K58390K99185
34732A38073j5456j96062P9199L45126P2656n05316q23359p91258o58907m64904
$$ y = [-880255, -552024, -104222, 400433, 483977, -269141, -1340090, -1616042, -753889, 380142, 791313, 331426, -546518, -1389073, -1833330, -1677170, -1227751, -1149429, -1673864, -2362984, -2814093, -3028937, -2888178, -2015220, -586269, 447687, 497113, 32205, -413009, -1158352, -2521177, -3805448, -4203273, -4156598, -4641968, -5444667, -5393749, -4193884, -2798396, -1916208, -1328242, -841348, -726244, -861218, -554798, 279350, 748564, 342516, -221507, -147176, 244898, 174791, -419131, -1089645, -1681321, -2155301, -2100872, -1243215, -140059, 364119, 177900, -149217, -319302, -424016, -419502, -161112, 138073, 122617, -73445, 5754, 350880, 423536, -81780, -905139, -1696397, -2355304, -2820208]
34722b820208j28174K11501L85749M71508N26204L63050n7904l48066j86287J99043
34712a383584M07919M19185L92908K70563K2998k9777L07884N59639J24681p36044
34702C56372j109492o81920j62617k24489n49563l67379L48647P62029K95623
34693a332789n40314p26177K8854R68679J235704P86330J59744l40845p99554
34684e60368j150442j034289l62996L58436N49790K02305j96663k45318K7682
34675b411863K90919K54285n2710l05781k58290k6080J52574L04903N52744O51335
34665h47964J90914o40656r96533l59175P63780J421745J201584L70625n87116
34656E17204j190036j054868l25129J56170l05244j211898j249727Q5368J709666
$$ y = [-2820208, -2948382, -2736881, -2351132, -1879624, -1353420, -990370, -1048274, -1396340, -1582627, -1383584, -975665, -556480, -163572, 106991, 129989, 100212, 408096, 967735, 1092416, 356372, -753120, -1435040, -1597657, -1822146, -2371709, -2739088, -2390441, -1628412, -1332789, -1873103, -2599280, -2570426, -1601747, -366043, 420287, 580031, 239186, -560368, -1710810, -2745099, -3108095, -2749659, -2199869, -1997564, -2194227, -2439545, -2411863, -2120944, -1866659, -1919369, -2225150, -2483440, -2509520, -2356946, -2052043, -1499299, -847964, -657050, -1297706, -2294239, -2653414, -1889634, -467889, 733695, 1104320, 517204, -672832, -1727700, -2052829, -1896659, -2201903, -3413801, -4663528, -4578160, -2868494]
34647b868494K167417J306110K52296j53437k69814p54852j304375r84401K63067
34638b346483J216151Q49036l21307r30464m87490K65788N87876N84977O75707
34629I3791Q53054Q26235M81871j16348q69317j503677j578367r26708P8511Q70300
34619a790655J112287P45757j6338o29988n97223j12172J01020j89908l90411
34610a767631q2460K45858J5134m36706l88278Q7748L07391J68056K93554R08698
34600f48636J342235R41971n1654q53415j000997o50784k87011l02680o48771
34591b159742q16428l87288L79577P68400M26126k98260q14038q04511l29337
34582d035501K43941M19087K9459m69547m79213J1441N08803P13897O86062M25983
$$ y = [-2868494, -701077, 605033, 857329, 703892, 434078, -320774, -1625149, -2609550, -2346483, -1130332, -281296, -602603, -1533067, -2020557, -1754769, -1166893, -581916, 93791, 946845, 1773080, 2254951, 2138603, 1269286, -234391, -1812758, -2739466, -2660955, -1790655, -678368, 67389, 51051, -578937, -1176160, -1288332, -1187312, -1377220, -1767631, -1850091, -1604233, -1589099, -2025805, -2414083, -2326335, -2018944, -1850888, -1557334, -648636, 693599, 1635570, 1583916, 730501, -270496, -921280, -1208291, -1510971, -2159742, -2976170, -3363458, -2983881, -2215481, -1789355, -2087615, -2901653, -3706164, -4035501, -3791560, -3372473, -3343014, -3812561, -4291774, -4280333, -3771530, -3057633, -2371571, -1945588]
34572a945588r4984m90707k39511M36571O54014Q9602n43569n75123k45379l7581
34562b992255J55197N30904O48350N8205p03084o67174J57832P95454P09441L68835
34552i38295K76452K41713n1161m05734m81011l49897k89201l35145l74471l90563
34542c097313l35684m8340M18700O72247M77958J23227q835N2488J01070J87423
34532a457059M06597N27316L21477N1286Q1876J76170j67715p27765o74282J45982
34522a316117P93108N03935k65278o34833o16989q69304j399527j386122m06491
34513e597618Q49324J412841J136185O07894K67011l225m65929j016034j196914
34504d006465p03761J76972P52982O65035L23877L94762R23912J272453R27546
$$ y = [-1945588, -2040572, -2531279, -2770790, -2334219, -1680205, -1590603, -2134172, -2709295, -2954674, -2992255, -2837058, -2306154, -1657804, -1599599, -2302683, -2969857, -2812025, -2016571, -1307130, -938295, -661843, -420130, -471291, -877025, -1358036, -1707933, -1997134, -2332279, -2706750, -3097313, -3432997, -3481337, -3062637, -2390390, -1912432, -1789205, -1798040, -1745552, -1644482, -1457059, -1050462, -523146, -201669, -150383, -68507, 107663, -60052, -787817, -1462099, -1316117, -523009, -19074, -284352, -919185, -1536174, -2405478, -3805005, -5191127, -5597618, -4748294, -3335453, -2199268, -1591374, -1324363, -1327588, -1793517, -2809551, -4006465, -4710226, -4533254, -3780272, -3115237, -2791360, -2396598, -1472686, -200233, 727313]
34495G27313O8626p47042j143591j025710m44513L43662Q66227Q03400L54538
34486a97090K6709M1639J15642r8830m59059m08302K74304R52653P43923k53870
34476G37719q31454j79396Q91074R40538j02250q46550m36191L47265M42369Q0754
34466A043878J83685P55789Q65835Q3082r17097j285507r33808l96379j91715
34457g92237m38504q04753p98472l19697J89174L77275N00616Q96037J222938
34448C2377Q51356q4915o73655l63437L96151P83919M64973k72637q65618q91369
34438f22855m56877j63694l82848p12247n67888q5064J73639K15025N24759J015584
34428a062466R63221J80434n93730p95422p42201q45824q73513n03244K8260L68981
$$ y = [727313, 795939, 48897, -1094694, -2120404, -2564917, -2221255, -1355028, -551628, -197090, -170381, -128742, -13100, -111930, -570989, -979291, -704987, 247666, 991589, 737719, -93735, -273131, 617943, 1558481, 1456231, 609681, 173490, 520755, 963124, 1043878, 1227563, 1983352, 2849187, 2932269, 2015172, 729665, -204143, -600522, -792237, -1230741, -2035494, -2833966, -3153663, -2964489, -2587214, -2086598, -1190561, 32377, 883733, 798818, 125163, -238274, 157877, 941796, 1406769, 1134132, 268514, -622855, -1079732, -1243426, -1626274, -2338521, -2906409, -2991473, -2817834, -2602809, -2078050, -1062466, -99245, 81189, -512541, -1307963, -2050164, -2895988, -3769501, -4272745, -4244485, -3875504]
34418c875504N84462P44311N44960j11938p11258q54535q38427r09459n85188
34409f012576M77448J494046J423743N12245k1854L09327Q14772Q35342M87667
34400C20160J10298k09023l84931l17973k74453o18593j046974q08559J17497
34391c112551P95278N94509J0262j69937Q6839L20251L72490L63549K33269j06488
34381f12529l59578j35561L99069O26443K86242j98043l34048k00434k16322m15863
34371a160624l12674L72199J121788J121381K77549o62931j059340r85011p40554
34362b028217l21994K42546N39430L13848j9038j3921K1834l89218q59934o15529
34352c130193J27042K92266m05811r45627m89346M68721R35660O96616K21130
$$ y = [-3875504, -3291042, -2546731, -2001771, -2113709, -2824967, -3679502, -4517929, -5427388, -6012576, -5535128, -4041082, -2617339, -2105094, -2126948, -1817621, -1002849, -167507, 320160, 430458, 221435, -163496, -481469, -755922, -1374515, -2421489, -3230048, -3112551, -2317273, -1722764, -1712502, -1882439, -1795600, -1475349, -1102859, -739310, -506041, -612529, -972107, -1107668, -708599, -82156, 204086, 6043, -328005, -528439, -744761, -1160624, -1473298, -1101099, 20689, 1142070, 1419619, 756688, -302652, -1287663, -2028217, -2350211, -2107665, -1568235, -1254387, -1273425, -1287346, -1265512, -1654730, -2514664, -3130193, -3003151, -2710885, -3116696, -4062323, -4551669, -4082948, -3147288, -2450672, -2229542]
34343b229542j17067j52856K64474R75732J327586Q19701k21642r62677q86595
34334a182886j25382P03132Q25384n5408j202797j425145n15367M37503N31402
34325b009564J77465J87357M19867J93187m04716o03417j93108K34960L13061
34316a684908L26006M50761L25454k63977q09063o46695J30851O82377L29709
34307a159485o50057j209729o40025N15483R79349L04034n51440n52789K8731
34298b935928J96667k33230n55938m61414l90777m81639j64777P33849J344580
34289b948607R10650j1683l35241m1125m0757n24567n06684N81662J718834J520789
$$ y = [-2229542, -2346609, -2499465, -2234991, -1259259, 68327, 888028, 666386, -296291, -1182886, -1308268, -605136, 220248, 164840, -1037957, -2463102, -2978469, -2540966, -2009564, -1832099, -1644742, -1224875, -1031688, -1436404, -2039821, -2232929, -1997969, -1684908, -1358902, -908141, -582687, -846664, -1655727, -2302422, -2171571, -1489194, -1159485, -1809542, -3019271, -3659296, -3143813, -2164464, -1860430, -2411870, -2964659, -2935928, -2739261, -2972491, -3528429, -3989843, -4380620, -4862259, -5027036, -4293187, -2948607, -2037957, -2049640, -2384881, -2426006, -2466763, -2991330, -3498014, -2916352, -1197518, 323271]
$$ [...]
##END NTUPLES=NMR SPECTRUM
##END=
