##TITLE=31Pdec_LR-784-R3-CR11
 CDCl3, 24 sc
 10.2.2025
##JCAMPDX= 6.0         $$ Bruker NMR JCAMP-DX V2.0
##DATA TYPE= NMR SPECTRUM
##DATA CLASS= NTUPLES
##ORIGIN= UXNMR, Bruker Analytische Messtechnik GmbH
##OWNER= root
$$ XWIN-NMR		Version 3.5
$$ Mon Feb 10 13:54:29 2025 Russian Standard Time (UT+4h)  she@DPX200
##.OBSERVE FREQUENCY= 81.013821
##.OBSERVE NUCLEUS= ^31P
##.ACQUISITION MODE= SIMULTANEOUS
##.ACQUISITION SCHEME= undefined
##.AVERAGES= 24
##.DIGITISER RES= 17
##SPECTROMETER/DATA SYSTEM= spect
##.PULSE SEQUENCE= zgpg30
##.SOLVENT NAME= CDCl3
##.SHIFT REFERENCE= (INTERNAL, CDCl3, 0, 198.062)
##AUDIT TRAIL= $$ (NUMBER, WHEN, WHO, WHERE, WHAT)
$$ ##TITLE= Audit trail, XWIN-NMR		Version 3.5
$$ ##JCAMPDX= 5.01
$$ ##ORIGIN= Bruker BioSpin GmbH
$$ ##OWNER= she
$$ F:/spectra/data/she/nmr/P31/2/pdata/1/auditp.txt
$$ ##AUDIT TRAIL=  $$ (NUMBER, WHEN, WHO, WHERE, WHAT)
(   1,<2025-02-10 13:53:19.92 +0400>,<she>,<DPX200>,
      <created by zg, POWCHK disabled, PULCHK disabled
       configuration hash MD5:
       00 E9 B6 7A A2 85 ED C7 34 08 36 98 17 FE 4E 26
       data hash MD5: 32K
       12 58 54 E8 5C A6 E2 BC 4A 3C FB 9E C7 C7 82 2E>)
(   2,<2025-02-10 13:53:27.12 +0400>,<she>,<DPX200>,
      <Start of raw data processing
       efp BC_mod = 2 LB = 1.5 FT_mod = 6 PKNL = 1 PHC0 = 1774.703 PHC1 = 70.09534 SI = 64K 
       data hash MD5: 64K
       75 9F 1E D7 7F F2 5D F4 D6 BB CE 17 3D D1 C5 0C>)
(   3,<2025-02-10 13:53:45.79 +0400>,<she>,<DPX200>,
      <pk PHC0 = 1.334276 PHC1 = 0 
       data hash MD5: 64K
       5F C5 20 CB 74 18 D2 C9 BB 74 3A 7F 48 4D A5 A1>)
(   4,<2025-02-10 13:53:54.48 +0400>,<she>,<DPX200>,
      <abs ABSG = 5 
       data hash MD5: 64K
       2D 4F 1A 4C 4C 44 C7 EB 5D 57 0B 2E B5 D7 2A 58>)
$$ ##END=
$$ 
$$ hash MD5
$$ 9A 24 81 7C 29 99 56 B8 78 EB E7 F0 19 A1 39 9C
##$RELAX= 
##$RELAX= 
##$RELAX= 
##$RELAX= 
##$RELAX= 
##$RELAX= 
##$RELAX= 
##$RELAX= 
$$ Bruker specific parameters
$$ --------------------------
##$DU= <F:/spectra>
##$EXPNO= 2
##$NAME= <P31>
##$PROCNO= 1
##$TYPE= <nmr>
##$USER= <she>
##$AMP= (0..31)
100 100 100 100 100 100 100 100 100 100 100 100 100 100 100 100 100 100 
100 100 100 100 100 100 100 100 100 100 100 100 100 100 
##$AQSEQ= 0
##$AQ_mod= 1
##$AUNM= <au_zg>
##$AUTOPOS= <>
##$BF1= 81.014009
##$BF2= 200.13
##$BF3= 200.13
##$BF4= 200.13
##$BF5= 200.13
##$BF6= 200.13
##$BF7= 200.13
##$BF8= 200.13
##$BYTORDA= 1
##$CFDGTYP= 0
##$CFRGTYP= 5
##$CHEMSTR= <none>
##$CNST= (0..31)
1 1 145 1 1 1 1 1 1 1 1 1 1 1 1 1 1 1 1 1 1 1 1 1 1 1 1 1 1 1 1 1 
##$CPDPRG= <waltz16>
##$CPDPRG1= <>
##$CPDPRG2= <waltz16>
##$CPDPRG3= <>
##$CPDPRG4= <mlev>
##$CPDPRG5= <mlev>
##$CPDPRG6= <mlev>
##$CPDPRG7= <mlev>
##$CPDPRG8= <mlev>
##$CPDPRGB= <>
##$CPDPRGT= <>
##$D= (0..31)
0 1 0 0 0 0 0 0 0 0.06 0 0.03 2e-05 3e-06 0 0 0.0002 0 0 0 0 0 0 0 0 0 
0 0 0 0 0 0 
##$DATE= 1739181199
##$DBL= (0..7)
120 120 120 11 120 120 24 19 
##$DBP= (0..7)
150 150 150 150 150 150 150 150 
##$DBP07= 0
##$DBPNAM0= <>
##$DBPNAM1= <>
$$ [...]
##$SUBNAM3= <"">
##$SUBNAM4= <"">
##$SUBNAM5= <"">
##$SUBNAM6= <"">
##$SUBNAM7= <"">
##$SUBNAM8= <"">
##$SUBNAM9= <"">
##$SW= 400.765351723535
##$SWIBOX= (0..15)
0 1 3 0 0 0 0 0 0 0 0 0 0 0 0 0 
##$SW_h= 32467.5324675325
##$TD= 32768
##$TD0= 1
##$TE= 0
##$TE2= 300
##$TE3= 300
##$TEG= 300
##$TL= (0..7)
0 120 53 12 22 120 120 120 
##$TP= (0..7)
150 150 150 150 150 150 150 150 
##$TP07= 0
##$TPNAME0= <>
##$TPNAME1= <>
##$TPNAME2= <>
##$TPNAME3= <>
##$TPNAME4= <>
##$TPNAME5= <>
##$TPNAME6= <>
##$TPNAME7= <>
##$TPOAL= (0..7)
0.5 0.5 0.5 0.5 0.5 0.5 0.5 0.5 
##$TPOFFS= (0..7)
0 0 0 0 0 0 0 0 
##$TUNHIN= 0
##$TUNHOUT= 0
##$TUNXOUT= 0
##$USERA1= <user>
##$USERA2= <user>
##$USERA3= <user>
##$USERA4= <user>
##$USERA5= <user>
##$V9= 5
##$VALIST= <valist>
##$VCLIST= <CCCCCCCCCCCCCCC>
##$VD= 0
##$VDLIST= <DDDDDDDDDDDDDDD>
##$VPLIST= <PPPPPPPPPPPPPPP>
##$VTLIST= <TTTTTTTTTTTTTTT>
##$WBST= 1024
##$WBSW= 4
##$XGAIN= (0..3)
0 0 0 0 
##$XL= 0
##$YL= 0
##$YMAX_a= 8212
##$YMIN_a= -7371
##$ZGOPTNS= <>
##$ZL1= 120
##$ZL2= 120
##$ZL3= 120
##$ZL4= 120
##$ABSF1= 198.0616
##$ABSF2= -202.7028
##$ABSG= 5
##$ABSL= 3
##$ALPHA= 0
##$AQORDER= 0
##$ASSFAC= 0
##$ASSFACI= 0
##$ASSFACX= 0
##$ASSWID= 0
##$AUNMP= <proc_1d>
##$AZFE= 0.1
##$AZFW= 0.5
##$BCFW= 0
##$BC_mod= 2
##$BYTORDP= 0
##$COROFFS= 0
##$CY= -3
##$DATMOD= 1
##$DC= 0
##$DFILT= <>
##$DTYPP= 0
##$F1P= 0
##$F2P= 0
##$FCOR= 1
##$FTSIZE= 65536
##$FT_mod= 6
##$GAMMA= 0
##$GB= 0
##$INTBC= 1
##$INTSCL= 9.790993e-09
##$ISEN= 30
##$LB= 1.5
##$LEV0= 0
##$LPBIN= 0
##$MAXI= 10000
##$MC2= 0
##$MEAN= 0
##$ME_mod= 0
##$MI= 50
##$NCOEF= 0
##$NC_proc= -7
##$NLEV= 6
##$NOISF1= 182.463
##$NOISF2= 159.3651
##$NSP= 0
##$NTH_PI= 0
##$NZP= 0
##$OFFSET= 198.0616
##$PC= 4
##$PHC0= 1776.037
##$PHC1= 70.09534
##$PH_mod= 1
##$PKNL= yes
##$PPARMOD= 0
##$PSCAL= 0
##$PSIGN= 0
##$REVERSE= no
##$SF= 81.0140089999434
##$SI= 65536
##$SIGF1= 159.3651
##$SIGF2= -187.1042
##$SINO= 113.3802
##$SIOLD= 16384
##$SREGLST= <1H.CDCl3>
##$SSB= 0
##$STSI= 65536
##$STSR= 0
##$SW_p= 32467.5324675325
##$SYMM= 0
##$S_DEV= 0
##$TDeff= 32768
##$TDoff= 0
##$TI= <>
##$TILT= no
##$TM1= 0
##$TM2= 0
##$TOPLEV= 0
##$USERP1= <user>
##$USERP2= <user>
##$USERP3= <user>
##$USERP4= <user>
##$USERP5= <user>
##$WDW= 1
##$XDIM= 65536
##$YMAX_p= 282566841
##$YMIN_p= -7280413
$$ End of Bruker specific parameters
$$ ---------------------------------
##NTUPLES= NMR SPECTRUM
##VAR_NAME=  FREQUENCY,     SPECTRUM/REAL,   SPECTRUM/IMAG
##SYMBOL=    X,             R,               I
##VAR_TYPE=  INDEPENDENT,   DEPENDENT,       DEPENDENT
##VAR_FORM=  AFFN,          ASDF,            ASDF
##VAR_DIM=   65536,         65536,           65536
##UNITS=     HZ,            ARBITRARY UNITS, ARBITRARY UNITS
##FACTOR=    0.49542278885378, 1,            1
##FIRST=     16045.7642231865, 0,            0
##LAST=      -16421.768244346, 0,            0
##MIN=       -16421.768244346, -7280413,     0
##MAX=       16045.7642231865, 282566841,    0
$$ Real data points
##PAGE= N=1
##DATA TABLE= (X++(R..R)), XYDATA
$$ [...]
$$ plain form
44297 -724045 -938156 -1098114 -1415548 -1564244 -1042328 13832 794155 696166 -77440 -918189
44287 -918189 -1486038 -1777193 -1787482 -1430834 -727269 149608 998771 1652113 2008870 2172666
44277 2172666 2440415 2904047 3115921 2479731 1063049 -296489 -899617 -908991 -836878 -587448
44267 -587448 381501 1920400 2903447 2489806 1193679 143600 -407171 -1144132 -2376830
44258 -2376830 -3431831 -3563843 -2863101 -1937514 -1173021 -656773 -405626 -265799 57132
44249 57132 455135 276417 -743634 -1721102 -1487359 -148179 890583 599722 -499529
44240 -499529 -1085295 -584402 328225 601695 -74341 -1045234 -1498886 -1347548 -1087903 -879751
44230 -879751 -314626 664791 1271278 935645 374171 708892 1760611 2214017 1483213
$$ packed form
44297g24045k14111j59958l17434j48696N21916J056160P80323r7989p73606q40749
44287i18189n67849k91155j0289L56648P03565Q76877Q49163O53342L56757J63796
44277B172666K67749M63632K11874o36190j416682j359538o03128r374P2113K49430
44267e87448R68949J538899R83047m13641j296127j050079n50771p36961j232698
44258b376830j055001j32012P00742R25587P64493N16248K51147J39827L22931
44249E7132L98003j78718j020051r77468K33743J339180J038762k90861j099251
44240d99529n85766N00893R12627K73470o76036r70893m53652J51338K59645K08152
44230h79751N65125R79417O06487l35633n61474L34721J051719M53406p30804
$$ plain form
44221 1483213 382703 -268178 -657930 -1142711 -1381784 -1037001 -570710 -517500 -534685 -45138
44211 -45138 606719 562983 -211833 -854333 -756738 -60121 879371 1740310 2015500 1369252
44201 1369252 323596 -130534 234348 658593 513773 -11988 -507386 -944541 -1418870
44192 -1418870 -1847578 -2198548 -2540605 -2711669 -2507597 -2320695 -2820620 -3707831 -3653528 -2057609
44182 -2057609 -104676 686410 341414 -15878 28441 -85894 -548697 -740107 -368068
44173 -368068 -105118 -606439 -1488974 -1795206 -1166969 -188196 270076 -164899 -1064790 -1534034
44163 -1534034 -1010782 152486 1037521 1122296 739511 585323 976157 1607231 1861425
44154 1861425 1353165 317781 -589471 -1005272 -1188719 -1447981 -1562466 -1211712 -702070
$$ packed form
44221A483213j100510o50881l89752m84781k39073L44783M66291N3210j7185M89547
44211d5138O51857m3736p74816o42500R7595O96617R39492Q60939K75190o46248
44201A369252j045656m54130L64882M24245j44820n25761m95398m37155m74329
44192a418870m28708l50970l42057j71064K04072J86902m99925q87211N4303J595919
44182b057609J952933P91086l44996l57292M4319j14335m62803j91410L72039
44173c68068K62950n01321q82535l06232O28237R78773M58272m34975q99891m69244
44163a534034N23252J163268Q85035Q4775l82785j54188L90834O31074K54194
44154A861425n08260j035384r07252m15801j83447k59262j14485L50754N09642
$$ plain form
44145 -702070 -617389 -830974 -583971 339869 1198392 1294382 797420 272288 -42389 -137315
44135 -137315 12258 133718 -383385 -1640699 -2739015 -2753413 -1921440 -1231503 -1039147
44126 -1039147 -799029 -134947 552876 793107 836746 1338016 2403837 3275852 3093649
44117 3093649 1964195 1073676 1435210 2596707 3080289 2200223 838281 140655 163421
44108 163421 355918 640977 1096344 1104714 17201 -1488382 -1899252 -845308 469124
44099 469124 1017368 1057624 1116010 959096 262059 -557585 -957265 -1095079 -1329109 -1469731
44089 -1469731 -1242092 -920647 -719460 -121625 1220391 2361698 1996117 381673 -789831
44080 -789831 -579143 130913 21107 -1090983 -2475465 -3542557 -4102277 -4049765 -3379616
$$ packed form
44145g02070Q4681k13585K47003R23840Q58523R5990m96962n25132l14677r4926
44135a37315J49573J21460n17103j257314j098316j4398Q31973O89937J92356
44126a039147K40118O64082O87823K40231M3639N01270J065821Q72015j82203
44117C093649j129454q90519L61534J161497M83582q80066j361942o97626K2766
44108A63421J92497K85059M55367Q370j087513j505583m10870J053944J314432
44099D69124N48244M0256N8386j56914o97037q19644l99680j37814k34030j40622
44089a469731K27639L21445K01187N97835J342016J141307l65581j614444j171504
44080g89831K10688P10056j09806j112090j384482j067092n59720N2512O70149
$$ plain form
44071 -3379616 -2370037 -1428756 -819513 -574724 -431014 117829 1267499 2345292 2343880
44062 2343880 1237803 262329 523320 1712726 2583335 2389726 1459828 570824 196131
44053 196131 319822 688806 1189028 1988241 3151308 4154456 4195228 3150877 1810769
44044 1810769 885830 209394 -694025 -1659235 -2066955 -1747553 -1108208 -448382 282924
44035 282924 1020299 1395074 1175560 556281 -79522 -394567 -106496 823999 1911926
44026 1911926 2430616 2138776 1448530 791118 174337 -490641 -1012987 -1138947 -879996
44017 -879996 -409336 104478 372811 48937 -778274 -1473245 -1619003 -1612260 -2041183 -2721176
44007 -2721176 -2931824 -2482835 -1879473 -1407648 -779955 75857 580983 330136 -176955
$$ packed form
44071c379616J009579R41281O09243K44789J43710N48843J149670J077793j412
44062B343880j106077r75474K60991J189406Q70609j93609r29898q89004l74693
44053A96131J23691L68984N00222P99213J163067J003148M0772j044351j340108
44044A810769r24939o76436r03419r65210m07720L19402O39345O59826P31306
44035B82924P37375L74775k19514o19279o35803l15045K88071R30495J087927
44026A911926N18690k91840o90246o57412o16781o64978n22346j25960K58951
44017h79996M70660N13814K68333l23874q27211o94971j45758O743m28923o79993
44007b721176k10648M48989O03362M71825O27693Q55812N05126k50847n07091
$$ plain form
43998 -176955 -198511 227503 515034 480989 397926 302601 12599 -222252 93042 743081
43988 743081 892241 452938 491626 1649197 2887588 2696644 1126095 -326540 -660291
43979 -660291 -245180 245029 758033 1374890 1742131 1585059 1257626 1187084 1127584 566233
43969 566233 -324110 -734051 -235699 695314 1272154 1188973 699047 158668 -282934 -596609
43959 -596609 -680991 -432201 -33896 13773 -618905 -1630559 -2344562 -2391343 -1887150 -1020691
43949 -1020691 107522 1178802 1692506 1562220 1269332 1120148 737005 -324834 -1795588
43940 -1795588 -3000744 -3708349 -4160846 -4424805 -4256204 -3596302 -2738187 -1972161 -1433828
43931 -1433828 -1245269 -1356354 -1273465 -485952 720462 1383176 1026535 301718 200378
$$ packed form
43998a76955k1556M26014K87531l4045q3063r5325k90002k34851L15294O50039
43988G43081J49160m39303L8688J157571J238391j90944j570549j452635l33751
43979f60291M15111M90209N13004O16857L67241j57072l27433p0542n9500n61351
43969E66233q90343m09941M98352R31013N76840q3181m89926n40379m41602l13675
43959e96609q4382K48790L98305M7669o32678j011654p14003m6781N04193Q66459
43949a020691J128213J071280N13704j30286k92888j49184l83143j061839j470754
43940a795588j205156p07605m52497k63959J68601O59902Q58115P66026N38333
43931a433828J88559j11085Q2889P87513J206414O62714l56641p24817j01340
$$ plain form
43922 200378 949859 1940398 2448392 2141180 1120317 -166368 -1130144 -1425389 -1147196
43913 -1147196 -594782 534 408934 313281 -431261 -1523176 -2415319 -2771398 -2607515
43904 -2607515 -2081045 -1340400 -578511 -58347 25049 -288609 -723765 -999672 -1111639 -1298384
43894 -1298384 -1630783 -1771821 -1384577 -703069 -369889 -665546 -1217515 -1567143 -1685756
43885 -1685756 -1748461 -1721223 -1457540 -986199 -429228 179192 721197 846939 357597 -373600
43875 -373600 -731774 -576765 -280478 -55077 350672 1138466 1984030 2352155 2129758 1680222
43865 1680222 1300096 848033 18068 -1104572 -1910595 -1797201 -836150 183511 455559
43856 455559 -126313 -968844 -1408374 -1275729 -920073 -773794 -871815 -789990 -170744 678299
$$ packed form
43922B00378P49481R90539N07994l07212j020863j286685r63776k95245K78193
43913a147196N52414N95316M08400r5653p44542j091915q92143l56079J63883
43904b607515N26470P40645P61889N20164Q3396l13658m35156k75907j11967j86745
43894a298384l32399j41038L87244O81508L33180k95657n51969l49628j18613
43885a685756o2705K7238K63683M71341N56971O08420N42005J25742m89342p31197
43875c73600l58174J55009K96287K25401M05749P87794Q45564L68125k22397m49536
43865A680222l80126m52063q29965j122640q06023J13394R61051J019661K72048
43856D55559n81872q42531m39530J32645L55656J46279r8021Q1825O19246Q49043
$$ plain form
43846 678299 949050 249276 -884719 -1643826 -1863635 -1880333 -1697813 -994804 -50747 127732
43836 127732 -871416 -1986673 -1895824 -835452 -328798 -1068006 -1987014 -1832374 -860228
43827 -860228 -272089 -499977 -929374 -1088134 -1156818 -1204486 -809672 154014 993607 945485
43817 945485 33980 -1195869 -2349932 -3145997 -3176064 -2347388 -1301338 -789175 -803425
43808 -803425 -863473 -907641 -1211700 -1589322 -1488201 -911028 -456049 -314653 -23722 542854
43798 542854 757153 260586 -294093 -100554 720065 1470878 1889346 2211544 2519307 2567690
43788 2567690 2095223 959653 -747226 -2413217 -3177352 -2907016 -2428253 -2305693 -1983091
43779 -1983091 -819397 623078 1277630 1130883 999749 1035393 687897 111850 256087
$$ packed form
43846F78299K70751o99774j133995p59107k19809j6698J82520P03009R44057J78479
43836A27732r99148j115257R0849J060372N06654p39208r19008J54640R72146
43827h60228N88139k27888m29397j58760o8684m7668L94814R63686Q39593m8122
43817I45485r11505j229849j154063p96065l0067Q28676J046050N12163j4250
43808h03425o0048m4168l04059l77622J01121N77173M54979J41396K90931N66576
43798E42854K14299m96567n54679J93539Q20619P50813M18468L22198L07763M8383
43788B567690m72467j135570j706879j665991p64135K70336M78763J22560L22602
43779a983091J163694J442475O54552j46747j31134L5644l47496n76047J44237
$$ plain form
43770 256087 1253594 1970081 1674392 1034212 802529 613818 -11257 -426630 194589 1310113
43760 1310113 1669989 1208555 1021385 1511968 1800025 1247788 500640 456004 958271 1173899
43750 1173899 825795 458853 672269 1517223 2559178 3251758 3326090 2994506 2696652
43741 2696652 2591221 2489667 2319514 2295659 2455359 2418550 1977853 1624673 1975800 2800951
43731 2800951 3194315 2795633 2282383 2350970 2675200 2390546 1363348 350170 -121269
43722 -121269 -402073 -984064 -1646003 -1844463 -1648800 -1676395 -2148124 -2561652 -2401058 -1705599
43712 -1705599 -783658 193394 1073806 1588335 1636180 1440728 1200290 918370 817485 1440929
43702 1440929 2845338 4052745 3954569 2619091 1109527 127411 -473990 -850799 -705573
$$ packed form
43770B56087R97507P16487k95689o40180k31683j88711o25075m15373O21219J115524
43760A310113L59876m61434j87170M90583K88057n52237p47148m4636N02267K15628
43750A173899l48104l66942K13416Q44954J041955O92580P4332l31584k97854
43741B696652j05431j01554j70153k3855J59700l6809m40697l53180L51127Q25151
43731B800951L93364l98682n13250O8587L24230k84654j027198j013178m71439
43722a21269k80804n81991o61939j98460J95663k7595m71729m13528J60594O95459
43712a705599R21941R77052Q80412N14529M7845j95452k40438k81920j00885O23444
43702A440929J404409J207407r8176j335478j509564r82116o01401l76809J45226
$$ plain form
43693 -705573 -13944 480286 91521 -837213 -1322652 -924850 -114439 434371 548318 585606
43683 585606 1015434 1920264 2764917 2826517 2045797 1219860 1067913 1345712 1272801 636234
43673 636234 -34215 -306683 -294695 -185214 124072 663915 1113488 1212559 1118321 1004303
43663 1004303 627233 -212960 -956638 -641086 877984 2512618 3054905 2467274 1770175
43654 1770175 1799304 2436342 3069438 3398688 3505343 3372799 2800285 1853381 1013624 630744
43644 630744 448283 -54122 -982172 -1942547 -2505939 -2486818 -1932203 -1212824 -977499 -1481908
43634 -1481908 -1986927 -1472616 -108791 696625 109797 -954748 -1113396 -385461 130340
43625 130340 125852 489241 1683826 2760966 2573186 1332531 305947 279076 885034
$$ packed form
43693g05573O91629M94230l88765r28734m85439L97802Q10411N48810J13947L7288
43683E85606M29828R04830Q44653O1600p80720q25937j51947K77799p2911o36567
43673F36234o70449k72468J1988J09481L09286N39843M49573R9071r4238j14018
43663A004303l77070q40193p43678L15552J519070J634634N42287n87631o97099
43654A770175K9129O37038O33096L29250J06655j32544n72514r46904q39757l82880
43644F30744j82461n02405r28050r60375n63392J9121N54615P19379K35325n04409
43634a481908n05019N14311J363825Q05416n86828j064545j58648P27935N15801
43625A30340m488L63389J194585J077140j87780j240655j026584k6871O05958
$$ plain form
43616 885034 1314330 1217966 885698 814910 1182005 1693795 2008013 2210288 2599048 3042611
43606 3042611 3012013 2397925 1820017 1833582 2242991 2559136 2747282 3054287 3369004 3247575
43596 3247575 2448280 1116580 -314739 -1081465 -381795 1653486 3557893 3836744 2608705
43587 2608705 1284661 710595 442500 -72208 -534576 -451338 -35351 141097 -46897
43578 -46897 -346329 -673485 -1084297 -1427523 -1509761 -1485289 -1672844 -2037062 -2162843 -1707931
43568 -1707931 -682940 583168 1540734 1680987 1026255 255742 35430 284629 387015
43559 387015 59773 -322725 -303541 64035 342251 256178 -44300 -236345 -241253 -316794
43549 -316794 -690162 -1175364 -1333278 -1035447 -655719 -574967 -666045 -458175 262392 1166062
$$ packed form
43616H85034M29296r6364l32268p0788L67095N11790L14218K02275L88760M43563
43606C042611l0598o14088n77908J3565M09409L16145J88146L07005L14717j21429
43596C247575p99295j331700j431319p66726O99670K035281J904407K78851j228039
43587B608705j324044n74066k68095n14708m62368Q3238M15987J76448j87994
43578d6897k99432l27156m10812l43226q2238K4472j87555l64218j25781M54912
43568a707931J024991J266108R57566J40253o54732p70513k20312K49199J02386
43559C87015l27242l82498J9184L67576K78216q6073l00478j92045m908p5541
43549c16794l73368m85202j57914K97831L79728Q0752r1078K07870P20567R03670
$$ plain form
43539 1166062 1665471 1418726 618368 -164134 -506047 -539037 -712592 -1142541 -1396233 -1020912
43529 -1020912 -108964 790735 1197248 1043258 646282 439477 601905 873538 862222 565606
43519 565606 394943 627525 1073743 1399026 1543109 1655237 1793124 1864857 1780321 1564025
43509 1564025 1370604 1345250 1347544 972875 121481 -652672 -811941 -683163 -998689 -1662089
43499 -1662089 -1800795 -1192664 -706752 -908251 -1153722 -772052 -335095 -797953 -1909887
43490 -1909887 -2509809 -2134052 -1385965 -862817 -611555 -568319 -650573 -392225 663686 2089928
43480 2089928 2845013 2551028 1811476 1169052 526487 -187357 -556014 -283447 294863
43471 294863 683871 810952 898170 1139369 1649630 2323336 2666692 2245548 1341680 634503
$$ packed form
43539A166062M99409k46745q00358p82502l41913l2990j73555m29949k53692L75321
43529a020912R11948Q99699M06513j53990l96976k06805J62428K71633j1316k96616
43519E65606j70663K32582M46218L25283J44083J12128J37887P1733q4536k16296
43509A564025j93421k5354K294l74669q51394p74153j59269J28778l15526o63400
43499a662089j38706O08131M85912k01499k45471L81670M36957m62858j111934
43490a909887n99922L75757P48087N23148K51262M3236q2254K58348J055911J426242
43480B089928P55085k93985p39552o42424o42565p13844l68657K72567N78310
43471B94863L89008J27081Q7218K41199N10261O73706L43356m21144r03868p07177
$$ plain form
43461 634503 256321 -148879 -436614 56514 1326406 2435728 2831732 3026057 3452125
43452 3452125 3588855 2970983 2224075 2115216 2190570 1451400 43342 -818387 -537274
43443 -537274 188549 441794 57136 -595622 -1123170 -1225214 -808365 -121371 589303 1507538
43433 1507538 2863901 4208251 4678909 4073102 3082220 2332844 1765112 1192145 900297
43424 900297 1222229 1828838 1963229 1371346 660819 597846 1184124 1619095 1245906 377166
43414 377166 -72915 281756 946947 1425533 1895693 2586998 2952996 2212254 599788
43405 599788 -661376 -779986 -186596 308460 537911 723472 683057 -13024 -1184207
43396 -1184207 -1992182 -1975776 -1671557 -1826306 -2316824 -2413492 -2008977 -1862374 -2376027 -2837213
$$ packed form
43461F34503l78182m05200k87735M93128J269892J109322L96004J94325M26068
43452C452125J36730o17872p46908j08859P5354p39170j408058q61729K81113
43443e37274P25823K53245l84658o52758n27548j02044M16849O86994P10674R18235
43433A507538J356363J344350M70658o05807r90882p49376n67732n72967k91848
43424I00297L21932O06609J34391n91883p10527o2973N86278M34971l73189q68740
43414C77166m50081L54671O65191M78586M70160O91305L65998p40742j612466
43405E99788j261164j18610N93390M95056K29451J85561m0415o96081j171183
43396a184207q07975J6406L04219j54749m90518r6668M04515J46603n13653m61186
$$ plain form
43386 -2837213 -2465371 -1662543 -1374022 -1545110 -1285174 -536610 -373299 -1241492 -2004984
43377 -2004984 -1478529 -86023 860240 914020 630069 410991 184032 -1840 57484 236523
43367 236523 288669 436347 1050262 1827948 2000598 1350129 407432 -315285 -690612 -659771
43357 -659771 -209850 326840 523463 400776 243070 34375 -368592 -731378 -770507 -753808
43347 -753808 -1044447 -1318258 -1097826 -801041 -1213671 -2058473 -2234198 -1483334 -660757 -280556
43337 -280556 -36419 98685 -312922 -938342 -733586 199657 320119 -960547 -2054219
43328 -2054219 -1501289 -213307 -36322 -1088613 -2009414 -2082593 -1582060 -581959 970609
43319 970609 2279861 2320158 1376786 677044 596155 549397 552848 1342868 2714668 3250148
$$ packed form
43386b837213L71842Q02828K88521j71088K59936P48564J63311q68193p63492
43377b004984N26455J392506R46263N3780k83951k19078k26959j85872N9324J79039
43367B36523N2146J47678O13915P77686J72650o50469r42697p22717l75327L0841
43357f59771M49921N36690J96623j22687j57706k08695m02967l62786l9129J6699
43347g53808k90639k73811K20432K96785m12630q44802j75725P50864Q22577L80201
43337b80556K44137J35104m11607o25420K04756R33243J20462j280666j093672
43328b054219N52930J287982J76985j052291r20801p3179N00533J000101J552568
43319I70609J309252M0297r43372o99742q0889m6758L451P90020J371800N35480
$$ plain form
43309 3250148 2275873 868054 240994 185993 -119433 -629868 -676837 -166329 307033 302038
43299 302038 -118071 -712333 -1269328 -1563235 -1416785 -825390 6779 648930 622979 -62057
43289 -62057 -703975 -679189 -247298 -26503 85601 619866 1284431 1118786 119898 -441561
43279 -441561 118352 781564 403063 -474220 -442406 702741 1863058 2350693 2576170
43270 2576170 2980628 3273140 3051278 2493786 2064579 1943975 1997796 1973906 1581941 754438
43260 754438 8177 148599 1287223 2401014 2254932 726865 -1075382 -2063317 -2266942
43251 -2266942 -2490493 -3066832 -3390539 -2821691 -1620787 -547254 207301 1041479 1903658
43242 1903658 1962030 685496 -1238123 -2515835 -2492348 -1459642 -119247 807789 793827
$$ packed form
43309C250148r74275j407819o27060n5001l05426n10435m6969N10508M73362m995
43299C02038m20109n94262n56995k93907J46450N91395Q32169O42151k5951o85036
43289f2057o41918K4786M31891K20795J12104N34265O64565j65645r98888n61459
43279d41561N59913O63212l78501q77283L1814J145147J160317M87635K25477
43270B576170M04458K92512k21862n57492m29207j20604N3821k3890l91965q27503
43260G54438p46261J40422J138624J113791j46082j528067j802247r87935k03625
43251b266942k23551n76339l23707N68848J200904J073533P54555Q34178Q62179
43242A903658N8372j276534j923619j277712K3487J032706J340395R27036j3962
$$ plain form
43233 793827 -39687 -805938 -749445 -189995 -38145 -446960 -622651 -106991 441450 161490
43223 161490 -775966 -1365248 -1000351 -58818 702572 950418 874735 744372 572610 210634
43213 210634 -335856 -781289 -798601 -336613 377224 1110723 1782282 2346552 2669952 2588057
43203 2588057 2020044 1024536 -136953 -980221 -1048626 -359778 467297 688234 42898
43194 42898 -1157961 -2419312 -3319941 -3457532 -2531013 -729957 1165958 2398025 2880826
43185 2880826 2991350 2849670 2277499 1499611 1288248 2053868 3222463 3964780 4196653
43176 4196653 4323059 4299953 3679237 2503014 1399954 679806 7398 -835465 -1516287
43167 -1516287 -1737736 -1620586 -1191354 -169566 1282247 2265424 2222117 1753332 1685118
$$ packed form
43233G93827q33514p66251N6493N59450J51850m08815j75691N15660N48441k79960
43223A61490r37456n89282L64897R41533P61390K47846p5683j30363j71762l61976
43213B10634n46490m45433j7312M61988P13837P33499O71559N64270L23400q1895
43203B588057n68013r95508j161489q43268o8405O88848Q27075K20937o45336
43194D2898j200859j261351r00629j37591R26519J801056J895915J232067M82801
43185B880826J10524j41680n72171p77888k11363P65620J168595P42317K31873
43176D196653J26406k3106o20716j176223j103060p20148o72408q42863o80822
43167a516287k21449J17150M29232J021788J451813R83177m3307m68785o8214
$$ plain form
43158 1685118 1841168 1554281 950134 735402 952655 991959 774201 831468 1086369 696276
43148 696276 -452662 -1123835 -308823 1313684 2272105 2132768 1652996 1465582 1445698
43139 1445698 1299304 1051379 817788 588062 414772 509858 972885 1534944 1663926 1001857
43129 1001857 -138738 -782131 -199317 1056401 1488008 352795 -1378470 -2175695 -1697952
43120 -1697952 -855263 -407347 -182709 329961 1227593 2208823 2966690 3403955 3645187
43111 3645187 3842496 3851246 3313769 2295680 1479320 1279524 1144359 408067 -457485 -347180
43101 -347180 787267 1742249 1722704 1194666 721071 -619 -1244108 -2303036 -2404842
43092 -2404842 -1973929 -1929404 -2082031 -1349822 480238 2243876 2858483 2477464 1926299
$$ packed form
43158A685118J56050k86887o04147k14732K17253L9304k17758N7267K54901l90093
43148F96276j148938o71173Q15012J622507R58421j39337m79772j87414j9884
43139A445698j46394k47925k33591k29726j73290R5086M63027N62059J28982o62069
43129A001857j140595o43393N82814J255718M31607j135213j731265p97225M77743
43120a697952Q42689M47916K24638N12670Q97632R81230P57867M37265K41232
43111C645187J97309Q750n37477j018089q16360j99796j35165p36292q65552J10305
43101c47180J134447R54982j9545n28038m73595p21690j243489j058928j01806
43092b404842M30913M4525j52627P32209J830060J763638O14607l81019n51165
$$ plain form
43083 1926299 1682340 1740895 1923559 1950277 1605337 1095867 867838 887884 599245 -127384
43073 -127384 -510102 217386 1725838 2909180 3106892 2617989 2111110 1869637 1615420
43064 1615420 903402 -270610 -1248832 -1357735 -835461 -687455 -1365562 -2030584 -1578869
43055 -1578869 -90631 1283768 1723382 1482659 1275151 1424974 1732252 1789216 1281081
43046 1281081 233787 -931442 -1770926 -2260258 -2678353 -3108826 -3323400 -3136266 -2586931
43037 -2586931 -1770943 -799341 23319 301475 -6982 -436976 -456395 10088 538351 639531
43027 639531 287718 54370 544331 1589836 2273805 1986950 1165777 634138 524142
43018 524142 350526 -99048 -581906 -967428 -1291531 -1293489 -667749 138360 190245 -619027
$$ packed form
43083A926299k43959N8555J82664K6718l44940n09470k28029K0046k88639p26629
43073a27384l82718P27488J508452J183342J97712m88903n06879k41473k54217
43064A615420p12018j174012r78222j08903N22274J48006o78107o65022M51715
43055a578869J488238J374399M39614k40723k07508J49823L07278N6964n08135
43046A281081j047294j165229q39484m89332m18095m30473k14574J87134N49335
43037b586931Q15988R71602Q22660K78156l08457m29994j9419M66483N28263J01180
43027F39531l51813k33348M89961J045505O83969k86855q21173n31639j09996
43018E24142j73616m49574m82858l85522l24103j958O25740Q06109N1885q09272
$$ plain form
43008 -619027 -1281260 -1050254 -383649 -83425 -208789 -386954 -542486 -658389 -372397 469424
42998 469424 1305638 1595131 1613818 1815427 1920109 1513142 1054232 1202330 1497225 1001659
42988 1001659 123818 332574 1788651 2696291 1688436 -320072 -1519630 -1479957 -1037391
42979 -1037391 -681359 -263131 54732 -249291 -1114748 -1788853 -1782117 -1292861 -646518 43227
42969 43227 579452 685396 487847 483522 846998 1234074 1421423 1629199 1967890 2070777
42959 2070777 1655246 1053305 731030 561338 92817 -582799 -785603 -182353 653556
42950 653556 867071 282628 -494934 -808320 -537353 -15229 379642 466071 297180 130114
42940 130114 267363 755022 1273664 1479414 1400038 1275926 1035038 275606 -1044372 -2198680
$$ packed form
43008f19027o62233K31006O66605L00224j25364j78165j55532j15903K85992Q41821
42998D69424Q36214K89493J8687K01609J04682m06967m58910J48098K94895m95566
42988A001659q77841K08756J456077R07640j007855k008508j199558L9673M42566
42979a037391L56032M18228L17863l04023q65457o74105O736M89256O46343O89745
42969D3227N36225J05944j97549m325L63476L87076J87349K07776L38691J02887
42959B070777m15531o01941l22275j69692m68521o75616k02804O03250Q35909
42950F53556K13515n84443p77562l13386K70967N22124L94871Q6429j68891j67066
42940A30114J37249M87659N18642K05750p9376j24112k40888p59432j319978j154308
$$ plain form
42930 -2198680 -2348751 -1538152 -688245 -543325 -897780 -1000740 -502902 209008 508274
42921 508274 145095 -607947 -1240840 -1395887 -1119021 -810087 -834704 -1102946 -1121131 -577374
42911 -577374 209468 608376 404743 -34104 -349403 -611093 -936791 -1004272 -373891 790721
42901 790721 1755179 2036549 1849910 1628917 1428651 998166 218508 -723046 -1459149 -1657000
42891 -1657000 -1287817 -732156 -394159 -221926 35846 125122 -538835 -1760109 -2335287
42882 -2335287 -1521438 -194561 210104 -458280 -1146636 -1277431 -1284903 -1402724 -1053019 28255
42872 28255 929104 594283 -758531 -1942674 -2220022 -1818662 -1279576 -894416 -698945
42863 -698945 -526823 -107683 537408 951757 859361 661869 793534 830852 6638 -1390536
$$ packed form
42930b198680j50071Q10599Q49907J44920l54455j02960M97838P11910K99266
42921E08274l63179p53042o32893j55047K76866L08934k4617k68242j8185N43757
42911e77374P86842L98908k03633m38847l15299k61690l25698o7481O30381J164612
42901G90721R64458K81370j86639k20993k00266m30485p79658r41554p36103j97851
42891a657000L69183N55661L37997J72233K57772Q9276o63957j221274n75178
42882b335287Q13849J326877M04665o68384o88356j30795p472j17821L49705J081274
42872B8255R00849l34821j352814j184143k77348M01360N39086L85160J95471
42863f98945J72122M19140O45091M14349r2396j97492J31665L7318q24214j397174
$$ plain form
42853 -1390536 -1959677 -867561 1022914 2145604 1924585 1026769 290593 11210 195392
42844 195392 894844 1977536 2842962 2770490 1683650 403895 -92757 324100 934507
42835 934507 1214664 1454760 2001906 2350375 1717720 380449 -428186 -146895 378280
42826 378280 195732 -415628 -532036 4739 508464 530752 324872 296132 545657 930857
42816 930857 1128581 721331 -332450 -1423911 -1944049 -2043576 -2213320 -2325049 -1837165
42807 -1837165 -883552 -276758 -252531 -74607 722274 1462081 1263340 276236 -610985 -878625
42797 -878625 -626289 -100327 409179 460664 -129427 -892008 -1224987 -1170109 -1183312 -1294176
42787 -1294176 -1079976 -443703 155921 354534 309317 345778 538480 774809 960794 1063980
$$ packed form
42853a390536n69141J092116J890475J122690k21019q97816p36176k79383J84182
42844A95392O99452J082692Q65426p2472j086840j279755m96652M16857O10407
42835I34507K80157K40096N47146L48469o32655j337271q08635K81291N25175
42826C78280j82548o11360j16408N36775N03725K2288k05880k8740K49525L85200
42816I30857J97724m07250j053781j091461n20138r9527j69744j11729M87884
42807a837165R53613O06794K4227J77924P96881P39807j98741r87104q87221k67640
42797h78625K52336N25962N09506N1485n90091p62581l32979N4878j3203j10864
42787a294176K14200O36273N99624J98613m5217L6461J92702K36329J85985J03186
$$ plain form
42777 1063980 1147170 1361409 1707393 1887967 1659919 1212889 856510 454255 -368351 -1466066
42767 -1466066 -2127569 -1925155 -1210873 -603087 -327667 -253311 -272537 -409351 -716863 -1207458
42757 -1207458 -1741235 -1944404 -1471857 -453849 497294 816183 422337 -328303 -963786
42748 -963786 -1236085 -1325829 -1596769 -1967241 -1790929 -714261 629065 1283866 1096537
42739 1096537 582377 -44402 -856234 -1388113 -955037 5217 72619 -1121240 -2053647
42730 -2053647 -1333615 290470 975704 245926 -721127 -954982 -686742 -475664 -364166
42721 -364166 -177198 50258 235369 372568 371438 197945 178375 636420 1206514 1112719
42711 1112719 267203 -486189 -433365 245383 1035676 1857781 2808744 3515593 3361656 2361739
$$ packed form
42777A063980Q3190K14239L45984J80574k28048m47030l56379m02255q22606j097715
42767a466066o61503K02414P14282O07786K75420P4356j9226j36814l07512m90595
42757a207458n33777k03169M72547J018008R51143L18889l93846p50640o35483
42748i63786k72299q9744k70940l70472J76312J076668J343326O54801j87329
42739A096537n14160o26779q11832n31879M33076R60254O7402j193859r32407
42730b053647P20032J624085O85234p29778r67053k33855K68240K11078J11498
42721c64166J86968K27456J85111J37199j130j73493j9570M58045N70094r3795
42711A112719q45516p53392N2824O78748P90293Q22105R50963P06849j53937r99917
$$ plain form
42701 2361739 1376279 1238099 1824609 2234844 1916501 1342503 1274104 1558432 1272790 175090
42691 175090 -712216 -431410 612579 1349505 1511911 1533301 1379038 610987 -437831
42682 -437831 -729119 -46959 546798 214941 -578584 -1006241 -1075780 -1257744 -1614289 -2020047
42672 -2020047 -2673863 -3594158 -4030460 -3216902 -1496573 21650 745825 866387 539752
42663 539752 -387357 -1791187 -3077606 -3734295 -3645219 -2876546 -1666574 -621572 -335316
42654 -335316 -697144 -1068690 -1202359 -1405300 -1688954 -1484745 -587773 255563 302046 -78913
42644 -78913 40666 691232 877218 -1225 -1276351 -1891455 -1648053 -1105447 -580172 108954
42634 108954 931719 1335929 942398 124283 -488076 -789103 -1057382 -1246873 -956339 -99302
$$ packed form
42701B361739r85460j38180N86510M10235l18343n73998o8399K84328k85642j097700
42691A75090q87306K80806J043989P36926J62406K1390j54263p68051j048818
42682d37831k91288O82160N93757l31857p93525m27657o9539j81964l56545m05758
42672b020047o53816r20295m36302Q13558J720329J518223P24175J20562l26635
42663E39752r27109j403830j286419o56689Q9076P68673J209972J045002K86256
42654c35316l61828l71546j33669k02941k83654K04209Q96972Q43336M6483l80959
42644g8913J19579O50566J85986q78443j275126o15104K43402N42606N25275O89126
42634A08954Q22765M04210l93531q18115o12359l01027k68279j89491K90534Q57037
$$ plain form
42624 -99302 870756 1494406 1685416 1525891 1112657 711213 618749 726834 677254 607007
42614 607007 1158759 2428155 3494632 3521917 2849970 2375668 2229972 1803128 884990
42605 884990 28244 -234668 50337 491189 633751 97655 -965873 -1583501 -805690
42596 -805690 1053717 2644958 3163194 3043058 2915164 2660858 1955508 1102846 690217
42587 690217 758112 842879 605866 4273 -888058 -1789234 -2187464 -1879490 -1347428 -1147280
42577 -1147280 -1095158 -569874 461769 1262914 1247282 663059 235249 436481 1208231 2121032
42567 2121032 2679965 2659408 2220394 1577568 605830 -971243 -2991257 -4725907 -5452049
42558 -5452049 -4994934 -3695663 -2087189 -692865 101268 208249 -141194 -606022 -935034
$$ packed form
42624i9302R70058O23650J91010j59525m13234m01444r2464J08085m9580p0247
42614F07007N51752J269396J066477K7285o71947m74302j45696m26844r18138
42605H84990q56746k62912K85005M40852J42562n36096j063528o17628P77811
42596h05690J859407J591241N18236j20136j27894k54306p05350q52662m12629
42587F90217O7895Q4767k37013o01593q92331r01176l98230L07974N32062K00148
42577a147280N2122N25284J031643Q01145j5632n84223m27810K01232P71750R12801
42567B121032N58933k0557m39014o42826r71738j577073k020014j734650p26142
42558e452049M57115J299271J608474J394324P94133J06981l49443m64828l29012
$$ plain form
42549 -935034 -1003744 -795136 -374801 197244 885014 1482975 1528198 722660 -518837 -1265033
42539 -1265033 -988424 -85430 664054 923739 884130 754229 515681 126467 -326712 -706155
42529 -706155 -855196 -587834 96256 789772 998202 801469 884837 1678112 2714642 3171973
42519 3171973 2884260 2402342 2081516 1606811 646906 -418293 -854953 -529461 -93417
42510 -93417 -159854 -599134 -789892 -366223 442636 1093750 1215117 908856 710030 1157099
42500 1157099 2217297 3151029 3146595 2193626 1213657 1177717 2104594 3041428 3055401 2149491
42490 2149491 1164744 904244 1460284 2285421 2713282 2428180 1662471 1023265 944747 1200577
42480 1200577 1110691 337836 -684498 -1230664 -1001335 -251719 508883 709901 -58156
$$ packed form
42549i35034o8710K08608M20335N72045O87770N97961M5223q05538j241497p46196
42539a265033K76609R02994P49484K59685l9609j29901k38548l89214m53179l79443
42529g06155j49041K67362O84090O93516K08430j96733Q3368P93275J036530M57331
42519C171973k87713m81918l20826m74705r59905j065199m36660L25492M36044
42510i3417o6437m39280j90758M23669Q08859O51114J21367l06261j98826M47069
42500A157099J060198R33732m434r52969r79969l5940R26877R36834J3973r05910
42490B149491r84747k60500N56040Q25137M27861k85102p65709o39206p8518K55830
42480A200577q9886p72855j022334n46166K29329P49616P60602K01018p68057
$$ plain form
42471 -58156 -1563245 -2838549 -3059157 -2473649 -2021338 -2071080 -2061045 -1428173 -344837 594644
42461 594644 896768 271836 -1141394 -2436944 -2557757 -1651621 -1095197 -1651025 -2385591
42452 -2385591 -2157723 -1347288 -976644 -786783 274557 1882046 2377985 1296476 204244
42443 204244 289464 588284 -252999 -1640015 -1930279 -959070 -117914 -198517 -621714 -813074
42433 -813074 -959828 -1120371 -813694 6086 567498 419849 67327 -122171 -744949 -2260955
42423 -2260955 -3773773 -3955658 -2844717 -1709998 -1234359 -810928 194126 1350408 1783833
42414 1783833 1335226 581285 -26237 -552680 -1150643 -1635011 -1677734 -1268908 -742427 -308795
42404 -308795 209986 997038 1790303 2156103 2113378 2037398 1929768 1331513 154470 -944800
$$ packed form
42471e8156j505089j275304k20608N85508M52311m9742J0035O32872J083336R39481
42461E94644L02124o24932j413230j295550j20813R06136N56424n55828p34566
42452b385591K27868Q10435L70644J89861J061340J607489M95939j081509j092232
42443B04244Q5220K98820q41283j387016k90264R71209Q41156q0603m23197j91360
42433h13074j46754j60543L06677Q19780N61412j47649l52522j89498o22778j516006
42423b260955j512818j81885J110941J134719M75639M23431J005054J156282M33425
42414A783833m48607p53941o07522n26443n97963m84368m2723M08826N26481M33632
42404c08795N18781P87052P93265L65800m2725p5980j07630n98255j177043j099270
$$ plain form
42394 -944800 -1359890 -1239861 -1053542 -973528 -1136671 -1891700 -3066467 -3518868 -2375359
42385 -2375359 -427764 712805 710592 676089 1249920 1737364 1483831 968364 928526 1325396
42375 1325396 1833725 2499767 3132632 2827280 1089463 -1052589 -2023744 -1495097 -377714
42366 -377714 641097 1615159 2570037 3191506 3368673 3308968 3053582 2520557 1997234 1881514
42356 1881514 1933062 1525174 693423 159141 184803 209628 -139050 -467214 -410371 -274827
42346 -274827 -405642 -539548 -337667 -56755 -97119 -255607 -29191 563143 1005818 1033170
42336 1033170 925911 1097490 1654666 2299928 2520252 2057109 1321726 1061959 1451165
42327 1451165 1860637 1757242 1398478 1281252 1325959 1134704 784905 776610 1259427 1793301
$$ packed form
42394i44800m15090J20029J86319Q0014j63143p55029j174767m52401J143509
42385b375359J947595J140569k213l4503N73831M87444k53533n15467l9838L96870
42375A325396N08329O66042O32865l05352j737817k142052r71155N28647J117383
42366c77714J018811R74062R54878O21469J77167n9705k55386n33025n23323j15720
42356A881514N1548m07888q31751n34282K5662K4825l48678l28164N6843J35544
42346b74827j30815j33906K01881K80912m0364j58488K26416N92334M42675K7352
42336A033170j07259J71579N57176O45262K20324m63143p35383k59767L89206
42327A451165M09472j03395l58764j17226M4707j91255l49799q295M82817N33874
$$ plain form
42317 1793301 1907905 1588922 1233401 1336634 2066885 2906847 2983425 2141599 1445801 2093054
42307 2093054 3929918 5555209 5859500 4982706 3791857 3000966 2920310 3484250 4204198
42298 4204198 4486600 4310475 4288313 4786083 5326621 5256142 4720308 4424666 4487122 4141123
42288 4141123 2827348 1111050 56284 -67200 84466 17367 -19497 259493 518806
42279 518806 346624 15039 64726 406881 531891 437685 558233 806783 578866 -124100
42269 -124100 -454882 70513 952888 1694099 2522910 3581692 4277214 4211746 3970428 4092515
42259 4092515 4019280 3146579 2230417 2378592 3073077 2731003 1150551 -147774 -237238
42250 -237238 50276 -208274 -537933 -46043 1128934 2220633 2954481 3472006 3709231
$$ packed form
42317A793301J14604l18983l55521J03233P30251Q39962P6578q41826o95798O47253
42307B093054J836864J625291L04291q76794j190849p90891q0656N63940P19948
42298D204198K82402j76125k2162M97770N40538p0479n35834k95642O2456l45999
42288D141123j313775j716298j054766j23484J51666o7099l6864K78990K59313
42279E18806j72182l31585M9687L42155J25010r4206J20548K48550k27917p02966
42269a24100l30782N25395Q82375P41211Q28811J058782O95522o5468k41318J22087
42259D092515p3235q72701r16162J48175O94485l42074j580452j298325q9464
42250b37238K87514k58550l29659M91890J174977J091699P33848N17525K37225
$$ plain form
42241 3709231 3553700 3161502 2575039 1552191 289100 -317425 220421 1158247 1469550
42232 1469550 1091886 537771 -157647 -1198689 -2131217 -2164022 -1284257 -264180 378038
42223 378038 746433 996399 1064302 917898 521509 -293239 -1349513 -1806473 -1114957 -113671
42213 -113671 -237032 -1585488 -2688496 -2385843 -1115739 -46727 274339 -15806 -676732
42204 -676732 -1408527 -1748698 -1473782 -889890 -402233 -76980 90553 -155012 -958678 -1864997
42194 -1864997 -2125126 -1480843 -431379 235918 91376 -608488 -1120791 -865894 63178
42185 63178 1129016 1952522 2400058 2239672 1277917 -76743 -946094 -913539 -367413 291221
42175 291221 1229902 2607447 3927171 4483066 4121258 3120979 1707988 233683 -536151
$$ packed form
42241C709231j55531l92198n86463j022848j263091o06525N37846R37826L11303
42232A469550l77664n54115o95418j041042r32528l2805Q79765J020077O42218
42223C78038L68395K49966O7903j46404l96389q14748j056274m56960O91516J001286
42213a13671j23361j348456j103008L02653J270104J069012L21066k90145o60926
42204f76732p31795l40171K74916N83892M87657L25253J67533k45565q03666r06319
42194a864997k60129O44283J049464O67297j44542o99864n12303K54897R29072
42185F3178J065838Q23506M47536j60386r61755j354660q69351L2555N46126O58634
42175B91221R38681J377545J319724N55895l61808j000279j412991j474305p69834
$$ plain form
42166 -536151 -70313 1087464 1803931 1686205 1313226 1132813 865496 267263 -163356
42157 -163356 271681 1572143 3100639 4285414 4875030 4715544 3772936 2413091 1306221
42148 1306221 892354 1053082 1341979 1428854 1300992 1126271 973850 699301 182264 -340883
42138 -340883 -389040 184624 896239 1129127 826672 451958 324196 283025 37664 -414394
42128 -414394 -787287 -701786 145318 1683822 3222655 3860319 3398367 2555797 2010356
42119 2010356 1596408 890526 223806 387346 1418508 2445153 2875707 3028372 3304393
42110 3304393 3458801 3188445 2838109 2851240 2920582 2407963 1394618 629311 539145 929474
42100 929474 1581979 2433369 3078342 2804799 1455443 -175742 -1100197 -1055725 -579364
$$ packed form
42166e36151M65838J157777P16467j17726l72979j80413k67317n98233m30619
42157a63356M35037J300462J528496J184775N89616j59486r42608j359845j106870
42148A306221m13867J60728K88897Q6875j27862j74721j52421k74549n17037n23147
42138c40883m8157N73664P11615K32888l02455l74714j27762m1171k45361m52058
42128d14394l72893Q5501Q47104J538504J538833O37664m61952q42570n45441
42119B010356m13948p05882o66720J63540J031162J026645M30554J52665K76021
42110C304393J54408k70356l50336J3131O9342n12619j013345p65307r0166L90329
42100I29474O52505Q51390O44973k73543j349356j631185r24455M4472M76361
$$ plain form
42091 -579364 -425233 -921560 -1622340 -1682869 -921846 -274345 -619315 -1414791 -1383333 -496752
42081 -496752 -171700 -1190478 -2535376 -2907484 -2420864 -1938970 -1546104 -732793 430811
42072 430811 1376549 1969577 2373832 2276933 1310952 98506 -221040 443953 1050107 979321
42062 979321 655868 427130 -61470 -928559 -1475030 -1163933 -451625 -77838 -187025 -659672
42052 -659672 -1559593 -2586631 -2805699 -1779628 -449927 -3711 -271532 -186932 462573
42043 462573 799548 341182 -275079 -269651 343928 1062319 1515810 1560729 1302340 1231536
42033 1231536 1797122 2626491 2731725 1781811 640250 271034 582129 791099 542728
42024 542728 147664 -44457 907 178171 359091 371866 172971 -10922 20518 82204
$$ packed form
42091e79364J54131m96327p00780o0529P61023O47501l44970p95476L1458Q86581
42081d96752L25052j018778j344898l72108M86620M81894L92866Q13311J163604
42072D30811R45738N93028M04255r6899r65981j212446l19546O64993O06154p0786
42062I79321l23453k28738m88600q67089n46471L11097P12308L73787j09187m72647
42052f59672q99921j027038k19068J026071J329701M46216k67821Q4600O49505
42043D62573L36975m58366o16261N428O13579P18391M53491M4919k58389p0804
42033A231536N65586Q29369J05234r49914j141561l69216L11095K08970k48371
42024E42728l95064j92121M5364J77264J80920J2775j98895j83893L1440O1686
$$ plain form
42014 82204 -170265 -698667 -1052763 -909485 -437140 -102510 -260684 -909837 -1705990 -2241460
42004 -2241460 -2401950 -2367863 -2197352 -1628779 -508729 781218 1636268 1870266 1765077
41995 1765077 1590659 1411775 1286738 1241046 1018376 278209 -825437 -1617387 -1633669 -1106621
41985 -1106621 -569522 -251027 -13146 391982 1161048 2218163 2972844 2694870 1451148
41976 1451148 301795 137611 646170 957014 1001435 1464749 2460703 3144102 2936075
41967 2936075 2376043 2230615 2339496 2047784 1427748 1242692 1723131 2147926 1886734
41958 1886734 1268695 1029133 1309936 1683193 1927421 2247389 2734944 3101029 3155807 3244370
41948 3244370 3883244 5028527 5940040 5832794 4597383 2910182 1734847 1666630 2555296
$$ packed form
42014H2204k52469n28402l54096J43278M72345L34630j58174o49153p96153n35470
42004b241460j60490L4087J70511N68573J120050J289947Q55050K33998j05189
41995A765077j74418j78884j25037m5692k22670p40167j103646p91950j6282N27048
41985a106621N37099L18495K37881M05128P69066J057115P54681k77974j243722
41976A451148j149353j64184N08559L10844M4421M63314R95954O83399k08027
41967B936075n60032j45428J08881k91712o20036j85056M80439M24795k61192
41958A886734o18039k39562K80803L73257K44228L19968M87555L66085N4778Q8563
41948C244370O38874J145283R11513j07246j235411j687201j175335o8217Q88666
$$ plain form
41939 2555296 3640940 4145737 3876868 3270313 2817292 2538443 2143947 1622684 1399568
41930 1399568 1793816 2523221 2961701 2794353 2194040 1422964 591954 -115586 -368279
41921 -368279 -152842 -73992 -732093 -1830207 -2369036 -1870149 -958100 -435247 -215087 281945
41911 281945 938262 909625 -94574 -1186208 -1343441 -606201 225757 695777 914074
41902 914074 948565 716089 478535 751514 1512017 2080825 2104232 2138557 2823834 3875484
41892 3875484 4431407 4174537 3573336 3103758 2758420 2374732 2000927 1771079 1684287 1615368
41882 1615368 1371213 776951 -25765 -434297 56679 1089216 1624555 1031840 -322794
41873 -322794 -1648066 -2457095 -2577433 -1983733 -1029978 -426927 -461567 -510128 137192 1196341
$$ packed form
41939B555296J085644N04797k68869o06555m53021k78849l94496n21263k23116
41930A399568L94248P29405M38480j67348o00313p71076q31010p07540k52693
41921c68279K15437P8850o58101j098114n38829M98887R12049N22853K20160M97032
41911B81945O56317k8637j004199j091634j57233P37240Q31958M70020K18297
41902I14074L4491k32476k37554K72979P60503N68808K3407L4325O85277J051650
41892C875484N55923k56870o01201m69578l45338l83688l73805k29848q6792o8919
41882A615368k44155n94262q02716m08532M90976J032537N35339n92715j354634
41873c22794j325272q09029j20338N93700R53755O03051l4640m8561O47320J059149
$$ plain form
41863 1196341 1763279 1630515 1459068 1534525 1180940 -102296 -1511421 -1652180 -199032
41854 -199032 1741819 2927075 3172865 3153948 3382078 3657897 3458434 2682866 1875303
41845 1875303 1602156 1677388 1310999 192731 -865453 -744974 622902 2113582 2674447
41836 2674447 2402687 2230507 2802243 3861619 4601632 4431498 3444775 2248675 1359708
41827 1359708 818776 461967 397972 899457 1833374 2601111 2842877 2889282 3223723 3725868
41817 3725868 3814481 3243403 2394218 1768858 1505370 1470145 1549832 1676646 1708077 1453982
41807 1453982 824832 -71208 -947599 -1486165 -1546735 -1231826 -734680 -235029 19558 -210409
41797 -210409 -765780 -1003806 -479923 426081 1012600 1272674 1780043 2503848 2539148 1465113
$$ packed form
41863A196341N66938j32764j71447P5457l53585j283236j409125j40759J453148
41854a99032J940851J185256K45790j8917K28130K75819j99463p75568q07563
41845A875303k73147P5232l66389j118268j058184J20479J367876J490680N60865
41836B674447k71760j72180N71736J059376P40013j70134r86723j196100q88967
41827A359708n40932l56809o3995N01485R33917P67737K41766M6405L34441N02145
41817C725868Q8613n71078q49185o25360k63488l5225P9687J26814L1431k54095
41807A453982o29150q96040q76391n38566o0570L14909M97146M99651K54587k29967
41797b10409n55371k38026N23883R06004N86519K60074N07369P23805L5300j074035
$$ plain form
41787 1465113 287805 291734 1365936 2306581 2571067 2794645 3505096 4274008 4521139
41778 4521139 4382537 4234143 3961567 3348568 2733752 2560813 2578935 2246014 1737413 1713300
41768 1713300 2092977 1976246 1071435 374940 870543 2136183 2917470 2745591 2292670
41759 2292670 2238175 2426241 2249458 1416050 179498 -905599 -1349262 -1070887 -457947
41750 -457947 64802 500154 1135459 2015590 2820645 3232845 3155134 2600047 1686216 786632
41740 786632 379105 648158 1413011 2403801 3329265 3745869 3299131 2187017 1019021
41731 1019021 139701 -525473 -920490 -713846 73423 833049 1137786 1334028 1989317
41722 1989317 3105668 4226151 4916750 4761657 3386331 1086347 -945046 -1697863 -1427641
$$ packed form
41787A465113j177308L929J074202R40645K64486K23578P10451P68912K47131
41778D521139j38602j48394k72576o12999o14816j72939J8122l32921n08601k4113
41768A713300L79677j16731r04811o96495M95603J265640P81287j71879m52921
41759B292670n4495J88066j76783q33408j236552j085097m43663K78375O12940
41750d57947N22749M35352O35305Q80131Q05055M12200p7711n55087r13831q99584
41740G86632m07527K69053P64853R90790R25464M16604m46738j112114j167996
41731A019021q79320o65174l95017K06644P87269P59626L04737J96242O55289
41722A989317J116351J120483O90599j55093j375326k299984k031393p52817K70222
$$ plain form
41713 -1427641 -1064854 -865859 -420431 235122 463599 46556 -457115 -500701 18549 1153585
41703 1153585 2851029 4319778 4429146 3192824 2030281 2006376 2545625 2488981 1704616
41694 1704616 908670 508106 485764 966173 1948514 2745108 2622095 1901650 1566168 1792853
41684 1792853 1760116 1043569 359843 561448 1509882 2359205 2545124 2133209 1488168 935052
41674 935052 601497 384184 138535 -67949 -33654 269646 651711 910294 880851 414295
41664 414295 -376778 -942979 -742877 143237 1142054 1861671 2322842 2655861 2996838 3591114
41654 3591114 4509699 5293164 5370975 4824098 4232515 3817785 3353203 2920078 2988353 3546053
41644 3546053 3893396 3654585 3338640 3485902 3879410 4089575 4211056 4458171 4529764 4083069
$$ packed form
41713a427641L62787J98995M45428O55553K28477m17043n03671m3586N19250J135036
41703A153585J697444J468749J09368j236322j162543k3905N39249n6644p84365
41694A704616p95946m00564k2342M80409R82341P96594j23013p20445l35482K26685
41684A792853l2737p16547o83726K01605R48434Q49323J85919m11915o45041n53116
41674I35052l33555k17313k45649k06484L4295L03300L82065K58583k9443m66556
41664D14295p91073n66201K00102Q86114R98817P19617M61171L33019L40977N94276
41654C591114R18585P83465P7811n46877n91583m14730m64582m33125O8275N57700
41644C546053L47343k38811l15945J47262L93508K10165J21481K47115P1593m46695
$$ plain form
41634 4083069 3511642 3552331 4300943 5218990 5932900 6413205 6533518 6176891 5791304 6134640
41624 6134640 7251748 8229839 8238972 7445558 6649640 6319176 6276147 6189304 6090259 6309962
41614 6309962 6954815 7582971 7602538 6998729 6372652 6127842 5974326 5537252 5113748 5320014
41604 5320014 6131201 6812048 6856369 6552487 6443225 6528078 6257891 5287877 4128154 3902934
41594 3902934 5238111 7389847 8840188 8909790 8374620 8242402 8455160 8329134 7820196
41585 7820196 7565263 7827628 8179567 8296983 8442961 9036317 10213584 11862432 13653570
41576 13653570 15106987 16127288 17311691 19049166 20470679 20224556 18366233 16476283
41568 16476283 15625529 15243634 14471617 13568448 13164711 12996953 12431525 11690157 11484642
$$ packed form
41634D083069n71427M0689P48612R18047P13910M80305J20313l56627l85587L43336
41624F134640J117108R78091R133p93414p95918l30464m3029q6843r9045K19703
41614F309962O44853O28156J9567o03809o26077k44810j53516m37074m23504K06266
41604E320014Q11187O80847M4321l03882j09262Q4853k70187r70014j159723k25220
41594C902934J335177K151736J450341O9602n35170j32218K12758j26026n08938
41585G820196k54933K62365L51939J17416J45978N93356J177267J648848J791138
41576A3653570J453417J020301J184403J737475J421513k46123j858323j889950
41568A6476283q50754l81895p72017r03169m03737j67758n65428p41368k05515
$$ plain form
41559 11484642 11756167 11816271 11598076 11778854 12638752 13685299 14515049 15216387 15725989
41550 15725989 15592953 14765613 14017160 14176929 15310441 16889753 18350046 19272549 19534355
41541 19534355 19641478 20506485 22476713 24838372 26625227 27694337 28709261 30326922
41533 30326922 32772720 36006928 39850158 43974319 48174346 52769919 58494134 65836095
41525 65836095 74609598 84317407 94961954 107411419 122820824 141630660 163283906
41518 163283906 187000882 212374109 238459500 262168051 278374721 282566841 273760502
41511 273760502 254929762 230924902 206144200 183564763 164839740 150616381 140862681
41504 140862681 135224386 133126901 133456410 134259365 133096109 128095942 118981596 107166425
$$ packed form
41559A1484642K71525O0104k18195J80778Q59898J046547Q29750P01338N09602
41550A5725989j33036q27340p48453J59769J133512J579312J460293R22503K61806
41541A9534355J07123Q65007J970228K361659J786855J069110J014924J617661
41533C0326922K445798L234208L843230M124161M200027M595573N724215P341961
41525F5836095Q773503R707809J0644547J2449465J5409405J8809836K1653246
41518A63283906K3716976K5373227K6085391K3708551J6206670M192120q806339
41511B73760502j8830740k4004860k4780702k2579437j8725023j4223359r753700
41504A40862681n638295k097485L29509Q02955j163256n000167r114346j1815171
$$ plain form
41496 107166425 94748244 83238270 73085938 64149535 56303677 49536020 43744487
41489 43744487 38714586 34287184 30457813 27347371 25078627 23545326 22294749 20870678
41481 20870678 19351201 18255902 17740243 17205792 16053092 14576945 13639405 13513602 13516793
41472 13516793 12880453 11619885 10406474 9861431 10099249 10704573 11004629 10561714 9524824
41463 9524824 8360210 7257112 6104884 5084763 4811787 5584630 6818045 7605605 7678339
41454 7678339 7475457 7421130 7513491 7574266 7535882 7425973 7316732 7315938 7410386 7366930 7039020
41443 7039020 6707638 6780652 7148652 7218797 6692112 5943787 5459365 5247795 5072417 4929747
41433 4929747 4907208 4790189 4301158 3690283 3599401 4195335 4840748 4903360 4619390 4788382
$$ packed form
41496A07166425j2418181j1509974j0152332q936403p845858o767657n791533
41489D3744487n029901m427402l829371l110442k268744j533301j250577j424071
41481B0870678j519477j095299n15659n34451j152700j476147r37540j25803L191
41472A3516793o36340j260568j213411n45043K37818O05324L00056m42915j036890
41463I524824j164614j103098j152228j020121k72976P72843J233415P87560P2734
41454G678339k02882n4327R2361O0775l8384j09909j09241p94R4448m3456l27910
41443G039020l31382P3014L68000P0145n26685p48325m84422k11570j75378j42670
41433D929747k2539j17019m89031o10875r0882N95934O45413O2612k83970J68992
$$ plain form
41423 4788382 5711587 6801257 7295743 7045975 6429691 5754337 5062088 4427592 4079563
41414 4079563 4115694 4353112 4633254 5086417 5879105 6825364 7497368 7681955 7517559 7220180
41404 7220180 6917824 6754045 6867392 7159085 7308575 7167537 6963367 6953395 7028276 6865511
41394 6865511 6425521 6126368 6487732 7615437 8987714 9789551 9644606 9054652 8878948
41385 8878948 9272623 9440047 8699584 7517484 7028862 7598540 8344820 8237537 7281460
41376 7281460 6348206 6104285 6433483 6772340 6655142 5951385 4949812 4357071 4881361
41367 4881361 6474198 8106827 8671699 8167826 7694464 8143193 9189191 9815626 9576031
41358 9576031 8943354 8516503 8347689 8163524 7870058 7597486 7461213 7496953 7693901 7917435
$$ packed form
41423D788382R23205J089670M94486k49768o16284o75354o92249o34496l48029
41414D079563L6131K37418K80142M53163P92688R46259O72004J84587j64396k97379
41404G220180l02356j63779J13347K91693J49490j41038k04170r972P4881j62765
41394F865511m39990k99153L61364J127705J372277Q01837j44945n89954j75704
41385H878948L93675J67424p40463j182100m88622N69678P46280j07283r56077
41376G281460r33254k43921L29198L38857j17198p03757j001573n92741N24290
41367D881361J592837J632629N64872n03873m73362M48729J045998O26435k39595
41358I576031o32677m26851j68814j84165k93466k72572j36273L5740J96948K23534
$$ plain form
41348 7917435 7919534 7598668 7180418 7013141 7228066 7659736 8034272 8221370 8397740 8925193
41338 8925193 9909816 10960295 11636379 12048406 12642571 13458387 14116329 14566842 15187031
41329 15187031 15925261 16103455 15542650 15177799 15830116 16899591 17138060 16388902 15652806
41320 15652806 15589476 15868320 16000002 15932430 15693152 15240529 14875521 15085103 15742012 16103185
41310 16103185 15814612 15298744 14990151 14892956 15088361 15876908 17069958 17888929 17958570
41301 17958570 17688785 17353001 16716314 16100467 16761552 19269894 22316202 24206266 24952364
41292 24952364 25766044 26985902 27834019 28038852 28357820 29333393 30654723 32019332 33651730
41283 33651730 35655714 37756128 40080918 43399405 48116301 53684081 59465371 65601081
$$ packed form
41348G917435K099l20866m18250j67277K14925M31670L74536J87098J76370N27453
41338H925193R84623J050479O76084M12027N94165Q15816O57942M50513O20189
41329A5187031P38230J78194n60805l64851O52317J069475K38469p49158p36096
41320A5652806o3330K78844J31682o7572k39278m52623l65008K09582O56909L61173
41310A6103185k88573n15868l08593r7195J95405P88547J193050Q18971O9641
41301A7958570k69785l35784o36687o15847O61085K508342L046308J890064P46098
41292B4952364Q13680J219858Q48117K04833L18968R75573J321330J364609J632398
41283C3651730K003984K100414K324790L318487M716896N567780N781290O135710
$$ plain form
41275 65601081 72571922 80405002 88770011 97453510 106342100 115285617 124237557 133025695
41267 133025695 140601089 145029560 144824488 140129845 132343122 122991327 113333636 104503952
41259 104503952 97239142 91468009 86616263 82321107 78622731 75647802 73395985 71637805
41251 71637805 69747805 66906265 62823141 58064310 53381276 48999728 44845801 41015493
41243 41015493 37512746 33940913 30130411 26757606 24536016 22979036 20907720 18229354
41235 18229354 16210330 15649723 15714834 15197095 14155253 13452784 13146104 12378165 10871478
41226 10871478 9614435 9687257 10947697 12307986 12996654 13089047 12893188 12293830 10970051
41217 10970051 9105603 7541376 7014359 7336166 7593805 7250870 6796995 7065925 8082931
$$ packed form
41275F5601081O970841P833080Q365009Q683499Q888590Q943517Q951940Q788138
41267A33025695P575394M428471k05072m694643p786723r351795r657691q829684
41259A04503952p264810n771133m851746m295156l698376k974929k251817j758180
41251G1637805j890000k841540m083124m758831m683034m381548m153927l830308
41243D1015493l502747l571833l810502l372805k221590j556980k071316k678366
41235A8229354k019024n60607O5111n17739j041842p02469l06680p67939j506687
41226A0871478j257043P2822J260440J360289O88668R2393j95859n99358j323779
41217A0970051j864448j564227n27017L21807K57639l42935m53875K68930J017006
$$ plain form
41208 8082931 8962330 8956744 8234728 7476166 7048948 6869320 6796117 6744310 6539944 6127882
41198 6127882 5912052 6377480 7236392 7484093 6638547 5455487 4907749 4826673 4252877
41189 4252877 2968991 1852520 1552540 1602010 1282630 759150 728017 1309605 1978756
41180 1978756 2449805 2949192 3545257 3814177 3431886 2690081 2131523 1938571 1945351 2042916
41170 2042916 2278087 2647294 3035770 3323337 3372242 2969702 2014595 818864 63478
41161 63478 314684 1551553 3155762 4364838 4816275 4753523 4723494 5050778 5614397 6096783
41151 6096783 6294652 6101609 5380269 4138557 2811071 2039256 1998368 2149312 1889547
41142 1889547 1330794 1158763 1733260 2603235 3042856 2902324 2740471 3125573 3933562
$$ packed form
41208H082931Q79399n586p22016p58562m27218j79628p3203n1807k04366m12062
41198F127882k15830M65428Q58912K47701q45546j183060n47738q1076n73796
41189D252877j283886j116471k99980M9470l19380n23480l1133N81588O69151
41180A978756M71049M99387N96065K68920l82291p41805n58558j92952O780R7565
41170B042916K35171L69207L88476K87567M8905m02540r55107j195731p55386
41161F3478K51206J236869J604209J209076M51437o2752l0029L27284N63619M82386
41151F096783J97869j93043p21340j241712j327486p71815m0888J50944k59765
41142A889547n58753j72031N74497Q69975M39621j40532j61853L85102Q07989
$$ plain form
41133 3933562 4446586 4172668 3445691 3007287 3015190 2817745 1899870 665803 -143373 -486974
41123 -486974 -811924 -955332 -171201 1498105 2769575 2667032 1886724 1848961 2825604
41114 2825604 3885165 4458746 4975963 5858968 6776237 7239847 7289016 7167762 6794291
41105 6794291 5976655 4865197 3834401 3070813 2490232 1929200 1313708 780482 630264
41096 630264 965949 1458699 1732732 1806437 1783618 1420687 675841 433528 1648872 3655307
41086 3655307 4433262 3060902 952922 -16982 195076 239660 -551470 -1545028 -1957155
41077 -1957155 -1701339 -1143339 -671251 -458958 -220923 550643 1694463 2205770 1559173
41068 1559173 653358 579315 937176 491373 -775093 -1547043 -1189729 -634274 -867940
$$ packed form
41133C933562N13024k73918p26977m38404P903j97445r17875j234067q09176l43601
41123d86974l24950j43408P84131J669306J271470j02543p80308l7763R76643
41114B825604J059561N73581N17217Q83005R17269M63610M9169j21254l73471
41105F794291q17636j111458j030796p63588n80581n61032o15492n33226j50218
41096F30264L35685M92750K74033P3705k2819l62931p44846k42313J215344K006435
41086C655307P77955j372360k107980r69904K12058M4584p91130r93558m12127
41077a957155K55816N58000M72088K12293K38035P71566J143820N11307o46597
41068A559173r05815p4043L57861m45803j266466p71950L57314N55455k33666
$$ plain form
41059 -867940 -1569644 -1799625 -1282522 -452878 220780 514414 507963 657811 1313074 1954110
41049 1954110 1557366 35071 -1355390 -1486255 -659290 71538 351162 671778 1374345
41040 1374345 2103497 2247416 1651892 916134 933831 1868296 2717726 2413107 1229209
41031 1229209 376829 257800 114272 -455432 -831955 -690648 -747883 -1399931 -1776685 -1240241
41021 -1240241 -802974 -1657844 -3026287 -3045865 -1447636 192587 758910 659079 527515
41012 527515 358755 244185 586106 1077791 716584 -544275 -1286945 -511982 947608
41003 947608 1686297 1516953 1138092 816086 415421 158528 314421 508709 294952 90385
40993 90385 595086 1555794 2120750 2250768 2676954 3441827 3631682 2849909 1910542 1564502
$$ packed form
41059h67940p01704k29981N17103Q29644O73658K93634o451J49848O55263O41036
41049A954110l96744j522295j390461j30865Q26965P30828K79624L20616P02567
41040A374345P29152J43919n95524p35758J7697R34465Q49430l04619j183898
41031A229209q52380j19029j43528n69704l76523J41307n7235o52048l76754N36444
41021a240241M37267q54870j368443j9578J598229J640223N66323r9831j31564
41012E27515j68760j14570L41921M91685l61207j260859p42670P74963J459590
41003I47608P38689j69344l78861l22006m00665k56893J55893J94288k13757k04567
40993I0385N04701R60708N64956J30018M26186P64873J89855p81773r39367l46040
$$ plain form
40983 1564502 1419150 766298 -235713 -968550 -1420250 -2009048 -2622932 -2660365 -1988355
40974 -1988355 -1169173 -661120 -365138 -75330 142781 204821 205246 174602 25535 -89981
40964 -89981 190586 785210 965702 203296 -1102553 -2154478 -2728265 -3129957 -3433177
40955 -3433177 -3388927 -3037522 -2776111 -2712463 -2509858 -2045583 -1698057 -1733211 -1876028 -1773462
40945 -1773462 -1448660 -1010606 -384227 320047 675045 638410 864512 1684305 2246223 1520587
40935 1520587 -112418 -1216047 -1165679 -708972 -581909 -592906 -426321 -370353 -620321 -647685
40925 -647685 -37981 633341 621474 305300 736529 2069105 3337605 3823943 3808772 3779234
40915 3779234 3658751 3208558 2616053 2202181 1889234 1392257 736503 232430 54704
$$ packed form
40983A564502j45352o52852j002011p32837m51700n88798o13884l7433O72010
40974a988355Q19182N08053K95982K89808K18111O2040M25l0644j49067j15516
40964h9981K80567N94624J80492p62406j305849j051925n73787m01692l03220
40955c433177M4250L51405K61411O3648K02605M64275L47526l5154j42817J02566
40945a773462L24802M38054O26379P04274L54998l6635K26102Q19793N61918p25636
40935A520587j633005j103629N0368M56707J27063j0997J66585N5968k49968k7364
40925f47685O09704O71322j1867l16174M31229J332576J268500M86338j5171k9538
40915C779234j20483m50193n92505m13872l12947m96977o55754n04073j77726
$$ plain form
40906 54704 92662 101675 -172822 -847927 -1684460 -2193546 -2162981 -1891548 -1704992 -1502748
40896 -1502748 -1084716 -647078 -492543 -434156 -73361 351860 55011 -1153232 -2398433
40887 -2398433 -2801234 -2527412 -2304350 -2290463 -2053235 -1440860 -752898 -52131 962122
40878 962122 2161776 2699413 1961243 466072 -597903 -558784 264274 1028013 1041856
40869 1041856 240135 -696388 -891710 -241710 400454 315956 -118792 -37434 622761 1088434
40859 1088434 926759 527835 268798 -98309 -816208 -1385816 -1027473 275820 1615693
40850 1615693 2043940 1419538 426697 -83714 205283 931405 1561371 1907869 2000596 1683915
40840 1683915 810745 -187739 -502065 37125 583117 248104 -870918 -1953576 -2426430
$$ packed form
40906E4704L7958R013k74497o75105q36533n09086L0565K71433J86556K02244
40896a502748M18032M37638J54535N8387L60795M25221k96849j208243j245201
40887b398433m02801K73822K23062J3887K37228O12375O87962P00767J014253
40878I62122J199654N37637p38170j495171j063975L9119Q23058P63739J3843
40869A041856q01721r36523j95322O50000O42164q4498m34748Q1358O60195M65673
40859A088434j61675l98924k59037l67107p17899n69608L58343J303293J339873
40850A615693M28247o24402r92841n10411K88997P26122O29966L46498R2727l16681
40840A683915q73170r98484l14326N39190N45992l35013j119022j082658m72854
$$ plain form
40831 -2426430 -2318342 -1941736 -1649932 -1720417 -2057418 -2130273 -1580237 -770322 -369431 -522228
40821 -522228 -826503 -996380 -1050834 -870692 -113781 1240978 2631004 3407587 3407168 2944760
40811 2944760 2442410 2124437 1895772 1478533 791054 121572 -228346 -300726 -228616 133518
40801 133518 886522 1549360 1406903 420825 -689260 -1294221 -1290526 -722569 331802 1323978
40791 1323978 1397474 385562 -876880 -1581854 -1754606 -1717389 -1470640 -1185507 -1589479
40782 -1589479 -2945295 -4107587 -3674378 -1943980 -668428 -752191 -1209064 -764935 401972
40773 401972 1133658 866093 -2218 -971305 -1914704 -2698314 -2919579 -2307576 -1184888
40764 -1184888 -310219 -196052 -590463 -744382 -313415 135000 -226459 -1402252 -2507228
$$ packed form
40831b426430J08088L76606K91804p0485l37001p2855N50036Q09915M00891j52797
40821e22228l04275j69877n4454J80142P56911J354759J390026P76583m19m62408
40811B944760n02350l17973k28665m17239o87479o69482l49918p2380P2110L62134
40801A33518P53004O62838j42457r86078j110085o04961L695N67957J054371R92176
40791A323978P3496j011912j262442p04974j72752L7217K46749K85133m03972
40782a589479j355816j162292M33209J730398J275552q3763m56873M44129J166907
40773D01972P31686k67565q68311r69087r43399p83610k21265O12003J122688
40764a184888Q74669J14167l94411j53919M30967M48415l61459j175793j104976
$$ plain form
40755 -2507228 -2815384 -2484824 -2117205 -2002279 -2035001 -2028679 -1800593 -1212687 -435614 60895
40745 60895 99307 156739 770839 1746603 2354545 2241107 1751912 1356314 1130020 917751
40735 917751 733818 815697 1326171 2017559 2199483 1255028 -609530 -2295259 -2770900
40726 -2770900 -2033304 -905214 -53641 457168 795177 1043086 1299924 1646995 1835546
40717 1835546 1355734 45342 -1596042 -2880097 -3519457 -3592884 -3159714 -2201462 -914860
40708 -914860 151035 386322 -379847 -1649323 -2630629 -2931436 -2755967 -2352178 -1597873
40699 -1597873 -473484 353281 25821 -1408240 -2922396 -3619353 -3467643 -2907438 -2307566
40690 -2307566 -1968899 -2042733 -2148990 -1666408 -768672 -541890 -1541886 -2837071 -3208105
$$ packed form
40755b507228l08156L30560L67619J14926l2722O322K28086N87906P77073M96509
40745F0895L8412N7432O14100R75764O07942j13438m89195l95598k26294k12269
40735I17751j83933Q1879N10474O91388J81924r44455j864558j685729m75641
40726b770900P37596J128090Q51573N10809L38009K47909K56838L47071J88551
40717A835546m79812j310392j641384j284055o39360p3427M33170R58252J286602
40708i14860J065895K35287p66169j269476r81306l00807J75469M03789P54305
40699a597873J124389Q26765l27460j434061j514156o96957J51710N60205N99872
40690b307566L38667p3834j06257M82582Q97736K26782r99996j295185l71034
$$ plain form
40681 -3208105 -2810346 -2744205 -3263142 -3441112 -2648878 -1393022 -424382 161602 535934
40672 535934 545586 41025 -683658 -1274785 -1775049 -2261123 -2430842 -2102489 -1795165 -2122142
40662 -2122142 -2737071 -2619083 -1513386 -411214 -275913 -833860 -1110044 -778728 -349941
40653 -349941 -163551 69850 528863 723067 184048 -634395 -746118 157627 1412096
40644 1412096 2305687 2761622 2936866 2681331 1800319 572515 -368068 -558259 44328
40635 44328 1077147 1840575 1699895 769761 -62257 -140181 205405 284698 93389 166314
40625 166314 611002 964822 993345 985523 1130090 1148658 753509 49373 -702337 -1362137
40615 -1362137 -1809325 -1898434 -1667739 -1327061 -974085 -585745 -255690 -87039 94966 495918
$$ packed form
40681c208105L97759O6141n18937j77970P92234J255856R68640N85984L74332
40672E35934R652n04561p24683n91127n00264m86074j69719L28353L07324l26977
40662b122142o14929J17988J105697J102172J35301n57947k76184L31316M28787
40653c49941J86390K33401M59013J94204n39019q18443j11723R03745J254469
40644A412096Q93591M55935J75244k55535q81012j227804r40583j90191O02587
40635D4328J032819P63428j40680r30134q32018p7924L45586P9293j91309P2925
40625A66314M44688L53820K8523p822J44567J8568l95149p04136p51710o59800
40615a362137m47188q9109K30695L40678L52976L88340L30055J68651J82005M00952
$$ plain form
40605 495918 884983 886781 666671 671854 697795 33234 -1266591 -2118519 -1860261 -1204743
40595 -1204743 -1192088 -1848141 -2523047 -2969669 -3307546 -3331224 -2691878 -1610305 -743228 -429406
40585 -429406 -539635 -828568 -919205 -275557 1117951 2283923 2219620 1240558 620133 917315
40575 917315 1421636 1348332 823834 404930 234699 75637 -177298 -339572 -120824 632062
40565 632062 1669423 2345395 2209990 1586065 1229115 1458456 1999718 2602364 3290938
40556 3290938 3947255 4163185 3714505 2834821 1875124 984533 216180 -336003 -602826
40547 -602826 -593628 -474251 -724021 -1832152 -3428446 -4167868 -3197133 -1423032 -477692
40538 -477692 -681586 -1060194 -1180703 -1589374 -2246972 -2074885 -776744 225056 -283069
$$ packed form
40605D95918L89065J798k20110N183K5941o64561j299825q51928K58258O55518
40595a204743J2655o56053o74906m46622l37877k3678O39346J081573Q67077L13822
40585d29406j10229k88933r0637O43648J393508J165972o4303r79062o20425K97182
40575I17315N04321p3304n24498m18904j70231j59062k52935j62274K18748P52886
40565F32062J037361O75972j35405o23925l56950K29341N41262O02646O88574
40556C290938O56317K15930m48680q79684r59697q90591p68353n52183k66823
40547f02826R198J19377k49770j108131j596294p39422R70735J774101R45340
40538d77692k03894l78608j20509m08671o57598J72087J298141J001800n08125
$$ plain form
40529 -283069 -1477142 -1760277 -1022848 -348417 -97267 265320 737400 658622 67162 -138275
40519 -138275 358529 819991 746377 584928 721408 747099 325302 -21104 320079 1065631
40509 1065631 1450228 1176217 424855 -603178 -1575705 -1886693 -1290352 -414042 -54601
40500 -54601 -200508 -307633 -267467 -421170 -769443 -889466 -629519 -229889 270157 1061098
40490 1061098 1908455 2225686 2071804 2326414 3373569 4232511 3675621 1828435 -25420
40481 -25420 -979986 -1146240 -915666 -399852 257928 693732 748732 634466 465041 91955
40471 91955 -370738 -395680 185878 711083 494123 -194633 -484250 -39363 690726 1256342
40461 1256342 1702866 2229266 2759996 2962226 2475085 1200133 -371873 -1306868 -1123638
$$ packed form
40529b83069j194073k83135P37429O74431K51150L62587M72080p8778n91460k05437
40519a38275M96804M61462p3614j61449J36480K5691m21797l46406L41183P45552
40509A065631L84597k74011p51362j028033r72527l10988N96341Q76310L59441
40500e4601j45907j07125M0166j53703l48273j20023K59947L99630N00046P90941
40490A061098Q47357L17231j53882K54610J047155Q58942n56890j847186j853855
40481b5420r54566j66254K30574N15814O57780M35804N5000j14266j69425l73086
40471I1955m62693k4942N81558N25205k16960o88756k89617M44887P30089N65616
40461A256342M46524N26400N30730K02230m87141j274952j572006r34995J83230
$$ plain form
40452 -1123638 -434185 -232471 -647605 -950181 -737794 -427108 -434525 -557496 -495146 -412898
40442 -412898 -577162 -866483 -1050735 -1181838 -1314026 -1200397 -715496 -289875 -461147 -1184344
40432 -1184344 -1969181 -2480490 -2617794 -2267171 -1489917 -824575 -878324 -1583111 -2208219 -2120971
40422 -2120971 -1296601 -193165 585508 641080 132590 -321001 -362467 -323226 -597354 -861469
40412 -861469 -427933 774549 2095455 2945659 3191483 2914093 2397437 2269055 2904150
40403 2904150 3615993 3230442 1708514 409197 317163 757780 505712 -464546 -1202123
40394 -1202123 -1380803 -1651026 -2328974 -2657518 -1846635 -314067 693937 563593 -68298
40385 -68298 -210258 302994 744087 464681 -368684 -1105017 -1429162 -1572378 -1792392 -1994626
$$ packed form
40452a123638O89453K01714m15134l02576K12387L10686p417j22971O2350Q2248
40442d12898j64264k89321j84252j31103j32188J13629M84901M25621j71272p23197
40432a184344p84837n11309j37304L50623P77254O65342n3749p04787o25108Q7248
40422b120971Q24370J103436P78673N5572n08490m53591m1466L9241k74128k64115
40412h61469M33536J202482J320906Q50204K45824k77390n16656j28382O35095
40403B904150P11843l85551j521928j299317r2034M40617k52068r70258p37577
40394a202123j78680k70223o77948l28544Q10883J532568J008004j30344o31891
40385f8298j41960N13252M41093k79406q33365p36333l24145j43216k20014k02234
$$ plain form
40375 -1994626 -1967287 -1711962 -1369591 -1025260 -759062 -693980 -795220 -814273 -668091 -670963
40365 -670963 -1056753 -1428585 -1143772 -253234 431124 395857 121716 372411 1099462 1528034
40355 1528034 1210237 504714 -10983 -116432 208062 1000809 2010509 2549775 2168805
40346 2168805 1293874 705311 517319 243438 -189842 -223247 346776 868304 756666 345455
40336 345455 253969 361378 108317 -447213 -624898 -121460 634817 1146551 1277434 1011254
40326 1011254 421089 -45382 49398 258962 -507614 -2481153 -4418627 -5019692 -4418113
40317 -4418113 -3671542 -3277037 -2969719 -2637326 -2469747 -2220517 -1254424 383365 1670527
40308 1670527 1782144 1027597 227616 -325798 -780509 -1041065 -869981 -495621 -434970 -681763
$$ packed form
40375a994626K7339K55325L42371L44331K66198O5082j01240j9053J46182k872
40365f70963l85790l71832K84813Q90538O84358l5267k74141K50695P27051M28572
40355A528034l17797p05523n15697j05449L24494P92747J009700N39266l80970
40346B168805q74931n88563j87992k73881m33280l3405N70023N21528j11638m11211
40336C45455r1486J07409k53061n55530j77685N03438P56277N11734J30883k66180
40326A011254n90165m66471R4780K09564p66576j973539j937474o01065O01579
40317d418113P46571L94505L07318L32393J67579K49230R66093J637789J287162
40308A670527J11617p54547p99981n53414m54711k60556J71084L74360O0651k46793
$$ plain form
40298 -681763 -665979 -149980 385460 471553 242970 -40990 -563485 -1487191 -2252715 -2035113
40288 -2035113 -880269 203423 404219 -106750 -657540 -848853 -634456 -119705 344394
40279 344394 225126 -581150 -1397668 -1450509 -807507 -263592 -349415 -831813 -1228246 -1456712
40269 -1456712 -1791292 -2351673 -2842085 -2844370 -2347693 -1888956 -2003489 -2549136 -2819161 -2406153
40259 -2406153 -1695467 -1361352 -1628199 -2191164 -2575152 -2355426 -1355563 26164 933311
40250 933311 874720 288904 -5432 263553 718280 900107 606074 -72601 -670919 -592248
40240 -592248 146834 713373 474016 -116067 -203925 225343 497706 345519 61645 -213626
40230 -213626 -469728 -243614 914976 2360903 2776962 1885764 782987 340660 294142
$$ packed form
40298f81763J5784N15999N35440Q6093k28583k83960n22495r23706p65524K17602
40288b035113J154844J083692K00796n10969n50790j91313K14397N14751M64099
40279C44394j19268q06276q16518n2841O43002N43915q5823m82398l96433k28466
40269a456712l34580n60381m90412k285M96677M58737j14533n45647k70025M13008
40259b406153P10686L34115k66847n62965l83988K19726R99863J381727R07147
40250I33311n8591n85816k94336K68985M54727J81827k94033o78675n98318P8671
40240e92248P39082N66539k39357n90083q7858M29268K72363j52187k83874k75271
40230b13626k56102K26114J158590J445927M16059q91198j102777m42327m6518
$$ plain form
40221 294142 242105 448543 1052280 1429868 1053865 218152 -713470 -1945979 -3418195
40212 -3418195 -4191369 -3628872 -2538273 -2146204 -2431020 -2445198 -1870265 -1232332 -847964
40203 -847964 -546885 -314005 -339292 -504947 -541948 -544143 -673961 -659153 -327672 -268381 -1049442
40192 -1049442 -2099209 -2373498 -1870528 -1385037 -1006266 -177857 805774 843202 -156597
40183 -156597 -918775 -768065 -601283 -1182399 -1756682 -1402588 -744645 -1067830 -2331269
40174 -2331269 -3256042 -3063496 -2070991 -752173 776005 2284036 3271337 3471385 3035001
40165 3035001 2208895 1278525 708746 765828 1010293 706582 -209857 -1044030 -1263658 -1041073
40155 -1041073 -789057 -629936 -522954 -530867 -676365 -753750 -528385 -19547 556370 1012548
$$ packed form
40221B94142n2037K06438O03737L77588l76003q35713r31622j232509j472216
40212c418195p73174N62497J090599L92069k84816j4178N74933O37933L84368
40203h47964L01079K32880k5287j65655l7001k195j29818J4808L31481N9291p81061
40192a049442j049767k74289N02970M85491L78771Q28409R83631L7428r99799
40183a56597p62178J50710J66782n81116n74283L54094O57943l23185j263439
40174b331269r24773J92546R92505J318818J528178J508031R87301K00048m36384
40165C035001q26106r30370n69779N7082K44465l03711r16439q34173k19628K22585
40155a041073K52016J59121J06982p913j45498p7385K25365N08838N75917M56178
$$ plain form
40145 1012548 1228720 1065051 440110 -451397 -1124507 -1181505 -751517 -403739 -484841 -682735
40135 -682735 -480915 82120 480148 499487 498226 720551 829926 433900 -325322 -1087669
40125 -1087669 -1806420 -2443263 -2428579 -1146940 1012686 2723576 3055958 2308645 1334869
40116 1334869 529190 -181589 -776214 -1124107 -1374113 -1813690 -2296278 -2275813 -1587198 -807729
40106 -807729 -562577 -758744 -847362 -614899 -278378 57092 475374 766785 506281 -135150
40096 -135150 -271562 518990 1380615 1202235 159203 -507168 -143898 644048 1037967
40087 1037967 942019 610012 50593 -706199 -1245591 -1226251 -927584 -870948 -1084816 -1151402
40077 -1151402 -825056 -228711 419779 892821 876562 229584 -668048 -1152676 -911895 -161510
$$ packed form
40145A012548K16172j63669o24941q91507o73110n6998M29988L47778q1102j97894
40135f82735K01820N63035L98028J9339j261K22325J09375l96026p59222p62347
40125a087669p18751o36843J4684J281639K159626J710890L32382p47313r73776
40116A334869q05679p10779n94625l47893k50006m39577m82588K0465O88615P79469
40106h07729K45152j96167q8618K32463L36521L35470M18282K91411k60504o41431
40096a35150j36412P90552Q61625j78380j043032o66371L63270P87946L93919
40087A037967r5948l32007n59419p56792n39392J9340K98667N6636k13868o6586
40077a151402L26346N96345O48490M73042j6259o46978q97632m84628K40781P50385
$$ plain form
40067 -161510 754730 1617874 2155881 1972686 896381 -718095 -2197534 -3042422 -3171696
40058 -3171696 -2778544 -2090937 -1319905 -744435 -658522 -1105010 -1714378 -1942418 -1500920 -543276
40048 -543276 471196 1030008 889567 364573 117657 356134 423124 -358484 -1561883
40039 -1561883 -2016993 -1383006 -651586 -731595 -1186733 -990131 -80736 593327 412890 -261048
40029 -261048 -796051 -986970 -881241 -505806 -103581 -183179 -876290 -1514693 -1342048 -549193
40019 -549193 -102484 -484448 -1114264 -1285484 -1211270 -1599321 -2448007 -2986532 -2852927 -2573035
40009 -2573035 -2549489 -2306249 -1358809 -267584 18690 -441008 -742133 -558892 -445379
40000 -445379 -658989 -697554 -329781 -148342 -550793 -931841 -552093 353775 994426 1098362
$$ packed form
40067a61510R16240Q63144N38007j83195j076305j614476j479439q44888j29274
40058c171696L93152O87607P71032N75470Q5913m46488o09368k28040M41498R57644
40048e43276J014472N58812j40441n24994k46916K38477O6990p81608j203399
40039a561883m55110O33987P31420q0009m55138J96602R09395O74063j80437o73938
40029b61048n35003j90919J05729L75435M02225p9598o93111o38403J72645P92855
40019e49193M46709l81964o29816j71220P4214l88051q48686n38525J33605K79892
40009b573035K3546K43240R47440J091225K86274m59698l01125J83241J13513
40000d45379k13610l8565L67773J81439m02451l81048L79748R05868O40651J03936
$$ plain form
39990 1098362 932024 618706 96876 -502039 -1026265 -1626944 -2366287 -2765866 -2364542
39981 -2364542 -1551079 -1207231 -1577226 -2044823 -2017557 -1541486 -1033809 -847659 -1136055 -1774914
39971 -1774914 -2359341 -2520431 -2253507 -1812605 -1427887 -1234671 -1203583 -1011708 -378010 322291
39961 322291 340219 -295489 -628123 -210883 150412 -193419 -470916 268883 1354851 1324858
39951 1324858 206583 -489433 -1648 859419 1232074 1149133 669665 -521277 -2061109
39942 -2061109 -2717584 -2051560 -1293248 -1749180 -3140670 -4279327 -4612175 -4274604 -3317086
39933 -3317086 -1823987 -340380 659438 1378358 2096072 2425374 1930919 1063685 627336
39924 627336 612637 415126 -2861 -68655 310340 448489 -144553 -1078274 -1562856 -1223231
$$ packed form
39990A098362j66338l13318n21830n98915n24226o00679p39343l99579M01324
39981b364542Q13463L43848l69995m67597K7266M76071N07677J86150k88396o38859
39971a774914n84427j61090K66924M40902L84718J93216L1088J91875O33698P00301
39961C22291J7928o35708l32634M17240L61295l43831k77497P39799J085968k9993
39951A324858j118275o96016M87785Q61067L72655q2941m79468j190942j539832
39942b061109o56475O66024P58312m55932j391490j138657l32848L37571R57518
39933c317086J493099J483607R99818P18920P17714L29302m94455q67234m36349
39924F27336j4699j97511m17987o5794L78995J38149n93042r33721m84582L39625
$$ plain form
39914 -1223231 -387153 170490 -124890 -987286 -1480443 -1173707 -694350 -698687 -823884 -408490
39904 -408490 181055 -24584 -966240 -1431826 -763473 237551 449087 -311906 -1513939
39895 -1513939 -2591104 -2905313 -1823106 369795 2103914 1933448 181355 -1450141
39887 -1450141 -1792608 -1144565 -424302 -133012 -293947 -742941 -1099036 -879761 -53009
39878 -53009 784271 1094581 986743 764617 252889 -784942 -1706119 -1314283 572993
39869 572993 2552492 3160754 2521562 1868928 1773333 1625743 816105 -384977 -1341868
39860 -1341868 -1797759 -1762400 -1201828 -312835 256263 -22945 -916034 -1747130 -2236202 -2625902
39850 -2625902 -3035972 -3121990 -2544122 -1551840 -871913 -980930 -1582604 -1947505 -1799631 -1641955
$$ packed form
39914a223231Q36078N57643k95380q62396m93157L06736M79357m337j25197M15394
39904d08490N89545k05639r41656m65586O68353J001024K11536p60993j202033
39895a513939j077165l14209J082207K192901J734119j70466j752093j631496
39887a450141l42467O48043P20263K91290j60935m48994l56095K19275Q26752
39878e3009Q37280L10310j07838k22126n11728j037831r21177L91836J887276
39869E72993J979499O08262o39192o52634r5595j47590q09638j201082r56891
39860a341868m55891L5359N60572Q88993N69098k79208q93089q31096m89072l89700
39850b625902m10070q6018N77868R92282O79927j09017o01674l64901J47874J57676
$$ plain form
39840 -1641955 -2010509 -2664699 -2935955 -2731885 -2619273 -2860057 -2966565 -2446317 -1471180
39831 -1471180 -513926 203192 573571 424116 -86861 -322855 66650 585197 613236 343597
39821 343597 367292 595102 348645 -502169 -1183354 -952977 83286 1198864 1678079
39812 1678079 1169537 -130957 -1495498 -2218143 -2298578 -2294158 -2442973 -2316957 -1506817 -304104
39802 -304104 575597 772828 547888 339285 272182 191332 103248 357197 1150365 1967934
39792 1967934 1985321 1195417 652194 1183406 2233142 2548068 1810087 962907 942641 1675324
39782 1675324 2433399 2653932 2206674 1307260 451364 118792 261744 301605 -128095 -609727
39772 -609727 -348644 939695 2729728 4198859 4862952 4733247 4070612 3161940 2288694
$$ packed form
39840a641955l68554o54190k71256K04070J12612k40784j06508N20248R75137
39831a471180R57254P17118L70379j49455n10977k35994L89505N18547K8039k69639
39821C43597K3695K27810k46457q50814o81185K30377J036263J115578M79215
39812A678079n08542j300494j364541p22645q0435M420j48815J26016Q10140J202713
39802c04104Q79701J97231k24940k08603o7103q0850q8084K53949P93168Q17569
39792A967934J7387p89904n43223N31212J049736L14926p37981q47180k0266P32683
39782A675324P58075K20533m47258q99414q55896l32572J42952L9861m29700m81632
39772f09727K61083J288339J790033J469131O64093j29705o62635r08672q73246
$$ plain form
39763 2288694 1673053 1284587 827752 135045 -526698 -800253 -761018 -706666 -524003 157835
39753 157835 1107500 1440252 720076 -451591 -1288953 -1697182 -1909212 -1902724 -1763824 -2030310
39743 -2030310 -2924600 -3709027 -3595904 -2899496 -2440993 -2193134 -1519603 -521242 -24217
39734 -24217 -220497 -385546 -123732 67632 -259477 -854050 -1347490 -1703430 -1809097 -1397220
39724 -1397220 -703896 -464992 -895610 -1356742 -1370785 -1244773 -1292459 -1178077 -549983 306455
39714 306455 974536 1492912 1935195 2004092 1638941 1473991 1981202 2561527 2248770 1116432
39704 1116432 282267 516954 1367189 1736280 1002678 -512579 -1979543 -2813552 -2949987
39695 -2949987 -2490728 -1532412 -602008 -633909 -1743278 -2485184 -1448007 610106 1522250
$$ packed form
39763B288694o15641l88466m56835o92707o61743k73555L9235N4352J82663O81838
39753A57835R49665L32752p20176j171667q37362m08229k12030O488J38900k66486
39743b030310q94290p84427J13123O96408M58503K47859O73531R98361M97025
39734b4217j96280j65049K61814J91364l27109n94573m93440l55940j05667M11877
39724a397220O93324K38904m30618m61132j4043J26012m7686J14382O28094Q56438
39714C06455O68081N18376M42283O8897l65151j64950N07211N80325l12757j132338
39704A116432q34165K34687Q50235L69091p33602j515257j466964q34009j36435
39695b949987M59259R58316R30404l1901j109369p41906J037177K058113R12144
$$ plain form
39686 1522250 666036 -321663 -155656 393290 263425 47961 823717 2130997 2641671
39677 2641671 2164432 1555513 1130399 579157 143301 477650 1421537 2113157 2282917
39668 2282917 2351178 2349657 1881872 1118099 695812 584767 123675 -760086 -1423886 -1640265
39658 -1640265 -1756713 -1690540 -1001639 -158536 -436383 -2136791 -4081812 -5324671 -6147422
39649 -6147422 -6779860 -6429355 -4550036 -2061627 -220201 964104 2101090 2872065 2375418
39640 2375418 748240 -743920 -1294540 -1309186 -1408714 -1443168 -829875 564886 2159289
39631 2159289 3081394 2795761 1501504 -33875 -1098713 -1439669 -1095330 -175886 1024011
39622 1024011 2028530 2588813 2883070 3106454 3128904 2799064 2295746 1852021 1338551
$$ packed form
39686A522250q56214r87699J66007N48946j29865k15464P75756J307280N10674
39677B641671m77239o08919m25114n51242m35856L34349R43887O91620J69760
39668B282917O8261j521m67785p63773m22287j11045m61092q83761o63800k16379
39658a640265j16448O6173O88901Q43103k77847j700408j945021j242859q22751
39649f147422o32438L50505J879319K488409J841426J184305J136986P70975m96647
39640B375418j627178j492160n50620j4646r9528l4454O13293J394761J594403
39631B159289R22105k85633j294257j535379j064838l40956L44339R19444J199897
39622A024011J004519N60283K94257K23384K2450l29840n03318m43725n13470
$$ plain form
39613 1338551 447667 -821107 -2084221 -2867668 -2865926 -2159152 -1347235 -1186061 -1831725
39604 -1831725 -2630778 -2836414 -2321805 -1481304 -779728 -600776 -1149058 -2159321 -2965900
39595 -2965900 -3159002 -2947508 -2672555 -2322790 -1830735 -1461740 -1468436 -1627478 -1567180 -1363849
39585 -1363849 -1375463 -1594290 -1553413 -853376 436693 1789043 2486880 2154445 1236184
39576 1236184 650761 746770 985623 916855 910657 1407973 1958752 1757158 848034 34994
39566 34994 -265452 -334271 -391834 -297269 -59801 57010 57575 189753 297231 -82476 -772196
39555 -772196 -878269 -61358 795693 740154 35871 -339998 -112794 76414 -284380 -972385
39545 -972385 -1493839 -1638905 -1483065 -1243337 -1236578 -1630080 -2134396 -2296707 -2212200 -2497152
$$ packed form
39613A338551q90884j268774j263114p83447J742P06774Q11917J61174o45664
39604a831725p99053k05636N14609Q40501P01576J78952n48282j010263q06579
39595b965900j93102K11494K74953L49765M92055L68995o696j59042O0298K03331
39585a363849j1614k18827M0877P00037J290069J352350O97837l32435r18261
39576A236184n85423R6009K38853o8768o198M97316N50779k01594r09124q13040
39566C4994l00446o8819n7563R4565K37468J16811N65J32178J07478l79707o89720
39555g72196j06073Q16911Q57051n5539p04283l75869K27204J89208l60794o88005
39545i72385n21454j45066J55840K39728O759l93502n04316j62311Q4507k84952
$$ plain form
39535 -2497152 -3263786 -3583244 -2573794 -807289 163375 -168208 -517576 362288 1776841
39526 1776841 1959484 569736 -807531 -851444 -98415 266711 295889 932811 2242031
39517 2242031 3108037 2733604 1563924 526796 38516 -7419 131330 126276 -229235 -604082
39507 -604082 -315043 772656 1891332 2218877 1765948 1136592 744269 626647 749034
39498 749034 1026983 1154679 827716 174664 -298198 -246873 161311 422302 124992 -708787
39488 -708787 -1590414 -1945908 -1640779 -1059574 -621430 -379118 -191541 -81542 -199532 -519430
39478 -519430 -769222 -681231 -265187 129854 81127 -400897 -687375 -188732 752545 1066617
39468 1066617 288601 -751458 -994398 -554376 -436895 -980049 -1296490 -523751 883990
$$ packed form
39535b497152p66634l19458J009450J766505R70664l31583l49368Q79864J414553
39526A776841J82643j389748j377267m3913P53029L65126K9178O36922J309220
39517B242031Q66006l74433j169680j037128m88280m5935J38749n054l55511l74847
39507f04082K89039J087699J118676L27545m52929o29356l92323j17622J22387
39498G49034K77949J27696l26963o53052m72862N1325M08184K60991k97310q33779
39488g08787q81627l55494L05129N81205M38144K42312J87577J09999j17990l19898
39478e19430k49792Q7991M16044L95041m8727m82024k86478M98643R41277L14072
39468A066617p78016j040059k42940M40022J17481n43154l16441P72739J407741
$$ plain form
39459 883990 1597401 1015444 20813 -24959 1114095 2200111 1894363 299066 -1183354
39450 -1183354 -1492319 -963370 -574089 -647548 -777003 -692991 -563330 -519226 -475011 -441451
39440 -441451 -475828 -275056 586018 1859367 2674548 2659150 2432444 2605825 2855982 2540016
39430 2540016 1783758 1274235 1209002 1137887 775496 337319 20148 -303108 -750294 -1229723
39420 -1229723 -1672825 -2072732 -2229103 -1887302 -1235031 -831601 -914916 -1206715 -1530413 -2107506
39410 -2107506 -2994127 -3730272 -3909379 -3667084 -3236053 -2496013 -1475865 -833672 -1097271
39401 -1097271 -1691411 -1561156 -736923 -429220 -1345323 -2665544 -3111534 -2453641 -1458310
39392 -1458310 -799029 -621643 -892319 -1488270 -1985424 -1961604 -1616285 -1594446 -2051603 -2384947
$$ packed form
39459H83990P13411n81957r94631m5772J139054J086016l05748j595297j482420
39450a183354l08965N28949L89281p3459j29455Q4012J29661M4104M4215L3560
39440d41451l4377K00772Q61074J273349Q15181j5398k26706J73381K50157l15966
39430B540016p56258n09523o5233p1115l62391m38177l17171l23256m47186m79429
39420a229723m43102l99907j56371L41801O52271M03430q3315k91799l23698n77093
39410b107506q86621p36145j79107K42295M31031P40040J020148O42193k63599
39401a097271n94140J30255Q24233L07703r16103j320221m45990O57893R95331
39392a458310O59281J77386k70676n95951m97154K3820L45319K1839m57157l33344
$$ plain form
39382 -2384947 -2129081 -1603936 -1241175 -731053 443636 1812415 2119271 926020 -724401
39373 -724401 -1657783 -1924922 -2192141 -2362192 -1770875 -548486 289107 304136 253108 825531
39363 825531 1587739 1790429 1553777 1472526 1506032 1131998 389693 -77581 -16768 116399
39353 116399 -95896 -601944 -1299765 -2272425 -3389437 -4159823 -4208246 -3558101 -2399202
39344 -2399202 -1052681 -217765 -591080 -1914192 -2930411 -2721392 -1718609 -980958 -806702
39335 -806702 -579174 148179 916710 838945 -406929 -2178920 -3450976 -3758694 -3461536
39326 -3461536 -3034048 -2430304 -1501153 -715550 -767257 -1486898 -1900108 -1575455 -1193557 -1405199
39316 -1405199 -1817492 -1709454 -1236117 -1197081 -1868467 -2733607 -3263036 -3364272 -3067826 -2327784
$$ packed form
39382b384947K55866N25145L62761N10122J174689J368779L06856j193251j650421
39373g24401r33382k67139k67219j70051N91317J222389Q37593J5029n1028N72423
39363H25531P62208K02690k36652q1251L3506l74034p42305m67274O0813J33167
39353A16399k12295n06048o97821r72660j117012p70386m8423O50145J158899
39344b399202J346521Q34916l73315j323112j016219K09019J002783P37651J74256
39335h06702K27528P27353P68531p7765j245874j771991j272056l07718K97158
39326c461536M27488O03744R29151P85603n1707p19641m13210L24653L81898k11642
39316a405199m12293J08038M73337L9036o71386q65140n29429j01236K96446P40042
$$ plain form
39306 -2327784 -1314856 -560216 -561434 -1289371 -2135828 -2390559 -1886537 -1147246 -726273 -527744
39296 -527744 -145362 261531 70454 -751564 -1437773 -1555364 -1615898 -2113827 -2698439 -2927769
39286 -2927769 -3138109 -3710850 -4021222 -3144340 -1368350 -51931 -36965 -981775 -2149348
39277 -2149348 -3023662 -3195306 -2510960 -1474473 -825945 -666055 -603375 -628419 -997199 -1315349
39267 -1315349 -788219 413435 1071773 623206 3559 221871 937218 1233426 1181519
39258 1181519 1695281 3064646 4434833 4784334 3910011 2397650 1008011 195529 -16389
39249 -16389 130399 376449 555419 637991 827638 1417447 2270844 2667728 2106242 1091084
39239 1091084 583524 767713 970469 739150 263200 -332023 -1276462 -2456247 -3177269
$$ packed form
39306b327784J012928P54640j218p27937q46457k54731N04022P39291M20973J98529
39296e27744L82382M06893j91077q22018o86209j17591o0534m97929n84612k29330
39286b927769k10340n72741l10372Q76882J775990J316419J4966r44810j167573
39277b149348q74314j71644O84346J036487O48528J59890O2680k5044l68780l18150
39267a315349N27130J201654O58338m48567o19647K18312P15347K96208n1907
39258A181519N13762J369365J370187L49501q74323j512361j389639q12482k11918
39249a6389J46788K46050J78970Q2572J89647N89809Q53397L96884n61486j015158
39239A091084n07560J84189K02756k31319m75950n95223r44439j179785p21022
$$ plain form
39230 -3177269 -3053539 -2533341 -2125855 -1667555 -824731 153850 677953 483129 -267835
39221 -267835 -1166095 -1591658 -1098080 -108928 313012 -209757 -838751 -765171 -366339 -495998
39211 -495998 -1163668 -1682500 -1769923 -1731926 -1769928 -1827049 -2007200 -2480474 -2988736 -3001872
39201 -3001872 -2398156 -1582663 -965357 -669968 -651028 -730917 -615672 -192906 308387 712667
39191 712667 1218901 2001747 2725882 2819220 2066168 695833 -823271 -1834804 -1793587
39182 -1793587 -936753 -268115 -416865 -884939 -899091 -584707 -689269 -1461012 -2411681 -2956181
39172 -2956181 -2775897 -1856324 -689730 -82934 -212199 -290681 227204 667046 181952
39163 181952 -747194 -914846 -167181 553587 772687 905756 1096257 820621 -68566 -904400
$$ packed form
39230c177269J23730N20198M07486M58300Q42824R78581N24103j94824p50964
39221b67835q98260m25563M93578R89152M21940n22769o28994P3580L98832j29659
39211d95998o67670n18832q7423L7997l8002n7121j80151m73274n08262j3136
39201c001872O03716Q15493O17306K95389J8940p9889J15245M22766N01293M04280
39191G12667N06234P82846P24135R3338p53052j370335j519104j011533M1217
39182a793587Q56834O68638j48750m68074j4152L14384j04562p71743r50669n44500
39172b956181J80284R19573J166594O06796j29265p8482N17885M39842m85094
39163A81952r29146j67652P47665P20768K19100J33069J90501k75636q89187q35834
$$ plain form
39153 -904400 -1163572 -1058785 -917098 -763355 -761475 -1230896 -1891193 -1874840 -892707 279363
39143 279363 839206 859474 810186 788981 618904 251788 -221447 -607947 -602478 -192701
39133 -192701 44088 -271844 -411166 608785 2269007 2817171 1537322 -415183 -1823961
39124 -1823961 -2810812 -3815559 -4431586 -4207384 -3625052 -3259243 -2770756 -1777556 -997631
39115 -997631 -1350275 -2406243 -2884884 -2420686 -1813600 -1700601 -1897852 -1968921 -1677542 -971868
39105 -971868 -146342 176717 -191239 -556005 -233097 510786 1035956 1320770 1578211 1450697
39095 1450697 629227 -153471 60180 864651 934345 -5250 -859373 -905119 -656959 -731934
39085 -731934 -974173 -1153128 -1573567 -2413122 -3132385 -3070483 -2209977 -1094610 -392918 -563399
$$ packed form
39153i04400k59172J04787J41687J53743J880m69421o60297J6353R82133J172070
39143B79363N59843K0268m9288k1205j70077l67116m73235l86500N469M09777
39133a92701K36789l15932j39322J019951J660222N48164j279849j952505j408778
39124a823961r86851j004747o16027K24202N82332L65809M88487R93200P79925
39115i97631l52644j055968m78641M64198O07086J12999j97251p1069K91379P05674
39105i71868Q25526L23059l67956l64766L22908P43883N25170K84814K57441j27514
39095A450697q21470p82698K13651Q04471O9694r39595q54123m5746K48160p4975
39085g31934k42239j78955m20439q39555p19263O1902Q60506J115367P01692j70481
$$ plain form
39075 -563399 -1388228 -1892967 -1412120 -583311 -390855 -454910 391370 1790191 1833473 -1251
39065 -1251 -1530698 -691375 1561948 2640013 1729118 251520 -532519 -703201 -563042
39056 -563042 64204 1059772 1735973 1794798 1666777 1546728 993048 -50001 -669690 -100129
39046 -100129 1113505 1704059 1113456 -152446 -1279905 -1758406 -1495351 -870586 -592438
39037 -592438 -1045352 -1791178 -2069229 -1744307 -1371529 -1324521 -1321655 -993757 -501482 -205786
39027 -205786 44688 803072 2153352 3367248 3680403 3172422 2577970 2351119 2260170
39018 2260170 1917205 1364868 964420 906566 1027444 1010707 636055 -77653 -833825 -1214553
39008 -1214553 -991205 -269615 687092 1672417 2528253 3077551 3202882 2937982 2424980
$$ packed form
39075e63399q24829n04739M80847Q28809J92456o4055Q46280J398821M3282j834724
39065a251j529447Q39323K253323J078065r10895j477598p84039j70682J40159
39056e63042O27246R95568O76201N8825j28021j20049n53680j043049o19689N69561
39046a00129J213634N90554n90603j265902j127459m78501K63055O24765K78148
39037e92438m52914p45826k78051L24922L72778M7008K866L27898M92275K95696
39027b05786K50474P58384J350280J213896L13155n07981n94452k26851r0949
39018B260170l42965n52337m00448n7854J20878j6737l74652p13708p56172l80728
39008a214553K23348P21590R56707R85325Q55836N49298J25331k64900n13002
$$ plain form
38999 2424980 1860082 1467065 1312585 1098940 441555 -467411 -796218 -38692 1154605
38990 1154605 1567223 826458 -187956 -432793 159288 796953 788442 117396 -785282 -1545713
38980 -1545713 -2042557 -2214026 -1863651 -889768 252111 682884 86794 -636227 -271461
38971 -271461 1138566 2247010 2151014 1533505 1556100 2164796 2300137 1568789 810542 846798
38961 846798 1404309 1664324 1383920 1034138 1101974 1606265 2123041 2059287 1138158 -148765
38951 -148765 -832848 -500173 185164 260046 -475068 -1463139 -2175140 -2492500 -2534543 -2538272
38941 -2538272 -2726822 -2869514 -2217123 -448761 1494611 2213795 1455123 222328 -695440
38932 -695440 -1454302 -2249662 -2657850 -2415478 -2043881 -1973310 -1688047 -602829 687720
$$ packed form
38999B424980n64898l93017j54480k13645o57385r08966l28807P57526J193297
38990A154605M12618p40765j014414k44837N92081O37665q511o71046r02678p60431
38980a545713m96844j71469L50375R73883J141879M30773n96090p23021L64766
38971b71461J410027J108444r5996o17509K2595O08696J35341p31348p58247L6256
38961H46798N57511K60015k80404l49782O7836N04291N16776o3754r21129j286923
38951a48765o84083L32675O85337P4882p35114r88071p12001l17360m2043l729
38941b538272j88550j42692O52391J768362J943372P19184p58672j232795r17768
38932f95440p58862p95360m08188K42372L71597P0571K85263J085218J290549
$$ plain form
38923 687720 1049742 508439 276610 993993 1876258 1951656 1381497 1049267 1354783 1946054
38913 1946054 2333981 2294590 1848930 1259556 931121 947374 800500 -15890 -1146887 -1561848
38903 -1561848 -820290 181535 122110 -1181788 -2520189 -2687126 -1787042 -927446 -905838
38894 -905838 -1571689 -2317257 -2722865 -2696586 -2423590 -2320409 -2670561 -3136703 -2980609 -1971306
38884 -1971306 -757830 -124543 -177496 -470646 -590177 -360461 169615 638684 609337 188037
38874 188037 15235 315458 479246 91603 -196168 380138 1262997 1081555 -466335
38865 -466335 -2168590 -2873741 -2684339 -2308470 -1967529 -1421948 -625596 97234 344837
38856 344837 -77252 -964572 -1766425 -2097905 -2165545 -2361255 -2573490 -2399396 -1933576 -1704678
$$ packed form
38923F87720L62022n41303k31829P17383Q82265P5398n70159l32230L05516N91271
38913A946054L87927l9391m45660n89374l28435J6253j46874q16390j130997m14961
38903a561848P41558J001825n9425j303898j338401j66937R00084Q59596K1608
38894i05838o65851p45568m05608K6279K72996J03181l50152m66142J56094J009303
38884a971306J213476O33287n2953k93150j19531K29716N30076M69069k9347m21300
38874A88037j72802L00223J63788l87643k87771N76306Q82859j81442j547890
38865d66335j702255p05151J89402L75869L40941N45581P96352P22830K47603
38856C44837m22089q87320q01853l31480o7640j95710k12235J74094M65820K28898
$$ plain form
38846 -1704678 -1812939 -1817398 -1601917 -1650101 -2214938 -2858460 -3118493 -3054428 -2834467 -2370525
38836 -2370525 -1719521 -1292556 -1250208 -1142657 -521458 494788 1532737 2358979 2711182
38827 2711182 2320401 1443490 788238 536159 54923 -1011254 -2061156 -2479648 -2558778
38818 -2558778 -2803014 -2968237 -2609264 -2062110 -1995686 -2350960 -2570845 -2579952 -2703253 -2875504
38808 -2875504 -2774990 -2532772 -2470574 -2318456 -1575232 -552657 -185120 -780440 -1701039
38799 -1701039 -2239369 -2092420 -1147964 285902 1140005 533288 -840559 -1330062 -548555
38790 -548555 108561 -417391 -1292331 -1082250 205117 1247648 1151874 315988 -268844
38781 -268844 -55199 639490 981878 528736 -180485 -312948 -29073 -432199 -1999046
$$ packed form
38846a704678j08261m459K15481m8184n64837o43522k60033O4065K19961M63942
38836b370525O51004M26965M2348J07551O21199J016246J037949Q26242L52203
38827B711182l90781q76911o55252k52079m81236j066177j049902m18492p9130
38818b558778k44236j65223L58973N47154O6424l55274k19885r107j23301j72251
38808b875504J00514K42218O2198J52118P43224J022575L67537n95320r20599
38799a701039n38330J46949R44456J433866Q54103o06717j373847m89503P81507
38790e48555O57116n25952q74940K10081J287367J042531r5774q35886n84832
38781b68844K13645O94689L42388m53142p09221j32463K83875m03126j566847
$$ plain form
38772 -1999046 -3743757 -4399180 -3883771 -3082607 -2625339 -2445649 -2238090 -1817138 -1205209
38763 -1205209 -747987 -929367 -1760696 -2629722 -3046800 -3189502 -3387119 -3510562 -3346596
38754 -3346596 -3175646 -3375854 -3703822 -3576481 -2943936 -2335216 -2093309 -2044801 -1899646 -1543771
38744 -1543771 -936022 -103124 723597 1251566 1413547 1327681 1107661 945010 1161332 1813555
38734 1813555 2393544 2304001 1537519 530891 -513056 -1695517 -2847222 -3383689 -2927056
38725 -2927056 -1811083 -806718 -436301 -568201 -621955 -250374 180067 60924 -450180
$$ packed form
38772a999046j744711o55423N15409Q01164M57268J79690K07559M20952O11929
38763a205209M57222j81380q31329q69026m17078j42702j97617j23443J63966
38754c346596J70950k00208l27968J27341O32545O08720K41907M8508J45155L55875
38744a543771O07749Q32898Q26721N27969J61981q5866k20020j62651K16322O52223
38734A813555N79989q9543p66482j006628j043947j182461j151705n36467M56633
38725b927056J115973J004365L70417j31900n3754L71581M30441j19143n11104
$$ [...]
##END NTUPLES=NMR SPECTRUM
##END=
