##TITLE=31Pdec_LR-784-R3-CR10
 CDCl3, 24 sc
 3.2.2025
##JCAMPDX= 6.0         $$ Bruker NMR JCAMP-DX V2.0
##DATA TYPE= NMR SPECTRUM
##DATA CLASS= NTUPLES
##ORIGIN= UXNMR, Bruker Analytische Messtechnik GmbH
##OWNER= root
$$ XWIN-NMR		Version 3.5
$$ Mon Feb  3 18:39:54 2025 Russian Standard Time (UT+4h)  she@DPX200
##.OBSERVE FREQUENCY= 81.013821
##.OBSERVE NUCLEUS= ^31P
##.ACQUISITION MODE= SIMULTANEOUS
##.ACQUISITION SCHEME= undefined
##.AVERAGES= 24
##.DIGITISER RES= 17
##SPECTROMETER/DATA SYSTEM= spect
##.PULSE SEQUENCE= zgpg30
##.SOLVENT NAME= CDCl3
##.SHIFT REFERENCE= (INTERNAL, CDCl3, 0, 198.062)
##AUDIT TRAIL= $$ (NUMBER, WHEN, WHO, WHERE, WHAT)
$$ ##TITLE= Audit trail, XWIN-NMR		Version 3.5
$$ ##JCAMPDX= 5.01
$$ ##ORIGIN= Bruker BioSpin GmbH
$$ ##OWNER= she
$$ F:/spectra/data/she/nmr/P31/2/pdata/1/auditp.txt
$$ ##AUDIT TRAIL=  $$ (NUMBER, WHEN, WHO, WHERE, WHAT)
(   1,<2025-02-03 18:38:51.76 +0400>,<she>,<DPX200>,
      <created by zg, POWCHK disabled, PULCHK disabled
       configuration hash MD5:
       00 E9 B6 7A A2 85 ED C7 34 08 36 98 17 FE 4E 26
       data hash MD5: 32K
       7C 57 75 0E 83 DA B4 72 21 5F 1D D9 EC C4 83 2D>)
(   2,<2025-02-03 18:38:54.14 +0400>,<she>,<DPX200>,
      <Start of raw data processing
       efp BC_mod = 2 LB = 1.5 FT_mod = 6 PKNL = 1 PHC0 = 1734.924 PHC1 = 177.2909 SI = 64K 
       data hash MD5: 64K
       4A 97 54 93 E1 D0 D1 12 74 7B 89 51 13 74 F9 E0>)
(   3,<2025-02-03 18:39:11.35 +0400>,<she>,<DPX200>,
      <pk PHC0 = 2.003259 PHC1 = 0 
       data hash MD5: 64K
       F5 B1 2A 0C 8B 28 DD 48 76 2C 9A EE CB CF BF FB>)
(   4,<2025-02-03 18:39:15.35 +0400>,<she>,<DPX200>,
      <abs ABSG = 5 
       data hash MD5: 64K
       BC 1F 81 D3 1D 61 86 25 C5 F2 43 70 78 96 20 C1>)
$$ ##END=
$$ 
$$ hash MD5
$$ DC 60 40 08 F2 B1 20 58 2F B2 BB 68 B3 B6 1C D5
##$RELAX= 
##$RELAX= 
##$RELAX= 
##$RELAX= 
##$RELAX= 
##$RELAX= 
##$RELAX= 
##$RELAX= 
$$ Bruker specific parameters
$$ --------------------------
##$DU= <F:/spectra>
##$EXPNO= 2
##$NAME= <P31>
##$PROCNO= 1
##$TYPE= <nmr>
##$USER= <she>
##$AMP= (0..31)
100 100 100 100 100 100 100 100 100 100 100 100 100 100 100 100 100 100 
100 100 100 100 100 100 100 100 100 100 100 100 100 100 
##$AQSEQ= 0
##$AQ_mod= 1
##$AUNM= <au_zg>
##$AUTOPOS= <>
##$BF1= 81.014009
##$BF2= 200.13
##$BF3= 200.13
##$BF4= 200.13
##$BF5= 200.13
##$BF6= 200.13
##$BF7= 200.13
##$BF8= 200.13
##$BYTORDA= 1
##$CFDGTYP= 0
##$CFRGTYP= 5
##$CHEMSTR= <none>
##$CNST= (0..31)
1 1 145 1 1 1 1 1 1 1 1 1 1 1 1 1 1 1 1 1 1 1 1 1 1 1 1 1 1 1 1 1 
##$CPDPRG= <waltz16>
##$CPDPRG1= <>
##$CPDPRG2= <waltz16>
##$CPDPRG3= <>
##$CPDPRG4= <mlev>
##$CPDPRG5= <mlev>
##$CPDPRG6= <mlev>
##$CPDPRG7= <mlev>
##$CPDPRG8= <mlev>
##$CPDPRGB= <>
##$CPDPRGT= <>
##$D= (0..31)
0 1 0 0 0 0 0 0 0 0.06 0 0.03 2e-05 3e-06 0 0 0.0002 0 0 0 0 0 0 0 0 0 
0 0 0 0 0 0 
##$DATE= 1738593531
##$DBL= (0..7)
120 120 120 11 120 120 24 19 
##$DBP= (0..7)
150 150 150 150 150 150 150 150 
##$DBP07= 0
##$DBPNAM0= <>
##$DBPNAM1= <>
$$ [...]
##$SUBNAM3= <"">
##$SUBNAM4= <"">
##$SUBNAM5= <"">
##$SUBNAM6= <"">
##$SUBNAM7= <"">
##$SUBNAM8= <"">
##$SUBNAM9= <"">
##$SW= 400.765351723535
##$SWIBOX= (0..15)
0 1 3 0 0 0 0 0 0 0 0 0 0 0 0 0 
##$SW_h= 32467.5324675325
##$TD= 32768
##$TD0= 1
##$TE= 0
##$TE2= 300
##$TE3= 300
##$TEG= 300
##$TL= (0..7)
0 120 53 12 22 120 120 120 
##$TP= (0..7)
150 150 150 150 150 150 150 150 
##$TP07= 0
##$TPNAME0= <>
##$TPNAME1= <>
##$TPNAME2= <>
##$TPNAME3= <>
##$TPNAME4= <>
##$TPNAME5= <>
##$TPNAME6= <>
##$TPNAME7= <>
##$TPOAL= (0..7)
0.5 0.5 0.5 0.5 0.5 0.5 0.5 0.5 
##$TPOFFS= (0..7)
0 0 0 0 0 0 0 0 
##$TUNHIN= 0
##$TUNHOUT= 0
##$TUNXOUT= 0
##$USERA1= <user>
##$USERA2= <user>
##$USERA3= <user>
##$USERA4= <user>
##$USERA5= <user>
##$V9= 5
##$VALIST= <valist>
##$VCLIST= <CCCCCCCCCCCCCCC>
##$VD= 0
##$VDLIST= <DDDDDDDDDDDDDDD>
##$VPLIST= <PPPPPPPPPPPPPPP>
##$VTLIST= <TTTTTTTTTTTTTTT>
##$WBST= 1024
##$WBSW= 4
##$XGAIN= (0..3)
0 0 0 0 
##$XL= 0
##$YL= 0
##$YMAX_a= 6394
##$YMIN_a= -11559
##$ZGOPTNS= <>
##$ZL1= 120
##$ZL2= 120
##$ZL3= 120
##$ZL4= 120
##$ABSF1= 198.0616
##$ABSF2= -202.7028
##$ABSG= 5
##$ABSL= 3
##$ALPHA= 0
##$AQORDER= 0
##$ASSFAC= 0
##$ASSFACI= 0
##$ASSFACX= 0
##$ASSWID= 0
##$AUNMP= <proc_1d>
##$AZFE= 0.1
##$AZFW= 0.5
##$BCFW= 0
##$BC_mod= 2
##$BYTORDP= 0
##$COROFFS= 0
##$CY= -3
##$DATMOD= 1
##$DC= 0
##$DFILT= <>
##$DTYPP= 0
##$F1P= 0
##$F2P= 0
##$FCOR= 1
##$FTSIZE= 65536
##$FT_mod= 6
##$GAMMA= 0
##$GB= 0
##$INTBC= 1
##$INTSCL= 9.790993e-09
##$ISEN= 30
##$LB= 1.5
##$LEV0= 0
##$LPBIN= 0
##$MAXI= 10000
##$MC2= 0
##$MEAN= 0
##$ME_mod= 0
##$MI= 50
##$NCOEF= 0
##$NC_proc= -7
##$NLEV= 6
##$NOISF1= 182.463
##$NOISF2= 159.3651
##$NSP= 0
##$NTH_PI= 0
##$NZP= 0
##$OFFSET= 198.0616
##$PC= 4
##$PHC0= 1736.927
##$PHC1= 177.2909
##$PH_mod= 1
##$PKNL= yes
##$PPARMOD= 0
##$PSCAL= 0
##$PSIGN= 0
##$REVERSE= no
##$SF= 81.0140089999434
##$SI= 65536
##$SIGF1= 159.3651
##$SIGF2= -187.1042
##$SINO= 113.3802
##$SIOLD= 16384
##$SREGLST= <1H.CDCl3>
##$SSB= 0
##$STSI= 65536
##$STSR= 0
##$SW_p= 32467.5324675325
##$SYMM= 0
##$S_DEV= 0
##$TDeff= 32768
##$TDoff= 0
##$TI= <>
##$TILT= no
##$TM1= 0
##$TM2= 0
##$TOPLEV= 0
##$USERP1= <user>
##$USERP2= <user>
##$USERP3= <user>
##$USERP4= <user>
##$USERP5= <user>
##$WDW= 1
##$XDIM= 65536
##$YMAX_p= 291073188
##$YMIN_p= -41238927
$$ End of Bruker specific parameters
$$ ---------------------------------
##NTUPLES= NMR SPECTRUM
##VAR_NAME=  FREQUENCY,     SPECTRUM/REAL,   SPECTRUM/IMAG
##SYMBOL=    X,             R,               I
##VAR_TYPE=  INDEPENDENT,   DEPENDENT,       DEPENDENT
##VAR_FORM=  AFFN,          ASDF,            ASDF
##VAR_DIM=   65536,         65536,           65536
##UNITS=     HZ,            ARBITRARY UNITS, ARBITRARY UNITS
##FACTOR=    0.49542278885378, 1,            1
##FIRST=     16045.7642231865, 0,            0
##LAST=      -16421.768244346, 0,            0
##MIN=       -16421.768244346, -41238927,    0
##MAX=       16045.7642231865, 291073188,    0
$$ Real data points
##PAGE= N=1
##DATA TABLE= (X++(R..R)), XYDATA
$$ [...]
$$ plain form
44311 -450395 -155556 -235893 -867418 -1619854 -1894942 -1441817 -512916 383167 898522 991773
44301 991773 684627 -46015 -961412 -1498937 -1384642 -1022494 -861655 -716629 -267222 143727
44291 143727 22148 -201582 380244 1583656 2075309 1247394 213784 345307 1517508
44282 1517508 2477679 2454760 1761027 1141650 1116016 1746019 2583464 3000129 2866599 2646824
44272 2646824 2597902 2336090 1578232 814996 666844 932847 925970 528024 259988 405291
44262 405291 678057 777216 756781 782862 919949 1185989 1482476 1505808 1078309 513193
44252 513193 290849 445497 655450 830263 1112799 1338595 1074693 316793 -398936 -801126
44242 -801126 -1269595 -2037577 -2459301 -1689468 13035 1239140 883125 -692653 -2196047
$$ packed form
44311d50395K94839q0337o31525p52436k75088M53125R28901Q96083N15355R3251
44301I91773l07146p30642r15397n37525J14295L62148J60839J45026M49407M10949
44291A43727j21579k23730N81826J203412M91653q27915j033610J31523J172201
44282A517508R60171k2919o93733o19377k5634O30003Q37445M16665j33530k19775
44272B646824m8922k61812p57858p63236j48152K66003o877l97946k68036J45303
44262D05291K72766R9159k0435K6081J37087K66040K96487K3332m27499n65116
44252E13193k22344J54648K09953J74813K82536K25796k63902p57900p15729m02190
44242h01126m68469p67982m21724P69833J702503J226105l56015j575778j503394
$$ plain form
44233 -2196047 -2874821 -3067279 -3334634 -3563031 -3278234 -2519496 -1817674 -1348131 -731398
44224 -731398 124829 582357 116379 -797835 -1147700 -486092 868728 2434640 3786996
44215 3786996 4410732 4088139 3469283 3546223 4355218 4828777 4246488 3245692 2904999
44206 2904999 3263097 3376981 2673414 1620613 988184 927377 1005079 841481 448061 83902
44196 83902 11324 320929 777289 860473 215321 -849628 -1528274 -1342488 -629142 -32453
44186 -32453 240118 318094 63257 -825853 -2041808 -2605993 -1892993 -321915 1227927
44177 1227927 2249537 2561000 2003240 796186 -173066 -124780 694644 1455033 1908652
44168 1908652 2418501 2961300 2974953 2326472 1593556 1076981 327501 -850776 -1647691
$$ packed form
44233b196047o78774j92458k67355k28397K84797P58738P01822M69543O16733
44224g31398Q56227M57528m65978r14214l49865O61608J354820J565912J352356
44215C786996O23736l22593o18856P6940Q08995M73559n82289j000796l40693
44206B904999L58098J13884p03567j052801o32429o0807P7702j63598l93420l64159
44196H3902p2578L09605M56360Q3184o45152j064949o78646J85786P13346N96689
44186c2453K72571P7976k54837q89110j215955n64185P13000J571078J549842
44177A227927J021610L11463n57760j207054r69252M8286Q19424P60389M53619
44168A908652N09849N42799J3653o48481p32916n16575p49480j178277p96915
$$ plain form
44159 -1647691 -1243648 -100575 588872 556116 690315 1510352 2229661 1843078 643675
44150 643675 -34864 482632 1378974 1439295 557399 -260434 -187676 608605 1421226 1759343
44140 1759343 1490167 696523 -277256 -955715 -1225448 -1426487 -1701454 -1668290 -1140209 -720087
44130 -720087 -1063669 -1865042 -2264729 -2066731 -1839756 -1943432 -2187944 -2372268 -2397306 -1916509
44120 -1916509 -717543 567822 1050018 893399 1004125 1337920 810251 -740985 -1905696
44111 -1905696 -1760808 -1260917 -1509081 -1816699 -901077 816078 1704090 1315614 761163
44102 761163 809175 1019140 876400 556301 321260 186385 392941 1246767 2267603 2438801
44092 2438801 1587268 682741 518730 899554 1343804 1743332 2060273 2184941 2350330
$$ packed form
44159a647691M04043J143073O89447l2756J34199Q20037P19309l86583j199403
44150F43675o78539N17496Q96342O0321q81896q17833P2758P96281Q12621L38117
44140A759343k69176p93644r73779o78459k69733k01039k74967L3164N28081M20122
44130g20087l43582q01373l99687J97998K26975j03676k44512j84324k5038M80797
44120a916509J198966J285365M82196j56619J10726L33795n27669j551236j164711
44111a905696J44888M99891k48164l07618R15622J717155Q88012l88476n54451
44102G61163M8012K09965j42740l20099k35041j34875K06556Q53826J020836J71198
44092B438801q51533r04527j64011L80824M44250L99528L16941J24668J65389
$$ plain form
44083 2350330 2895360 3449934 3270772 2549159 2287417 2608418 2478114 1618863 1285512
44074 1285512 2253161 3362561 3269512 2493987 2280513 2355378 1527608 -39040 -956046
44065 -956046 -839999 -695878 -979655 -936483 -256297 143020 -323754 -800148 -257504 1048114
44055 1048114 2153344 2659399 2708457 2370299 1791958 1406081 1288862 801320 -431697
44046 -431697 -1626311 -1671992 -562976 684515 1288990 1199942 566579 -499680 -1605096
44037 -1605096 -2169629 -2011168 -1426118 -638503 407421 1612488 2474839 2492208 1656567
44028 1656567 474745 -399092 -600890 -299267 4672 -985 -203801 -377327 -474547 -485748
44018 -485748 -310150 6515 208198 272564 586959 1323010 1965660 1932229 1404105 1036298
$$ packed form
44083B350330N45030N54574j79162p21613k61742L21001j30304q59251l33351
44074A285512R67649J109400r3049p75525k13474P4865q27770j566648r17006
44065i56046J16047J44121k83777M3172O80186L99317m66774m76394N42644J305618
44055A048114J105230N06055M9058l38158n78341l85877j17219m87542j233017
44046d31697j194614m5681J109016J247491O04475q9048o33363j066259j105416
44037a605096n64533J58461N85050P87615J045924J205067Q62351J7369q35641
44028A656567j181822q73837k01798L01623L03939n657k02816j73526r7220j1201
44018d85748J75598L16665K01683O4366L14395P36051O42650l3431n28124l67807
$$ plain form
44008 1036298 1049171 1141648 1107913 927133 387910 -660717 -1686326 -1824454 -992654 -25365
43998 -25365 446465 621794 892890 1314113 1993537 3245226 4826866 5655824 4967059
43989 4967059 3388818 2264053 2165308 2600254 2902745 2816276 2345399 1606421 849470
43980 849470 282460 -73039 -146803 270600 1058340 1570832 1382937 889940 624178 354283
43970 354283 -413930 -1358631 -1684474 -1429076 -1431371 -1891483 -1948136 -996281 459820 1649873
43960 1649873 2376125 2559898 1877118 545852 -340369 -144201 307318 -4018 -630234
43951 -630234 -469920 201748 6059 -1215113 -1876199 -970742 385502 597350 -220906
43942 -220906 -790807 -753259 -942949 -1732425 -2278889 -1740127 -450854 568337 819107
$$ packed form
44008A036298J2873R2477l3735j80780n39223j048627j025609j38128Q31800R67289
43998b5365M71830J75329K71096M21223O79424J251689J581640Q28958o88765
43989D967059j578241j124765r8745M34946L02491q6469m70877p38978p56951
43980H49470n67010l55499p3764M17403P87740N12492j87895m92997k65762k69895
43970C54283p68213r44701l25843K55398k295m60112n6653R51855J456101J190053
43960A649873P26252J83773o82780j331266q86221J96168M51519l11336o26216
43951f30234J60314O71668j95689j221172o61086R05457J356244K11848q18256
43942b20906n69901L7548j89690p89476n46464N38762J289273J019191K50770
$$ plain form
43933 819107 626388 491115 529842 529437 337081 108098 154605 561121 1068618 1407035
43923 1407035 1550424 1466600 859388 -450705 -1974562 -2822208 -2620681 -1867911 -1325283
43914 -1325283 -1371397 -1969900 -2816201 -3326365 -2922623 -1686428 -449593 104268 212567
43905 212567 597978 1492433 2457844 2970642 2768348 1810062 441538 -458975 -129567
43896 -129567 1093425 1940878 1635573 764582 424375 841060 1251897 959093 60661
43887 60661 -836307 -1247453 -1052516 -382947 495137 1214340 1403043 949311 254343 50924
43877 50924 689369 1610325 1818421 960952 -331059 -1254753 -1633681 -1716759 -1582787 -1158825
43867 -1158825 -611099 -275241 -271861 -539551 -1132242 -2055807 -2863201 -2924089 -2235094 -1551522
$$ packed form
43933H19107j92719j35273L8727m05j92356k28983M6507M06516N07497L38417
43923A407035J43389q3824o07212j310093j523857q47646K01527P52770N42628
43914a325283m6114n98503q46301n10164M03742J236195J236835N53861J08299
43905B12567L85411Q94455R65411N12798k02294r58286j368524r00513L29408
43896a29567J222992Q47453l05305q70991l40207M16685M10837k92804q98432
43887F0661q96968m11146J94937O69569Q78084P19203J88703m53732o94968k03419
43877E0924O38445R20956K08096q57469j292011r23694l78928q3078J33972M23962
43867a158825N47726L35858L380k67690n92691r23565q07394o0888O88995O83572
$$ plain form
43857 -1551522 -1516809 -1999469 -2501525 -2855862 -3141994 -3148976 -2446494 -1079881 191280 635741
43847 635741 392121 265628 662465 1060183 789782 76979 -199152 249748 749344 785332
43837 785332 851071 1593193 2602282 2893928 2395270 2032272 2268745 2473034 2052410 1384713
43827 1384713 1102206 1129949 1072507 1021128 1265589 1589461 1575140 1324552 1161136 885739
43817 885739 147305 -635014 -669973 -95766 151004 -52247 327505 1687250 2780653
43808 2780653 2475315 1676691 2180373 3959249 5011544 4073738 2216025 1198208 1280130
43799 1280130 1507155 1433545 1476239 1815196 1987629 1720169 1377105 1288439 1217170 838329
43789 838329 306494 -7759 -4355 261400 863257 1774158 2571325 2779024 2397054 1777992
$$ packed form
43857a551522L4713m82660n02056l54337k86132o982P02482J366613J271161M44461
43847F35741k43620j26493L96837L97718k70401p12803k76131M48900M99596L5988
43837G85332O5739P42122J009089K91646m98658l62998K36473K04289m20624o67697
43827A384713k82507K7743n7442n1379K44461L23872j4321k50588j63416k75397
43817H85739p38434p82319l4959N74207K46770k03251L79752J359745J093403
43808B780653l05338p98624N03682J778876J052295r37806j857713j017817Q1922
43799A280130K27025p3610M2694L38957J72433k67460l43064q8666p1269l78841
43789H38329n31835l14253L404K65755O01857R10901P97167K07699l81970o19062
$$ plain form
43779 1777992 1143985 584029 364297 771057 1657413 2542897 3168507 3583144 3705752
43770 3705752 3271640 2325988 1354271 737226 395009 128681 5211 217517 793606
43761 793606 1564462 2201829 2270474 1584475 577981 -41337 -68488 171378 552599 1245615
43751 1245615 1909439 1608020 109848 -1345572 -1343450 -28613 1149528 1186088 324034
43742 324034 -705508 -1455638 -1717705 -1384032 -600024 319060 1200870 1929106 2150316
43733 2150316 1573205 559111 -114028 -174628 -92340 -312639 -725800 -1017470 -1086025 -938285
43723 -938285 -585310 -231431 -182140 -348144 -175277 700186 1971406 2998922 3407140
43714 3407140 3253923 2874490 2662981 2770223 2944731 2871940 2611966 2399748 2129946 1509496
$$ packed form
43779A777992o34007n59956k19732M06760Q86356Q85484O25610M14637J22608
43770C705752m34112r45652r71717o17045l42217k66328j23470K12306N76089
43761G93606P70856O37367O8645o85999j006494o19318k7151K39866L81221O93016
43751A245615O63824l01419j498172j455420K122J314837J178141L6560q62054
43742C24034j029542p50130k62067L33673P84008R19084Q81810P28236K21210
43733B150316n77111j014094o73139o0600Q2288k20299m13161k91670o8555J47740
43723i38285L52975L53879M9291j66004J72867Q75463J271220J027516M08218
43714C407140j53217l79433k11509J07242J74508p2791k59974k12218k69802o20450
$$ plain form
43704 1509496 680915 134940 -67254 -409456 -1102345 -1711865 -1830827 -1605170 -1354704
43695 -1354704 -1184937 -1226718 -1717001 -2530300 -3158928 -3486248 -4014837 -4933173 -5543390 -5122592
43685 -5122592 -3830784 -2246412 -579218 980295 1671199 843357 -970528 -2458425
43677 -2458425 -2937075 -2728294 -2276638 -1618940 -765094 8201 394453 260118 -331384
43668 -331384 -1011436 -1272936 -1123203 -1213601 -1841629 -2313832 -2012144 -1586766 -2084598 -3232854
43658 -3232854 -3784409 -3447579 -3159120 -3318713 -3149636 -2254082 -1450095 -1317453 -1114920
43649 -1114920 -127666 908508 892401 121763 -264102 -76091 -16402 -156877 146394 842059
43639 842059 1019728 412689 -112372 29315 323027 315829 570859 1621813 2754056 2846065
$$ packed form
43704A509496q28581n45975k02194l42202o92889o09520j18962K25657K50466
43695a354704J69767m1781m90283q13299o28628l27320n28589r18336o10217M20798
43685e122592J291808J584372J667194J559513O90904q27842j813885j487897
43677b458425m78650K08781M51656O57698Q53846P73295L86252j34335n91502
43668c31384o80052k61500J49733r0398o28028m72203L01688M25378m97832j148256
43658c232854n51555L36830K88459j59593J69077Q95554Q03987J32642K02533
43649a114920R87254J036174j6107p70638l85865J88011N9689j40475L03271O95665
43639H42059J77669o07039n25061J41687K93712p198K55030J050954J132243R2009
$$ plain form
43629 2846065 1986077 1251668 1105514 1010977 633548 416745 659103 849927 432805 -342918
43619 -342918 -860629 -990329 -954612 -686271 42201 993435 1558133 1452680 862158 -1513
43609 -1513 -893990 -1146918 -78054 1904163 3251408 2819301 1084664 -547611 -1248779
43600 -1248779 -1174811 -824260 -590206 -692762 -956989 -796561 42855 864107 733947 -235335
43590 -235335 -917192 -528151 584968 1574917 1966009 1779383 1319917 1038762 1172022
43581 1172022 1340739 912273 -114500 -1023769 -1295580 -1107904 -805584 -483747 -353971
43572 -353971 -857635 -1952298 -2834008 -2907573 -2582758 -2556242 -2749533 -2621106 -2158025 -1773826
43562 -1773826 -1443603 -789734 7485 232972 -269653 -778711 -739745 -450559 -323593 -90001
$$ packed form
43629B846065q59988p34409j46154r4537l77429k16803K42358J90824m17122p75723
43619c42918n17711j29700L5717K68341P28472R51234N64698j05453n90522q63671
43609a513q92477k52928J068864J982217J347245m32107j734637j632275p01168
43600a248779P3968L50551K34054j02556k64227J60428Q39416Q21252j30160r69282
43590b35335o81857L89041J113119R89949L91092j86626m59466k81155J33260
43581A172022J68717m28466j026773r09269k71811J87676L02320L21837J29776
43572c53971n03664j094663q81710p3565L24815K6516j93291J28427M63081L84199
43562a773826L30223O53869P97219K25487n02625n09058L8966K89186J26966K33592
$$ plain form
43552 -90001 695842 1781215 2475324 2576521 2458401 2330467 2006822 1474852 1137011 1234511
43542 1234511 1430697 1284271 861942 548842 450801 350790 145458 -45715 -148199 -128731
43532 -128731 236698 1121051 2099377 2356350 1659477 663205 -5631 -422518 -743011 -549705
43522 -549705 447442 1509971 1604744 869795 394360 532186 450545 -392902 -1340603 -1647967
43512 -1647967 -1646456 -2016199 -2498644 -2250520 -1225405 -337584 -208948 -430566 -292574 205259
43502 205259 420720 26830 -395453 45764 1358098 2426145 2301032 1402240 823710
43493 823710 680100 94636 -1065701 -1560942 -483851 1287970 2173455 1810242 1039953
43484 1039953 463937 5698 -284689 53684 1224987 2778895 3943021 4052082 2891420
$$ packed form
43552i0001P85843J085373O94109J01197j18120j27934l23645n31970l37841R7500
43542A234511J96186j46426m22329l13100r8041j00011k05332j91173j02484J9468
43532a28731L65429Q84353R78326K56973o96873r96272o68836m16887l20493J93306
43522e49705R97147J062529R4773p34949m75435J37826q1641q43447r47701l07364
43512a647967J511l69743m82445K48124J025115Q87821J28636k21618J37992M97833
43502B05259K15461l93890m22283M41217J312334J068047j25113q98792n78530
43493H23710j43610n85464j160337m95241J077091J771821Q85485l63213p70289
43484A039953n76016m58239k90387L38373J171303J553908J164126J09061j160662
$$ plain form
43475 2891420 1034204 -458247 -1123746 -1536657 -2230976 -2764905 -2530399 -1874551 -1477121
43466 -1477121 -1130719 -275637 622334 546611 -317031 -630911 161262 1188735 1659208
43457 1659208 1768294 1741713 1204904 106987 -771906 -914439 -811586 -992903 -1117042
43448 -1117042 -665019 187252 998230 1680530 2140044 2018406 1377341 926252 995863 1042531
43438 1042531 745477 685566 1169808 1340655 507866 -433079 -160615 1019064 1539012
43429 1539012 706165 -679258 -1632987 -1812301 -1182615 8519 903348 716285 -120171
43420 -120171 -353769 450315 1462980 1814085 1453727 767788 176584 185243 996045 1970183
43410 1970183 2278447 2116727 2345503 2861294 2481074 824728 -802389 -1072791 -302247
$$ packed form
43475B891420j857216j492451o65499m12911o94319n33929K34506O55848L97430
43466a477121L46402Q55082Q97971p5723q63642l13880P92173J027473M70473
43457A659208J09086k6581n36809j097917q78893j42533J02853j81317j24139
43448a117042M52023Q52271Q10978O82300M59514j21638o41065m51089O9611M6668
43438A042531k97054n9911M84242J70847q32789r40945K72464J179679N19948
43429A539012q32847j385423r53729j79314O29686J191134Q94829j87063q36456
43420a20171k33598Q04084J012665L51105l60358o85939n91204Q659Q10802R74138
43410A970183L08264j61720K28776N15791l80220j656346j627117k70402P70544
$$ plain form
43401 -302247 297793 305560 164928 90070 -155253 -545541 -673431 -447187 -378867 -977603
43391 -977603 -2081663 -2912719 -2777212 -1769194 -744459 -451055 -777297 -1089332 -1098978
43382 -1098978 -924247 -461041 577592 1909406 2711350 2670307 2340794 2131017 1644234
43373 1644234 542953 -575964 -889389 -529065 -318717 -537508 -639169 -175065 577727
43364 577727 1001710 768727 23737 -771492 -1150249 -1041715 -895808 -1230377 -2016710 -2610319
43354 -2610319 -2322361 -1087244 389682 1260652 1434983 1614124 2147986 2245963 1016999
43345 1016999 -913466 -1802134 -970759 369111 858750 593344 346094 116979 -561013
43336 -561013 -1472901 -1961404 -2025443 -2200467 -2498650 -2391362 -1807051 -1290817 -1117516 -1001794
$$ packed form
43401c02247O00040P767j40632p4858k45323l90288j27890K26244O8320n98736
43391i77603j104060q31056J35507J008018J024735K93404l26242l12035r646
43382a098978J74731M63206J038633J331814Q01944m1043l29513k09777m86783
43373A644234j101281j118917l13425L60324K10348k18791j01661M64104P52792
43364E77727M23983k32983p44990p95229l78757J08534J45907l34569p86333n93609
43354b610319K87958J235117J476926Q70970J74331J79141N33862R7977j228964
43345A016999j930465q88668Q31375J339870M89639k65406k47250k29115o77992
43336e61013r11888m88503o4039j75024k98183J07288N84311N16234J73301J15722
$$ plain form
43326 -1001794 -762493 -573334 -470963 -281602 -110127 -217200 -310404 312626 1690180
43317 1690180 2908215 3141921 2437869 1290252 88050 -756498 -825824 -316890 -136362
43308 -136362 -874642 -2008279 -2517522 -2024468 -1019060 -264699 -280253 -1108885 -2270183
43299 -2270183 -3123487 -3450057 -3443571 -3106386 -2152821 -687101 582768 1142937 1209897 1155257
43289 1155257 955737 649136 735330 1469919 2213630 2214599 1700904 1426167 1400191 960613
43279 960613 12517 -753898 -1025064 -1339063 -2028980 -2467459 -1956487 -870554 -266255
43270 -266255 -570611 -1200345 -1425442 -1175331 -919854 -1025708 -1348033 -1375547 -760687 274575
43260 274575 1132200 1458092 1436517 1413787 1413372 1181449 597286 -148743 -762431 -1102068
$$ packed form
43326a001794K39301J89159J02371J89361J71475j07073r3204O23030J377554
43317A690180J218035K33706p04052j147617j202202q44548o9326N08934J80528
43308a36362p38280j133637n09243M93054J005408P54361j5554q28632j161298
43299b270183q53304l26570O486L37185R53565J465720J269869N60169O6960n4640
43289A155257j99520l06601Q6194P34589P43711R69n13695k74737k5976m39578
43279I60613r48096p66415k71166l13999o89917m38479N10972J085933O04299
43270b66255l04356o29734k25097K50111K55477j05854l22325k7514O14860J035262
43260B74575Q57625L25892k1575k2730m15k31923n84163p46029o13688l39637
$$ plain form
43250 -1102068 -1231171 -1300365 -1374585 -1335018 -999525 -414886 12080 -199001 -1121998 -2275692
43240 -2275692 -3017535 -3087520 -2739585 -2392319 -2270528 -2373765 -2556554 -2480471 -1728532 -324615
43230 -324615 958097 1240642 539011 -290783 -673750 -852980 -1118645 -1173146 -773040 -414596
43220 -414596 -613744 -896602 -420080 605326 1159173 1118810 1579858 3072345 4528510
43211 4528510 4754465 4064365 3511666 3153117 2243330 849446 8389 130329 326341
43202 326341 -252092 -1240151 -1776324 -1756757 -1713313 -1828999 -1768734 -1372557 -918119 -609293
43192 -609293 -234037 477246 1390949 2068586 2249338 2086027 1871812 1644996 1248566 809380
43182 809380 848030 1579969 2294797 1980938 663322 -423514 -294793 622912 1229261
$$ packed form
43250a102068j29103o9194p4220L9567L35493N84639M26966k11081r22997j153694
43240b275692p41843o9985L47935L47266J21791j03237j82789P6083P51939J403917
43230c24615J282712K82545p01631q29794l82967j79230k65665n4501M00106L58444
43220d14596j99148k82858M76522J025406N53847m0363M61048J492487J456165
43211D528510K25955o90100n52699l58549r09787j393884q41057J21940J96012
43202C26341n78433r88059n36173J9567M3444j15686O0265L96177M54438L08826
43192f09293L75256P11283R13703O77637J80752j63311k14215k26816l96430m39186
43182H09380L8650P31939P14828l13859j317616j086836J28721R17705O06349
$$ plain form
43173 1229261 1231310 1224287 1495975 1558179 1026547 278989 -132649 -212263 -195433 103422 1007367
43162 1007367 2200087 2854341 2605853 1897189 1207082 421855 -728377 -1996574 -2815134
43153 -2815134 -2968654 -2655991 -2004607 -995722 101195 689517 448814 -326797 -1163806
43144 -1163806 -1867411 -2338602 -2314339 -1708139 -988447 -736831 -893831 -898683 -586147 -454922
43134 -454922 -889157 -1564023 -1936007 -2007618 -2207704 -2645093 -2868673 -2429124 -1440435 -457034
43124 -457034 118212 381745 645022 895650 771356 177046 -355564 -273362 202124 367942
43114 367942 100673 55569 655190 1443145 1744290 1465025 875029 107906 -638263 -908740
43104 -908740 -654187 -675927 -1609099 -2706234 -2531048 -846682 1040800 1935975 1936350 1753566
$$ packed form
43173A229261K049p023K71688O2204n31632p47558m11638p9614J6830K98855R03945
43162A007367J192720O54254k48488p08664o90107p85227j150232j268197q18560
43153b815134j53520L12663O51384J008885J096917N88322k40703p75611q37009
43144a163806p03605m71191K4263O06200P19692K51616j57000m852L12536J31225
43134d54922m34235o74866l71984p1611k00086m37389k23580M39549R88689R83401
43124d57034N75246K63533K63277K50628j24294n94310n32610Q2202M75486J65818
43114C67942k67269m5104N99621P87955L01145k79265n89996p67123p46169k70477
43104i08740K54553k1740r33172j097135J75186J684366J887482Q95175L75j82784
$$ plain form
43094 1753566 1678583 1636698 1599107 1433907 835501 -144309 -903443 -1008426 -696435 -331943
43084 -331943 131640 739735 1133126 1107678 1110443 1565951 2107664 2123350 1692197 1267242
43074 1267242 767936 -162157 -1185412 -1474825 -920791 -328442 -301523 -651649 -1030900
43065 -1030900 -1405501 -1685923 -1576458 -1070440 -498097 139164 1216167 2577819 3307942
43056 3307942 2886820 1994786 1625445 1872563 2130479 2059668 1755476 1298531 766755 491855
43046 491855 733204 1209203 1408634 1231166 917653 558461 135101 -153178 -118121 20278
43036 20278 -18748 7255 513175 1240599 1385069 587485 -752583 -2129061 -3259265 -3748728
43026 -3748728 -3223003 -2084603 -1442495 -1831627 -2516681 -2519441 -1860250 -1246851 -950102 -684381
$$ packed form
43094A753566p4983m1885l7591j65200n98406r79810p59134j04983L11991L64492
43084c31943M63583O08095L93391k5448K765M55508N41713J5686m31153m24955
43074A267242m99306r30093j023255k89413N54034N92349K6919l50126l79251
43065a030900l74601k80422J09465N06018N72343O37261J077003J361652P30123
43056C307942m21122q92034l69341K47118K57916p0811l04192m56945n31776k74900
43046D91855K41349M75999J99431j77468l13513l59192m23360k88279L5057J38399
43036B0278l9026K6003N05920P27424J44470p97584j340068j376478j130204m89463
43026c748728N25725J138400O42108l89132o85054k760O59191O13399K96749K65721
$$ plain form
43016 -684381 -416590 -556087 -1208177 -1762517 -1498258 -372601 945404 1694306 1630770
43007 1630770 1171156 967527 1253972 1636796 1600183 1092298 460958 -35031 -392663 -636490
42997 -636490 -731569 -741542 -828073 -1051501 -1342183 -1625640 -1758249 -1435656 -517224 580074
42987 580074 1225244 1351279 1396071 1346877 523837 -1221897 -2728759 -2781822 -1842441 -1544979
42977 -1544979 -2451616 -3325430 -2985277 -1915038 -1329052 -1409409 -1455762 -1326869 -1580731 -2246236
42967 -2246236 -2568599 -2211012 -1723604 -1427452 -796824 411235 1285715 943015 -40430
42958 -40430 -452468 -326008 -786163 -2077771 -3002017 -2640332 -1537522 -634448 -16604
42949 -16604 526871 595460 -95188 -652175 69964 1639876 2373022 1648443 750790 948244
$$ packed form
43016f84381K67791j39497o52090n54340K64259J125657J318005P48902o3536
43007A630770m59614k03629K86445L82824l6613n07885o31340m95989l57632k43827
42997f36490r5079r973q6531k23428k90682k83457j32609L22593R18432J097298
42987E80074O45170J26035M4792m9194q23040j745734j506862n3063R39381K97462
42977a544979r06637q73814L40153J070239N85986q0357m6353J28893k53862o65505
42967b246236l22363L57587M87408K96152O30628J208059Q74480l42700r83445
42958d0430m12038J26460m60155j291608r24246L61685J102810R03074O17844
42949a6604N43475O8589o90648n56987P22139J569912P33146p24579q97653J97454
$$ plain form
42939 948244 1782243 2052888 1676982 1471596 1518071 988057 -329363 -1467743 -1718889
42930 -1718889 -1725568 -2384158 -3256850 -3049590 -1506907 120549 698933 513054 509188 854203
42920 854203 935894 519242 147265 286817 645510 648496 276534 73984 407391 993830
42910 993830 1254631 1036318 837064 1211365 2012472 2489174 2254323 1845129 1992371 2589573
42900 2589573 2906697 2708692 2490734 2502551 2286266 1562544 876085 716442 554685 -365415
42890 -365415 -1585562 -1811827 -765725 344198 495294 65923 -145525 -256545 -805275
42881 -805275 -1498150 -1499625 -786935 -204252 -84968 212389 1043452 1626905 1117427 -55787
42871 -55787 -738773 -673575 -734427 -1527875 -2541864 -2980395 -2804577 -2440419 -1905483 -927572
$$ packed form
42939I48244Q33999K70645l75906k05386M6475n30014j317420j138380k51146
42930a718889o679o58590q72692K07260J542683J627456N78384j85879l866L45015
42920H54203Q1691m16652l71977J39552L58693K986l71962k02550L33407N86439
42910I93830K60801k18313j99254L74301Q01107M76702k34851m09194J47242N97202
42900B589573L17124j98005k17958J1817k16285p23722o86459j59643j61757r20100
42890c65415j220147k26265J046102J109923J51096m29371k11448j11020n48730
42881h05275o92875j475P12690N82683J19284K97357Q31063N83453n09478j173214
42871e5787o82986O5198o0852p93448j013989m38531J75818L64158N34936R77911
$$ plain form
42861 -927572 213459 740806 520689 524778 1630394 3306131 4136224 3586589 2600899
42852 2600899 2272124 2543781 2676024 2531301 2692604 3418731 4190051 4480625 4431270 4426918
42842 4426918 4421708 4116391 3550386 3054286 2730465 2421314 2141166 2053616 1945795 1243616
42832 1243616 -160194 -1496529 -1966926 -1760187 -1725895 -2121352 -2263108 -1605450 -661111
42823 -661111 -426556 -1164306 -2238659 -3048906 -3571859 -3868080 -3621260 -2621584 -1420298
42814 -1420298 -954137 -1487492 -2303972 -2529462 -1957635 -982082 -64156 514399 650154
42805 650154 495358 431406 697291 1075926 1146496 818368 440964 406292 792476 1364584
42795 1364584 1759459 1668975 992145 -126136 -1399631 -2462345 -2842521 -2166369 -642029
$$ packed form
42861i27572J141031N27347k20117M089J105616J675737Q30093n49635r85690
42852B600899l28775K71657J32243j44723J61303P26127P71320K90574m9355m352
42842D426918n210l05317n66005m96100l23821l09151k80148q7550j07821p02179
42832A243616j403810j336335m70397K06739L4292l95457j41756O57658R44339
42823f61111K34555p37750j074353q10247n22953k96221K46820R99676J201286
42814a420298M66161n33355q16480k25490N71827R75553R17926N78555J35755
42805F50154j54796o3952K65885L78635P0570l28128l77404l4672L86184N72108
42795A364584L94875r0484o76830j118281j273495j062714l80176O76152J524340
$$ plain form
42786 -642029 815651 1259791 522749 -781830 -1916401 -2457494 -2317108 -1789473 -1530287
42777 -1530287 -2013712 -2912256 -3391156 -3084041 -2361299 -1558027 -496294 920494 2131722
42768 2131722 2448609 1941328 1374665 1375291 1979932 2852552 3566249 3713446 3092164 1904900
42758 1904900 665986 -120664 -248657 24068 97728 -356893 -850054 -575675 382563
42749 382563 914560 320733 -686320 -986822 -550309 -170868 -107728 38615 225302 -207889
42739 -207889 -1402685 -2548310 -2937006 -2755598 -2479396 -2163725 -1799052 -1770562 -2370038
42730 -2370038 -3209028 -3618672 -3374410 -2651193 -1587591 -336661 690270 1066393 747640
42721 747640 28705 -674251 -878824 -330163 476301 559572 -343816 -1318482 -1515618 -1354114
$$ packed form
42786f42029J457680M44140p37042j304579j134571n41093J40386N27635K59186
42777a530287m83425q98544m78900L07115P22742Q03272J061733J416788J211228
42768B131722L16887n07281n66663O26O04641Q72620P13697J47197o21282j187264
42758A904900j238914p86650j27993K72725P3660m54621m93161K74379R58238
42749C82563N31997n93827j007053l00502M36513L79441O3140J46343J86687m33191
42739b07889j194796j145625l88696J81408K76202L15671L64673K8490n99476
42730b370038q38990m09644K44262P23217J063602J250930J026931L76123l18753
42721G47640p18935p02956k04573N48661Q06464Q3271r03388r74666j97136J61504
$$ plain form
42711 -1354114 -1777525 -2725741 -3259645 -3073615 -2941033 -3486128 -4284927 -4513462 -3950174
42702 -3950174 -3021996 -2244725 -1861406 -1727742 -1406385 -674541 13226 -12714 -608953 -746337
42692 -746337 260874 1831523 2745494 2444334 1422822 515674 77876 -176972 -673436
42683 -673436 -1331025 -1530953 -898577 55039 475455 287973 264926 880094 1640339 1816472
42673 1816472 1362738 741195 194828 -394660 -1157145 -2087006 -3045258 -3624375 -3273616
42664 -3273616 -1930377 -343555 595851 725640 534606 426726 439666 522761 632390
42655 632390 586202 239375 -167531 -211698 93532 226811 -166117 -793406 -1060442 -699551
42645 -699551 72353 865296 1433720 1759256 1953327 2114578 2258977 2326399 2174920 1626323
$$ packed form
42711a354114m23411r48216n33904J86030J32582n45095p98799k28535N63288
42702c950174R28178P77271L83319J33664L21357P31844O87767k5940n96239j37384
42692g46337J007211J570649R13971l01160j021512r07148m37798k54848m96464
42683f73436o57589j99928O32376R53616M20416j87482k3047O15168P60245J76133
42673A816472m53734o21543n46367n89488p62485r29861r58252n79117L50759
42664c273616J343239J586822R39406J29789j91034j07880J2940Q3095J09629
42655F32390m6188l46827m06906m4167L05230J33279l92928o27289k67036L60891
42645f99551P71904P92943N68424L25536J94071J61251J44399O7422j51479n48597
$$ plain form
42635 1626323 716140 -81837 -156063 554866 1379992 1595261 1105269 323776 -336005 -645026
42625 -645026 -584981 -533257 -1078235 -2182227 -2837615 -2181308 -768461 -16791 -421164 -1103706
42615 -1103706 -1257673 -1172424 -1404258 -1692382 -1404010 -621156 -64020 -112493 -492361 -826503
42605 -826503 -957979 -764738 -172403 558230 932605 709689 58759 -710253 -1267684 -1230638
42595 -1230638 -480944 452468 816821 594639 583332 1263335 2014918 1877269 818594
42586 818594 -229443 -525100 -266012 -125091 -406389 -867448 -1176435 -1283954 -1325305 -1303822
42576 -1303822 -1014139 -339476 458489 933988 999440 1079386 1547040 2144859 2219452 1496254
42566 1496254 379022 -512920 -840576 -572436 102240 695390 605368 -248446 -1152535
$$ packed form
42635A626323r10183p97977p4226P10929Q25126K15269m89992p81493o59781l09021
42625f45026O0045N1724n44978j103992o55388O56307J412847P51670m04373o82542
42615a103706j53967Q5249k31834k88124K88372P82854N57136m8473l79868l34142
42605h26503j31476J93241N92335P30633L74375k22916o50930p69012n57431L7046
42595a230638P49694R33412L64353k22182j1307O80003P51583j37649j058675
42586H18594j048037k95657K59088J40921k81298m61059l08987j07519m1351K1483
42576a303822K89683O74663P97965M75499O5452P9946M67654N97819P4593p23198
42566A496254j117232q91942l27656K68140O74676N93150r0022q53814r04089
$$ plain form
42557 -1152535 -1338461 -897598 -567541 -679212 -830318 -698798 -612996 -967470 -1508907 -1684533
42547 -1684533 -1430177 -1110336 -869763 -605899 -463344 -672106 -840969 -182544 1216807
42538 1216807 2044388 1273797 -443501 -1589248 -1662123 -1454633 -1590976 -1742141 -1544038
42529 -1544038 -1430244 -1941995 -2753216 -3104474 -2950355 -2944791 -3293964 -3313957 -2398447 -945157
42519 -945157 82885 279126 83148 25450 63332 -196960 -848117 -1502327 -1764483 -1707327
42509 -1707327 -1743150 -2064069 -2358818 -2166881 -1451255 -723891 -590933 -1200634 -2120225 -2723778
42499 -2723778 -2716794 -2307541 -1881827 -1587919 -1341285 -1157633 -1215662 -1488167 -1566142 -1111645
42489 -1111645 -370289 44954 -133263 -556080 -702349 -382960 196790 636576 563141 -82463
$$ packed form
42557a152535j85926M40863L30057j11671j51106J31520Q5802l54474n41437j75626
42547a684533K54356L19841K40573K63864J42555k08762j68863O58425J399351
42538A216807Q27581p70591j717298j145747p2875K07490j36343j51165J98103
42529a544038J13794n11751q11221l51258J54119N564l49173j9993R15510J453290
42519i45157J028042J96241j95978n7698L7882k60292o51157o54210k62156N7156
42509a707327l5823l20919k94749J91937P15626P27364J32958o09701r19591o03553
42499b723778O984M09253M25714K93908K46634J83652n8029k72505p7975M54497
42489a111645P41356M15243j78217m22817j46269L19389N79750M39786p3435o45604
$$ plain form
42479 -82463 -856000 -1121698 -714004 -141220 11055 -264460 -506997 -446808 -333404 -554680
42469 -554680 -1028717 -1109371 -251253 1190607 2069517 1629421 421014 -356270 -334029 -239912
42459 -239912 -603283 -887003 -355033 710836 1309048 1012282 362318 22148 38607 3221
42449 3221 -407017 -1091602 -1522160 -1206889 -395275 -34835 -621651 -1406158 -1325051 -466224
42439 -466224 138893 41100 -197875 -157069 -173583 -493108 -700897 -522340 -441290 -899225
42429 -899225 -1501968 -1697304 -1705189 -2035995 -2527500 -2665918 -2538455 -2614179 -2770060 -2417461
42419 -2417461 -1576014 -978947 -977716 -1088286 -857902 -529028 -506995 -671482 -608241 -238155
42409 -238155 83924 -42092 -685394 -1449884 -1733884 -1325238 -636948 -102270 426607 1234760
$$ packed form
42479h2463p73537k65698M07694N72784J52275k75515k42537O0189J13404k21276
42469e54680m74037q0654Q58118J441860Q78910m40096j208407p77284K2241R4117
42459b39912l63371k83720N31970J065869N98212k96766o49964l40170J6459l5386
42449C221m10238o84585m30558L15271Q11614L60440n86816p84507Q1107Q58827
42439d66224O05117r7793k38975M0806j6514l19525k07789J78557Q1050m57935
42429h99225o02743j95336p885l30806m91505j38418J27463p5724j55881L52599
42419b417461Q41447N97067J231j10570K30384L28874K2033j64487O3241L70086
42409b38155L22079j26016o43302p64490k84000M08646O88290N34678N28877Q08153
$$ plain form
42399 1234760 1951658 1886090 1092647 353238 -2830 -480451 -1354654 -1990541 -1718412 -824477
42389 -824477 -133915 -1138 -182275 -355356 -297339 164296 919658 1503940 1613933 1465880
42379 1465880 1343643 1127621 647527 146798 -79067 -203605 -489355 -618793 -24714
42370 -24714 1156226 2015902 1880240 1046671 427965 635384 1392500 1780432 1251816 448923
42360 448923 595193 1902075 3185091 3483571 3382031 3958973 4971136 5147570 4101495
42351 4101495 2869361 2448654 2738887 3130988 3261120 2872572 1759336 291019 -670919
42342 -670919 -809725 -725409 -915172 -1045861 -703791 -209613 -85882 -262046 -447456 -792222
42332 -792222 -1444360 -1851354 -1327951 -118108 868372 1258207 1435220 1647266 1659459 1359018
$$ packed form
42399A234760P16898o5568p93443p39409l56068m77621q74203o35887K72129Q93935
42389h24477O90562J32777j81137j73081N8017M61635P55362N84282J09993j48053
42379A465880j22237k16022m80094n00729k25865j24538k85750j29438N94079
42370b4714J180940Q59676j35662q33569o18706K07419P57116L87932n28616q02893
42360D48923J46270J306882J283016K98480j01540N76942J012163J76434j046075
42351D101495j232134m20707K90233L92101J30132l88548j113236j468317r61938
42342f70919j38806Q4316j89763j30689L42070M94178J23731j76164j85410l44766
42332g92222o52138m06994N23403J209843R86480L89835J77013K12046J2193l00441
$$ plain form
42322 1359018 1004940 736641 468019 419022 1065179 2249813 2971443 2520351 1381920
42313 1381920 537199 239403 38955 -231513 -181158 372508 938085 966078 628334 617984
42303 617984 1240044 2016369 2295009 2018576 1648040 1433763 1120353 489261 -133772 -223637
42293 -223637 251754 832717 1235501 1691374 2530543 3657814 4562407 4737835 4067191
42284 4067191 2917391 1842455 1059424 271041 -827730 -1979979 -2575974 -2357133 -1589386
42275 -1589386 -606706 384396 1049756 1050688 644269 634166 1342972 2052714 1923731 1130587
42265 1130587 552646 578947 820658 892056 821594 617883 52087 -843542 -1481566 -1255718
42255 -1255718 -179298 1169989 2132894 2314905 1754161 912008 276268 -109849 -465140
$$ packed form
42322A359018l54078k68299k68622m8997O46157J184634P21630m51092j138431
42313A381920q44721k97796k00448k70468N0355N53666N65577K7993l37744j0350
42303F17984O22060P76325K78640k76433l70536k14277l13410o31092o23033q9865
42293b23637M75391N80963M02784M55873Q39169J127271R04593J75428o70644
42284D067191j149800j074936p83031p88383j098771j152249n95995K18841P67747
42275a589386R82680R91102O65360R32m06419j0103P08806P09742j28983p93144
42265A130587n77941K6301K41711P1398p0462k03711n65796q95629o38024K25848
42255a255718J076420J349287R62905J82011n60744q42153o35740l86117l55291
$$ plain form
42246 -465140 -646716 -241667 530614 640463 -496574 -2007439 -2453969 -1535111 -289178
42237 -289178 266872 44827 -528267 -1089148 -1298290 -859608 42889 732137 760743 304843
42227 304843 -347658 -1188485 -2016414 -2114851 -1036490 546323 1392110 1019638 8818
42218 8818 -922607 -1592058 -2069586 -2252997 -1965847 -1242224 -405776 19338 -374225 -1350741
42208 -1350741 -1990541 -1615744 -665526 -161424 -368177 -563684 -130307 815820 1985527
42199 1985527 3281282 4243156 3960254 2232080 267099 -541783 -196977 258308 349655
42190 349655 560880 1200655 1757898 1611279 778289 -262710 -1039715 -1239034 -845849
42181 -845849 -279489 7509 128304 508021 1027609 1071718 602616 456429 1151465 2049629
$$ packed form
42246d65140j81576M05049P72281J09849j137037j510865m46530R18858J245933
42237b89178N56050k22045n73094n60881k09142M38682R02497O89248K8606m55900
42227C04843o52501q40827q27929r8437J078361J582813Q45787l72472j010820
42218H818r31425o69451m77528j83411K87150P23623Q36448M25114l93563r76516
42208a350741o39800L74797R50218N04102k06753j95507M33377R46127J169707
42199A985527J295755R61874k82902j728174j964981q08882L44806M55285R1347
42190C49655K11225O39775N57243j46619q32990j040999p77005j99319L93185
42181h45849N66360K86998J20795L79717N19588M4109m69102j46187O95036Q98164
$$ plain form
42171 2049629 2300617 2096159 2221353 2680151 2659185 1866591 1078298 1054576 1530401 1730950
42161 1730950 1495517 1362702 1697626 2276135 2840348 3607306 4844863 6140367 6594917
42152 6594917 5881292 4721673 4028143 3875466 3737088 3486519 3533272 3965728 4239588
42143 4239588 3984740 3561787 3425473 3396514 3061385 2561791 2424844 2763536 3142263 3165642
42133 3165642 2794822 2171309 1529745 1190219 1212050 1139660 560969 -125879 -27091 1099596
42123 1099596 2508257 3417830 3844426 4261998 4813954 5145894 4805649 3647141 2064607
42114 2064607 922308 921234 1825410 2570972 2354809 1415595 582124 314160 440345 636824
42104 636824 822041 1070864 1355146 1498006 1409054 1312423 1555372 2080712 2326614 1911932
$$ packed form
42171B049629K50988k04458J25194M58798k0966p92594p88293k3722M75825K00549
42161A730950k35433j32815L34924N78509N64213P66958J237557J295504M54550
42152F594917p13625j159619o93530j52677j38378k50569M6753M32456K73860
42143D239588k54848m22953j36314k8959l35129m99594j36947L38692L78727K3379
42133C165642l70820o23513o41564l39526K1831p2390n78691o86848R8788J126687
42123A099596J408661R09573M26596M17572N51956L31940l40245j158508j582534
42114B064607j142299j074R04176P45562k16163r39214q33471k67964J26185J96479
42104F36824J85217K48823K84282J42860q8952r6631K42949N25340K45902m14682
$$ plain form
42094 1911932 1182819 672080 226480 -738881 -2181180 -3314846 -3693470 -3745212 -3947899
42085 -3947899 -4066875 -3607567 -2561161 -1317289 -231110 410182 445166 204146 332192
42076 332192 881278 1132400 760952 516639 1070738 1800812 1636152 715289 191617 541654
42066 541654 1038189 932919 297172 -418029 -869385 -731632 109097 1046607 1136228 278998
42056 278998 -548942 -515335 144400 675330 780878 764557 1061268 1830827 2745453 3183362
42046 3183362 2987826 2862572 3431996 4110905 3777406 2546735 1842577 2461184 3592778
42037 3592778 4202084 4367845 4578438 4577118 3796926 2410887 1177814 606076 797032
42028 797032 1619967 2522690 2754262 2341218 2200536 2686822 2821832 1779903 333645
$$ packed form
42094A911932p29113n10739m45600r65361j442299j133666l78624n1742k02687
42085c947899j18976M59308J046406J243872J086179O41292L4984k41020J28046
42076C32192N49086K51122l71448k44313N54099P30074j64660r20863n23672L50037
42066E41654M96535j05270o35747p15201m51356J37753Q40729R37510Q9621q57230
42056B78998q27940L3607O59735N30930J05548j6321K96711P69559R14626M37909
42046C183362j95536j25254N69424O78909l33499j230671p04158O18607J131594
42037C592778O09306J65761K10593j320p80192j386039j233073n71738J90956
42028G97032Q22935R02723K31572m13044j40682M86286J35010j041929j446258
$$ plain form
42019 333645 -214179 181577 773737 1570592 2908222 3935314 3322473 1536074 669155
42010 669155 1558993 2606139 2152324 678918 -306771 -503804 -796383 -1626319 -2456102
42001 -2456102 -2617112 -1918294 -535738 1139492 2601726 3514149 3825748 3567611 2894980
41992 2894980 2381230 2675291 3586316 4034822 3266335 1706847 356333 -234872 -194698
41983 -194698 -59051 -466153 -1530520 -2334129 -1741460 56697 1646672 2327398 2895027
41974 2895027 3948402 4596461 3864445 2424404 1662598 1707581 1731868 1688605 2204797 2942836
41964 2942836 2687126 1291789 107334 -2653 184833 -271481 -933756 -789386 154538
41955 154538 1001509 1267720 1242335 1257656 1287575 1241149 1153522 1026542 777517 386203
$$ packed form
42019C33645n47824L95756N92160P96855J337630J027092o12841j786399q66919
42010F69155Q89838J047146m53815j473406r85689j97033k92579q29936q29783
42001b456102j61010O98818J382556J675230J462234R12423L11599k58137o72631
41992B894980n13750K94061R11025M48506p68487j559488j350514n91205M0174
41983a94698J35647m07102j064367q03609N92669J798157J589975O80726N67629
41974B895027J053375O48059p32016j440041p61806M4983K4287m3263N16192P38039
41964B942836k55710j395337j184455j09987J87486m56314o62275J44370R43924
41955A54538Q46971K66211k5385J5321K9919m6426q7627j26980k49025l91314
$$ plain form
41945 386203 -61746 -452525 -676936 -650364 -351269 206160 967051 1687702 1960941 1655634
41935 1655634 1192271 1040108 1041985 612918 -471953 -1858800 -3041629 -3570252 -3058093
41926 -3058093 -1643088 -335204 -124050 -675445 -687719 342886 1577352 2275257 2777366
41917 2777366 3520224 4011722 3621733 2732132 2195412 2076447 1792335 1201204 726280
41908 726280 598224 734830 1185123 1911559 2283143 1644714 388896 -363630 -245604
41899 -245604 -23947 -355303 -960157 -1317028 -1429442 -1493372 -1446498 -1328762 -1531433 -2121950
41889 -2121950 -2366923 -1588847 -273416 290971 -561051 -2237495 -3607607 -3944963 -3223420
41880 -3223420 -1956234 -869010 -405678 -377874 -237551 264841 850652 1142735 1115260
$$ packed form
41945C86203m47949l90779k24411K6572K99095N57429P60891P20651K73239l05307
41935A655634m63363j52163J877m29067j084871j386847j182829n28623N12159
41926c058093J415005J307884K11154n51395j2274J030605J234466O97905N02109
41917B777366P42858M91498l89989q89601n36720j18965k84112n91131m74924
41908G26280j28056J36606M50293P26436L71584o38429j255818p52526J18026
41899b45604K21657l31356o04854l56871j12414o3930M6874J17736k02671n90517
41889b121950k44973P78076J315431N64387q52022j676444j370112l37356P21543
41880c223420J267186J087224M63332K7804J40323N02392N85811K92083k7475
$$ plain form
41871 1115260 1032550 1084426 1195170 1161726 938597 765440 946091 1483007 2047209 2360877
41861 2360877 2440450 2362251 2039274 1490349 1117559 1303681 1793105 1915998 1487874 1032875
41851 1032875 942637 899332 511915 124093 390657 1181754 1547333 931228 -59182 -378874
41841 -378874 272718 1291040 1952961 2010547 1607233 989482 410319 88781 78200 198151
41831 198151 171321 -144466 -632559 -1007273 -1054032 -789484 -364475 119102 567747 754153
41821 754153 509763 138124 302445 1227975 2239700 2452405 1821480 1133204 957618
41812 957618 1007626 674990 -132699 -958748 -1430714 -1638885 -1862480 -2091782 -1962683 -1223763
41802 -1223763 -216629 303383 -29399 -698694 -833091 -156501 804223 1371702 1281201
$$ packed form
41871A115260q2710N1876J10744l3444k23129j73157J80651N36916N64202L13668
41861B360877P9573p8199l22977n48925l72790J86122M89424J22893m28124m54999
41851A032875r0238m3305l87417l87822K66564P91097L65579o16105r90410l19692
41841c78874O51592J018322O61921N7586m03314o17751n79163l21538j0581J19951
41831A98151k6830l15787m88093l74714m6759K64548M25009M83577M48645J86406
41821G54153k44390l71639J64321R25530J011725K12705o30925o88276j75586
41812I57618N0008l32636q07689q26049m71966k08171k23595k29302J29099P38920
41802a223763J007134N20012l32782o69295j34397O76590R60724N67479r0501
$$ plain form
41793 1281201 657107 -154437 -639693 -417954 292939 837744 973235 1194055 1876562
41784 1876562 2465017 2076910 788162 -294383 -357096 222074 533394 280675 -104383
41775 -104383 -236849 -200444 -195380 -143241 179911 782500 1370160 1563563 1190821 497304
41765 497304 77488 376200 1154727 1696468 1719728 1782217 2424150 3191388 3109396 2062487
41755 2062487 1006677 655173 671794 538749 495055 938373 1455241 1351370 885896 1021167
41745 1021167 1918562 2555812 2081137 870509 -44238 -72115 621334 1380547 1460438 691360
41735 691360 -75943 253318 1616749 2787434 2972976 2695095 2744936 3067676 3243203
41726 3243203 3339554 3542854 3497315 2825724 1935098 1553248 1748618 2062120 2265990 2312271
$$ packed form
41793A281201o24094q11544m85256K21739P10893N44805J35491K20820O82507
41784A876562N88455l88107j288748j082545o2713N79170L11320k52719l85058
41775a04383j32466L6405N064N2139L23152O02589N87660J93403l72742o93517
41765D97304m19816K98712P78527N41741K3260O2489O41933P67238q1992j046909
41755B062487j055810l51504J6621j33045m3694M43318N16868j03871m65474J35271
41745A021167Q97395O37250m74675j210628r14747k7877O93449P59213P9891p69078
41735F91360p67303L29261J363431J170685J85542k77881M9841L22740J75527
41726C243203R6351K03300m5539o71591q90626l81850J95370L13502K03870M6281
$$ plain form
41716 2312271 1938906 1152662 742299 1343923 2218830 2008381 657459 -456862 -399142
41707 -399142 347437 966522 1320528 1487533 1258635 686497 379734 635596 901718 719638
41697 719638 643352 1492097 3037854 4140978 4057872 3085728 2016273 1422354 1462652 2003617
41687 2003617 2812687 3718795 4554845 4991852 4692359 3689507 2363598 1034036 -104809
41678 -104809 -707628 -488267 195838 578641 553634 898814 2042588 3174325 3169321 2063285
41668 2063285 1038158 1082919 2068995 3036262 3114565 2294350 1436862 1312213 1637713 1562047
41658 1562047 1145045 1541719 3292722 5222721 5780565 4940608 3993577 3857089 4407449
41649 4407449 5184486 5886249 6261007 6250985 6197620 6305131 6082119 5002738 3536960
$$ packed form
41716B312271l73365p86244m10363O01624Q74907k10449j350922j114321N7720
41707c99142P46579O19085L54006J67005k28898n72138l06763K55862K66122j82080
41697G19638p6286Q48745J545757J103124q3106r72144j069455n93919M0298N40965
41687B003617Q09070R06108Q36050M37007k99493j002852j325909j329562j138845
41678a04809o02819K19361O84105L82803k5007L45180J143774J131737n004j106036
41668B063285j025127M4761R86076R67267P8303q20215q57488j24649L25500p5666
41658A562047m17002L96674J751003J929999N57844q39957r47031j36488N50360
41649D407449P77037P01763L74758j0022n3365J07511k23012j079381j465778
$$ plain form
41640 3536960 2738790 2907135 3439158 3915799 4445863 4927406 4923488 4466762 4146182 4196502
41630 4196502 4320210 4544439 5241862 6010115 5688984 4121849 2834673 3079122 4103577
41621 4103577 4446579 4201980 4637789 5919729 6690317 6082087 4905357 4356813 4496428
41612 4496428 4639328 4577566 4659376 4986180 5229025 5207222 5144656 5256517 5426504 5466238
41602 5466238 5485150 5746405 6159639 6162447 5327916 4021471 3170055 3288900 3981238 4543133
41592 4543133 4778453 4922455 4978648 4581920 3563102 2343211 1662472 2046394 3468376
41583 3468376 5298080 6635322 7013763 6833814 6862533 7314294 7752738 7926939 8236931
41574 8236931 9096909 10201192 10865677 10978909 11206846 12189075 13777955 15158019 15583883
$$ packed form
41640C536960p98170J68345N32023M76641N30064M81543l918m56726l20580N0320
41630D196502J23708K24229O97423P68253l21131j567135j287176K44449J024455
41621D103577L43002k44599M35809J281940P70588o08230j176730n48544J39615
41612D496428J42900o1762Q1810L26804K42845k1803o2566J11861J69987L9734
41602E466238J8912K61255M13234K808q34531j306445q51416J18845O92338N61895
41592D543133K35320J44002N6193l96728j018818j219891o80739L83922J421982
41583C468376J829704J337242L78441j79949K8719M51761M38444J74201L09992
41574H236931Q59978J104283O64485J13232K27937R82229J588880J380064M25864
$$ plain form
41565 15583883 14970419 13879723 12976662 12451684 11986489 11280099 10457281 9856291 9589847
41556 9589847 9525087 9563795 9666559 9678092 9460038 9208240 9308428 9808884 10363346 10801074
41546 10801074 11389243 12332691 13374295 14196813 14920111 15829025 16856574 17785220 18810625
41537 18810625 20426006 22786842 25625965 28772926 32284942 36025540 39631526 43095054
41529 43095054 46985279 51900187 58039614 65465556 74382827 84958866 97286766 111818572
41521 111818572 129457969 150866297 175903307 203824110 233246421 261141475 282292507
41514 282292507 291073188 284714049 265092207 237474254 207573974 179294060 154289159
41507 154289159 132893841 115162424 101046229 89937420 80670983 72296239 64598411
$$ packed form
41565A5583883o13464j090696r03061n24978m65195p06390q22818o00990k66444
41556I589847o4760L8708J02764J1533k18054k51798J00188N00456N54462M37728
41546A0801074N88169R43448J041604Q22518P23298R08914J027549R28646J025405
41537A8810625J615381K360836K839123L146961L512016L740598L605986L463528
41529D3095054L890225M914908O139427P425942Q917271J0576039J2327900J4531806
41521A11818572J7639397K1408328K5037010K7920803K9422311K7895054K1151032
41514B82292507Q780681o359139j9621842k7617953k9900280k8279914k5004901
41507A54289159k1395318j7731417j4116195j1108809r266437q374744p697828
$$ plain form
41500 64598411 57697789 51540740 46093847 41609900 38213808 35503716 33004202 30719020
41492 30719020 28791781 27015029 25269458 24049269 23766440 23797681 23075491 21466107 19685258
41483 19685258 17996114 16028126 13889870 12315844 11476727 10757563 10060137 10133617 11018428
41474 11018428 11340302 10083602 8159365 7174526 7341994 7691310 7788285 8034994 8527154
41465 8527154 8769440 8531416 8073075 7496593 6669570 5808454 5403305 5527651 5836906
41456 5836906 6153779 6396719 6134575 5072358 3866496 3490362 3790713 3733556 3210060
41447 3210060 3370953 4680774 5812575 5360495 3837902 2977006 3517942 4627711 5241605
41438 5241605 5095765 4499497 3872664 3643148 4040930 4802772 5403213 5640048 5716511 5764144
$$ packed form
41500F4598411o900622o157049n446893m483947l396092k710092k499514k285182
41492C0719020j927239j776752j745571j220189k82829L1241p22190j609384j780849
41483A9685258j689144j967988k138256j574026q39117p19164o97426P3480Q84811
41474A1018428L21874j256700j924237r84839J67468L49316R6975K46709M92160
41465H527154K42286k38024m58341n76482q27023q61116m05149J24346L09255
41456E836906L16873K42940k62144j062217j205862l76134L00351n7157n23496
41447C210060J60893J309821J131801m52080j522593q60896N40936J109769O13894
41438E241605j45840n96268o26833k29516L97782P61842O00441K36835P6463M7633
$$ plain form
41428 5764144 5617976 5143474 4572942 4435243 5172519 6667323 8044873 8229324 7001320
41419 7001320 5338532 4430966 4547458 5170942 5952232 6957845 8047734 8643232 8345148
41410 8345148 7400621 6353790 5542868 5126572 5268603 5942343 6666117 6742971 5879121
41401 5879121 4565731 3859316 4638400 6788564 9079532 10148805 9780849 9006972 8796838
41392 8796838 8942245 8547695 7407681 6399901 6423712 7333255 8184089 8352051 8119740
41383 8119740 8170336 8759094 9567417 10311744 11246466 12833618 14945732 16717837 17461553
41374 17461553 17602127 18366776 20493209 23547300 26632670 29412959 32092600 34625840
41366 34625840 36474654 37239614 37120538 36507764 35378687 33424923 30705960 27884337
$$ packed form
41428E764144j46168m74502n70532j37699P37276J494804J377550J84451j228004
41419G001320j662788r07566J16492O23484P81290J005613J089889N95498k98084
41410H345148r44527j046831q10922m16296J42031O73740P23774P6854q63850
41401E879121j313390p06415P79084K150164K290968J069273l67956p73877k10134
41392H796838J45407l94550j140014j007780K3811R09543Q50834J67962k32311
41383H119740N0596N88758Q08323P44327R34722J587152K112114J772105P43716
41374A7461553J40574P64649K126433L054091L085370K780289K679641K533240
41366C4625840J848814P64960j19076o12774j129077j953764k718963k821623
$$ plain form
41358 27884337 25703270 24316500 23183578 21606322 19389872 17027161 15249848 14406357
41350 14406357 14271178 14344981 14197715 13612401 12703236 12000849 12144715 13237473 14638965
41341 14638965 15653814 16362468 17525334 19661181 22446647 25094194 27137379 28700790
41333 28700790 30073866 31188907 31624252 31109133 29890067 28463389 27021663 25392667
41325 25392667 23540561 21847488 20752222 20311730 20241773 20142658 19547711 18132668 16230669
41316 16230669 14813920 14456618 14519756 13959392 12851432 12407534 13351278 14979269 16165780
41307 16165780 16678063 16993719 17323646 17501695 17574050 17764832 17886091 17456675 16563366
41298 16563366 16048766 16575664 17912804 19405514 20749913 21950893 22895801 23527623 24298369
$$ packed form
41358B7884337k181067j386770j132922j577256k216450k362711j777313q43491
41350A4406357j35179P3803j47266n85314r09165p02387J43866J092758J401492
41341A4638965J014849P08654J162866K135847K785466K647547K043185J563411
41333B8700790J373076J115041M35345n15119j219066j426678j441726j628996
41325B5392667j852106j693073j095266m40492o9957r9115n94947j415043j901999
41316A6230669j416749l57302O3138n60364j107960m43898R43744J627991J186511
41307A6165780N12283L15656L29927J78049P2355J90782J21259m29416q93309
41298A6563366n14600N26898J337140J492710J344399J200980R44908O31822P70746
$$ plain form
41289 24298369 25859799 28196286 30522973 32246158 33659288 35437845 37786359 40468459
41281 40468459 43462168 47103857 51584568 56725191 62404135 68936691 76840839 86327326
41273 86327326 97064852 108295468 119125192 128814997 136799057 142371397 144587327 142818170
41265 142818170 137326805 128970578 118490617 106585194 94512858 83764200 74850535
41258 74850535 67075085 59794861 53195793 47465258 42131675 36995098 32918241 30649315
41250 30649315 29412661 27823634 25811346 24347060 23492882 22225779 20352029 19069381
41242 19069381 19058285 19310909 18613512 17099459 15508972 13939762 12336584 11338568 11458510
41233 11458510 12019418 12054522 11785229 12036813 12591479 12449693 11599070 11193281 11810435
$$ packed form
41289B4298369J561430K336487K326687J723185J413130J778557K348514K682100
41281D0468459K993709L641689M480711N140623N678944O532556P904148R486487
41273H6327326J0737526J1230616J0829724R689805P984060N572340K215930j769157
41265A42818170n491365q356227j0479961j1905423j2072336j0748658q913665
41258G4850535p775450p280224o599068n730535n333583n136577m076857k268926
41250C0649315j236654j589027k012288j464286q54178j267103j873750j282648
41242A9069381j1096K52624o97397j514053j590487j569210j603178r98016J19942
41233A1458510N60908L5104k69293K51584N54666j41786q50623m05789O17154
$$ plain form
41224 11810435 12703072 13092168 13195675 13574526 14303712 15169123 15902884 15869628 14362074
41215 14362074 11728338 9491476 8772505 9157063 9599526 9788282 9991723 10171695 10081278
41206 10081278 9906201 10046426 10441591 10731093 10874031 10991348 10808040 9963403 8797038
41197 8797038 8136615 8268664 8712006 9026230 9207336 9194854 8679185 7697665 6884833 6761854
41187 6761854 7133285 7462978 7493658 7222831 6635393 5825037 5132404 4837446 4901399 5234090
41177 5234090 5911719 6811963 7355095 7083365 6337304 5901622 6064840 6443757 6638900
41168 6638900 6577507 6242467 5623811 5059849 5082843 5648602 5945017 5304349 3996545 2802570
41158 2802570 2100198 1747318 1623162 1819525 2365319 3136241 4008970 4806106 5179110
$$ packed form
41224A1810435Q92637L89096J03507L78851P29186Q65411P33761l3256j507554
41215A4362074k633736k236862p18971L84558M42463J88756K03441J79972r0417
41206A0081278j75077J40225L95165K89502J42938J17317j83308q44637j166365
41197H797038o60423J32049M43342L14224J81106j2482n15669r81520q12832j22979
41187F761854L71431L29693L0680k70827n87438q10356o92633k94958O3953L32691
41177E234090O77629R00244N43132k71730p46061m35682J63218L78917J95143
41168F638900o1393l35040o18656n63962K2994N65759K96415o40668j307804j193975
41158B802570p02372l52880j24156J96363N45794P70922Q72729P97136L73004
$$ plain form
41149 5179110 4926002 4404964 4225467 4451700 4496954 3972604 3293574 3147437 3557380 3816782
41139 3816782 3392945 2682443 2672976 3798429 5272299 5832020 5192055 4397845 4478948 5109755
41129 5109755 5100443 3995980 2537314 1549364 1084010 885822 1026254 1603257 2284019
41120 2284019 2696327 2999757 3564396 4276745 4672682 4671669 4696958 5038730 5482386 5642192
41110 5642192 5380668 4844400 4317543 4068485 4124402 4165647 3829016 3141201 2496729 2193588
41100 2193588 2121634 1924470 1402842 793309 648785 1269894 2205389 2590081 2133187 1464334
41090 1464334 1255054 1357521 1245279 1010750 1286949 2205728 3043361 3080589 2362288 1391880
41080 1391880 483924 -249132 -555083 -150341 790191 1555970 1556662 1058714 1065646 2233879
$$ packed form
41149E179110k53108n21038j79497K26233M5254n24350o79030j46137M09943K59402
41139C816782m23837p10502r467J125453J473870N59721o39965p94210Q1103O30807
41129E109755r312j104463j458666r87950m65354j98188J40432N77003O80762
41120B284019M12308L03430N64639P12349L95937j013K5289L41772M43656J59806
41110E642192k61524n36268n26857k49058N5917M1245l36631o87815o44472l03141
41100B193588p1954j97164n21628o09533j44524O21109R35495L84692m56894o68853
41090A464334k09280J02467j12242k34529K76199R18779Q37633L7228p18301r70408
41080A391880r07956p33056l05951M04742R40532P65779O92m97948O932J168233
$$ plain form
41070 2233879 3945017 4780169 4059731 2607214 1722108 1666707 1572402 720194 -518971
41061 -518971 -1087639 -349288 1209765 2232265 1587480 -501968 -2486369 -2864979 -1495601
41052 -1495601 526753 1981064 2279934 1540430 418520 -303790 -405173 -371936 -592771
41043 -592771 -798125 -710824 -683232 -974608 -979818 -228072 308570 -686418 -2565250 -3091595
41033 -3091595 -1484044 432796 804780 53645 -393150 -397140 -753565 -1432986 -1720662
41024 -1720662 -1646426 -1783101 -1810088 -751207 1218230 2528022 2194852 1025819 378815
41015 378815 578561 1091636 1558896 2002247 2417123 2723799 2945209 3102940 3095389 2855232
41005 2855232 2428252 1834854 1165767 843410 1308178 2266229 2743732 2220503 1317315
$$ packed form
41070B233879J711138Q35152p20438j452517q85106n5401r4305q52208j239165
41061e18971n68668P38351J559053J022500o44785k089448j984401l78610J369378
41052a495601K022354J454311K98870p39504j121910p22310j01383L3237k20835
41043e92771k05354Q7301K7592k91376n210P51746N36642r94988j878832n26345
41033c091595J607551J916840L71984p51135m46795l990l56425o79421k87676
41024a720662P4236j36675k6987J058881J969437J309792l33170j169033o47004
41015C78815J99746N13075M67260M43351M14876L06676K21410J57731p551k40157
41005B855232m26980n93398o69087l22357M64768R58051M77503n23229r03188
$$ plain form
40996 1317315 975671 1285534 1588808 1528602 1453959 1766156 2307660 2574423 2272185 1476889
40986 1476889 415579 -676556 -1508606 -1764915 -1316079 -334083 888181 2148691 3250098
40977 3250098 3842880 3665337 2975737 2434177 2392333 2520514 2287582 1583695 704997 -23040
40967 -23040 -385747 -288933 97760 388092 397321 312954 277941 158149 9268 318347 1245971
40956 1245971 1972982 1487171 -115644 -1746522 -2630949 -2834663 -2570016 -1818121 -829437
40947 -829437 -230732 -248269 -392109 -280730 -253213 -738682 -1485593 -1927056 -1979559 -1959987
40937 -1959987 -1927513 -1625328 -998417 -317813 251155 873119 1720529 2587105 2931930 2363935
40927 2363935 1182009 369122 767026 2165530 3467574 3870046 3590687 3273932 3064188
$$ packed form
40996A317315l41644L09863L03274o0206p4643L12197N41504K66763l02238p95296
40986A476889j061310j092135q32050k56309M48836R81996J222264J260510J101407
40977C250098N92782j77543o89600n41560m1844J28181k32932p03887q78698p28037
40967b3040l62707R6814L86693K90332R229q4367l5013j19792j48881L09079R27624
40956A245971P27011m85811j602815j630878q84427k03714K64647P51895R88684
40947h29437N98705j7537j43840J11379K7517m85469p46911m41463n2503J9572
40937a959987L2474L02185O26911O80604N68968O21964Q47410Q66576L44825n67995
40927B363935j181926q12887L97904J398504J302044M02472k79359l16755k09744
$$ plain form
40918 3064188 2658246 2060326 1790903 2249276 3141418 3702983 3443420 2629993 2030543
40909 2030543 2142832 2699014 2998840 2658001 1875145 1051853 428691 105908 118903 369322
40899 369322 675878 968723 1271923 1511904 1575729 1511831 1369293 921102 7731 -839582
40889 -839582 -704070 566757 2012686 2648706 2470674 2092247 1851330 1683528 1504811
40880 1504811 1290416 1065286 1150838 2006169 3373746 4035850 3095680 1245886 60395
40871 60395 138085 650171 739178 637204 1116473 2328637 3557465 3930056 3191916 1912573
40861 1912573 994024 861234 1149593 1266447 1084501 901824 963248 1327132 1971929 2643561
40851 2643561 2800207 2165423 1182875 451541 -104504 -914290 -1770321 -1958379 -1475144
$$ packed form
40918C064188m05942n97920k69423M58373Q92142N61565k59563q13427n99450
40909B030543J12289N56182K99826l40839p82856q23292o23162l22783J2995K50419
40899C69322L06556K92845L03200K39981O3825o3898j42538m48191r13371q47313
40889h39582J35512J270827J445929O36020j78032l78427k40917j67802j78717
40880A504811k14395k25130Q5552Q55331J367577O62104r40170j849794j185491
40871F0395P7690N12086Q9007j01974M79269J212164J228828L72591p38140j279343
40861A912573r18549j32790K88359J16854j81946j82677O1424L63884O44797O71632
40851B643561J56646o34784r82548p31334n56045q09786q56031j88058M83235
$$ plain form
40842 -1475144 -1305900 -2107320 -3235549 -3582486 -2950976 -2073022 -1521015 -1140257 -547473
40833 -547473 199379 600890 313582 -347922 -648898 -253238 431129 961460 1574587 2645112
40823 2645112 3656828 3536935 2136130 588315 -123074 -233477 -384216 -458777 45028
40814 45028 940333 1458146 1275239 791410 466982 444670 768601 1427050 2135494 2512179
40804 2512179 2507118 2309903 1887085 1035089 -95282 -938024 -1069962 -556787 258246 1022403
40794 1022403 1447468 1412117 1006618 309160 -700394 -1750345 -2155070 -1640832 -1056722
40785 -1056722 -1517398 -2850548 -3664050 -3107509 -1811799 -800213 -248246 167472 382357
40776 382357 177514 -73139 316997 1368569 2301701 2390320 1562270 235885 -1014743
$$ packed form
40842a475144J69244q01420j128229l46937O31510Q77954N52007L80758N92784
40833e47473P46852M01511k87308o61504l00976L95660O84367N30331O13127J070525
40823B645112J011716j19893j400805j547815p11389j10403j50739p4561N03805
40814D5028Q95305N17813j82907m83829l24428k2312L23931O58449P08444L76685
40804B512179n061j97215m22818q51996j130371q42742j31938N13175Q15033P64157
40794A022403M25065l5351m05499o97458j009554j049951m04725N14238N84110
40785a056722m60676j333150q13502N56541J295710J011586N51967M15718K14885
40776C82357k04843k50653L90136J051572R33132Q8619q28050j326385j250628
$$ plain form
40767 -1014743 -1686866 -1686419 -1481128 -1571577 -1797593 -1521218 -536040 561261 1014964 635136
40757 635136 -246124 -1271938 -2282049 -3142833 -3601194 -3464277 -2926420 -2506890 -2407283
40748 -2407283 -2067850 -841394 853221 1706420 1195988 443675 766563 1906663 2553734
40739 2553734 2247776 1684731 1247486 472882 -727999 -1495496 -1327919 -1058830 -1706866
40730 -1706866 -2980068 -3763486 -3643989 -3120884 -2627824 -2189266 -1872957 -1775300 -1597811
40721 -1597811 -957642 -149395 33705 -697988 -1822922 -2671575 -2859860 -2179781 -791169
40712 -791169 438233 565193 -221152 -685879 -112564 839731 1148081 676159 21965
40703 21965 -315442 -157542 450621 1034068 834517 -241373 -1170665 -941345 120043
$$ packed form
40767a014743o72123M47K05291r0449k26016K76375R85178J097301M53703l79828
40757F35136q81260j025814j010111q60784m58361J36917N37857M19530R9607
40748b407283L39433J226456J694615Q53199n10432p52313L22888J140100O47071
40739B553734l05958n63045m37245p74604j200881p67497J67577K69089o48036
40730a706866j273202p83418J19497N23105M93060M38558L16309R7657J77489
40721a597811O40169Q08247J83100p31693j124934q48653j88285O80079J388612
40712g91169J229402J26960p86345m64727N73315R52295L08350m71922o54194
40703B1965l37407J57900O08163N83447j99551j075890r29292K29320J061388
$$ plain form
40694 120043 789011 534175 -18733 -164724 42404 166609 2409 -434019 -1045802 -1491456
40684 -1491456 -1260128 -254795 936179 1639748 1776993 1677988 1438278 854606 -57798
40675 -57798 -892522 -1312956 -1377587 -1218173 -672502 409453 1606691 2122923 1705295 1064763
40665 1064763 1119904 1977516 2884990 3049157 2264119 882950 -501949 -1406037 -1794571
40656 -1794571 -2067436 -2461190 -2600130 -2032328 -1100397 -709477 -1133412 -1610264 -1366138
40647 -1366138 -547293 197952 636606 1020287 1510677 1944669 2048406 1655500 898406
40638 898406 315567 419204 961887 1081112 469326 -124559 -13955 357541 145578 -541411
40628 -541411 -883497 -712424 -684560 -1073328 -1295904 -864644 -25753 856406 1821485 2794015
$$ packed form
40694A20043O68968k54836n52908j45991K07128J24205j64200m36428o11783m45654
40684a491456K31328J005333J190974P03569J37245r9005k39710n83672r12404
40675e7798q34724m20434o4631J59414N45671J081955J197238N16232m17628o40532
40665A064763N5141Q57612R07474J64167p85038j381169j384899r04088l88534
40656a794571k72865l93754j38940N67802R31931L90920m23935m76852K44126
40647a366138Q18845P45245M38654L83681M90390M33992J03737l92906p57094
40638H98406n82839J03637N42683J19225o11786n93885J10604L71496k11963o86989
40628e41411l42086J71073K7864l88768k22576M31260Q38891Q82159R65079R72530
$$ plain form
40618 2794015 3197242 2677742 1777002 1273454 1142386 779478 101607 -227118 231534
40609 231534 999528 1242791 766888 185937 191602 884069 1859748 2766431 3570935 4301157
40599 4301157 4765579 4705555 4136870 3375031 2738295 2314997 1971644 1518872 956461 599931
40589 599931 786734 1372070 1779401 1732961 1634261 1906271 2269988 2133182 1488671 861558
40579 861558 428133 -197863 -1163146 -1890158 -1696429 -608344 670415 1416540 1396310
40570 1396310 916336 473540 237522 -91680 -760273 -1453516 -1629100 -1250313 -812721
40561 -812721 -704810 -916381 -1278514 -1538236 -1302364 -478967 267131 161468 -522375 -682727
40551 -682727 46621 724728 456656 -418986 -1022270 -1160636 -1181969 -1098602 -679760 -193695
$$ packed form
40618B794015M03227n19500r00740n03548j31068l62908o77871l28725M58652
40609B31534P67994K43263m75903n80951N665O92467R75679R06683Q04504P30222
40599D301157M64422o0024n68685p61839o36736m23298l43353m52772n62411l56530
40589E99931J86803N85336M07331m6440r8700K72010L63717j36806o44511o27113
40579H61558m33425o25996r65283p27012J93729J088085J278759P46125k0230
40570A396310m79974m42796k36018l29202o68593o93243j75584L78787M37592
40561h12721J07911k11571l62133k59722K35872Q23397P46098j05663o83843j60352
40551f82727P29348O78107k68072q75642o03284j38366k1333Q3367M18842M86065
$$ plain form
40541 -193695 -254601 -880018 -1314359 -969461 -140131 415246 384049 205547 486922 1184590
40531 1184590 1540041 1032644 219271 149933 946342 1572830 1252532 491262 230012 469242
40521 469242 346608 -666877 -2193411 -3442439 -3859756 -3417249 -2622286 -2113354 -1967736
40512 -1967736 -1619106 -720722 246214 604139 387436 161708 227350 506038 959996 1558613
40502 1558613 2002458 2047096 2003594 2399844 3210707 3870835 3949923 3420650 2484654 1621144
40492 1621144 1529681 2384951 3343163 3461106 2921393 2600688 2624653 2317321 1573091 1189382
40482 1189382 1539787 1903346 1585353 859340 271271 -169029 -442339 49415 1594249
40473 1594249 3209451 3526718 2421626 961746 -68254 -748387 -1242070 -1379439 -1205285
$$ packed form
40541a93695o0906o25417m34341L44898Q29330N55377l1197j78502K81375O97668
40531A184590L55451n07397q13373o9338P96409O26488l20298p61270k61250K39230
40521D69242j22634j013485j526534j249028m17317M42507P94963N08932J45618
40512a967736L48630Q98384R66936L57925k16703k25728O5642K78688M53958N98617
40502A558613M43845M4638m3502L96250Q10863O60128P9088n29273r35996q63510
40492A621144r1463Q55270R58212J17943n39713l20705K3965l07332p44230l83709
40482A189382L50405L63559l17993p26013n88069m40300k73310M91754J544834
40473A594249J615202L17267j105092j459880j030000o80133m93683j37369J74154
$$ plain form
40464 -1205285 -1140033 -1260309 -1057485 -281426 547437 906154 1025051 1315148 1480677 958919
40454 958919 69618 -80350 1018587 2599159 3520268 3329585 2253915 784067 -323399
40445 -323399 -254839 954556 2069967 1923485 830796 38301 -76139 -386268 -1542303
40436 -1542303 -3000591 -3851600 -3889358 -3436886 -2717266 -1881470 -1191710 -724170 -267343
40427 -267343 157386 156805 -299066 -575744 -288192 43719 -174901 -661764 -791052 -585117
40417 -585117 -437674 -296609 44294 200394 -345751 -1259282 -1699642 -1477514 -1007537 -325914
40407 -325914 821207 1992574 2288953 1750401 1474539 2020203 2626375 2426086 1594230
40398 1594230 798826 238827 -219285 -516113 -559323 -515153 -515005 -395522 -32501 394051
$$ packed form
40464a205285O5252j20276K02824P76059Q28863L58717J18897K90097J65529n21758
40454I58919q89301j49968J098937J580572R21109j90683j075670j469848j107466
40445c23399O8560J209395J115411j46482j092689p92495j14440l10129j156035
40436a542303j458288q51009l7758M52472P19620Q35796O89760M67540M56827
40427b67343M24729n81m55871k76678K87552L31911k18620m86863j29288K05935
40417e85117J47443J41065L40903J56100n46145r13531m40360K22128M69977O81623
40407c25914J147121J171367K96379n38552k75862N45664O06172k00289q31856
40398A594230p95404n59999m58112k96828m3210M4170J48J19483L63021M26552
$$ plain form
40388 394051 689964 873986 1003312 1162748 1636990 2531193 3172929 2601237 864010
40379 864010 -851379 -1650864 -1823268 -1989015 -2085672 -1701526 -863898 24003 650749 833587
40369 833587 490346 -102872 -421228 -327507 -222709 -421897 -849965 -1398445 -1909208 -1726371
40359 -1726371 -165258 2246173 3865562 3736653 2532722 1319655 295828 -684154
40351 -684154 -1292655 -1257319 -985972 -879535 -653248 -56677 416492 317131 71252 195068
40341 195068 317585 -139391 -894083 -1307618 -1407590 -1543068 -1586244 -1354906 -1210325 -1297581
40331 -1297581 -869393 563952 2077906 2506239 2122417 1868400 1595848 626597 -494589
40322 -494589 -614010 -73506 -325369 -1451273 -1972027 -1377285 -924864 -1367594 -1718531
$$ packed form
40388C94051K95913J84022J29326J59436M74242Q94203O41736n71692j737227
40379H64010j715389p99485j72404j65747r6657L84146Q37628Q87901O26746J82838
40369H33587l43241n93218l18356R3721J04798j99188m28068n48480n10763J82837
40359a726371J561113K411431J619389j28909j203931j213067j023827r79982
40351f84154o08501L5336K71347J06437K26287N96571M73169r9361k45879J23816
40341A95068J22517m56976p54692m13535r9972j35478m3176K31338J44581q7256
40331a297581M28188J433345J513954M28333l83822k54017k72552r69251j121186
40322d94589j19421N40504k51863j125904n20754N94742M52421m42730l50937
$$ plain form
40313 -1718531 -1137766 -422940 -545006 -1060818 -1181481 -1327395 -2339288 -3879820 -4779857
40304 -4779857 -4489061 -3289863 -1601281 59971 921552 674538 74992 109680 793558
40295 793558 1329673 1148955 323019 -680732 -1216244 -840776 126243 869240 1178505
40286 1178505 1630988 2338004 2410914 1328912 -13122 -507962 -387673 -575159 -1064598
40277 -1064598 -1097294 -605528 -277059 -262097 30154 687440 894687 199987 -594850 -371426
40267 -371426 890064 2113957 2386064 1868547 1439213 1578376 1782833 1219639 -152506
40258 -152506 -1443277 -1821701 -1245358 -136494 1114334 2043973 2064382 1032846 -371960
40249 -371960 -1201508 -990813 124709 1573218 2448147 2082613 918156 235837 614384
$$ packed form
40313a718531N80765P14826j22066n15812j20663j45914j011893j540532r00037
40304d779857K90796J199198J688582J661252Q61581k47014n99546L4688O83878
40295G93558N36115j80718q25936j003751n35512L75468R67019P42997L09265
40286A178505M52483P07016P2910j082002j342034m94840J20289j87486m89439
40277a064598l2696M91766L28469J4962K92251O57286K07247o94700p94837K23424
40267c71426J261490J223893K72107n17517m29334J39163K04457n63194j372145
40258a52506j290771l78424N76343J108864J250828R29639K0409j031536j404806
40249c71960q29548K10695J115522J448509Q74929l65534j164457o82319L78547
$$ plain form
40240 614384 1272041 1378565 1227916 1404280 1574519 1124832 441013 421607 1039855 1519796
40230 1519796 1756885 2381644 3378570 3796845 3132404 2066949 1451797 1273656 980983
40221 980983 279467 -650033 -1262282 -902507 497729 1965806 2396854 1964606 1875175
40212 1875175 2612652 3298384 3081802 2290832 1692102 1347484 850232 160872 -462218
40203 -462218 -1021525 -1662983 -2205831 -2294303 -1909496 -1381517 -1025809 -1021582 -1423019 -1977635
40193 -1977635 -2121046 -1482220 -320632 731487 1256437 1277007 1098446 1056222 1222807
40184 1222807 1274132 881168 271619 47316 347712 619274 403970 -81087 -414491 -576848
40174 -576848 -719722 -717754 -399749 50105 351547 555376 803446 908410 630184 157493
$$ packed form
40240F14384O57657J06524j50649J76364J70239m49687o83819j9406O18248M79941
40230A519796K37089O24759R96926M18275o64441j065455o15152j78141k92673
40221I80983p01516r29500o12249L59775J400236J468077M31048m32248q9431
40212A875175P37477O85732k16582p90970n98730l44618m97252o89360o23090
40203d62218n59307o41458n42848q8472L84807N27979L55708M227m01437n54616
40193a977635j43411O38826J161588J052119N24950K0570j78561m2224J66585
40184A222807N1325l92964o09549k24303L00396K71562k15304m85057l33404j62357
40174e76848j42874J968L18005M49854L01442K03829K48070J04964k78226m72691
$$ plain form
40164 157493 -179516 -484501 -1024976 -1544997 -1527052 -1119617 -1038109 -1352847 -1164476 40432
40154 40432 1372714 1607346 884578 508234 1121772 1921255 1926182 1341613 1163905 1840797
40144 1840797 2860972 3489867 3429770 2811782 1978857 1348417 1168597 1304418 1439473
40135 1439473 1461863 1441004 1331401 1036285 700855 541239 403691 -40751 -635702 -839159
40125 -839159 -642908 -770823 -1594139 -2399582 -2276589 -1363181 -632272 -654348 -1120489 -1486217
40115 -1486217 -1568505 -1462516 -1241839 -866566 -281534 357156 582813 61305 -791682 -1095493
40105 -1095493 -627387 -171858 -457336 -1300131 -2184399 -3023334 -3756089 -3864855 -3106719
40096 -3106719 -2167563 -1673372 -1070379 420205 2147138 2629240 1674470 586771 188397
$$ packed form
40164A57493l37009l04985n40475n20021J7945M07435Q1508l14738J88371J204908
40154D0432J332282K34632p22768l76344O13538P99483M927n84569j77708O76892
40144A840797J020175O28895o0097o17988q32925o30440j79820J35821J35055
40135A439473K2390k0859j09603k95116l35430j59616j37548m44442n94951k03457
40125h39159J96251j27915q23316q05443J22993R13408P30909k2076m66141l65728
40115a486217q2288J05989K20677L75273N85032O38690K25657n21508q52987l03811
40105a095493M68106M55529k85478q42795q84268q38935p32755j08766P58136
40096c106719R39156M94191O02993J490584J726933M82102r54770j087699l98374
$$ plain form
40087 188397 -68787 -761827 -1508476 -1776849 -1656091 -1388479 -1065840 -1109594 -1996034 -3132936
40077 -3132936 -3187513 -2056763 -1266169 -1679832 -2090148 -1123133 571429 1306140 713138
40068 713138 -171979 -566899 -438588 140191 875275 893949 -254633 -1550702 -1658488
40059 -1658488 -825259 -365799 -542967 -416074 287850 727125 598714 729069 1516808
40050 1516808 2135635 1967596 1660941 1956934 2426731 2225576 1335444 261909 -799455
40041 -799455 -1688414 -1852870 -1124209 -409049 -661487 -1532240 -1955801 -1753535 -1625566 -1713589
40031 -1713589 -1320098 -250540 591556 439042 -233339 -400204 199072 980838 1422617
40022 1422617 1497206 1366362 1162062 1076284 1248411 1469718 1333615 831239 517676 836987
$$ packed form
40087A88397k57184o93040p46649k68373J20758K67612L22639m3754q86440j136902
40077c132936n4577J130750P90594m13663m10316R67015J694562P34711n93002
40068G13138q85117l94920J28311N78779P35084J8674j148582j296069j07786
40059a658488Q33229M59460j77168J26893P03924M39275j28411J30355P87739
40050A516808O18827j68039l06655K95993M69797k01155q90132j073535j061364
40041g99455q88959j64456P28661P15160k52438q70753m23561K02266J27969q8023
40031a713589L93491J069558Q42096j52514o72381j66865N99276P81766M41779
40022A422617P4589j30844k04300q5778J72127K21307j36103n02376l13563L19311
$$ plain form
40012 836987 1444910 1512954 716959 -333643 -782323 -493501 -158314 -452588 -1226211 -1604818
40002 -1604818 -873244 789422 2458895 3288685 3129714 2415325 1635527 984158 323545
39993 323545 -635393 -1922416 -2925626 -2733927 -1222978 460807 1019819 458894 -179758
39984 -179758 -409027 -762308 -1510175 -1910345 -1366794 -579549 -671077 -1602278 -2344131 -2405468
39974 -2405468 -2318694 -2622622 -3139978 -3401783 -3193550 -2553813 -1727837 -1195531 -1270590 -1636287
39964 -1636287 -1745954 -1637025 -1770687 -2114248 -2138176 -1845569 -1985280 -2896113 -3875203 -4169413
39954 -4169413 -3927186 -3559943 -2768162 -1074907 948269 1912977 1210598 -251621 -1140906
39945 -1140906 -1091612 -762144 -836982 -1338659 -1873945 -2271506 -2783880 -3652995 -4618417 -5039347
$$ packed form
40012H36987O07923O8044p95995j050602m48680K88822L35187k94274p73623l78607
40002a604818P31574J662666J669473Q29790j58971p14389p79798o51369o60613
39993C23545r58938j287023j003210J91699J510949J683785N59012n60925o38652
39984a79758k29269l53281p47867m00170N43551P87245r1528r31201p41853o1337
39974b405468Q6774l03928n17356k61805K08233O39737Q25976N32306p5059l65697
39964a636287j09667J08929j33662l43561k3928K92607j39711r10833r79090k94210
39954d169413K42227L67243P91781J693255K023176R64708p02379j462219q89285
39945a140906M9294L29468p4838n01677n35286l97561n12374q69115r65422m20930
$$ plain form
39935 -5039347 -4554938 -3515983 -2671610 -2443772 -2549042 -2373495 -1764926 -1361352 -1889418
39926 -1889418 -3118720 -3899275 -3463874 -2301624 -1362536 -814713 -209530 443559 642150
39917 642150 404008 411200 912431 1296878 1131840 863338 956519 999088 340180 -831069
39907 -831069 -1730903 -2013053 -1956001 -1875783 -1927162 -2250417 -2724684 -2782064 -2080666 -1187596
39897 -1187596 -938525 -1255564 -1339263 -993323 -911891 -1454410 -1950792 -1682404 -948830 -589941
39887 -589941 -826480 -1148797 -1155086 -947962 -717064 -389095 164239 828233 1291871 1274935
39877 1274935 676820 -345196 -1367635 -1894394 -1708464 -1063221 -491506 -394434 -763414
39868 -763414 -1222803 -1324856 -904398 -252553 107811 -42666 -335144 -257466 111529 120862
$$ packed form
39935e039347M84409J038955Q44373K27838j05270J75547O08569M03574n28066
39926a889418j229302p80555M35401J162250R39088N47823O05183O53089J98591
39917F42150k38142P192N01231L84447j65038k68502R3181M2569o58908j171249
39907h31069q99834k82150N7052Q0218n1379l23255m74267n7380P01398Q93070
39897a187596K49071l17039q3699L45940Q1432n42519m96382K68388P33574L58889
39887e89941k36539l22317o289K07124K30898L27969N53334O63994M63638j6936
39877A274935n98115j022016j022439n26759J85930O45243N71715R7072l68980
39868g63414m59389j02053M20458O51845L60364j50477k92478P7678L68995R333
$$ plain form
39858 120862 -546559 -1328281 -1479598 -1040854 -629468 -444887 -109170 473756 775152 439716
39848 439716 -101978 -202360 190805 645322 859025 831483 695457 669495 898639 1105358
39838 1105358 789224 62348 -217124 405152 1219703 1376234 1195151 1616833 2634806
39829 2634806 3247901 2940364 2265496 1795588 1358647 627540 -281706 -1180257 -2124462
39820 -2124462 -2952478 -3100655 -2371253 -1408831 -931738 -886628 -803398 -578700 -423904 -406933
39810 -406933 -551448 -1044607 -1809950 -2213141 -1814880 -1148682 -1072067 -1540317 -1771797 -1542349
39800 -1542349 -1495262 -2059181 -2829346 -3271861 -3369712 -3274880 -2969239 -2643960 -2774011 -3312821
39790 -3312821 -3399828 -2511050 -1419743 -1251735 -1922271 -2350345 -2024969 -1426275 -910841
$$ packed form
39858A20862o67421p81722j51317M38744M11386J84581L35717N82926L01396l35436
39848D39716n41694j00382L93165M54517K13703k7542j36026k5962K29144K06719
39838A105358l16134p26876k79472O22276Q14551J56531j81083M21682J017973
39829B634806O13095l07537o74868m69908m36941p31107r09246q98551r44205
39820b124462q28016j48177P29402R62422M77093M5110Q3230K24698J54796J6971
39810d06933j44515m93159p65343m03191L98261O66198P6615m68250k31480K29448
39800a542349M7087n63919p70165m42515r7851R4832L05641L25279j30051n38810
39790c312821q7007Q88778J091307J68008o70536m28074L25376N98694N15434
$$ plain form
39781 -910841 -211348 657925 948707 202973 -975190 -1783255 -2248125 -2717585 -2911826
39772 -2911826 -2374742 -1499532 -1123567 -1253274 -1165168 -736869 -604974 -810307 -422607 929881
39762 929881 2116284 1888029 534369 -684171 -1232504 -1509086 -1721240 -1614072 -1310547
39753 -1310547 -1448851 -2189511 -2767890 -2383034 -1088681 446546 1680328 2472876 2934226
39744 2934226 3196548 3171562 2567025 1428934 505957 523785 1132760 1260945 636088 183292
39734 183292 575467 1192801 1135646 571575 222200 39475 -512174 -1083129 -616516 864051
39724 864051 1831317 1265775 149591 29139 752715 812870 -323229 -1512325 -1764934
39715 -1764934 -1573637 -1776657 -2047013 -1489017 -197733 848423 1267895 1619716 2202840
$$ packed form
39781i10841O99493Q69273K90782p45734j178163q08065m64870m69460j94241
39772b911826N37084Q75210L75965j29707Q8106M28299J31895k05333L87700J352488
39762I29881J186403k28255j353660j218540n48333k76582k12154J07168L03525
39753a310547j38304p40660n78379L84856J294353J535227J233782P92548M61350
39744B934226K62322k4986o04537j138091r22977J7828O08975J28185o24857m52796
39734A83292L92175O17334n7155n64071l49375j82725n51649n70955M66613J480567
39724H64051R67266n65542j116184j20452P23576O0155j136099j189096k52609
39715a764934J91297k03020k70356N57996J291284J046156M19472L51821N83124
$$ plain form
39706 2202840 2495993 2121726 1532995 1252945 1111615 812362 686630 1198108 2082901
39697 2082901 2678585 2857973 2973221 3066862 2845664 2372843 2084767 2032954 1712184 812618
39687 812618 -327606 -1176825 -1527255 -1451445 -1125391 -823429 -782802 -987611 -1298869 -1679326
39677 -1679326 -1946872 -1536562 -130244 1537455 2211420 1583550 589893 83929 -99965
39668 -99965 -482665 -1038397 -1421514 -1558792 -1514232 -1163945 -464095 296287 916068 1615333
39658 1615333 2546115 3300173 3319603 2518520 1152808 -570604 -2355514 -3660936 -4166269
39649 -4166269 -4117503 -3810019 -3088570 -1834404 -564079 53325 2125 -311558 -779004
39640 -779004 -1435386 -1886275 -1658092 -977610 -464125 -161039 345441 928919 964304 478178
$$ packed form
39706B202840K93153l74267n88731k80050j41330k99253j25732N11478Q84793
39697B082901N95684J79388J15248R3641k21198m72821k88076n1813l20770q99566
39687H12618j140224q49219l50430P5810L26054L01962M0627k04809l11258l80457
39677a679326k67546M10310J406318J667699O73965o27870r93657n05964j83894
39668i9965l82700n55732l83117j37278M4560L50287O99850P60382O19781O99265
39658A615333R30782P54058J9430q01083j365712j723412j784910j305422n05333
39649d166269M8766L07484P21449J254166J270325O17404n1200l13683m67446
39640g79004o56382m50889K28183O80482N13485L03086N06480N83478L5385m86126
$$ plain form
39630 478178 317595 826227 1196763 685542 -191485 -359588 306933 859373 549614 -298619
39620 -298619 -776289 -460016 144567 205376 -455057 -1170546 -1335889 -1173385 -1219410 -1379106
39610 -1379106 -1167133 -742640 -852287 -1616167 -2228025 -2203066 -2115885 -2579803 -3216539 -3321582
39600 -3321582 -2971963 -2685505 -2401230 -1651376 -516804 405187 865792 1023139 730212
39591 730212 -360251 -1877915 -2786673 -2673378 -2269697 -2304891 -2524499 -2406064 -2259035
39582 -2259035 -2794997 -3832458 -4260376 -3433887 -2008914 -1102296 -1026773 -1229117 -1252133
39573 -1252133 -1287207 -1687596 -2289302 -2549345 -2293139 -1970449 -1993854 -2087309 -1652568 -701947
39563 -701947 24717 34164 -223071 11110 704249 1047096 551247 -329953 -852472 -880799
$$ packed form
39630D78178j60583N08632L70536n11221q77027j68103O66521N52440l09759q48233
39620b98619m77670L16273O04583O0809o60433p15489j65343J62504m6025j59696
39610a379106K11973M24493j09647p63880o11858K4959Q7181m63918o36736j05043
39600c321582L49619K86458K84275P49854J134572R21991M60605J57347k92927
39591G30212j090463j517664r08758J13295M03681l5194k19608J18435J47029
39582b259035n35962j037461m27918Q26489J424973R06618P5523k02344k3016
39573a252133l5074m00389o01706k60043K56206L22690k3405r3455M34741R50621
39563g01947P26664R447k57235K34181O93139L42847m95849q81200n22519k8327
$$ plain form
39553 -880799 -824302 -905015 -879415 -463093 280068 1037728 1524460 1595395 1266003 703506
39543 703506 94742 -492551 -1016221 -1317305 -1309944 -1258279 -1514283 -1924291 -1884051 -1160674
39533 -1160674 -306909 -19791 -404212 -1106494 -1778110 -2054084 -1521130 -297618 647879
39524 647879 446235 -510583 -998255 -486132 422702 1020750 1180572 939688 285389 -349254
39514 -349254 -219569 636270 1195784 887917 468559 757786 1241979 900910 -107191
39505 -107191 -713137 -621862 -571761 -937539 -1209815 -1067168 -921754 -1031054 -1001935 -662387
39495 -662387 -582871 -1124400 -1692106 -1639063 -1324571 -1501302 -2087219 -2340011 -1943252 -1136759
39485 -1136759 -22008 1389845 2540556 2670796 1952061 1449624 1688635 2017227 1777219
$$ packed form
39553h80799N6497q0713K5600M16322P43161P57660M86732P0935l29392n62497
39543G03506o08764n87293n23670l01084P361N1665k56004m10008M0240P23377
39533a160674Q53765K87118l84421p02282o71616k75974N32954J223512R45497
39524F47879k01644r56818m87672N12123R08834N98048J59822k40884o54299o34643
39514c49254J29685Q55839N59514l07867m19358K89227M84193l41069j008101
39505a07191o05946R1275N0101l65778k72276J42647J45414j09300K9119L39548
39495f62387P9516n41529n67706N3043L14492j76731n85917k52792L96759Q06493
39485a136759J114751J411853J150711J30240p18735n02437K39011L28592k40008
$$ plain form
39476 1777219 1358056 1463072 1905105 1940156 1488789 1138320 957663 232795 -1254325
39467 -1254325 -2428480 -2110252 -680838 195271 -446620 -1802793 -2480291 -2198013 -1754763
39458 -1754763 -1579196 -1086114 284665 1954022 2673541 1957611 585576 -340635 -441066
39449 -441066 -36831 522257 1143489 1745204 2128362 2226185 2260520 2451009 2656840 2519089
39439 2519089 1973746 1408344 1174913 1120440 853028 400142 250189 618735 994127 719751
39429 719751 -109849 -649675 -201860 1093726 2430522 2973312 2379471 1020479 -204730
39420 -204730 -535709 -14869 617248 735286 354668 -178864 -692952 -1157783 -1395986 -1152877
39410 -1152877 -411232 554379 1364451 1639348 1104946 -122952 -1440095 -2216916 -2356519
$$ packed form
39476A777219m19163J05016M42033L5051m51367l50469j80657p24868j487120
39467a254325j174155L18228J429414Q76109o41891j356173o77498K82278M43250
39458a754763J75567M93082J370779J669357P19519p15930j372035r26211j00431
39449d41066M04235N59088O21232O01715L83158R7823L4335J90489K05831j37751
39439B519089n45343n65402k33431n4473k67412m52886j49953L68546L75392k74376
39429G19751q29600n39826M47815J295586J336796N42790n93841j358992j225209
39420b04730l30979N20840O32117J18038l80618n33532n14088m64831k38203K43109
39410a152877P41645R65611Q10072K74897n34402j227898j317143p76821j39603
$$ plain form
39401 -2356519 -2221779 -2126547 -2149918 -2302068 -2483898 -2353133 -1704338 -1022086 -1125784 -2068484
39391 -2068484 -2909362 -2925889 -2570052 -2700547 -3240893 -3317104 -2624171 -1898453 -1827453 -2088154
39381 -2088154 -1841884 -796901 614765 1853584 2646568 2880012 2537250 1788123 888789
39372 888789 -29106 -889742 -1469871 -1552344 -1279079 -1030881 -873564 -443334 446139 1377009
39362 1377009 1766043 1497734 814908 -192528 -1514412 -2694170 -2942115 -2027277 -700861
39353 -700861 71626 82930 -169454 -283811 -337867 -553252 -934197 -1325463 -1646440 -2002152
39343 -2002152 -2603815 -3473661 -4143057 -3886420 -2539901 -924796 -100412 -277821 -829027
39334 -829027 -1256752 -1628346 -1992553 -1956670 -1192061 -27266 788377 737969 -186005 -1542792
$$ packed form
39401b356519J34740R5232k3371j52150j81830J30765O48795O82252j03698r42700
39391b068484q40878j6527L55837j30495n40346p6211O92933P25718P1000k60701
39381b088154K46270J044983J411666J238819P92984K33444l42762p49127q99334
39372H88789r17895q60636n80129q2473K73265K48198J57317M30230Q89473R30870
39362A377009L89034k68309o82826j007436j321884j179758k47945R14838J326416
39353g00861P72487J1304k52384j14357n4056k15385l80945l91266l20977l55712
39343b002152o01663q69846o69396K56637J346519J615105Q24384j77409n51206
39334h29027m27725l71594l64207L5883P64609J164795Q15643n0408r23974j356787
$$ plain form
39324 -1542792 -2569757 -2602119 -1728074 -832589 -703856 -1278672 -1992780 -2565895 -3057191
39315 -3057191 -3383786 -3277105 -2689835 -1892084 -1171097 -686377 -543101 -746555 -1152344
39306 -1152344 -1656124 -2271641 -2816416 -2794984 -1930984 -578797 734867 1877046 2807089
39297 2807089 3117159 2527072 1546355 882410 395643 -494834 -1523373 -1789984 -1356282
39288 -1356282 -1412044 -2388059 -3060736 -2338825 -987229 -515943 -1010135 -1259390 -729798
39279 -729798 -191105 -316118 -693269 -572729 112931 836610 1123115 848193 250390 -177309
39269 -177309 -107304 227094 359904 304233 502794 1012475 1240888 716867 -266051 -1016097
39259 -1016097 -1136909 -653554 191358 949572 1048531 258608 -983658 -1964194 -2334810
$$ packed form
39324a542792j026965l2362Q74045Q95485J28733n74816p14108n73115m91296
39315c057191l26595J06681N87270P97751P20987M84720J43276k03454m05789
39306a152344n03780o15517n44775K1432Q64000J352187J313664J142179R30043
39297B807089L10070n90087r80717o63945m86767q90477j028539k66611M33702
39288a356282n5762r76015o72677P21911J351596M71286m94192k49255N29592
39279g29798N38693j25013l77151J20540O85660P23679K86505k74922n97803m27699
39269a77309P0005L34398J32810n5671J98561N09681K28413n24021r82918p50046
39259a016097j20812M83355Q44912P58214R8959p89923j242266r80536l70616
$$ plain form
39250 -2334810 -2191930 -1665829 -744192 476239 1601825 2133755 1815747 825285 -284745
39241 -284745 -891703 -754762 -255179 -65120 -448868 -956338 -948904 -381390 148030 158677
39231 158677 -160012 -310811 -152269 77093 195747 162228 -136460 -693299 -1025272 -612312
39221 -612312 169085 185921 -1020227 -2473689 -2905458 -2224160 -1335172 -904407 -959389 -1414434
39211 -1414434 -2172495 -2734561 -2488399 -1587816 -952862 -1147383 -1727938 -1955241 -1719633
39202 -1719633 -1427784 -1267782 -958838 -168501 1017916 2058699 2398925 2019926 1437410
39193 1437410 1009651 452248 -657154 -2075914 -3040186 -3170598 -2825708 -2551197 -2551068 -2704608
39183 -2704608 -2758684 -2539770 -2299084 -2670023 -3815464 -4838345 -4707345 -3637550 -2756239
$$ packed form
39250b334810J42880N26101R21637J220431J125586N31930l18008r90462j110030
39241b84745o06958J36941M99583J90059l83748n07470P434N67514N29420J0647
39231A58677l18689j50799J58542K29362J18654l3519k98688n56839l31973M12960
39221f12312P81397J6836j206148j453462m31769O81298Q88988M30765n4982m55045
39211a414434p58061n62066K46162R00583O34954j94521n80555k27303K35608
39202a719633K91849J60002L08944P90337J186417J040783L40226l78999n82516
39193A437410m27759n57403j109402j418760r64272j30412L44890K74511J29j53540
39183b704608n4076K18914K40686l70939j145441j022881J31000J069795Q81311
$$ plain form
39174 -2756239 -2436083 -1918517 -762490 372571 831482 881479 890444 469667 -705506
39165 -705506 -1882471 -2004533 -1120628 -176621 295785 471313 483687 260587 20005 161733
39155 161733 654730 1128220 1485630 1843138 2021368 1777309 1424804 1509934 1926447 2050569
39145 2050569 1694215 1200725 670897 -81760 -830128 -1115783 -1213547 -1896067 -2985419
39136 -2985419 -3209528 -1986976 -351537 549164 912551 1382572 1592729 820127 -430417
39127 -430417 -841417 -198652 324215 -22139 -567805 -482839 -99301 -254175 -897621 -1189348
39117 -1189348 -794411 -341457 -473888 -990304 -1239152 -1064269 -960033 -1337639 -2008906
39108 -2008906 -2541379 -2816724 -2920099 -2677160 -1795500 -514026 378558 416838 -31587
$$ packed form
39174b756239L20156N17566J156027J135061M58911M9997Q965m20777j175173
39165g05506j176965j22062Q83905R44007M72406J75528J2374k23100k40582J41728
39155A61733M92997M73490L57410L57508J78230k44059l52505Q5130M16513J24122
39145B050569l56354m93490n29828p52657p48368k85655r7764o82520j089352
39136b985419k24109J222552J635439R00701L63387M70021K10157p72602j250544
39127d30417m11000O42765N22867l46354n45666Q4966L83538j54874o43446k91727
39117a189348L94937M52954j32431n16416k48848J74883J04236l77606o71267
39108b008906n32473k75345j03375K42939Q81660J281474Q92584L8280m48425
$$ plain form
39099 -31587 -411812 -714137 -1089927 -1113466 -203252 1237512 1914026 1242245 268587 420206
39089 420206 1665707 2584296 2221293 1202887 715310 881037 734032 -303372 -1526114
39080 -1526114 -1802310 -966930 63423 468915 390100 502422 1079528 1769762 2150707
39071 2150707 2187969 2103330 1998155 1746738 1229753 590241 176302 157342 243922 -26180
39061 -26180 -645260 -982378 -509861 400890 726009 -48078 -1231456 -1644619 -969562 -125115
39051 -125115 -182412 -1113134 -1895514 -1824841 -1353279 -1416806 -2206542 -3006149 -3164583 -2773065
39041 -2773065 -2261789 -1751915 -1117638 -427979 42807 160456 25695 -178759 -190170 337923
39031 337923 1473083 2671286 3183392 2854142 2199285 1663699 1227539 878553 948691
$$ packed form
39099c1587l80225l02325l75790k3539R10214J440764O76514o71781r73658J51619
39089D20206J245501R18589l63003j018406m87577J65727j47005j037404j222742
39080a526114k76196Q35380J030353M05492p8815J12322N77106O90234L80945
39071B150707L7262q4639j05175k51417n16985o39512m13939j8960Q6580k70102
39061b6180o19080l37118M72517R10751L25119p74087j183378m13163O75057Q44447
39051a25115n7297r30722p82380P0673M71562o3527p89736p99607j58434L91518
39041b773065N11276N09874O34277O89659M70786J17649j34761k04454j1411N28093
39031C37923J135160J198203N12106l29250o54857n35586m36160l48986P0138
$$ plain form
39022 948691 1559458 2088911 1760182 662055 -321742 -598079 -391332 -118905 206410
39013 206410 653527 890171 487888 -470602 -1474376 -2172968 -2555128 -2651912 -2455565 -2135789
39003 -2135789 -1976120 -2016804 -2037380 -1944004 -1890187 -1956059 -2011924 -1989987 -1980481 -1935647 -1600330
38992 -1600330 -916142 -209875 199279 299003 142346 -311873 -870793 -1031209 -610518 -113601
38982 -113601 -62879 -305103 -446107 -574017 -897158 -999530 -315721 780327 1297727 1112920
38972 1112920 1165622 1893693 2456160 2086734 1370074 1348857 1946092 2204121 1785134 1303775
38962 1303775 1209084 1163379 707490 -74976 -799482 -1249344 -1374579 -1134814 -561373 165384
38952 165384 770934 943109 494530 -277149 -578260 98762 1228800 1738983 1286646
$$ packed form
39022I48691O10767N29453l28729j098127r83797k76337K06747K72427L25315
39013B06410M47117K36644m02283r58490j003774o98592l82160r6784J96347L19776
39003b135789J59669m0684k0576R3376N3817o5872n5865K1937R506M4834L35317
38992a600330O84188P06267M09154R9724j56657m54219n58920j60416M20691M96917
38982a13601N0722k42224j41004j27910l23141j02372O83809J096048N17400j84807
38972A112920N2702P28071N62467l69426p16660k1217N97235K58029m18987m81359
38962A303775r4691m5705m55889p82466p24506m49862j25235K39765N73441P26757
38952A65384O05550J72175m48579p71679l01111O77022J130038N10183m52337
$$ plain form
38943 1286646 615844 514049 835046 815384 90250 -872710 -1254063 -690879 302585 755534
38933 755534 265926 -503106 -673937 -362855 -471343 -1224398 -1642859 -891330 421970
38924 421970 937775 242577 -781593 -1187580 -901674 -394873 -41500 -48780 -539957 -1331291
38914 -1331291 -1887281 -1824560 -1314464 -767182 -319408 104347 452027 655946 938038 1519530
38904 1519530 2049475 1886863 1103509 592055 781081 831001 -182706 -1671428 -2083263
38895 -2083263 -1036155 122802 241885 -122899 154336 895688 968685 166338 -453966
38886 -453966 -226813 188780 -27443 -617335 -847983 -778356 -1093229 -1885983 -2408904 -2162581
38876 -2162581 -1630629 -1597854 -2074448 -2299860 -1749797 -789382 -158133 3760 299467 1196319
$$ packed form
38943A286646o70802j01795L20997j9662p25134r62960l81353N63184R93464M52949
38933G55534m89608p69032j70831L11082j08488p53055m18461P51529J313300
38924D21970N15805o95198j024170m05987K85906N06801L53373p280m91177p91334
38914a331291n55990O2721N10096N47282M47774M23755L47680K03919K82092N81492
38904A519530N29945j62612p83354n11454J89026M9920j013707j488722m11835
38895b083263J047108J158957J19083l64784K77235P41352P2997q02347o20304
38886d53966K27153M15593k16223n89892k30648O9627l14873p92754n22921K46323
38876b162581N31952L2775m76594k25412N50063R60415O31249J61893K95707Q96852
$$ plain form
38866 1196319 2306543 2796047 2335741 1343409 398607 -202363 -349274 -58184 317631
38857 317631 204510 -569393 -1461312 -1727425 -1114095 27836 1053736 1356175 756044
38848 756044 -185846 -539438 30488 893914 1266647 1088479 812242 666466 544067 351660
38838 351660 9710 -661044 -1550390 -1984403 -1457314 -486633 -9940 39874 684856 2189966
38828 2189966 3303175 2834362 1357135 510809 903315 1548232 1380271 553171 -59789
38819 -59789 -105628 -26006 -304404 -833969 -1059798 -575071 443107 1321604 1461960 912327
38809 912327 339407 357344 914365 1408430 1355294 830032 273229 17557 64848 195011
38799 195011 168936 -108169 -503895 -784494 -926602 -1212673 -1847453 -2574048 -2934143 -2864236
$$ packed form
38866A196319J110224M89504m60306r92332r44802o00970j46911K91090L75815
38857C17631j13121p73903q91919k66113O13330J141931J025900L02439o00131
38848G56044r41890l53592N69926Q63426L72733j78168k76237j45776j22399j92407
38838C51660l41950o70754q89346m34013N27089R70681M76693M9814O44982J505110
38828B189966J113209m68813j477227q46326L92506O44917j67961q27100o12960
38819e9789m5839P9622k78398n29565k25829M84727J018178Q78497J40356n49633
38809I12327n72920J7937N57021M94065n3136n25262n56803k55672M7291J30163
38799A95011k6075k77105l95726k80599j42108k86071o34780p26595l60095O9907
$$ plain form
38789 -2864236 -2681816 -2442320 -1774665 -606630 387971 537499 106021 -62946 268601
38780 268601 462963 -43393 -1056295 -2039319 -2708161 -2949639 -2616379 -1836678 -1240601
38771 -1240601 -1381836 -2003727 -2286347 -1859766 -1246838 -1174296 -1654556 -1927959 -1271837 228396
38761 228396 1715035 2301970 1744864 458247 -901206 -1745613 -1704956 -843851 284277
38752 284277 1127072 1717783 2465485 3352221 3780532 3389995 2596042 2032851 1838005 1820703
$$ packed form
38789b864236J82420K39496O67655J168035R94601J49528m31478j68967L31547
38780B68601J94362n06356j012902r83024o68842k41478L33260P79701N96077
38771a240601j41235o21891k82620M26581O12928P2542m80260k73403O56122J500233
38761B28396J486639N86935n57106j286617j359453q44407M0657Q61105J128128
38752B84277Q42795N90711P47702Q86736M28311l90537p93953n63191j94846j7302
$$ [...]
##END NTUPLES=NMR SPECTRUM
##END=
