##TITLE=31Pdec_LR-784-R3-C1
 CDCl3, 24 sc
 28.1.2025
##JCAMPDX= 6.0         $$ Bruker NMR JCAMP-DX V2.0
##DATA TYPE= NMR SPECTRUM
##DATA CLASS= NTUPLES
##ORIGIN= UXNMR, Bruker Analytische Messtechnik GmbH
##OWNER= root
$$ XWIN-NMR		Version 3.5
$$ Tue Jan 28 16:31:32 2025 Russian Standard Time (UT+4h)  she@DPX200
##.OBSERVE FREQUENCY= 81.013821
##.OBSERVE NUCLEUS= ^31P
##.ACQUISITION MODE= SIMULTANEOUS
##.ACQUISITION SCHEME= undefined
##.AVERAGES= 24
##.DIGITISER RES= 17
##SPECTROMETER/DATA SYSTEM= spect
##.PULSE SEQUENCE= zgpg30
##.SOLVENT NAME= CDCl3
##.SHIFT REFERENCE= (INTERNAL, CDCl3, 0, 198.062)
##AUDIT TRAIL= $$ (NUMBER, WHEN, WHO, WHERE, WHAT)
$$ ##TITLE= Audit trail, XWIN-NMR		Version 3.5
$$ ##JCAMPDX= 5.01
$$ ##ORIGIN= Bruker BioSpin GmbH
$$ ##OWNER= she
$$ F:/spectra/data/she/nmr/P31/2/pdata/1/auditp.txt
$$ ##AUDIT TRAIL=  $$ (NUMBER, WHEN, WHO, WHERE, WHAT)
(   1,<2025-01-28 16:30:30.03 +0400>,<she>,<DPX200>,
      <created by zg, POWCHK disabled, PULCHK disabled
       configuration hash MD5:
       00 E9 B6 7A A2 85 ED C7 34 08 36 98 17 FE 4E 26
       data hash MD5: 32K
       D2 76 24 C2 D6 5F 45 03 49 16 34 A6 98 55 C8 05>)
(   2,<2025-01-28 16:30:32.43 +0400>,<she>,<DPX200>,
      <Start of raw data processing
       efp BC_mod = 2 LB = 1.5 FT_mod = 6 PKNL = 1 PHC0 = 1543.992 PHC1 = 529.4901 SI = 64K 
       data hash MD5: 64K
       E5 E7 6D 0D 99 9F AC 02 E5 86 C7 C6 A9 15 B2 14>)
(   3,<2025-01-28 16:31:00.92 +0400>,<she>,<DPX200>,
      <pk PHC0 = 246.0018 PHC1 = -483.7999 
       data hash MD5: 64K
       BE 8E 56 E6 74 1F CC BA 6C 33 1D CC D4 DC DB 9C>)
$$ ##END=
$$ 
$$ hash MD5
$$ 0E 96 D8 12 E8 14 F9 4A B2 09 89 B0 EC 2B 6A 8E
##$RELAX= 
##$RELAX= 
##$RELAX= 
##$RELAX= 
##$RELAX= 
##$RELAX= 
##$RELAX= 
##$RELAX= 
$$ Bruker specific parameters
$$ --------------------------
##$DU= <F:/spectra>
##$EXPNO= 2
##$NAME= <P31>
##$PROCNO= 1
##$TYPE= <nmr>
##$USER= <she>
##$AMP= (0..31)
100 100 100 100 100 100 100 100 100 100 100 100 100 100 100 100 100 100 
100 100 100 100 100 100 100 100 100 100 100 100 100 100 
##$AQSEQ= 0
##$AQ_mod= 1
##$AUNM= <au_zg>
##$AUTOPOS= <>
##$BF1= 81.014009
##$BF2= 200.13
##$BF3= 200.13
##$BF4= 200.13
##$BF5= 200.13
##$BF6= 200.13
##$BF7= 200.13
##$BF8= 200.13
##$BYTORDA= 1
##$CFDGTYP= 0
##$CFRGTYP= 5
##$CHEMSTR= <none>
##$CNST= (0..31)
1 1 145 1 1 1 1 1 1 1 1 1 1 1 1 1 1 1 1 1 1 1 1 1 1 1 1 1 1 1 1 1 
##$CPDPRG= <waltz16>
##$CPDPRG1= <>
##$CPDPRG2= <waltz16>
##$CPDPRG3= <>
##$CPDPRG4= <mlev>
##$CPDPRG5= <mlev>
##$CPDPRG6= <mlev>
##$CPDPRG7= <mlev>
##$CPDPRG8= <mlev>
##$CPDPRGB= <>
##$CPDPRGT= <>
##$D= (0..31)
0 1 0 0 0 0 0 0 0 0.06 0 0.03 2e-05 3e-06 0 0 0.0002 0 0 0 0 0 0 0 0 0 
0 0 0 0 0 0 
##$DATE= 1738067429
##$DBL= (0..7)
120 120 120 11 120 120 24 19 
##$DBP= (0..7)
150 150 150 150 150 150 150 150 
##$DBP07= 0
##$DBPNAM0= <>
##$DBPNAM1= <>
##$DBPNAM2= <>
##$DBPNAM3= <>
##$DBPNAM4= <>
##$DBPNAM5= <>
##$DBPNAM6= <>
##$DBPNAM7= <>
##$DBPOAL= (0..7)
0.5 0.5 0.5 0.5 0.5 0.5 0.5 0.5 
$$ [...]
##$SUBNAM3= <"">
##$SUBNAM4= <"">
##$SUBNAM5= <"">
##$SUBNAM6= <"">
##$SUBNAM7= <"">
##$SUBNAM8= <"">
##$SUBNAM9= <"">
##$SW= 400.765351723535
##$SWIBOX= (0..15)
0 1 3 0 0 0 0 0 0 0 0 0 0 0 0 0 
##$SW_h= 32467.5324675325
##$TD= 32768
##$TD0= 1
##$TE= 0
##$TE2= 300
##$TE3= 300
##$TEG= 300
##$TL= (0..7)
0 120 53 12 22 120 120 120 
##$TP= (0..7)
150 150 150 150 150 150 150 150 
##$TP07= 0
##$TPNAME0= <>
##$TPNAME1= <>
##$TPNAME2= <>
##$TPNAME3= <>
##$TPNAME4= <>
##$TPNAME5= <>
##$TPNAME6= <>
##$TPNAME7= <>
##$TPOAL= (0..7)
0.5 0.5 0.5 0.5 0.5 0.5 0.5 0.5 
##$TPOFFS= (0..7)
0 0 0 0 0 0 0 0 
##$TUNHIN= 0
##$TUNHOUT= 0
##$TUNXOUT= 0
##$USERA1= <user>
##$USERA2= <user>
##$USERA3= <user>
##$USERA4= <user>
##$USERA5= <user>
##$V9= 5
##$VALIST= <valist>
##$VCLIST= <CCCCCCCCCCCCCCC>
##$VD= 0
##$VDLIST= <DDDDDDDDDDDDDDD>
##$VPLIST= <PPPPPPPPPPPPPPP>
##$VTLIST= <TTTTTTTTTTTTTTT>
##$WBST= 1024
##$WBSW= 4
##$XGAIN= (0..3)
0 0 0 0 
##$XL= 0
##$YL= 0
##$YMAX_a= 5680
##$YMIN_a= -13281
##$ZGOPTNS= <>
##$ZL1= 120
##$ZL2= 120
##$ZL3= 120
##$ZL4= 120
##$ABSF1= 0
##$ABSF2= 0
##$ABSG= 0
##$ABSL= 0
##$ALPHA= 0
##$AQORDER= 0
##$ASSFAC= 0
##$ASSFACI= 0
##$ASSFACX= 0
##$ASSWID= 0
##$AUNMP= <proc_1d>
##$AZFE= 0.1
##$AZFW= 0.5
##$BCFW= 0
##$BC_mod= 2
##$BYTORDP= 0
##$COROFFS= 0
##$CY= -3
##$DATMOD= 1
##$DC= 0
##$DFILT= <>
##$DTYPP= 0
##$F1P= 0
##$F2P= 0
##$FCOR= 1
##$FTSIZE= 65536
##$FT_mod= 6
##$GAMMA= 0
##$GB= 0
##$INTBC= 1
##$INTSCL= 9.790993e-09
##$ISEN= 30
##$LB= 1.5
##$LEV0= 0
##$LPBIN= 0
##$MAXI= 10000
##$MC2= 0
##$MEAN= 0
##$ME_mod= 0
##$MI= 50
##$NCOEF= 0
##$NC_proc= -9
##$NLEV= 6
##$NOISF1= 182.463
##$NOISF2= 159.3651
##$NSP= 0
##$NTH_PI= 0
##$NZP= 0
##$OFFSET= 198.0616
##$PC= 4
##$PHC0= 1789.994
##$PHC1= 45.69022
##$PH_mod= 1
##$PKNL= yes
##$PPARMOD= 0
##$PSCAL= 0
##$PSIGN= 0
##$REVERSE= no
##$SF= 81.0140089999434
##$SI= 65536
##$SIGF1= 159.3651
##$SIGF2= -187.1042
##$SINO= 113.3802
##$SIOLD= 16384
##$SREGLST= <1H.CDCl3>
##$SSB= 0
##$STSI= 65536
##$STSR= 0
##$SW_p= 32467.5324675325
##$SYMM= 0
##$S_DEV= 0
##$TDeff= 32768
##$TDoff= 0
##$TI= <>
##$TILT= no
##$TM1= 0
##$TM2= 0
##$TOPLEV= 0
##$USERP1= <user>
##$USERP2= <user>
##$USERP3= <user>
##$USERP4= <user>
##$USERP5= <user>
##$WDW= 1
##$XDIM= 65536
##$YMAX_p= 364378267
##$YMIN_p= -197321178
$$ End of Bruker specific parameters
$$ ---------------------------------
##NTUPLES= NMR SPECTRUM
##VAR_NAME=  FREQUENCY,     SPECTRUM/REAL,   SPECTRUM/IMAG
##SYMBOL=    X,             R,               I
##VAR_TYPE=  INDEPENDENT,   DEPENDENT,       DEPENDENT
##VAR_FORM=  AFFN,          ASDF,            ASDF
##VAR_DIM=   65536,         65536,           65536
##UNITS=     HZ,            ARBITRARY UNITS, ARBITRARY UNITS
##FACTOR=    0.49542278885378, 1,            1
##FIRST=     16045.7642231865, 0,            0
##LAST=      -16421.768244346, 0,            0
##MIN=       -16421.768244346, -197321178,   0
##MAX=       16045.7642231865, 364378267,    0
$$ Real data points
##PAGE= N=1
##DATA TABLE= (X++(R..R)), XYDATA
$$ [...]
46207 6134093 10060230 11256775 10347068 8768972 7711417 7758863 8428430 8457092 7057472
46198 7057472 4510422 1604152 -658415 -1005445 1074952 4078448 5651571 5431496
46190 5431496 5484288 7514929 10894586 13850299 15199828 14369198 11333871 7611541 5857796
46181 5857796 6902913 8029753 5826544 470772 -4288062 -5563995 -4490241 -4277973
46173 -4277973 -5996260 -7650914 -7680248 -7796996 -10500301 -14249244 -13925261 -7403104 791864
46164 791864 4830236 4714433 4758480 6173173 5646262 1781895 -1629933 -981656 2120465
46155 2120465 4174240 5307256 7754737 10555866 10076548 5848017 2195417 2787200
46147 2787200 6029616 7492534 5403703 1953253 -374903 -2054655 -5244351 -9922979
46139 -9922979 -12852479 -11275660 -6574445 -2604873 -1008655 -379231 166425 -313721 -1426579
46130 -1426579 -333880 3891887 7452370 6424180 2396287 262875 1612514 3772670
46122 3772670 4733192 5206621 5520937 4151845 698287 -2446625 -3049742 -1779360 -613914
46113 -613914 -55034 769479 2373276 4389646 6010949 6319587 4937615 2632801 473458
46104 473458 -1465365 -3364792 -4056133 -2089891 1532587 3797760 3289245 1395857 -394849
46095 -394849 -1939666 -2436500 77106 5306699 9149553 8157829 4180957 2080884 3676388
46086 3676388 6337990 7169612 6223461 5281050 5262706 5554554 5000486 3185951 1127826
46077 1127826 410941 1141904 1452013 -58473 -2086229 -2120833 217005 2731169 3494900
46068 3494900 2792207 1942693 1410393 823159 215029 398208 2037421 4696985 7006097
46059 7006097 7767830 6774969 4534175 1615884 -1353639 -3517675 -4342042 -4146247 -3466965
46050 -3466965 -2317364 -865186 -57115 -99056 986007 5082350 10391240 12667999 10547896
46041 10547896 6990757 4455983 1621510 -3092484 -7401440 -7571308 -3477407 1608612
46033 1608612 5340378 7711858 8865685 8314312 6295032 3614399 237963 -3889999
46025 -3889999 -6984389 -6820523 -3972629 -1276984 -20743 830315 1461384 205650 -3420115
46016 -3420115 -7423063 -10391588 -13274337 -16317156 -16647375 -11670685 -3616305 2149265
46008 2149265 3184589 2065010 2136817 3329084 3431620 2147941 1712371 3121452 3630743
45999 3630743 -8692 -6289041 -9479212 -6500908 -1108777 812396 -1518126 -3891555
45991 -3891555 -3281361 -500465 3038165 7283188 11061110 11144412 6294952 147574 -2399117
45982 -2399117 -506517 2764327 4794062 5565270 6051704 6243971 4996180 1337571 -3680681
45973 -3680681 -6625931 -4807584 -151564 2213524 374297 -1597238 891032 6702721
45965 6702721 10586039 9674124 5908005 2830322 2190105 3070551 2529361 -1882700 -8322438
45956 -8322438 -10941774 -6728636 -580493 130695 -4772307 -8409843 -6827622 -3967524
45948 -3967524 -4797766 -7824843 -7876970 -3590526 1733859 5503579 8435245 11676371 14089464
45939 14089464 13465383 9254091 3445129 -851728 -1744189 91931 2465056 3998273
45931 3998273 4781359 4959030 4184782 2900414 2524704 3433660 4160709 3611606 2618447
45922 2618447 2176586 1839410 1381115 2161956 4581463 5862426 3443737 -390919 -815151
45913 -815151 2660249 5229219 3543243 -83557 -1970882 -2408569 -3865471 -5989882
45905 -5989882 -5838206 -2481593 1575295 3784257 4064401 3486722 2535119 1697658 2347298
45896 2347298 5663129 11018655 16126874 18717401 18103755 15616867 13513466 12865583
45888 12865583 12504273 10606608 7141405 3923067 2399701 2406281 2986912 3133960 1643793
45879 1643793 -2094566 -6547201 -8803789 -7753124 -5086210 -2412634 551397 3434082
45871 3434082 3300160 -1641268 -7787367 -9294901 -5370547 -918967 507176 648004
45863 648004 2074804 3639454 3223801 2158829 3210235 5685947 6281944 4361343 3067961
45854 3067961 4940718 9103586 13110363 15113134 13931502 9650650 4894144 3005900
45846 3005900 3951942 4313087 2368360 617532 1673476 4232159 5510250 5569599 6182248
45837 6182248 6756777 4889863 756238 -2353375 -2606263 -2047858 -3214869 -5440691 -6165384
45828 -6165384 -4563006 -2186183 -670880 -217855 -154950 -18649 -89916 -1315834 -4304224
45819 -4304224 -7848027 -9048161 -5939575 88740 5364246 7500424 7131912 6004049
45811 6004049 4456198 1704927 -1978170 -4740929 -5213701 -4242916 -3798340 -4476916 -4862620
45802 -4862620 -3467532 -821083 631663 -1290254 -6183224 -10738321 -11296298 -7415438
45794 -7415438 -2536772 -244539 -237495 678518 3706012 6087935 4975030 1656003 110546
45785 110546 1903556 4265519 3468625 -1088503 -6608301 -9967779 -10592887 -10528151 -11887723
45776 -11887723 -14329719 -15308728 -12805541 -7308552 -1138968 3286791 4426138 2306476
45768 2306476 -902945 -2310836 -1480319 -1047215 -2858740 -4845180 -3675351 595912
45760 595912 5007242 8119622 11036357 14009146 15203741 13829375 11787821 10797469
45752 10797469 10167051 8958883 8112061 8386175 8069386 5161556 643279 -2735577 -4027656
45743 -4027656 -4200840 -3488147 -1266185 1470142 1992984 -1027622 -5740166 -8941733 -8710861
45734 -8710861 -5386432 -1277626 755969 -29999 -1075131 395725 3218503 3358084
45726 3358084 -431255 -4317469 -4074180 -268014 3036086 3672175 3416124 4703820 7031461
45717 7031461 7570597 4890730 1126237 -218230 1585472 3728323 3901573 3624577 5614633
45708 5614633 8729271 8511998 3380457 -2486252 -3993169 -736547 4033847 8010037
45700 8010037 10810563 11812165 10242185 7294066 5344959 4661733 3297318 811791
45692 811791 -408628 1320526 4387355 6435888 7625381 9273990 10638376 9550678
45684 9550678 5807340 1694896 -851740 -1713740 -1214259 637368 3124278 5076430
45676 5076430 6820861 9756888 12940194 12533240 6788697 -367226 -3623353 -3000880
45668 -3000880 -3034998 -5804641 -8681503 -9679348 -10881160 -14166830 -16855977 -15194741 -10364786
45659 -10364786 -7275319 -8010752 -9878810 -9941540 -8269347 -6161705 -4145292 -2872986
45651 -2872986 -3476802 -5573425 -6916304 -6377602 -5352700 -4811316 -3132506 975473 5109543
45642 5109543 5413375 1458090 -3444668 -6356047 -6924954 -5824447 -3524857 -1127163
45634 -1127163 -239922 -939361 -1259405 306593 2881013 4670586 5359365 5881749 6374843
45625 6374843 5658915 2990299 -418311 -2193359 -1120072 1533554 3115567 1922673
45617 1922673 -1592326 -5467000 -7477836 -6130970 -1665514 3547448 6625336 6748723
45609 6748723 5330351 3517030 1171805 -998746 -608170 3053848 6541150 5991463
45601 5991463 2556756 1059802 3353011 6163503 6121721 3810606 1493990 -331058
45593 -331058 -2115940 -3310633 -3647760 -4667774 -7336392 -9309211 -7405527 -2361141
45585 -2361141 1614633 2185508 1346548 1979066 4214841 6371660 7691449 8461291 8364117
45576 8364117 6495602 3085728 37799 -790502 495997 1980822 2032260 1093872 1148672
45567 1148672 3410844 7002440 10153474 12076854 12944668 12507987 10009495 5797287
45559 5797287 2065325 1126139 3035260 5351980 5396706 2803891 -53235 -241984 3009081
45550 3009081 7871787 12118866 15088037 17032229 17411534 15222765 11040002 7389967
45542 7389967 6374760 7533865 8532391 7436917 4043373 -178393 -2832041 -2171259
45534 -2171259 989558 3463929 3011057 1205206 1642784 5313848 9396177 11159563
45526 11159563 11288334 12020570 13480742 13902421 12693926 10903978 8788576 5534375
45518 5534375 1978655 800481 2405459 3163068 316566 -3269021 -2631478 2017975
45510 2017975 5454105 5022497 3944522 5511511 7802422 7188638 4413219 3372156
45502 3372156 5133155 7053177 7640735 8456611 10249347 10704529 8223617 5498704 6426739
45493 6426739 10494206 13023403 11080487 6862585 4470655 5071597 6523460 6670030
45485 6670030 5397806 3806253 3002264 4023847 7384442 11636150 13521508 11194810
45477 11194810 6971272 5270095 7654301 11372394 13229894 13366164 14272724 17339004
45469 17339004 21563440 24705366 24462453 19536431 11377978 4509634 3190809 7293651
45461 7293651 12579002 15198320 14895202 13901258 14197419 16205543 18680256 19119102 15500721
45452 15500721 8675304 2311294 -454443 126175 1451268 1692701 989034 176698 -324717
45443 -324717 -261915 771566 2844767 5266044 7032283 7605382 7169987 6355580 5834377
45434 5834377 5894594 6012109 4944828 1891693 -2069817 -4301159 -3269246 -729647 -112354
45425 -112354 -2445505 -5056609 -4990676 -2524310 -119383 1111260 2207560 4067720 6137718
45416 6137718 7501637 7738491 6466757 3623401 687168 -27438 1690895 3034586
45408 3034586 1512142 -1683695 -3071181 -1216064 1711331 2723264 1157723 -1377437
45400 -1377437 -3337121 -4701352 -6232032 -7977773 -9094747 -9071660 -8396184 -7552244 -6058430
45391 -6058430 -3503337 -1162132 -1167156 -3767183 -6671705 -7773954 -7396184 -6808791 -5471723
45382 -5471723 -1454648 5281258 11459209 13327434 10489870 6060371 3082357 1798613
45374 1798613 977527 759504 2364754 5053854 5638873 2343729 -2424616 -4964466 -4855189
45365 -4855189 -4570170 -5268086 -5493391 -4080338 -1895202 -76940 1413248 2737308 3423468
45356 3423468 3318107 2693969 1152173 -1479037 -2881087 176033 6764817 11223206
45348 11223206 9607646 4200865 -558543 -3887380 -7384094 -10427931 -10962405 -9679095
45340 -9679095 -9287707 -9884819 -8829100 -5366974 -1760021 619262 2599703 3720821
45332 3720821 1350199 -4701975 -9940273 -10197446 -6589270 -2959358 -524217 1918692
45324 1918692 4016120 3739459 1085093 -1268887 -1729298 -1774283 -3059560 -4507625 -4002231
45315 -4002231 -1911678 -910474 -2150992 -3188814 -764424 5010618 10486674 12494507
45307 12494507 11276175 8946801 6539899 4056718 2408121 2979386 5124702 6252958
45299 6252958 5252896 4031009 4411453 5111009 3623875 102517 -2815797 -3817568
45291 -3817568 -4335068 -5561452 -5989957 -3446500 1471523 5823755 8045087 9460529
45283 9460529 11521714 13240072 12904935 11264073 10742239 11540137 10837330 6740736 1051394
45274 1051394 -3212005 -5256562 -5748312 -4358629 -731656 2998905 3676811 1328048
45266 1328048 -539286 647053 3831758 6484737 7373368 6598747 4960782 4146069 5600462
45257 5600462 8260012 9341401 8464360 8849854 12732309 17402906 18060167 13721652 8387217
45248 8387217 6646702 9342602 13169651 13754746 9709198 4028878 541553 -866337
45240 -866337 -3368050 -7437052 -9417347 -7465416 -5198846 -6142907 -7600734 -4562140
45232 -4562140 2162487 6810111 7011725 6091511 6717466 7567703 7805999 9660312 13594418
45223 13594418 15282496 11469232 5876786 4874462 8968447 12802653 12673470 9861940
45215 9861940 6670257 3408928 413322 -567479 891268 2122669 592309 -2475430
45207 -2475430 -3694849 -1939155 653988 1754759 1210560 39051 -1665884 -4883162
45199 -4883162 -9919542 -15137763 -17888017 -16825237 -12955438 -8071301 -2699144 3492141
45191 3492141 9574745 13211924 13240470 11166380 9073581 7004101 3731945 -510708
45183 -510708 -3695140 -4312786 -2613768 529692 4446363 7902298 9074267 7358678
45175 7358678 4285410 1701354 -192440 -2199561 -4459826 -6486138 -8074358 -8984197
45167 -8984197 -8415244 -6172274 -3806971 -3045021 -3338227 -2557221 -82044 2350518 3063456
45158 3063456 2321604 1612101 2328066 5202364 9572583 13101262 13804122 12488253 11511672
45149 11511672 11243027 10118886 8383511 8563981 10922731 11696931 8330054 3819768
45141 3819768 2733854 4834344 6157179 5113549 3648653 2835830 1370778 -1023375
45133 -1023375 -2432864 -2327207 -3114179 -6204157 -8976305 -7909955 -3156582 2013718
45125 2013718 5117613 5926149 5047528 3178175 1473926 793649 331100 -1569889 -4708289
45116 -4708289 -6235050 -3588481 2054602 6292711 6026703 2902699 1244873 2772490
45108 2772490 4886214 4627211 2445318 625420 -289798 -1199425 -1761151 -961891 -43113
45099 -43113 -1696500 -5745455 -8468596 -7348520 -4100882 -1776365 -1166101 -1486174 -2296902
45090 -2296902 -2921763 -2101959 -403046 -1055675 -5795915 -11266795 -12363490 -8360988 -3084496
45081 -3084496 389354 2361388 3969786 4942737 4690317 3556575 2099485 523309
45073 523309 -770390 -1456625 -2216167 -3710971 -4552359 -2471339 1857322 4469327 2965901
45064 2965901 -171068 -888451 1276026 3426326 3697441 2927811 2116567 792799 -1152401
45055 -1152401 -2056127 -685863 1201411 591313 -2496650 -4395451 -2394791 1518908
45047 1518908 3227894 2120789 1947820 5437426 9992636 10522704 5776660 -123614
45039 -123614 -2704592 -1995716 -1289219 -2111575 -2286300 548102 4932972 6786795 4599630
45030 4599630 1741579 2429697 6451257 9690981 9627124 8212877 8608568 10854969 12200157
45021 12200157 10624711 6529821 1563599 -2708948 -5178685 -5619165 -4968408 -4405441
45013 -4405441 -4205730 -4192319 -4877642 -6919879 -9471907 -10447106 -9047499 -7115269 -7089513
45004 -7089513 -8948515 -10015616 -8041542 -3973202 -993990 -799165 -1726656 -1249646 601600
44995 601600 1751871 1474085 1191990 1697147 1884362 1220612 1231983 2967775 5016814
44986 5016814 6031661 7272965 10055394 12380740 11466413 8603583 7640104 8702012
44978 8702012 7442685 1585153 -5352267 -8643518 -7814115 -5526819 -3487258 -1836592
44970 -1836592 -817937 -609375 -592606 -687082 -2205495 -5471563 -7860331 -6497799 -2119177
44961 -2119177 1906048 3716454 3989381 3552233 2560437 1905068 2733398 4003839 2902673
44952 2902673 -1234784 -5242159 -5543817 -1922949 3084124 7145182 9251569 9138318
44944 9138318 7310686 5235569 4117782 3540124 2278963 309777 -992654 -643734
44936 -643734 917255 2753328 4498788 6100560 7226901 7558252 7217181 6255950 4089586
44927 4089586 415026 -3238544 -4050370 -936585 3515837 5374719 3723232 1541728
44919 1541728 1706011 3287800 3150051 573123 -1621785 -974052 1396121 2823257 3096615
44910 3096615 4321050 7048323 8890110 7852511 5133747 3057770 1671593 -470727
44902 -470727 -2884691 -2984583 447594 5636478 10043477 12304358 11589687 7544856 2113712
44893 2113712 -963851 -491366 196042 -2123134 -5538500 -5477371 -1193640 3323009 4647478
44884 4647478 3142790 772571 -1290168 -2190567 -1311645 234161 383155 -537737 378158
44875 378158 4107286 7308077 6329103 1937902 -1748600 -1821605 1267059 4677398 5056267
44866 5056267 1153630 -3940228 -4911309 -209940 5883767 8860996 9323732 10289038 11652792
44857 11652792 11088816 8937473 7862394 7980900 6602900 3393901 1798050 3892156
44849 3892156 7191949 8459255 7926984 7646739 7962077 8041101 8253393 9498949 11057362
44840 11057362 11300648 10152054 9084625 8862516 8673785 7440974 5013292 2236438
44832 2236438 507145 691445 1693019 915596 -2607750 -6181787 -6171914 -2661552 338508
44823 338508 -89322 -2079232 -1687709 1526908 3596112 1331676 -3214293 -5078249 -2441262
44814 -2441262 1680213 3860731 3992314 3458956 1940319 -1534164 -5681090 -7904288
44806 -7904288 -7636498 -6103130 -3130270 2623583 9872934 14584481 15107448 14441803 15356989
44797 15356989 15957198 12983174 7627115 4594241 5907179 8676348 9308816 7543937
44789 7543937 5605835 5087087 5675463 6234685 6530402 7777406 10896223 14103622 13788272
44780 13788272 8997958 3589959 1929544 3422330 3678865 649970 -2995973 -3864766
44772 -3864766 -1829875 713354 1687366 570862 -1628021 -2778176 -1320939 1675134
44764 1675134 3276418 2007505 -789235 -3210245 -4797820 -5761838 -6031388 -6062856 -6904343
44755 -6904343 -8263986 -8093773 -5431295 -2111555 -149988 963533 2472129 3414687
44747 3414687 1980601 -1132734 -3264678 -3140482 -1252561 2385336 7741942 12139575
44739 12139575 11721353 6610355 1522820 -191787 -188159 -1061629 -1889342 -796568 666596
44730 666596 -268471 -2333352 -1406718 3155053 7268026 7849912 6262537 4863277 3498135
44721 3498135 1418147 -77866 508147 2146570 2765284 2157660 1306839 83862 -2129070
44712 -2129070 -4546914 -6015243 -7096985 -8756619 -9682007 -7607008 -3103907 570338
44704 570338 1609068 1282940 1221281 1480506 1758715 2148028 2006900 308804 -2213726
44695 -2213726 -3507377 -3368244 -3619717 -4383894 -3251795 370672 3245495 2810913 753927
44686 753927 -654410 -2901784 -8135966 -13753470 -14514988 -9530520 -3395893 -501975
44678 -501975 -1434277 -4673218 -8298336 -9912070 -8457989 -6647442 -8253718 -12471080
44670 -12471080 -14453953 -12120362 -8508621 -6208199 -3809570 -136387 2240280 1158495
44662 1158495 -814050 -110355 2423582 3950846 5126792 8271403 11528731 10421223
44654 10421223 5312555 1912916 2892226 3752887 -405356 -7788283 -12762817 -13129632
44646 -13129632 -11089706 -8611251 -5464154 -1596437 1495266 2402520 1085619 -1793149
44638 -1793149 -5332116 -7861190 -7366108 -3296305 2527627 7179365 8669342 7112465
44630 7112465 4566671 3516865 4743525 6716970 7611510 7439459 7216022 6577018 4063111
44621 4063111 49208 -2662428 -2487272 -1686963 -3297009 -6332271 -6674876 -2913217 1338916
44612 1338916 2129820 -81772 -2275865 -3581916 -5257848 -6828440 -5712247 -1424412
44604 -1424412 2713927 3621736 2158423 1078641 1066202 974092 793453 1785899 3804991
44595 3804991 4673951 2802729 -801937 -3470608 -3094862 298358 4265261 5699979
44587 5699979 3967843 1683405 1088758 618174 -2824104 -8745285 -12982137 -13114325 -11307107
44578 -11307107 -10628715 -10762682 -9053149 -4392867 1474127 5641271 6009064 2599444
44570 2599444 -2084121 -4881433 -4891037 -3680290 -2454998 -850237 911716 1142521 -434078
44561 -434078 -1080205 1568097 6206602 10064695 12570046 14217999 13626498 9330866 3662935
44552 3662935 1018874 2179180 3805330 3859171 3756434 4113523 2330709 -3067753 -8530810
44543 -8530810 -9055782 -4291973 1557326 5125776 6787803 8390932 10196589 10777663
44535 10777663 9069472 5863316 3004194 928363 -2228401 -7792745 -13424286 -15093724
44527 -15093724 -12459415 -9727641 -10119495 -12034760 -12455485 -11707587 -12146992 -13728086 -13934190
44518 -13934190 -11532572 -7783951 -4138624 -1021089 1153705 1856759 1523048 1175123
44510 1175123 1119008 1460920 3200377 6716375 9748023 9479242 6574074 4512227 4737082
44501 4737082 5283765 4735561 4397048 5248127 5756776 4742960 3858291 4737830 5803736
44492 5803736 4819372 3041143 3457355 5662671 6115014 3796264 2143179 3924388 7033791
44483 7033791 7735564 6319210 6594991 10058428 13267409 12042733 6462060 51027
44475 51027 -4900017 -8937590 -12365661 -13255495 -10385471 -6518129 -5873977 -8401920 -9307515
44466 -9307515 -5326136 798690 3913855 2950159 1471665 2368577 4451564 4773541 2466144
44457 2466144 -766995 -2894307 -3182857 -2040462 -258486 1342666 1976854 1201847 -424609
44448 -424609 -1215032 249119 3156709 4715886 3237713 361164 -1011914 -627387 -1023758
44439 -1023758 -3415400 -5257565 -3349856 1686966 5907264 6864705 6155882 6635253 8714146
44430 8714146 10643044 11307922 10982094 9749815 7170924 3859138 1605226 1076225 899376
44421 899376 116670 27273 1962114 4501098 5096672 3795169 2962528 3491319 3826993
44412 3826993 3161815 2995760 4379080 5866427 5937017 5788834 7696364 11420707 13991895
44403 13991895 12785147 7853484 1857274 -1478766 93795 4989203 8617456 7752513
44395 7752513 3572970 -334963 -1783426 -650039 2700065 7501487 11826828 13943497
44387 13943497 14358019 14793638 15292574 14111468 10567925 6312704 3439616 2644880 3492133
44378 3492133 5260685 7160268 8539580 9058183 8283580 5802732 2533816 839855
44370 839855 1862911 3664042 3757383 2571727 2243897 2797183 2248445 261984 -1181628
44361 -1181628 -1039271 -428501 -176243 106463 -89473 -2207917 -5436270 -6436791 -3900351
44352 -3900351 -711399 267903 -67234 144177 -299207 -3748862 -9239389 -13080817 -13333747
44343 -13333747 -11163298 -8215569 -5044636 -1927773 975771 4366250 8874897 13254729
44335 13254729 15040628 13233399 9266724 5433963 3296787 3153049 3846648 3434512
44327 3434512 1123583 -1821701 -3873684 -5022575 -5717052 -5303445 -3261782 -1083394
44319 -1083394 -960920 -3051970 -5592286 -6991470 -6270951 -2771402 2096625 3915744
44311 3915744 -569887 -8401423 -12804679 -11223752 -7844076 -7156038 -8389638 -8420477 -7238205
44302 -7238205 -7126449 -7724893 -5508106 1231898 9176701 12917914 10105701 2973908
44294 2973908 -4351495 -8961563 -9927939 -7530070 -2870483 2212015 6099188 8387213
44286 8387213 9083092 7305966 2657949 -2241244 -3553259 -1782139 -2427695 -8576259
44278 -8576259 -15597703 -16822673 -12415956 -8154380 -6617507 -4807230 -584036 3978920
44270 3978920 7109677 10150241 13399750 13655178 9289417 4229702 3123306 5247934
44262 5247934 6893121 7233588 7558285 6585379 1587403 -6039930 -10734699 -9195082 -3896301
44253 -3896301 382262 1085770 -1244645 -4047716 -4290764 -1261807 1786241 837153 -3902158
44244 -3902158 -8311890 -9521252 -8215963 -5830024 -2632622 562040 1936256 1591052
44236 1591052 2426682 6208867 10756395 12929870 12590552 11489956 9843563 6604590
44228 6604590 2343648 -681911 -1325914 -494783 855238 2993393 6211622 9502792
44220 9502792 11027206 9514901 5385785 1107455 -68788 2961242 7387975 8851637
44212 8851637 5989622 1623407 -1099819 -2547138 -5285883 -9597946 -12310501 -10864692
44204 -10864692 -7080111 -5254356 -7067413 -10138621 -11650698 -11378734 -10312469 -8291993
44196 -8291993 -4820423 -944516 1771252 3422726 4836974 5090050 2500926 -1952432
44188 -1952432 -4938869 -5016695 -3856310 -2379048 1100363 6785879 10403780 7835684
44180 7835684 1395399 -2111398 598220 6293299 10385404 11828162 11799029 10502009
44172 10502009 7581520 4015829 1151144 -1468465 -5140423 -8964707 -9800901 -6022336
44164 -6022336 1327 4235458 5133533 4396049 3902618 3353074 1737540 97303 979679
44155 979679 4696016 7685365 6195250 1126755 -2528132 -1476273 2167087 3965798
44147 3965798 2708644 1055708 1033118 1189594 -639140 -3398007 -3853726 -1367134 521414
44138 521414 -1728839 -7246241 -11868585 -12883756 -11089064 -8462183 -5705263 -2789181
44130 -2789181 -453338 252404 -486488 -1226631 -829613 503452 1688471 1805439 773167
44121 773167 -658878 -1665863 -2296335 -3403579 -5382919 -7411584 -8442151 -8567408 -8661731
44112 -8661731 -8839560 -8208849 -6467759 -4958195 -5335664 -7375642 -8878863 -8063053 -5556283
44103 -5556283 -3512664 -3088756 -3557202 -3776229 -3397940 -2278676 -49625 2680232 3883187
44094 3883187 2481577 337452 -2130 1147922 1671202 1658925 2993145 4650796 2655858
44085 2655858 -3285976 -7171105 -4284334 1770447 4130707 2360271 1534651 2995952
44077 2995952 2794981 148413 443260 6573099 13153107 14114742 11516113 11068476 12248797
44068 12248797 9734857 3312907 -812287 662824 3916673 5060158 5568674 7461340
44060 7461340 8232591 5266193 1613510 1911785 4580727 3714792 -1780481 -6341328 -5769947
44051 -5769947 -2183104 834347 3532244 7400975 10752477 10961063 9236620 8975803
44043 8975803 10002190 8615130 3995905 685311 2567440 7052654 8139729 4145312
44035 4145312 -348211 -262097 4396373 9321550 10704354 8190738 3945512 130510
44027 130510 -2413612 -3661524 -3499284 -2009403 -527599 -1258039 -4844456 -8913356 -10451553
44018 -10451553 -9651809 -9793374 -12548697 -14913030 -12489096 -5193555 2289735 6027103
44010 6027103 6908541 8026940 9524840 8437391 3685815 -1197267 -1908426 1410003
44002 1410003 4926766 6632105 8477076 12174963 15403458 14583572 10171463 6286409
43994 6286409 5123956 4566193 2234547 -698285 -1642375 -703290 -236356 -1159210 -2092394
43985 -2092394 -1982290 -1414984 -1082837 -865423 -903071 -1739943 -2596327 -1235609 3119887
43976 3119887 7904045 9600744 7298292 2791106 -1908586 -5639811 -7332562 -6184555
43968 -6184555 -2965039 294048 2542842 4635283 7368512 9545059 9045747 5515198
43960 5515198 1065093 -1746373 -2017839 -567248 1336324 2839311 3622244 3926066 4455325
43951 4455325 5655614 6957075 7264679 6340245 5036435 3902792 2500326 817573
43943 817573 319628 2047389 4097648 2958039 -2031220 -7011468 -7469364 -3028043 2434613
43934 2434613 4856492 3440564 551648 -1006519 -663673 -306170 -1686209 -3946911
43926 -3946911 -4686593 -3307157 -1681280 -1083544 -439639 1113769 1815285 -403806 -4316450
43917 -4316450 -6607828 -6344223 -5825112 -6728380 -7622559 -6182251 -2298333 1981463 4584220
43908 4584220 4802366 3435237 2099011 1745938 1702562 936835 71922 801916 3258326
43899 3258326 5551411 6319149 6101099 5581672 4297580 2228831 946037 1391674 1656605
43890 1656605 -960664 -6045512 -10100107 -10654806 -8807079 -7155553 -6494572 -5604975 -3729340
43881 -3729340 -1938600 -1569944 -2107900 -1729747 42303 1454412 908295 -886942 -2190998
43872 -2190998 -2553100 -2277985 -531123 3745200 9271639 13159618 14463403 14836210 15418649
43863 15418649 15601516 15410702 16152955 17385621 16160914 11274970 5722441 2622442
43855 2622442 1067494 -1338351 -4107440 -5284603 -5336330 -5855012 -5685448 -2540097 2015294
43846 2015294 3587014 1490589 188931 2877630 7130507 8757185 7136380 4631044
43838 4631044 2952527 2317710 2617588 3272433 2841082 524157 -2372227 -3538684 -1842925
43829 -1842925 2000038 6141011 8769665 9679053 10753647 13488394 16093405 15174685
43821 15174685 10658495 6519589 5540692 5894000 4721530 2822581 3186065 6222620
43813 6222620 9173862 9801941 8366356 5994664 3167780 358802 -1297136 -911918
43805 -911918 1013250 2893080 3614345 3741627 4844079 7385817 9989466 11504601 12690043
43796 12690043 14211578 14073440 9834640 3149920 -1164268 -1261999 -176975 -391686 -155091
43787 -155091 2333675 4356775 2030210 -3566304 -7351541 -6750936 -4269683 -3760612 -6396245
43778 -6396245 -10105523 -11250623 -7471877 -478047 4918277 6053228 5275844 5927733
43770 5927733 7603286 7907525 6670261 5009273 2137801 -2794762 -7115494 -7524843
43762 -7524843 -5808340 -6719057 -10358873 -11970081 -9824489 -7585626 -7155258 -4973468
43754 -4973468 1385768 7903004 9550646 7352371 5784098 6120416 6731088 7514040 9255543
43745 9255543 10170025 7911302 4297378 3405638 5107718 5104056 2025212 -27205 2208620
43736 2208620 6118323 7155991 5187266 3849761 4984642 6717587 6955337 6368035
43728 6368035 7025413 9394576 11840877 12771809 12298426 11430170 10325857 8267211 5175822
43719 5175822 1929763 -1188444 -5008503 -9415152 -11919724 -10012271 -4673953 55823
43711 55823 1318591 87659 -781655 -64983 1044668 1064652 150747 -335684 316097
43702 316097 1411698 2149181 2985076 4806009 6998646 7663154 6223625 4723549 5627437
43693 5627437 8928955 12178747 12914420 10508299 6249005 2358885 485910 421197 483378
43684 483378 -518930 -2131265 -3149133 -2780271 -640612 3193382 7430122 10039702
43676 10039702 10442566 10192412 10553633 10696746 9647343 8688078 9775232 12249376 13272335
43667 13272335 11471109 8330122 5862297 4548251 3814789 3035131 1690516 -146290
43659 -146290 -1176746 -48357 2433716 3596178 2078728 -344635 -937992 699660
43651 699660 2213599 958162 -3516474 -8962437 -12016131 -10698535 -5892156 -489893
43643 -489893 2863943 3320434 1790056 -114484 -1463507 -2746510 -4763245 -6572669
43635 -6572669 -5726671 -1494736 3319313 5387034 4927827 4853472 6181909 6564065 3918263
43626 3918263 -396221 -3230429 -3403882 -2667192 -3244659 -5080856 -5686116 -2994066 1539326
43617 1539326 3781550 1885146 -790753 295036 4611748 6961637 4307688 -592959
43609 -592959 -3409337 -3464647 -2870902 -2546565 -1786349 -903599 -1615083 -4510471 -7958305
43600 -7958305 -10062328 -10465723 -9723739 -7994001 -5250551 -2332530 -815908 -1451913 -2990061
43591 -2990061 -3043981 -397653 3732291 6963185 8034195 7539731 6778933 6517628 6766475
43582 6766475 7155491 7405001 7620501 7871686 7373665 4936336 893206 -2259080 -2158260
43573 -2158260 1083486 5621293 9840799 12355657 11569125 7549562 3455834 2491973
43565 2491973 3918549 4741050 4714549 6127921 8687163 8991561 6334504 4608477 6001054
43556 6001054 6856489 3337156 -2114886 -4270503 -2685459 -1093355 -797577 208639
43548 208639 2023571 2076211 406412 712001 4114112 6119741 2706242 -3721119 -7624407
43539 -7624407 -7243023 -4911911 -2259032 1109928 4704425 6603073 6463174 6354720 7705924
43530 7705924 9612841 11011387 12166386 12628940 10148899 4149215 -1304519 -1269460 3594367
43521 3594367 7407469 6419900 2872320 268190 -1871477 -5703080 -9955567 -11095180
43513 -11095180 -8855304 -6828183 -7218217 -8243906 -7502934 -4983069 -1728859 1675684
43505 1675684 4045007 3804619 1903572 1913736 5339533 9296971 10855831 10957600 11401498
43496 11401498 10742323 6923768 2101093 678627 3323765 6633188 8230909 8607507
43488 8607507 8251978 6707939 4618083 3233716 1776507 -1130724 -3384437 -1111105
43480 -1111105 4671364 7707988 4824651 426126 -84706 2233233 2421175 -1132754
43472 -1132754 -5810448 -9330466 -11435886 -11896568 -10174506 -6933285 -3424945 356111
43464 356111 4827999 8648726 9586059 7353370 3768319 383355 -2451433 -4676057
43456 -4676057 -6263918 -7319965 -7117909 -4223879 667575 3585743 1679250 -2277986
43448 -2277986 -2839170 1217278 6131119 8916435 10070707 10105819 7558740 2367858 -2118344
43439 -2118344 -3107524 -2057880 -1964583 -2859975 -2578272 -539256 1862232 3668328 4700231
43430 4700231 4290056 2198340 301862 817087 3038855 4378555 4569014 5900536 8684387
43421 8684387 9565816 5991242 -39343 -4622429 -6335742 -5771366 -2652723 3355033
43413 3355033 9782535 12753591 11637212 9505490 8366654 6859778 3913848 1685657
43405 1685657 2429543 4591640 4953180 3332732 2029232 1362266 -598357 -3502663 -3571242
43396 -3571242 1249522 7560666 10170187 7948910 4140715 2169834 3097232 6048842
43388 6048842 8814031 8638967 4865717 732801 232986 2818181 3508985 -772552 -6978746
43379 -6978746 -9578814 -7047323 -2879263 -829767 -1142898 -1742311 -1473380 -995933 -1071019
43370 -1071019 -1223164 -540120 821094 1781356 2050821 2765435 4657857 6246000 5234274
43361 5234274 1839069 -754660 -174717 1907445 1602446 -2652906 -8719589 -13624628
43353 -13624628 -16070205 -15744927 -12150605 -5783452 515811 3440532 2634688 897063
43345 897063 728514 1823540 2211895 566109 -3147552 -7956237 -11891981 -12846894 -10553497
43336 -10553497 -6907504 -3410803 575785 5819064 10837579 13484807 13858177 13272138
43328 13272138 11186394 6280326 519442 -1468445 1690268 5931378 7254659 6572406
43320 6572406 6802484 7897629 8061993 7959862 9779000 12890374 14336778 13718520 13864868
43311 13864868 15803059 16530542 13504983 8648007 5786765 5991010 7419362 8285276
43303 8285276 7967443 6255754 3454401 699231 -1206248 -2594772 -3556216 -3131747 -1475028
43294 -1475028 -1174556 -3776371 -6064205 -3307324 3599518 7841377 5046496 -966127
43286 -966127 -3079734 620728 5934057 8596437 7986364 5265774 1319872 -2470769
43278 -2470769 -4064411 -3006954 -1240561 -356878 418185 2066297 3209724 1803062
43270 1803062 -1560177 -4252573 -5036672 -4624251 -3049226 747432 5861790 8472293
43262 8472293 5899096 339933 -3360220 -3144553 -1299492 -683740 -1021838 252306 4228025
43253 4228025 8719165 10604801 9378247 7389340 6483664 5711106 3253324 -648298
43245 -648298 -4311238 -7178743 -9559731 -10412873 -8345919 -5196711 -5453717 -10528965 -16031333
43236 -16031333 -16638915 -11823253 -5030756 689248 3913802 3612827 -190448 -5132207
43228 -5132207 -8299761 -8948167 -7786694 -4800262 -114973 4058184 5106841 3129052
43220 3129052 71276 -3179461 -6062197 -6139752 -1808028 3160253 2502178 -4069461 -9562784
43211 -9562784 -8637984 -3983355 -1485413 -2669183 -5081601 -7226883 -9146347 -9652615
43203 -9652615 -6921603 -1699523 2909529 4995011 5175525 4521778 3064788 541143
43195 541143 -2719830 -5717284 -6835213 -4646199 270461 5054118 7311121 7469629
43187 7469629 7361800 7541260 7473518 7324030 7611957 7685620 6507880 4685162 3853620
43178 3853620 4155326 4185150 3562270 3639163 5050879 6203014 5235772 2444657 -330249
43169 -330249 -2097402 -3334169 -4300443 -3937905 -1308824 2386673 4547726 4210645 2988592
43160 2988592 2183821 627925 -2832619 -6247161 -6810270 -5366274 -5153558 -6117730 -4627254
43151 -4627254 -30991 2727667 -387913 -6701777 -10460666 -9596692 -5970510 -1586126
43143 -1586126 2003459 2855707 997126 -146644 1767943 4038320 3202295 919119
43135 919119 746315 1156614 -2152904 -7970376 -10349725 -8105533 -6699993 -8949799 -10533707
43126 -10533707 -7836352 -4197797 -4051829 -5778864 -5333304 -3172179 -2342637 -2469076 -1040580
43117 -1040580 978998 28293 -4119374 -7691382 -8081889 -6063156 -3097059 -16169
43109 -16169 1618576 360440 -2335401 -2985203 -294577 3769997 7121438 9136538 9060613
43100 9060613 5994350 1491099 -504027 2031011 6431798 7989370 4243879 -3680889
43092 -3680889 -12227528 -17087841 -15576226 -8994060 -2070167 997399 -79768 -2235069
43084 -2235069 -2311489 267747 3327191 4297215 3148767 2500573 4094065 6089520 5387180
43075 5387180 2003266 -860990 -1032195 402131 1417397 1613764 1638263 1714465 1864916
43066 1864916 2455247 3459787 3910736 2852113 384732 -2446015 -4077401 -2891951
43058 -2891951 1301181 5929310 7393354 4919169 1298228 -1025901 -2999489 -6726426
43050 -6726426 -11670178 -15178765 -16179670 -16212622 -16676592 -16909752 -15600508 -12652366 -8870183
43041 -8870183 -5055632 -2430139 -2749831 -6312803 -10366208 -11393208 -9162306 -6731464
43033 -6731464 -5993204 -5391963 -3357400 -1669883 -2738087 -5049047 -4872124 -2115161 -622837
43024 -622837 -1972609 -2946692 -949018 1882092 2843472 3579255 6837581 10721705 10972335
43015 10972335 8010357 6877399 9861213 13453657 13700764 11002295 8257520 7259081
43007 7259081 8238338 10214901 10516079 6713697 485286 -3124925 -1829192 1230511
42999 1230511 2585227 3112989 5068839 7275153 6832925 4047728 2126535 2553317 3671311
42990 3671311 3598582 2104090 -206734 -2342190 -2692369 -438314 2754604 4231098 3573839
42981 3573839 2805360 3469270 4998522 5869074 4981389 2105647 -1632348 -3910324 -3250933
42972 -3250933 -797373 1057269 1376554 837654 -71237 -1373535 -2604410 -3134497 -3153602
42963 -3153602 -2908569 -1662356 833838 2600199 1371231 -2104920 -4857423 -5388690
42955 -5388690 -4347456 -2168419 943480 2820047 702647 -4218466 -6790686 -3929765
42947 -3929765 1893843 6539235 8805260 9416982 8325111 5812427 4276992 5793273
42939 5793273 8871560 10293591 9488761 8613012 8726193 8417615 6478706 4032220 3514531
42930 3514531 6563072 12691029 18939961 21417345 18713991 13478289 9221639 6225890
42922 6225890 2533625 -1567010 -2865854 184809 4557637 5984795 3952928 1767633
42914 1767633 2221034 4639227 6251191 5379214 2743513 160125 -1189515 -977391 883307
42905 883307 3836488 5760955 4063821 -1317781 -6990439 -9299419 -7817807 -4755799
42897 -4755799 -1871930 595161 2662454 4137467 5392509 7086890 8906849 9619223
42889 9619223 8316525 4799769 -532519 -5800414 -7612335 -4178443 1860897 6027548
42881 6027548 7261041 8015608 9222858 8604629 4996179 887932 -1324496 -2666670
42873 -2666670 -4717232 -6078607 -4778328 -2180388 -1195453 -2025657 -2920037 -3801045 -5538263
42864 -5538263 -6742287 -5467661 -3590407 -4827278 -8025601 -7352196 -703175 6699525
42856 6699525 9484381 8626066 7665097 6520632 3462002 221314 -82772 1404577 867953
42847 867953 -1465267 -1348222 2226794 4750770 2939804 -379719 -652448 2270458 5193331
42838 5193331 6517349 7188116 8012219 8653492 8738177 8028861 5981463 2733942 148046
42829 148046 499844 4204145 9348290 12856965 12036873 6648492 150367 -3044825 -2598105
42820 -2598105 -2294040 -3717459 -2980951 3303913 11503558 14710677 11593775 6900583
42812 6900583 3791110 891270 -2398018 -3211855 -400613 2070745 471746 -3065862
42804 -3065862 -3946415 -1774316 212270 618675 587354 -250029 -4183592 -11048295 -16750011
42795 -16750011 -17545616 -13791119 -8575387 -4433614 -2246534 -1826140 -2548906 -4094884
42787 -4094884 -6722080 -10008772 -11846834 -10326061 -6465565 -3298577 -2243830 -2273534
42779 -2273534 -2716259 -4509684 -7896127 -10994889 -11908605 -10800091 -8965044 -7258510
42771 -7258510 -6172681 -5846921 -5140806 -2396011 1878831 4788891 4606223 2839169 1735634
42762 1735634 1795680 3088664 6572309 11917067 16103486 16692481 14738557 12070150 8033706
42753 8033706 2374053 -912202 2461371 9992301 14367701 12928080 10260723 10233325
42745 10233325 10525786 7594522 2660038 -809505 -2418243 -3961221 -5547246 -6232044
42737 -6232044 -6864213 -8881743 -11479387 -13018704 -14000774 -15575476 -16458654 -14816415 -12098877
42728 -12098877 -11106678 -10904592 -7898229 -1996882 2631370 3697526 3543692 4553990
42720 4553990 5891096 6577050 7796740 9527787 8485748 2872112 -3415953 -4839388
42712 -4839388 -693942 5482906 10910249 14389895 14001384 8575206 1115241 -3428563
42704 -3428563 -4147131 -4236345 -4718144 -2383919 4287874 10961697 12137338 7742350 2264063
42695 2264063 -1063369 -2353691 -2426773 -1352803 -14631 -507726 -3541175 -6679140 -6605319
42686 -6605319 -2909878 1335857 2985758 2157169 1590724 3020881 5264378 6300510
42678 6300510 6055837 5892618 6122600 5865029 5328923 6198438 8878750 10999056 10165314
42669 10165314 7336535 5823537 7046592 8720589 7791066 4233514 918107 -101099
42661 -101099 130353 -229571 -269149 2723184 8374538 11816010 9188714 2960858 -922386
42652 -922386 -375899 1339091 1265740 412956 802500 2110547 3220225 4603224 6744636
42643 6744636 8030210 6798007 4296570 3053218 3053011 2085801 -347687 -1945995 -910943
42634 -910943 1503226 2676569 2028144 2003165 5459837 11751932 15879897 13125302 4732326
42625 4732326 -3198777 -7255149 -10226167 -15091066 -18758646 -15862110 -7048231 1207552
42617 1207552 4794006 5552563 6233302 6462668 5567845 5517179 8073403 11297985 11649029
42608 11649029 8355071 3723447 83214 -2008648 -3305748 -4751865 -6213105 -6080462
42600 -6080462 -3406683 -326198 -67622 -2188191 -2573187 847071 5377509 8051703
42592 8051703 9640627 11908282 14007252 14759496 15882637 19099961 21853432 19996652
42584 19996652 13808728 7489446 3286056 -72363 -3425165 -5658706 -6472912 -7025194
42576 -7025194 -7201280 -5626999 -3059430 -2321211 -3943389 -5323438 -5334710 -6086580 -8429600
42567 -8429600 -9499183 -7273055 -4206236 -3167912 -2591497 635609 5564343 8475686
42559 8475686 8457371 7627261 6506772 3514646 -591146 -1959187 1173488 5837192 8692288
42550 8692288 10151491 11784772 12140428 8679130 2924514 6827 2313801 6341132
42542 6341132 7398489 5479478 4295354 5552413 6829413 5354062 1564685 -2100659
42534 -2100659 -4066480 -3776960 -655406 4849435 10028160 12083721 11291392 9888698
42526 9888698 8230203 4765657 -95526 -3384756 -3952075 -4348082 -6487409 -8245458
42518 -8245458 -6909290 -3710643 -1885793 -1852057 -1486469 -67324 1285450 2310100 3453443
42509 3453443 3600957 1541293 -494495 1233711 5902878 8116021 5489424 2336346
42501 2336346 3354397 7075823 8861560 7757810 6445855 5886134 4203206 833250
42493 833250 -1766574 -1406210 1227381 3946020 5127612 4001492 1012610 -1229664
42485 -1229664 666295 6981996 13328406 14350709 8923642 1286294 -2684895 -425234
42477 -425234 5231491 8759143 7512330 4581399 5153921 10293058 15895176 17854574
42469 17854574 16121012 12853686 9007444 4837792 2027385 2321920 4443471 5106944
42461 5106944 3429102 1868366 2121990 2731375 2325511 2807315 6579194 11954281 14568366
42452 14568366 13235030 11250344 11070967 10731720 7506624 2741562 131843 379496
42444 379496 692302 -586319 -1935665 -1962038 -1940768 -3502534 -5942237 -7762997 -9187820
42435 -9187820 -10819357 -11032251 -7487174 -945326 5019975 8327027 10011095 11148044
42427 11148044 10857835 8684924 6618223 6715974 8286759 9462098 10202032 11333743 11620138
42418 11620138 8794709 3546574 -356819 -698145 792194 1638482 1849245 2341850 2257482
42409 2257482 294168 -2391233 -3126619 -1312550 1002547 2104033 2232455 2037548 1390349
42400 1390349 462658 363901 1647895 3285280 4102706 4375098 4998718 5723289 5262256
42391 5262256 3019199 57494 -1684764 -1061418 1156140 3015017 3798664 5212451
42383 5212451 8920228 13300095 14679828 12081890 8378095 5777854 2887862 -1628462
42375 -1628462 -4979277 -3363641 1925986 5296532 3900456 497920 -1477018 -2315933
42367 -2315933 -3627790 -4281791 -1758870 3414705 7262664 6774597 3280827 795580
42359 795580 1490980 3305464 2376423 -2143217 -6644199 -7337209 -4916206 -3052651 -2816741
42350 -2816741 -1273670 3869327 10745662 15589054 16476126 13782185 9132623 5257004
42342 5257004 4559100 5931987 5018313 -292348 -6507839 -8776781 -6404175 -1669169
42334 -1669169 4417957 11527646 16943240 17480970 14005976 10145320 6888426 2573124
42326 2573124 -1969515 -3155003 -512179 1934004 2022131 2788634 6838936 11451076 12827802
42317 12827802 12047107 12712507 14792205 14957246 12040036 8463385 6515943 6104684 6040947
42308 6040947 5263252 3200863 948689 1255475 5134318 9458998 10413850 8387469 6743530
42299 6743530 6756107 7019523 7159832 8286032 9666988 8871505 6037371 4298279 4616668
42290 4616668 3755854 -552746 -5511508 -6932344 -4705088 -1899460 -185692 1006428
42282 1006428 1927583 2077467 2128689 3819736 7426104 10837712 11650305 9418924 5740889
42273 5740889 2614330 650208 -1216442 -3842005 -6015263 -5776208 -3614706 -2479086
42265 -2479086 -3855542 -5641573 -5004692 -1641052 3021201 7927038 11982605 13388251
42257 13388251 11644692 8900882 7092188 5004954 535565 -5463216 -10374727 -13676836
42249 -13676836 -16356240 -17371190 -14622535 -9353333 -5382747 -3242535 554851 6721701
42241 6721701 10112754 6659211 7436 -2805581 -230452 3359128 4852225 5585066
42233 5585066 7302885 9101712 9707195 9656135 9476995 8126622 5266439 3283563 4614858
42224 4614858 7830842 8640726 4911377 -941161 -4965926 -5787631 -4939964 -3997900 -2727409
42215 -2727409 -341768 2408583 3581926 2614979 1547803 2860532 6545838 10258213
42207 10258213 12126284 12227881 11113604 8293739 3259066 -2749878 -7279590 -8924492
42199 -8924492 -8196800 -6235115 -3618339 -607050 2468043 5607901 9142683 12606106
42191 12606106 14263949 12807715 9359829 6848963 7190696 9584336 11512143 10846060
42183 10846060 7279556 2702172 81567 723304 2442448 1836377 -1252404 -3282474
42175 -3282474 -1893234 821978 1777751 1792143 4069125 8609250 11548906 10513865 7600464
42166 7600464 5960365 6130014 7222442 9114514 11192523 11012497 7054379 1750738
42158 1750738 -791552 517348 3447066 5894458 7076771 6072333 2420125 -1664429
42150 -1664429 -2811573 -1027048 131257 -1084026 -2078856 -491419 1602441 836587
42142 836587 -2111596 -3606337 -2471889 -1011316 -711483 -118318 2050227 4084927 3098861
42133 3098861 -1594534 -7942381 -12980138 -14458489 -11817098 -6677398 -1836225 978360
42125 978360 2025253 2208575 1989055 2042473 3379257 5524353 5918775 3026996 -749549
42116 -749549 -1477080 1204264 3785384 4061022 3856462 5115932 5861866 2994520 -2161033
42107 -2161033 -4621267 -2328392 1188287 2044592 1251806 2475047 6207866 8948770
42099 8948770 7855564 3922367 173665 -1641312 -2033087 -2630704 -4508909 -6890981
42091 -6890981 -7484827 -4889482 -323462 4072749 7866781 11415821 13105081 10640174
42083 10640174 5543645 2832184 4313259 5292034 901137 -6683972 -11137295 -10653274
42075 -10653274 -9314366 -9899637 -9942710 -6574924 -1533296 1423150 1749300 1835990 2715212
42066 2715212 2752073 364228 -3943396 -8310201 -10911978 -10670438 -7777205 -3721274 -248630
42057 -248630 1600245 1405392 -553878 -2548689 -2222818 449678 2230552 390174 -3549713
42048 -3549713 -5930439 -6087812 -6716800 -9040636 -10458659 -8255673 -3601446 -147979
42040 -147979 276148 -818608 -689216 2066836 6466764 9790789 9722643 6469615 2361483
42031 2361483 -740794 -2581088 -2934254 -897282 2878124 4966850 2590226 -2268128
42023 -2268128 -4445279 -1477037 4005850 8144291 10157076 11719920 13601123 14663497
42015 14663497 13800634 11453270 8949797 7051699 5399962 3116780 -49269 -3007733
42007 -3007733 -4048908 -2755205 -1007671 -1343337 -3993360 -6072389 -4323391 1414015
41999 1414015 7949360 11911777 12556046 11263915 9176079 6240768 2212070 -2516515
41991 -2516515 -7143306 -10589230 -11335488 -8384235 -3019797 1395578 2348833 418364
41983 418364 -2005197 -3493284 -4227623 -4598650 -4404976 -3356414 -1551701 495804 1962238
41974 1962238 2440811 2979102 5187521 8267172 8350885 2815635 -5571121 -11116129 -11395931
41965 -11395931 -8490199 -4336308 1626088 8998542 14038058 13583453 9603712 6970840
41957 6970840 7405988 8069477 5963004 1569589 -2296161 -3820271 -3800474 -4487801 -6859047
41948 -6859047 -8943921 -7736735 -3164232 1317360 3014641 2993124 3049612 1906621 -2241103
41939 -2241103 -6630466 -5818885 669092 6686752 7444902 5752269 7281505 12047928
41931 12047928 14538841 11568514 6106663 2530100 1348753 690578 787506 3723041
41923 3723041 8760557 10934551 6378382 -2082397 -7107690 -4933655 803138 4357040
41915 4357040 4792959 5203553 6447205 5438397 417120 -5341503 -7260274 -4983670
41907 -4983670 -1811170 236671 2208475 5242968 8134458 8773801 6927593 4849411
41899 4849411 5351850 9082660 13246539 13628040 8890332 2455278 -1038711 -747603 365447
41890 365447 205224 56314 1750706 4461035 6084860 6551993 7532460 9143903 9176079
41881 9176079 6303866 2427548 584954 1481052 3346036 4580182 5026362 4774831 3337097
41872 3337097 556864 -2811558 -6018752 -8770912 -10227834 -8949256 -4990045 -837364
41864 -837364 1300772 2210112 3886220 5924374 6173408 4757154 4517312 6603692 8285210
41855 8285210 6817306 3431479 1354851 1256264 1045583 -383805 -1514818 -603181 1818745
41846 1818745 3383580 2177374 -1441991 -4816385 -5126942 -2199740 1227341 2610016
41838 2610016 2288788 2272547 3146252 3538630 2455961 929084 1016324 3601975 7215850
41829 7215850 9048347 7653852 4572207 2338061 1121181 -917239 -3886575 -5447828
41821 -5447828 -4888787 -4953806 -7385407 -9371249 -7704722 -4423820 -4273369 -7612557 -10111061
41812 -10111061 -9343670 -7457264 -6600430 -5614565 -2645645 2138021 7777511 13558199
41804 13558199 17592840 17429291 13614869 9793206 7747740 5455727 1814760 -329516
41796 -329516 1269319 3910784 3823227 1980696 2025553 4032805 4579941 2274440 -814973
41787 -814973 -3050635 -4693182 -5180792 -2760078 1977021 5353228 5112554 3406736 3654238
41778 3654238 6190485 8645287 9276659 8248920 6374138 4188281 2314957 1776811
41770 1776811 3373556 6588736 9287879 9273945 6638180 3850939 2862975 2997205 2581042
41761 2581042 1484667 597783 -93631 -944326 -993468 790640 2997065 3012172 831552
41752 831552 -883358 -938957 -1186635 -3096683 -5317115 -6140781 -6266720 -7239848 -8724726
41743 -8724726 -9213172 -8156219 -5472073 -178849 7933465 15700728 18432322 15209422
41735 15209422 10403088 8630895 9511449 9058646 5609618 2254452 2739020 6643112
41727 6643112 10265006 11523687 11938265 13605828 16320944 18689326 20279061 21040228
41719 21040228 19975413 16496722 12408806 10416366 10807503 11397222 10602779 8792023
41711 8792023 6784318 5151235 5206635 8398684 13776045 17738034 17333255 12777675 6424292
41702 6424292 820355 -1827681 -381052 3724445 7200805 8524229 9684672 12998655
41694 12998655 17244540 18672738 15557978 10375822 7228720 7767828 9873623 10208914
41686 10208914 7912848 5279525 4498398 4709924 3439343 123863 -3482801 -5884760
41678 -5884760 -6801274 -5887092 -2990454 75713 646034 -1067215 -1674455 969104 5201453
41669 5201453 8299413 9289998 7818287 3092320 -3811717 -8821656 -8650350 -4395842
41661 -4395842 532579 4400698 7007276 7573857 5797459 3932247 4852315 8356985
41653 8356985 11658687 13062586 13077605 12597023 12381099 13898407 18138968 23431713 26436231
41644 26436231 25527987 21795021 17002623 12145004 7653903 3526141 -338424 -2755061
41636 -2755061 -1411240 3831477 9148443 10623559 8832883 7112864 6577794 6048440
41628 6048440 5908161 8041399 11913590 14603253 15443318 17043868 20602327 23572122
41620 23572122 23526981 21417988 19366618 17877258 16856475 16741247 16756471 14637479 10307759
41611 10307759 7462818 8827666 11724284 11381856 7560475 4881310 6836921 12005702
41603 12005702 16449379 17888751 16964681 15732124 15629773 16463503 17122617 17201049 17269596
41594 17269596 17354904 16300715 13572536 10886867 10797354 13789240 17635089 19762134 19868236
41585 19868236 20075428 22556677 27206156 32152593 36504980 41358630 47601397 54628461
41577 54628461 62819319 75236579 93917759 115864577 136618543 157523281 185133908
41570 185133908 222479368 264744939 304687800 337817361 359919087 364378267 347188647
41563 347188647 313062937 272624548 234128720 200294812 171279511 146843498 126041780
41556 126041780 108062724 93549011 82984132 74479945 65641754 56944632 50676189
41549 50676189 47266922 45522532 45719481 48852909 52777415 52962378 48280632 42875318
41541 42875318 40693244 40880339 40482038 39225683 38928056 39596772 39096241 36617897 34122082
41532 34122082 33598880 34515705 35196252 35801317 38227966 42938609 47729138 51000696 54935759
41523 54935759 63126656 75494631 88416061 100486147 115134790 135782293 160946903
41516 160946903 186420494 209816119 229633946 241592238 240389385 225647922 203034170
41509 203034170 178836981 155954886 135589218 119681989 109749568 104987618 103187105
41502 103187105 102683087 102497333 101559900 98901793 94359868 88705076 83244672 78936202
41494 78936202 75198211 70107223 62881336 55765427 52084195 52489478 54282681 54317550
41486 54317550 51534464 47041941 43056896 41551530 42606719 44142345 44265384 43518306
41478 43518306 43812351 45809912 48572895 51034991 52491153 52522212 51925873 52777347 56053170
41469 56053170 60362307 64589398 70113180 78398642 88515373 99832888 114799762 135051774
41461 135051774 156728350 174809677 191291623 213421492 243245769 273987535 297695486
41454 297695486 311387345 314368487 305320286 285435232 260387070 235713933 212711022
41447 212711022 190750629 170377744 152137977 135762060 122367793 113692532 107434024
41440 107434024 98205968 85801313 77208781 76495983 77926591 74376069 67868488 65125865
41432 65125865 66131286 64747687 59166030 54179526 52795839 52127445 48911116 43872085
41424 43872085 39153889 35700233 34379594 35848891 38230402 38395262 36381292 35295062
41416 35295062 36363961 37478006 37057981 35909872 34851245 33989902 34564721 37672891
41408 37672891 40943143 40756998 38256426 38359068 41753505 43083598 39135366 33688923
41400 33688923 31190824 30338143 27988180 25558456 26641039 30547281 32947199 32030621
41392 32030621 30370060 31153195 35295731 41563213 47149470 48975157 46630915 43238721
41384 43238721 41720259 41673236 41767714 43080061 47158811 52490284 56336702 59125836 63516225
41375 63516225 69512395 74088642 76123020 78642908 85182662 96179523 109909504 125119823
41367 125119823 141664456 159585475 177969780 193822776 202507075 201158107 191904084
41360 191904084 180029315 168525219 155938062 140003998 121754196 104979361 92547234
41353 92547234 84207921 77764731 71920596 67783620 67119799 69049137 69739438 66482141
41345 66482141 61050888 57470066 57258464 58760840 60539116 62953275 66272284 69714086
41337 69714086 73213315 78159136 85319101 93516045 101104238 107148170 110568318 110440329
41329 110440329 108546444 109287906 114740704 121617022 126065882 130244213 140433788 158616894
41321 158616894 179623930 197750231 212662462 226357032 237121003 240275125 234037130
41314 234037130 221282403 205392940 187325219 167560042 148303301 132060899 119456119
41307 119456119 109742350 102310012 96606639 91787087 87695856 85189330 84272354 82910342
41299 82910342 79070036 73230284 67691260 64140506 62895439 63384037 64021067 62887239
41291 62887239 60283539 59397425 62354685 66776643 68798177 68564256 69680295 73621258
41283 73621258 78056773 81037991 83541966 86956329 91087684 95976655 102924217 112040449
41275 112040449 121065559 128398670 135517713 144916633 157240377 171478943 185964845
41268 185964845 198007980 204773215 206021468 204044208 199816401 191803827 179946248 167626400
41260 167626400 157371761 147621676 136676984 127019656 122035226 120562670 118546862 114512304
41252 114512304 109637318 103971943 96829729 89865732 85278529 81462183 74984689 66803604
41244 66803604 61788760 61485000 62000379 60208883 57426040 55162444 51864571 46745760
41236 46745760 42917191 42996468 44352367 42589794 38040711 35060984 35763374 37959525
41228 37959525 39311496 40475910 43210239 47324443 50762666 51990097 51437919 50470196
41220 50470196 49212860 46263821 41397194 37659282 38663858 43649482 47540943 46927200
41212 46927200 43943468 42811085 44484543 46863655 48914720 51746997 55570859 57989166
41204 57989166 56566790 52212139 48905785 49911813 54588777 59242414 61001766 60201691
41196 60201691 58807417 57744798 56843603 56278359 56307398 56214331 55344989 54642446 55111813
41187 55111813 55378990 53341960 49851246 47695638 46984470 45109095 41798335 40151886
41179 40151886 41220806 41726937 39566902 37607950 38642613 40010189 37479524 32074078
41171 32074078 28584301 28866163 30929840 33399869 36163845 37117121 33265211 25910447
41163 25910447 20649346 20944506 24854468 28829350 31201202 30941520 26977114 20975091
41155 20975091 17607975 19301683 22888827 23902700 22219953 20887639 21117794 21523545
41147 21523545 21387052 21499205 21726072 20618590 18323951 17608345 20374196 24443409 25657343
41138 25657343 22893137 19267886 17803335 17390984 14629692 9037992 4341347 4053266
41130 4053266 7574967 11735277 14547926 15874440 15853525 14936899 14697363 16241561 18105955
41121 18105955 17943147 16141171 15473641 17152014 19666444 21695643 23316931 23631578
41113 23631578 20390959 13888607 8736873 9245472 14372179 19331724 21113153 20505375
41105 20505375 19746461 20342691 22637783 25467826 26360666 23775958 19207397 15764676
41097 15764676 14725289 14641158 13685777 11680004 9872695 9847458 12580103 17373528 21512326
41088 21512326 21991741 18138644 12271582 7797574 6816609 8958708 11779030 12614271
41080 12614271 10863949 8379534 7183544 7236591 7014791 5716662 4092081 3486968 4730340
41071 4730340 7389934 9440484 8612849 5313857 3411619 6409643 13079681 18533846
41063 18533846 19630112 17675734 15607785 14423201 13363656 12125380 11280635 10910539
41055 10910539 10075043 7964785 5180206 3565510 4530173 7426095 10017004 10887062
41047 10887062 10669838 10145911 8138309 3082222 -3585558 -7741384 -6964734 -3001508
41039 -3001508 932294 3646935 5562630 6360560 5071888 2037121 -919988 -2355044
41031 -2355044 -2222155 -1217186 -100654 525172 744248 1469401 3227640 5226066 6623594
41022 6623594 8049342 10294631 12046435 11152449 8247831 6571135 7233026 7257206 4249485
41013 4249485 768068 1004459 4218266 5029506 650369 -5288958 -7557392 -5620040
41005 -5620040 -3095118 -2414987 -2524594 -1766639 -957219 -2434807 -6536583 -9991989 -8708960
40996 -8708960 -2579822 3356753 3993680 85718 -2866818 -1811784 519400 732807
40988 732807 61543 1428391 3542093 2490258 -1270138 -2353454 1858398 7133769
40980 7133769 8315509 5935668 4036387 4291412 5926360 9268148 14835311 19712428
40972 19712428 19546397 14815328 11051590 11480351 13114796 12144142 9686622 9029266 9693056
40963 9693056 8229341 3971728 271286 -133927 2041523 4804862 6993117 7336359
40955 7336359 4263592 -1539407 -6301179 -6783710 -3466938 1260575 6284385 11022736
40947 11022736 13234758 10872045 5751979 2139709 1157618 -396632 -4626353 -9026546
40939 -9026546 -10457556 -9955021 -10451781 -11343082 -9107040 -3175902 2437846 4499719 4694241
40930 4694241 6558311 10211313 12401284 11013930 7550692 5010665 4440730 3860452
40922 3860452 312658 -6739826 -13926105 -16656220 -13645013 -7741280 -1855200 4170735
40914 4170735 11180328 16965588 17836088 13735558 8967786 6981074 6781159 5909898 4811651
40905 4811651 5795890 8714696 10454786 9041748 6161860 4822184 6075496 8973939
40897 8973939 12276564 14763724 14935411 12322711 8853180 7126649 7168082 6676054 5066852
40888 5066852 5245202 9656874 15896135 18683338 16233703 12492876 12113945 14811813
40880 14811813 16311990 14198120 10855784 10001492 11725656 12640458 10750734 8224474
40872 8224474 8062955 9357888 8215224 3371119 -1611612 -2853094 -791983 1369708
40864 1369708 2086998 2079096 1924263 1977736 4023889 9630786 16402207 18966312 14944878
40855 14944878 7590818 1415751 -2267683 -4043845 -3583199 -893170 1584022 1513100
40847 1513100 777515 4045362 12687578 22113810 26033456 22553926 15824617 12105260
40839 12105260 13908175 17652677 17810865 13515666 9361741 8889907 9760099 7678247
40831 7678247 3101703 561209 1964058 4169322 3812966 1531777 62176 343295
40823 343295 1222763 1888354 3064139 5832851 9710132 12139018 10793920 6891059 4666433
40814 4666433 6075350 7699183 5450139 968935 -222741 3440134 7462203 7592590
40806 7592590 4489368 944423 -1725069 -2503334 470506 6738884 11765344 11792868 8993257
40797 8993257 8645411 12126204 15578244 15020329 10276924 4209570 311413 732355 4481385
40788 4481385 7671024 7383503 5019081 4018231 4865558 4790657 2398269 -20 470033
40779 470033 3615266 6650863 7077288 4430153 283234 -2810093 -3157619 -1256400 997024
40770 997024 2173531 1822241 -48218 -2460223 -2819819 1174395 8351810 14258320 15377923
40761 15377923 12315429 8308347 5617995 4198268 3197562 2596882 2972107 3932312
40753 3932312 3570467 497295 -3513813 -4404886 -438902 5207302 7976307 7268146 6500274
40744 6500274 8353129 11972367 14908221 15871430 15058653 13288902 11511792 10295453
40736 10295453 9637705 9957193 12470594 16973052 20093267 18370631 13020128 8841302
40728 8841302 7988505 7965022 6898662 7271499 11766536 17998248 20788673 18457212 13739916
40719 13739916 9158021 4654174 -26147 -3508784 -4427608 -3123639 -826820 1605766
40711 1605766 3564401 4498885 4475565 4045496 3248103 1733468 104531 -150094 1289145
40702 1289145 2714821 2552293 1612432 2082901 4572345 7179080 7656372 5871402 3845653
40693 3845653 3700807 5817229 8771258 10628608 10180629 7406250 3421101 33077
40685 33077 -1390733 -1201788 -1325819 -3268854 -6274711 -7827502 -6056711 -1611276 2600303
40676 2600303 3476281 148068 -5106333 -8734569 -9276453 -8570284 -9034184 -10266786 -9506089
40667 -9506089 -5416988 -37542 3692355 5211030 5979178 6512607 5403096 1644894
40659 1644894 -3298325 -6633507 -6887966 -4749803 -1865809 286745 855395 302294 596429
40650 596429 3229827 6660927 7307163 3983287 -126367 -1292615 254960 1474570
40642 1474570 1109163 629478 803945 60875 -2823545 -6419358 -8227896 -7234249 -4016145
40633 -4016145 264550 3957380 5346271 4230807 2224887 654769 -766590 -2452898
40625 -2452898 -3643947 -3756168 -3595020 -3826002 -3596006 -2192812 -612232 372141 2152997
40616 2152997 5816009 8915299 7791675 2806242 -1642239 -2469288 -619579 1738046
40608 1738046 3755101 4827117 3812247 823004 -2250310 -4210477 -5554044 -6048510
40600 -6048510 -3933039 776994 4839052 6151711 7335923 11727394 17326815 18590853
40592 18590853 13969767 7975696 5068523 4755085 4169079 2635707 1263090 -260743
40584 -260743 -3584534 -8516611 -12018205 -11133278 -6073688 94387 4379681 6131108
40576 6131108 6668790 7230786 7740875 7537084 6534514 5007034 2731272 -594648 -4141561
40567 -4141561 -6254985 -6278098 -5184909 -4051789 -2804949 -992654 1079479 2709541
40559 2709541 3630534 3800573 3037866 1626274 595326 458227 268259 -1017308 -2771433
40550 -2771433 -3449561 -2527708 -288937 3596299 9035161 13185164 12109257 6104268
40542 6104268 979338 1790205 6739578 9635219 7457572 2953677 125949 -77469
40534 -77469 966483 2223020 3668332 5580986 8044699 10305281 10488414 7347108 2459899
40525 2459899 -1038468 -2216652 -2764852 -3228808 -1727849 2019458 4391193 2519334
40517 2519334 -806224 -413673 4161999 8542567 10122883 10949903 13217966 15360683
40509 15360683 14372097 9698103 3322872 -2011835 -3431481 791656 8484849 13898891
40501 13898891 13195436 8673190 5625492 6058783 7686985 8265315 8174898 8497399 8846129
40492 8846129 8086843 5935283 3105450 676533 -361534 203445 1243438 1210004 133
40483 133 -709964 641455 3688101 6469310 7311003 6249061 4705890 3741695 2799228
40474 2799228 769444 -1718692 -2236982 521563 4788931 7698182 8285777 7344702 5446187
40465 5446187 3069269 1944946 3661478 6747593 7700276 5730738 4030715 4892212
40457 4892212 5927809 3532132 -1474791 -4601994 -3599589 -781353 865108 1237170
40449 1237170 1686336 2243635 2159257 2002707 3246862 6047232 8891388 10416390 10480147
40440 10480147 9531972 8046801 6681490 5988638 5702340 4971486 3346882 959018 -1916598
40431 -1916598 -4512148 -5309312 -3648843 -1241346 -75778 980131 4688182 10104997
40423 10104997 12423379 10084832 8196310 11077281 14514590 10937913 977075 -6400243
40415 -6400243 -5993498 -2569080 -2587716 -5188023 -5433458 -2467784 542748 2293756 4272524
40406 4272524 6757060 8150264 8135243 8045967 8175932 7724465 7199346 7875253 9000408
40397 9000408 8518507 6551290 5280621 5447841 5960500 6812430 8968848 11232379 10997963
40388 10997963 8709592 7626437 8188182 6923503 2696530 -471810 332613 1972154
40380 1972154 394165 -2742799 -3212856 -1463090 -1387789 -3080239 -2481150 1159945 2575718
40371 2575718 -2515589 -11057511 -15901846 -13608108 -6995640 -1154999 1147808 435087
40363 435087 -1524761 -3815587 -6289222 -8009850 -7282233 -3996711 -601918 694565
40355 694565 748152 1953826 4781670 7580379 9026563 8796887 6543032 2511394 -1274305
40346 -1274305 -2924854 -3554117 -5642134 -8648098 -9279095 -6560144 -3433087 -2199291
40338 -2199291 -1452578 758850 3553025 5230607 6246173 7519228 7769093 5670602
40330 5670602 3414082 4677671 9230848 12633385 11832020 8495775 5851788 4391988
40322 4391988 2279086 -1272179 -4749487 -6326049 -6082850 -5940138 -7494881 -9996179
40314 -9996179 -10834323 -8476380 -4537415 -2074729 -1901137 -1677794 880747 4879790 7389205
40305 7389205 7382444 7176675 9245886 12500737 13231141 9897480 5484831 4060853 6034992
40296 6034992 8292040 8359211 6606080 4533294 3073405 3122556 5610434 9737430 12681968
40287 12681968 12513312 10341199 8446248 7581149 7463819 8407576 10385442 11534570 10025886
40278 10025886 7049596 5681544 6873158 8726435 9733904 10297769 10543599 9141382
40270 9141382 5591365 1797392 -142303 -458344 -841173 -2253647 -4663758 -7530022
40262 -7530022 -9163222 -7018984 -613354 6566463 9944949 8406811 4629597 1591857
40254 1591857 542013 1777569 4895996 7932230 8560020 7049886 6142857 7035691 7538678
40245 7538678 5744072 3536534 3990515 6422573 6932037 3773519 -563936 -3311683
40237 -3311683 -4921389 -7105088 -9312382 -9385850 -6996900 -4413572 -3728466 -4619906 -5100577
40228 -5100577 -3658755 -541776 2512771 3865316 3615949 3196080 3023699 1762328 -1011719
40219 -1011719 -2783209 -883199 3376782 5963155 5611182 5323296 7552346 10579378
40211 10579378 11326522 9526128 6976210 4465282 1939623 404217 823962 1740894
40203 1740894 714113 -2057253 -4139839 -4811256 -5682036 -6867073 -5636179 -473569
40195 -473569 5869648 9330405 8936250 6534006 3707039 1071559 -490921 -311808 589524
40186 589524 360880 -1397234 -3557644 -5234863 -5994330 -4741315 -554101 5137141 9223617
40177 9223617 10435448 10470833 10913134 10940506 9360673 7062454 5377209 3257445 -1236850
40168 -1236850 -6839297 -9174216 -5872849 389560 5185486 6987827 6984304 5868119 3419631
40159 3419631 831647 618527 3379095 6802664 9097222 11432755 15110659 17884030
40151 17884030 15851743 8763593 957816 -3473657 -4483579 -4456864 -4888553 -5917060
40143 -5917060 -7436154 -8834669 -8538858 -5568871 -1168533 2507176 4919838 6916229
40135 6916229 8339195 7723637 4760080 1552689 610653 2392919 5307673 7374356
40127 7374356 7548169 6265320 5117607 5260751 5956174 5773428 5514297 8248006 15181703
40118 15181703 22837482 26264072 24517742 21016556 18591572 16450453 12911451 9191147
40110 9191147 8485422 11719429 15811280 16622286 13027301 7791313 4699670 4982552 6496716
40101 6496716 6281908 3557440 -45206 -2559591 -3014740 -1151851 2440074 5481243
40093 5481243 5149866 1423119 -2001244 -1674240 1688366 4834936 6324333 6930533 6610435
40084 6610435 4306735 1036010 -177094 1209014 1830315 -382711 -2199476 606062
40076 606062 6520806 9472378 6629007 1928273 1033396 5000875 10051101 12198204
40068 12198204 11083456 9890936 11884476 16596381 19775169 17957546 12500227 7794257
40060 7794257 6144569 6202620 5964286 4995085 3590184 2071873 1385711 2132205 2456815
40051 2456815 -492256 -5860730 -8463422 -4785876 2384249 7396926 8160291 6919900
40043 6919900 6036493 5591860 4629681 2516411 -840942 -4544930 -6762250 -6501273 -4700467
40034 -4700467 -2365131 1141604 6176131 10527648 11599029 10149681 9231109 9795629
40026 9795629 10081996 9151513 7962320 6574735 3485495 -1130174 -4339144 -4193769 -2254105
40017 -2254105 -764057 480547 2494512 4322828 4392771 3457158 3713361 5483669 6895152
40008 6895152 6741246 5872385 5535085 5607428 4825519 2247950 -1298403 -3041253 -675300
39999 -675300 4217494 6589951 3443450 -2088246 -4206381 -1404305 2380551 3538035
39991 3538035 3097170 4184184 7156958 9130700 7700585 3680267 29898 -1240427
39983 -1240427 -840264 -944093 -2358513 -3662677 -3769173 -4386247 -8151726 -14347773 -18573299
39974 -18573299 -17750844 -13892700 -11334507 -11294372 -11122547 -8569911 -4678118 -1877526 -908508
39965 -908508 -786026 -779894 -995853 -1240731 -543710 1830441 5441587 8927204 10843964
39956 10843964 10376219 7914145 5159223 4044942 5066543 6901582 7878468 7459336
39948 7459336 6141792 4605078 3530596 3671530 5154139 6839633 7190053 5800872
39940 5800872 3461397 870944 -1788647 -4014832 -4918552 -4500461 -3949959 -3840584 -2889620
39931 -2889620 243747 4281146 5859584 3162356 -1871861 -5545933 -6063824 -4614315
39923 -4614315 -3258844 -2677371 -2159278 -974041 1018917 3832447 7468156 11215834
39915 11215834 13530887 13406658 11759023 10721226 11255847 11873922 10204127 5815994
39907 5815994 1051647 -1292292 -888923 133967 184250 157873 1609790 3972673 5280150
39898 5280150 5336006 6098506 8504101 10981365 12018711 12093614 11688116 9676624 5875452
39889 5875452 3105496 3690879 5402500 4402744 1211568 -374402 61875 -1126792 -4717797
39880 -4717797 -6115333 -2431981 2337671 3109555 1348835 2218413 6129418 8320392
39872 8320392 6477482 3899084 4017244 5680614 5745058 3527978 527944 -2392384 -5228524
39863 -5228524 -7072806 -6224514 -2416040 2064312 4099894 2612915 -474791 -2339070
39855 -2339070 -2052336 -667206 1128952 3864128 7301942 9366966 8382405 5191801
39847 5191801 1812560 -709920 -1706209 155618 4954885 9590969 10392426 7438888
39839 7438888 4220818 3306303 4337622 5911752 7208338 7825621 7998950 8921139 11170224
39830 11170224 13346133 14066963 14260813 15049846 14642144 10739206 5262025 2708702 3899988
39821 3899988 5425733 5435103 5339091 5041112 1833251 -3824339 -6619600 -3916428 -575587
39812 -575587 -2036470 -6096797 -6390177 -1682085 3167671 4203862 1925056 -1410576
39804 -1410576 -4040949 -4588326 -3084153 -1821736 -2392504 -2789550 -538178 2534263 2507210
39795 2507210 -448117 -2350996 -1764318 -1527391 -3527752 -5820307 -6151784 -4815626 -2669843
39786 -2669843 439958 3778208 5114317 3562576 700128 -2064216 -4620292 -6087970
39778 -6087970 -5093613 -3245807 -4411595 -8524067 -10111508 -6052825 -1227266 -2379970
39770 -2379970 -8870416 -13927935 -13596758 -10016165 -6490497 -3718564 -1378436 263212
39762 263212 1472457 3123970 4693260 4324724 1608220 -1709801 -4323273 -6599504
39754 -6599504 -8633300 -9320957 -8431348 -7647269 -8235377 -9161533 -8661642 -6349222 -2880394
39745 -2880394 786393 2684122 515314 -4835426 -8080819 -4673774 3358623 9382260
39737 9382260 9868553 7427644 5810918 5080224 3446130 1233395 165144 63733 -757443
39728 -757443 -2225882 -2406839 -817311 761355 1312600 1806046 2389580 1085299 -2856352
39719 -2856352 -6624202 -7326242 -6048084 -5705294 -6299589 -5595783 -3648550 -2792825 -2910402
39710 -2910402 -612550 5457040 11762605 14358631 13737930 13009036 13340453 13797538 14260541
39701 14260541 15659965 17671269 18375856 16307504 11535269 5131158 -1068725 -4660273
39693 -4660273 -4237431 -890215 2689227 4431008 3965752 2620834 2999726 6898282 12288957
39684 12288957 14141309 10263297 4733424 2948857 4649326 5203716 3101545 2109188
39676 2109188 5240090 10224607 12776107 11759889 9159829 6826921 5236655 4237936
39668 4237936 3367868 2119160 750583 -133584 -1153095 -3530208 -6270140 -6303456 -2876677
39659 -2876677 456710 285421 -2137629 -3272943 -2615107 -2701658 -4636630 -6596668 -6791281
39650 -6791281 -5466979 -3699658 -2017427 -219520 2916292 8981074 16947686 21907275
39642 21907275 19832172 13126520 8040423 6724241 5881244 3698203 3000599 5249472
39634 5249472 6336792 2573208 -2548999 -2478517 3462031 10001630 13475999 14513785
39626 14513785 13756390 10307659 5435238 3137853 5210429 9306464 13264080 17523262
39618 17523262 21594918 22381714 18769752 14202250 11553448 9019683 4871083 2635360
39610 2635360 6207033 12175776 13246768 8706225 5414435 7669471 11827747 12957061
39602 12957061 11710741 11437439 12358386 12351558 11057345 9709326 8381411 6359859 4245853
39593 4245853 3261685 3301435 3645599 4611869 6570451 8348529 8582219 7727242 6833861
39584 6833861 5345041 2234164 -1487141 -3639715 -3810396 -3429240 -3322996 -3054822 -2247000
39575 -2247000 -671880 2503162 7515804 12335437 14260340 13186083 11478893 10662279
39567 10662279 10014215 8448239 6090270 3907442 3115299 4667136 8025292 11133839
39559 11133839 12992759 14856885 16821404 15257115 7399088 -2659805 -7203254 -4300054
39551 -4300054 492058 2472321 2961594 4522601 6134816 6261648 6455920 8009494 8403242
39542 8403242 5339635 1567973 1118510 2834265 2549343 341542 437967 4238044 8387441
39533 8387441 10222595 10558665 10210695 8208015 4985961 3240145 3519511 2593689 -1336843
39524 -1336843 -5040012 -4759314 -1647970 531202 1075444 2180368 4350041 5564353
39516 5564353 4820410 3527592 3151061 3816965 5375937 7549425 8756462 7141733 3461067
39507 3461067 847937 765702 1088218 -598886 -3538833 -5242586 -4969500 -3771241 -1965114
39498 -1965114 1039597 4396307 5640473 3800889 1030924 -138498 -3474 -693474
39490 -693474 -2788712 -4651491 -4884230 -3743295 -1934843 305730 2334697 2914436 2036031
39481 2036031 1738378 3751680 7053780 9042812 8620607 6958605 5720164 5715187 6825729
39472 6825729 8001706 7770618 5988723 4444222 4260878 3663515 606432 -3059386 -3206740
39463 -3206740 459819 3314515 2204493 -288696 -326139 1247202 851896 -1607456 -2382805
39454 -2382805 482074 4602668 6911961 6967290 5644665 3225376 524435 -13113 3365190
39445 3365190 8859131 12227853 10839656 5929980 1130106 -653086 713374 2957550
39437 2957550 3855511 3463736 3579595 5132778 7144817 8594998 10000605 12046331 13595343
39428 13595343 12705959 9488939 6391352 5143491 4640945 2770245 -463873 -2866596
39420 -2866596 -2875197 -1122016 1165635 3944702 7323309 9639380 8528839 4215290 105127
39411 105127 -765546 1292855 4046240 6364419 8366946 9638262 9341179 7850469 6464371
39402 6464371 5465414 4070599 2291463 1087004 538386 -228479 -996816 -441631 1243134
39393 1243134 2009161 1290554 1237502 2981380 4121351 2386984 -259470 -361759 1505719
39384 1505719 1526585 -1489608 -4644217 -5645868 -5437188 -5191103 -4165105 -2338122 -2038256
39375 -2038256 -4236561 -5545269 -2217106 4032526 7471234 5407024 946812 -1602236
39367 -1602236 -1434675 -352202 642353 2088567 4365060 6751403 8074009 7632506 5752859
39358 5752859 3809462 3238381 4116866 5181658 5544739 5615700 5743044 4928792 2260792
39349 2260792 -772608 -1140882 1990263 5715584 6633450 4773526 3063750 3486123 5366293
39340 5366293 7397850 9418756 11250421 11330034 8247969 3197804 -603906 -1077718 1029062
39331 1029062 3522586 4859800 4816268 4022781 3222219 2587474 1795511 1073324 1557257
39322 1557257 3742089 6179513 7064827 6810742 7489815 9733662 11808000 11959809 10032688
39313 10032688 6511146 1923252 -2186356 -3783708 -2952080 -2070469 -2180473 -1324530 1712899
39304 1712899 4205710 2780227 -1441465 -3977150 -2700939 279849 2098367 1705538
39296 1705538 -942041 -5242177 -8808255 -8669346 -4821020 -557240 1740371 3108188
39288 3108188 5216152 7362061 8112944 8191125 9341015 11097434 10921016 7637380 3214335
39279 3214335 776657 1719200 4974369 8530469 11355531 13732674 15581578 15132914
39271 15132914 10659508 3663347 -1352347 -1355779 2069728 5123034 6204984 6410436 6408971
39262 6408971 5027152 1477976 -2518084 -4089717 -2386957 461030 1754571 1072055
39254 1072055 220748 644983 1847784 2687988 3143245 3851037 4815281 5914650 7971548
39245 7971548 11546749 15005258 15785251 13751610 11433519 10677446 10972247 11376494 11863013
39236 11863013 12099983 11292463 10300506 11463587 14773140 16576376 14137466 9474014
39228 9474014 6343269 5171755 3646790 1092748 -544898 482106 4183532 9498522
39220 9498522 14456655 16485609 14776221 11686598 9801573 8654738 6682618 5021203
39212 5021203 6011032 8565282 8647240 4613446 -992969 -5205111 -7139205 -6572657 -3535855
39203 -3535855 -198220 152013 -2664103 -5307646 -5762822 -5423768 -5048191 -2341542 3782496
39194 3782496 9435127 9562474 4023943 -2766927 -7050177 -8264654 -7558589 -6181393
39186 -6181393 -4929838 -3586100 -1345109 1463564 3373203 4162739 5158676 6124572 4611631
39177 4611631 301373 -2967185 -2367485 -603878 -1665193 -4363054 -4526153 -2101156
39169 -2101156 -995446 -2248361 -2634113 -875043 -156545 -2409784 -4481777 -3011708
39161 -3011708 167037 923032 -1063292 -2533686 -1792976 -383949 98447 194518 1161627
39152 1161627 3104002 4987822 5531593 4019747 1099236 -1283163 -1554515 -200484
39144 -200484 716307 -287825 -2629834 -4063084 -2554420 1640415 5747651 7161442
39136 7161442 6360086 5914275 6527805 6059042 3432601 1323800 2710196 6078691 6883659
39127 6883659 3573083 -528831 -1924830 -1065736 -420837 -424860 458861 2475648 3654155
39118 3654155 2422305 -448962 -3119956 -4685253 -5086815 -4079291 -1679776 639787
39110 639787 665123 -2131337 -5709906 -7558570 -7048472 -5212537 -2999116 -774029 928242
39101 928242 1644339 2346611 5325804 11616274 18925819 23172454 22331562 18227784 14333771
39092 14333771 12394415 11684845 10959404 9947070 8827776 7580599 6734601 7654241 10553998
39083 10553998 12854506 11481106 6857235 2604771 814881 -150405 -2093709 -3690986
39075 -3690986 -2903624 -700333 606841 1621826 5021262 10534844 14218646 13675905
39067 13675905 11017238 9102333 7462294 4137179 -411576 -3874514 -5543052 -6627994
39059 -6627994 -7474737 -6808798 -4068577 -663734 1693671 2656755 2826257 2883017 3634626
39050 3634626 5658326 7996696 8282011 5576518 2603274 3381966 8148166 12149720
39042 12149720 10834163 5319996 828844 -81138 -219270 -2638308 -5232300 -3157282
39034 -3157282 4268527 12000064 14904652 12634465 8305875 4665889 2789077 2600239
39026 2600239 2931619 2239999 729744 637643 2896509 4695747 2425462 -3452152 -8496313
39017 -8496313 -9333121 -6956238 -4642925 -3974201 -3753261 -2337130 -338816 -498603 -4259419
39008 -4259419 -8772430 -9016572 -3734637 2470941 4576367 3102880 2320281 3766338
39000 3766338 4888491 4004803 2937802 3465967 4386587 4364257 5200170 9158085 14260884
38991 14260884 15505083 10893526 3809088 -1115454 -2464242 -1685728 -286995 1059681
38983 1059681 1679493 908182 -1032499 -3128271 -4641018 -5539392 -5979205 -5983264 -5636600
38974 -5636600 -5035092 -4022606 -2541411 -1194824 -628153 -204585 1521369 4211720 4761429
38965 4761429 583602 -6381729 -10755027 -9415297 -4830082 -1982011 -3156575 -6760656
38957 -6760656 -10194386 -12304704 -13323306 -13837321 -14133736 -13881429 -12516821 -10496848 -9661308
38948 -9661308 -11277077 -13963286 -14785805 -12514173 -8733803 -5600807 -3615134 -1960868
38940 -1960868 -13753 2092404 3781666 4545189 4609120 5067854 6564081 7939443 7395915
38931 7395915 5178713 3724660 4570294 6374646 6758044 4924205 1674918 -1783574
38923 -1783574 -3845650 -2746405 1273864 4796462 4330956 594018 -2065563 -769237
38915 -769237 2857206 5087637 4094770 956458 -2083184 -3485554 -3291425 -2785254 -2784538
38906 -2784538 -2070500 1508373 7926558 14106935 17028643 16770388 15354639 13448840
38898 13448840 9975856 4925962 662375 -612628 344379 877364 -4792 -468747 1272042
38889 1272042 3964705 4379034 1216567 -3163904 -5352147 -4361397 -1798101 721401
38881 721401 3130946 5911189 8549974 9561951 7937295 4635434 2597998 4387472
38873 4387472 9145517 12928898 13317839 12553332 14005013 16526953 15725432 11031452 7395379
38864 7395379 8013834 9281191 6551311 1909758 1271325 5116423 7563392 5042485
38856 5042485 817977 -698134 416544 2080247 4206425 6696365 6579331 1471698
38848 1471698 -5683641 -9270510 -7651708 -3909483 -828137 1280841 2229389 1367815
38840 1367815 -194671 -310591 476730 -663023 -3580865 -3885994 910882 7056293 9259139
38831 9259139 7560185 6229006 7082250 7497840 5224401 2084619 1507372 4062241 7012558
38822 7012558 7796927 6722387 5858827 5969528 5654021 3850163 1853145 1353654 1294251
38813 1294251 -1033031 -5684372 -9312445 -9518015 -7625902 -5872679 -4198309 -1794693
38805 -1794693 222664 303653 -723088 -1021531 -1007899 -2397441 -4461193 -4271523 -1050074
38796 -1050074 2341975 3069556 1479324 -125105 -53450 2118891 5657730 8445753 8136274
38787 8136274 4647977 571030 -1605550 -1762210 -1312306 -1383885 -2351460 -3802429 -4206594
38778 -4206594 -1891711 2696791 6690401 7618403 5745191 3027341 797100 -793175
38770 -793175 -2116941 -3840973 -6547701 -9721325 -11729256 -11399428 -8968354 -5308453
38762 -5308453 -1465101 779694 -214544 -3481333 -5644122 -4957009 -3420104 -3230813 -3140197
38753 -3140197 -899400 2320503 3385998 2375193 2565374 5021937 6971638 6716280
38745 6716280 6532607 8565418 11018166 11378508 10873223 12011453 13456175 11811106 8030606
38736 8030606 7212031 10903274 14150144 12718798 9429593 9522284 12391369 12666260 8478743
38727 8478743 3728655 1628857 640181 -1337505 -2764987 -1500306 836284 1160147
38719 1160147 -94070 9958 1702568 2107744 313926 -644811 1829941 6111648 8535760
38710 8535760 7570778 4335353 514279 -2510632 -3465934 -2000861 378379 1359293 -2575
38701 -2575 -2571207 -4408004 -4517363 -3692024 -3763666 -5485058 -7137946 -6121832 -2185421
38692 -2185421 1855999 3120987 1654152 -22934 259032 2224981 3320060 1014488
38684 1014488 -4149778 -7997377 -6682908 -1429015 2369075 1369525 -2067696 -3294050
38676 -3294050 -630984 4051089 8216247 10219158 9252819 5932627 2426303 309788
38668 309788 -1152615 -3080892 -4312321 -2834975 668792 3163512 3165143 2002087 1012931
38659 1012931 70896 -389822 1318655 5042254 7270153 5266215 1394447 507045 3485902
38650 3485902 6345227 6256374 5505159 7620523 11733495 13659394 11875169 9410540 9214790
38641 9214790 10241914 9648335 6927310 3757007 959722 -1950368 -4564172 -5249905
38633 -5249905 -3336997 100571 3809901 6982824 8268857 6384545 2383328 -716069
38625 -716069 -1478023 -1332559 -1447954 -687165 1674725 3437948 2217263 -622563 -1391207
38616 -1391207 1101934 4395211 5824340 5125771 3538091 2002509 626816 -1047910
38608 -1047910 -3299262 -5171676 -4791682 -1569209 2720425 6028778 8247744 10245149
38600 10245149 11905216 12572796 12244201 10686614 6708566 324476 -5644214 -8522022
38592 -8522022 -9212859 -10058960 -10481729 -8208651 -4273686 -2744651 -4774816 -6615033 -5125445
38583 -5125445 -2331708 -2469946 -6458484 -11141797 -12754269 -9841189 -3877124 1925785
38575 1925785 5150882 5972390 5839425 5051981 3284826 1729861 2100694 3682193 4151105
38566 4151105 3305702 2871175 2589576 461111 -2378969 -1584627 3600554 7863073 7189231
38557 7189231 4803317 5855440 9485232 10951533 9466752 8650992 9950075 10611949
38549 10611949 8702416 5982369 4656068 4423868 3988537 3081427 1990316 1030363 1142917
38540 1142917 3136616 5790466 6595555 5069033 3748187 5270568 9683134 14794676
38532 14794676 17832556 16885293 12534406 8243479 7326390 9196808 10273944 8720895
38524 8720895 6236895 4735137 3585123 1381269 -1391497 -3068020 -3091696 -2213574 -1130424
38515 -1130424 -100268 570759 726371 952274 2264063 4999055 8119846 9770454 8966051
38506 8966051 6880265 5688653 5758451 5267405 3577498 3228273 6306180 10042689 9266311
38497 9266311 3268612 -3018680 -5582309 -5916176 -7256090 -9018362 -7982557 -3667626
38489 -3667626 592834 2022288 1559432 1956771 4176439 6642866 7545781 7066312 6953301
38480 6953301 7959750 8438346 6417590 2722261 462474 982833 1922532 472392 -2628908
38471 -2628908 -3969488 -1848122 1789498 3917256 3732300 2957323 3612453 6090203 9206604
38462 9206604 11603422 12719129 12450175 10587887 7336453 4014828 2136677 1702484
38454 1702484 1452532 965075 1183825 2373662 3091260 2354928 1595753 2824041 5557853
38445 5557853 7289164 6730703 4977576 3541732 2965317 3575619 5688513 8211011 8675367
38436 8675367 5917096 1546394 -2397707 -5888582 -9405370 -11482227 -10493366 -8315875
38428 -8315875 -8908129 -12481163 -14141909 -10057788 -2465803 3670540 6779839 8592490
38420 8592490 9719156 9042540 6915869 5233595 4062703 1640089 -1648144 -2704310
38412 -2704310 -253336 3273738 5707171 7655597 9368868 8749709 5216386 2326997
38404 2326997 3162857 5646913 6022613 4731962 4865703 6528910 6994976 5385122 3188044
38395 3188044 1062838 -944755 -1160010 1307042 3008535 247783 -3861544 -2471189
38387 -2471189 4350386 8475659 5136072 -655779 -2092465 672999 3668802 5913204
38379 5913204 8106242 8394801 4958516 516089 -741757 749450 1110555 -1141763
38371 -1141763 -4404107 -7659290 -10768636 -12325192 -11251000 -9466242 -9006766 -7755451
38363 -7755451 -2608001 3988946 5817803 1392786 -4157442 -6387593 -6019584 -5014126
38355 -5014126 -3021735 -81828 1161147 -982208 -4066824 -4577284 -2351144 77526
38347 77526 814110 -492486 -3400419 -6547563 -8021114 -7187109 -5102386 -2618408 123120
38338 123120 1915116 888014 -2166465 -3635028 -1935337 150907 109940 -44207 2913679
38329 2913679 7925693 10905360 10338763 8364284 6906629 5951605 5591266 6672831 8640185
38320 8640185 8999138 5919429 130688 -5949660 -9701018 -9277015 -5059377 -234265
38312 -234265 1964401 1819450 2147168 3714919 4053362 1579620 -1581184 -2518220 -1414632
38303 -1414632 -562476 -851748 -1419535 -1967231 -2979305 -3639965 -1889135 2534004 6766699
38294 6766699 7798149 5738630 2843412 104937 -3356700 -7459640 -9698796 -7905058
38286 -7905058 -3519007 -308535 303239 1026630 4915631 10898691 14554925 13068115
38278 13068115 8033768 3192444 754355 614592 1848929 3450735 4083858 2878007
38270 2878007 991386 1136669 4533340 8825396 9936484 5985676 -1046797 -7259594
38262 -7259594 -9861590 -8605043 -5261369 -2132774 -491868 249990 1926354 5750866
38254 5750866 10638348 13393266 11216452 4769404 -1433694 -2714536 1290662 6581185
38246 6581185 9445622 9916317 9894305 9568780 7723598 4720745 2692658 2643835 3455948
38237 3455948 4073877 4542823 4316976 1924776 -2375515 -5652014 -5760195 -4191930 -3588470
38228 -3588470 -3672642 -1822296 2926017 8417617 11711675 11343279 7574851 2027131 -2836890
38219 -2836890 -5125592 -4815361 -3303017 -2031551 -1812789 -2500277 -2718643 -1105652 1504093
38210 1504093 2779378 2731805 4587797 9931975 15287104 16438827 14382749 13390126 14253157
38201 14253157 13572324 9793317 5996354 5647529 8608793 12356521 14507388 13352024
38193 13352024 8666279 3084102 241394 642287 1688128 2252662 4149237 8129612
38185 8129612 11829415 13383092 13988741 14876032 14611023 11707865 7349479 3194078 -1018226
38176 -1018226 -5278444 -7408793 -6271147 -4494964 -4783536 -5578044 -3867854 -549169
38168 -549169 767691 -914231 -3407752 -4975021 -4939682 -1943377 4067429 8714865 6798829
38159 6798829 -467823 -6138928 -6400298 -4685258 -5594969 -8787922 -11179301 -11802754 -11616569
38150 -11616569 -10871994 -9535761 -8782017 -9598960 -10984808 -11429117 -10978942 -9998183 -7283596
38141 -7283596 -1837435 4262266 7327827 6506235 4725778 4735710 5902867 5945950 4751709
38132 4751709 4898585 8153236 12614282 14645764 13529047 12499194 14167015 16526138
38124 16526138 15679545 11706494 8885778 9596459 10829998 8484969 3189088 -457353
38116 -457353 299475 3364590 4741658 3044410 352834 -965734 -1467135 -3817973 -8554391
38107 -8554391 -11996228 -10116424 -3975024 982674 1418191 -419885 -732582 648171
38099 648171 1168048 50949 -785293 -16658 1164599 945434 -723272 -2262137 -2141421
38090 -2141421 34877 3564229 7352787 10739965 13700689 16240179 17926737 18262844
38082 18262844 17214369 15145440 12555898 10046922 8105731 6691741 5394019 4043328
38074 4043328 2669225 959537 -1378011 -3653961 -4632089 -4217962 -3667401 -3671824 -3277207
38065 -3277207 -1294310 2156364 6084401 9670269 12304442 13610215 14066620 14596102
38057 14596102 14974080 13896723 11289843 8992376 8090236 7227363 5093515 3014593
38049 3014593 3000372 4371699 4697097 3478898 2572672 3161924 4507046 5668786 6346169
38040 6346169 5917376 3890552 1712543 1863327 4294844 5810465 4180873 1152572
38032 1152572 -85090 903949 1737500 515334 -2346369 -5208094 -6810415 -6715690 -5039210
38023 -5039210 -2168635 1241413 4008157 4704020 3044725 728043 -262055 -113241 -611820
38014 -611820 -2182739 -3368916 -3608605 -4207661 -5406616 -4933422 -1673785 1183423 -249091
38005 -249091 -4706893 -6815605 -4078305 270807 2240932 2058971 2462790 4184917 5473479
37996 5473479 5114315 3784495 2585172 1812229 1303385 919133 521265 159910 235369
37987 235369 911593 1602562 1655304 1233108 813489 153499 -1323000 -3223721 -4191986
37978 -4191986 -3331047 -973706 1931924 4483685 5943084 6115408 5814276 6134906 6997071
37969 6997071 7228130 6486250 6185613 7627250 9742243 9935128 7482282 5100239 6015314
37960 6015314 9608874 11453217 8748053 4591421 4619778 9401923 12888418 9803894
37952 9803894 2135413 -4155942 -6867624 -8460060 -10259157 -10209621 -7265015 -4011397
37944 -4011397 -2754347 -1942070 924137 4952106 7187260 6888981 5824008 5071171 3924589
37935 3924589 1731852 -968749 -3040920 -3457983 -2085623 -568819 -1171971 -3795082
37927 -3795082 -5891052 -6470242 -7702848 -10649837 -12313293 -9986156 -5873746 -3450780
37919 -3450780 -1522313 3193533 9123030 11220667 9088360 7980737 10836533 14587652
37911 14587652 15714884 14343231 11198823 5922690 845273 950776 6494299 10485883
37903 10485883 7754249 2306896 1010199 3746262 5285028 4064780 3144977 3881528
37895 3881528 4244941 3042279 1247812 -519370 -1900349 -1011863 3069990 6833387
37887 6833387 5732900 572822 -3773982 -5327389 -5957853 -6022720 -3685729 -37977 852630
37878 852630 -1475678 -2496310 93710 2734323 2124099 387945 993770 3444649 5427669
37869 5427669 6871377 8328377 8243124 5617351 3201608 4342069 8160488 11058499
37861 11058499 11619165 10992369 9727128 7419626 4820950 3439525 3186237 2398925 -71952
37852 -71952 -4111067 -8826711 -12668790 -14322961 -14493183 -15092082 -15823020 -14157397 -9975476
37843 -9975476 -6847927 -6451344 -5333332 -510380 5216478 7739866 8250245 10245343
37835 10245343 12593014 11681854 8848127 8865837 11364562 10761015 5758005 2131848 3888330
37826 3888330 7902097 10284055 12070962 14606847 14780506 10131354 4537278 3066742
37818 3066742 4090131 2363897 -2011165 -3756067 -766554 3409944 5575482 6093977
37810 6093977 5452217 2842387 -172070 637247 6137593 11305281 11724454 9506905 9355824
37801 9355824 11270217 11303090 8339302 5754953 5946676 6892308 5752948 3447447 3540267
37792 3540267 7647322 13665470 18234496 19754150 19043291 17962069 17596514 17285164 15299979
37783 15299979 10869106 5600491 2450583 2976540 5819627 8148902 8413705 7402902
37775 7402902 6824821 7347130 8032841 7187393 3633286 -2247718 -8323001 -12035985 -12525261
37766 -12525261 -11200804 -9792634 -8331689 -5879151 -2769470 -659314 -115938 276486
37758 276486 1413119 1547959 -1606471 -7078511 -10753189 -9700804 -5078759 -200944
37750 -200944 2958798 4390479 4393381 3001550 826263 -1064841 -2488672 -4286431 -6605592
37741 -6605592 -7922416 -6557376 -2744467 1436270 3915023 3960926 2176233 141079
37733 141079 12058 3251215 8839080 13206273 13049933 8562069 3250907 216755 -711088
37724 -711088 -1490316 -2342861 -1319755 2375208 6174492 6460080 2530817 -2638467 -5268156
37715 -5268156 -3869130 -197580 2041317 206108 -4423726 -7431640 -6128778 -2837719
37707 -2837719 -1636970 -2654454 -2148252 1838727 6883467 10047285 11340843 11608083
37699 11608083 9730340 4819729 -453535 -1965499 739822 3864670 3785245 130184
37691 130184 -5135819 -9476003 -10849054 -9421623 -8365973 -10553245 -14050069 -13475880
37683 -13475880 -6867227 1147055 4557748 2537978 -882184 -2169446 -1261299 7245
37675 7245 409502 116681 71506 707228 1030761 -350014 -2931783 -4280336 -3207757
37666 -3207757 -1707347 -2244373 -4085770 -4171783 -1217725 2887967 5731349 6634250 5950049
37657 5950049 3830402 662386 -2334012 -4067391 -4826134 -5900163 -8021462 -10459952
37649 -10459952 -11643546 -10720012 -8605369 -7180129 -7212035 -7640127 -7372719 -6863819 -6795998
37640 -6795998 -6133097 -3478427 -137913 625893 -1818485 -3906834 -2470892 950970
37632 950970 2510295 1347032 -215781 -1025849 -2297286 -3894894 -2758286 2832026
37624 2832026 9514219 11960696 8836860 3524940 -307245 -1468476 -48451 3493156
37616 3493156 7181355 8053736 5601598 3074802 3526033 5683413 5740888 2639004 -548923
37607 -548923 -641940 1977456 4328841 4295691 2394011 736065 813258 2057829 2428162
37598 2428162 661977 -2128348 -3473217 -2072652 947236 2994277 1997520 -1820919
37590 -1820919 -5500817 -5464947 -1137093 4114115 6640895 6325125 5425601 4741278 3229710
37581 3229710 975570 -287169 -130096 -323274 -1764219 -2877904 -2457924 -1897533 -2775962
37572 -2775962 -4135417 -4392343 -4535850 -6894123 -11315590 -14726562 -14309490 -9713597 -2843587
37563 -2843587 2938068 4367780 1244645 -2579401 -3190586 -1200342 -310180 -1860491
37555 -1860491 -3472209 -3163357 -1951060 -1415208 -990121 967704 4898705 9777476 13878067
37546 13878067 15319498 13411797 10005810 7907538 7523233 6918628 5515087 5121725
37538 5121725 6234141 6108915 2579424 -2387437 -5311516 -5712455 -5624058 -6072101 -6664200
37529 -6664200 -7587942 -9207105 -10231823 -8936594 -5943933 -3431061 -1906919 -228306
37521 -228306 1545536 2149041 1978905 2991250 5256253 6523009 5963769 5333488 5226455
37512 5226455 3348676 -1464753 -6270346 -7683080 -6482943 -5797535 -6264170 -5942559 -3992899
37503 -3992899 -1439361 1194558 4105219 6263675 6181387 4883314 5267392 7773493 9406279
37494 9406279 8279668 6587583 7172635 9120393 9131698 6175753 2447632 112172 -824853
37485 -824853 -1382020 -2215633 -3799735 -6389228 -8951309 -9281696 -6308171 -1767399 1335380
37476 1335380 1659647 144305 -1916802 -4074663 -5678639 -5110848 -1589104 2683562
37468 2683562 3893431 785384 -3572065 -4952945 -2223057 2178873 5137358 5312616
37460 5312616 3512474 1935455 2605806 5180204 6544940 4062159 -866161 -4136479
37452 -4136479 -4024366 -3007135 -3777663 -5456897 -5427145 -3536611 -2275379 -3117404 -4660745
37443 -4660745 -4794959 -3362204 -2066949 -2586503 -5296684 -9234349 -12652889 -13795617
37435 -13795617 -11749028 -7053848 -1676694 1967177 2668473 1355595 -501 -465935
37427 -465935 -593740 -863455 -761844 20478 417062 -1003298 -4185543 -7377236 -8523921
37418 -8523921 -6734023 -3168918 -777474 -1888850 -5199427 -6325725 -2543488 4021896
37410 4021896 9128561 11042233 10686032 8532454 4148285 -1438614 -5724317 -7607158
37402 -7607158 -8036381 -7373754 -4648864 -315244 2964219 3964991 4984237 8053862
37394 8053862 11016086 10238862 6165455 3122607 3785505 6562649 8724007 9468282 9099973
37385 9099973 7709405 6196863 6565993 9142860 10865917 8669019 3905605 1041110
37377 1041110 2034243 4399287 5273770 4844007 4395686 3382729 948563 -1107426 -58873
37368 -58873 3171868 4093288 109189 -6320756 -10862123 -11529533 -8716393 -3429796 2552619
37359 2552619 6566305 7416301 6865152 6987511 7287568 6366570 4886306 4169358 3055003
37350 3055003 -518207 -5168725 -6714448 -3604601 1158539 4081534 4525530 3539772
37342 3539772 2225260 2068990 4107322 6701309 6748521 4064774 1767806 1319718 464424
37333 464424 -2414062 -5445470 -7012173 -8798864 -12091865 -14258988 -12696788 -9712981
37325 -9712981 -9246327 -10594166 -9884351 -6615312 -4119750 -3940946 -4287356 -4364316 -5846348
37316 -5846348 -8847272 -10131065 -7182092 -1685052 2357185 2268593 -1789383 -6694220
37308 -6694220 -7663761 -2487394 5004371 8379575 6061145 2590705 1983253 3172644
37300 3172644 3259608 1881303 239246 -1546199 -3717931 -5356932 -5600761 -4965199 -4043549
37291 -4043549 -2569534 -1010871 -1027849 -2800377 -3922856 -2619713 -75279 2054662
37283 2054662 4133092 6493402 7296028 5151043 1978423 322498 -618444 -3115298
37275 -3115298 -6233708 -6502458 -2935230 1713162 4823992 6381912 7312429 7807817 7910622
37266 7910622 7891043 7504752 6273792 4724604 4138608 5073998 7020208 8913694 9110794
37257 9110794 6333187 2323356 1730125 6596968 12472150 13561151 10721352 9881855
37249 9881855 12549444 13119454 7544001 -390 -2621993 218363 3118437 2501878
37241 2501878 54885 -1157923 -608904 272181 310366 -624399 -1776699 -2039715 -1154243
37232 -1154243 -256095 -318505 -455124 909407 3323398 4242514 2079078 -1767201 -4476703
37223 -4476703 -4679034 -3207460 -1496608 28009 1809265 3827163 5110129 5010563 4413972
37214 4413972 4597819 4965986 3390626 -534708 -3986335 -3998462 -1196819 1129591 1293383
37205 1293383 854687 1854400 4013285 5487638 5354458 4258722 2952518 1195738 -1485668
37196 -1485668 -4225604 -4633278 -938254 5480109 10550711 11384981 9295302 7956267
37188 7956267 8826153 9722102 8142319 4579598 1672767 1014762 1875728 2663619 2722358
37179 2722358 2728221 3709142 5406444 5529633 1688915 -5120583 -9963139 -8365651 -1012454
37170 -1012454 7134871 12063716 13723697 14214229 14888691 15588270 14993134 11133215 3302552
37161 3302552 -5613667 -10483554 -9059056 -4469898 -1176417 182210 2054511 5354849
37153 5354849 8157604 8765277 7722004 6394911 5411559 5058017 5714352 7174138 8437350
37144 8437350 8544154 7083886 4328538 1843573 2135262 5961263 10535423 12386209
37136 12386209 11564451 10790966 10969117 10531101 9175505 8625284 8785145 6891910 2330943
37127 2330943 -1156576 -628683 1743118 2663108 3431405 7778222 15451706 21880340 23781866
37118 23781866 21865808 18269598 14414035 11385949 9519933 7282636 3086899 -1523759
37110 -1523759 -2931780 -71081 4222494 6855358 7342081 6678709 5576008 4531259
37102 4531259 3870002 3106545 1751497 919852 2340369 5557916 8117353 8999107 9899474
37093 9899474 12296402 14861083 14728946 10446320 3387313 -2932520 -5384879 -4347902
37085 -4347902 -3612408 -5627576 -8050639 -7394787 -4707475 -3997846 -5677397 -5953192 -3213039
37076 -3213039 -513678 -233207 -465950 972868 2593579 1987254 -443637 -3088360 -5584483
37067 -5584483 -7049532 -5016047 430364 4200795 2024225 -3146625 -4862401 -2240204
37059 -2240204 -927774 -5069874 -12223595 -17053938 -17134740 -14132523 -11344642 -10803183 -11399979
37050 -11399979 -9765971 -4223989 2699548 7205497 8704279 9360241 10193259 10322808
37042 10322808 9604689 9142168 9072749 8486244 7852865 8929678 11545492 12824613 10712511
37033 10712511 6576918 3348125 2417270 3137190 4237264 4999661 5692233 7032772 8732004
37024 8732004 9157332 7478939 5324947 4684152 4830918 3375068 148681 -2046506 -869553
37015 -869553 2914207 6349291 6655295 3057676 -2311886 -5801466 -5914901 -4840830 -4951170
37006 -4951170 -5351433 -4138351 -2253244 -1717164 -1359129 1579487 6109507 8109403 6400151
36997 6400151 3931078 2578686 1376924 667047 2944373 8020114 12406236 15567997
36989 15567997 21550634 31975228 43577267 56421603 77195279 106916708 130852892
36982 130852892 130908453 107108095 78009116 59256806 49879926 41314649 31025576 22034156
36974 22034156 15290227 9328596 4829870 3930251 5918668 7651069 7696446 6998305 6136403
36965 6136403 4882424 3994234 4621682 5994306 6121392 4802714 3721651 3538991 3229052
36956 3229052 2588190 2955041 4585382 5566617 4712645 3607496 3902756 4090012 1481281
36947 1481281 -3116477 -5366506 -2650402 2735053 6721168 8027064 7864578 6421235
36939 6421235 2289217 -4333736 -10048729 -11193676 -7576059 -2486727 371495 -513003
36931 -513003 -3899255 -6755793 -6285758 -2089558 3556044 7807607 9218560 7554997
$$ [...]
##END NTUPLES=NMR SPECTRUM
##END=
