##TITLE=31Pdec_LR-784-R2-REG2
 CDCl3, 24 sc
 22.1.2025
##JCAMPDX= 6.0         $$ Bruker NMR JCAMP-DX V2.0
##DATA TYPE= NMR SPECTRUM
##DATA CLASS= NTUPLES
##ORIGIN= UXNMR, Bruker Analytische Messtechnik GmbH
##OWNER= root
$$ XWIN-NMR		Version 3.5
$$ Wed Jan 22 13:55:59 2025 Russian Standard Time (UT+4h)  she@DPX200
##.OBSERVE FREQUENCY= 81.013821
##.OBSERVE NUCLEUS= ^31P
##.ACQUISITION MODE= SIMULTANEOUS
##.ACQUISITION SCHEME= undefined
##.AVERAGES= 24
##.DIGITISER RES= 17
##SPECTROMETER/DATA SYSTEM= spect
##.PULSE SEQUENCE= zgpg30
##.SOLVENT NAME= CDCl3
##.SHIFT REFERENCE= (INTERNAL, CDCl3, 0, 198.062)
##AUDIT TRAIL= $$ (NUMBER, WHEN, WHO, WHERE, WHAT)
$$ ##TITLE= Audit trail, XWIN-NMR		Version 3.5
$$ ##JCAMPDX= 5.01
$$ ##ORIGIN= Bruker BioSpin GmbH
$$ ##OWNER= she
$$ F:/spectra/data/she/nmr/P31/2/pdata/1/auditp.txt
$$ ##AUDIT TRAIL=  $$ (NUMBER, WHEN, WHO, WHERE, WHAT)
(   1,<2025-01-22 13:54:41.01 +0400>,<she>,<DPX200>,
      <created by zg, POWCHK disabled, PULCHK disabled
       configuration hash MD5:
       00 E9 B6 7A A2 85 ED C7 34 08 36 98 17 FE 4E 26
       data hash MD5: 32K
       34 DF EB 26 DC 27 AA 60 D6 05 FC 1B 9A 2B AE 71>)
(   2,<2025-01-22 13:54:43.89 +0400>,<she>,<DPX200>,
      <Start of raw data processing
       efp BC_mod = 2 LB = 1.5 FT_mod = 6 PKNL = 1 PHC0 = 1821.747 PHC1 = -49.1137 SI = 64K 
       data hash MD5: 64K
       A3 6C E1 E2 32 60 D8 DF FC 32 85 36 44 53 B2 43>)
(   3,<2025-01-22 13:55:12.64 +0400>,<she>,<DPX200>,
      <pk PHC0 = 5.743031 PHC1 = -41.19997 
       data hash MD5: 64K
       6C 81 89 B2 53 98 F8 D7 A3 69 16 6D 07 66 B6 F8>)
(   4,<2025-01-22 13:55:19.21 +0400>,<she>,<DPX200>,
      <abs ABSG = 5 
       data hash MD5: 64K
       AF 40 21 4B B7 3A 85 AF 4A 58 5C AF 47 73 2D 8B>)
$$ ##END=
$$ 
$$ hash MD5
$$ E8 4B 55 77 0F 2E 7E EA 98 D6 D1 4C 17 8F CA C3
##$RELAX= 
##$RELAX= 
##$RELAX= 
##$RELAX= 
##$RELAX= 
##$RELAX= 
##$RELAX= 
##$RELAX= 
$$ Bruker specific parameters
$$ --------------------------
##$DU= <F:/spectra>
##$EXPNO= 2
##$NAME= <P31>
##$PROCNO= 1
##$TYPE= <nmr>
##$USER= <she>
##$AMP= (0..31)
100 100 100 100 100 100 100 100 100 100 100 100 100 100 100 100 100 100 
100 100 100 100 100 100 100 100 100 100 100 100 100 100 
##$AQSEQ= 0
##$AQ_mod= 1
##$AUNM= <au_zg>
##$AUTOPOS= <>
##$BF1= 81.014009
##$BF2= 200.13
##$BF3= 200.13
##$BF4= 200.13
##$BF5= 200.13
##$BF6= 200.13
##$BF7= 200.13
##$BF8= 200.13
##$BYTORDA= 1
##$CFDGTYP= 0
##$CFRGTYP= 5
##$CHEMSTR= <none>
##$CNST= (0..31)
1 1 145 1 1 1 1 1 1 1 1 1 1 1 1 1 1 1 1 1 1 1 1 1 1 1 1 1 1 1 1 1 
##$CPDPRG= <waltz16>
##$CPDPRG1= <>
##$CPDPRG2= <waltz16>
##$CPDPRG3= <>
##$CPDPRG4= <mlev>
##$CPDPRG5= <mlev>
##$CPDPRG6= <mlev>
##$CPDPRG7= <mlev>
##$CPDPRG8= <mlev>
##$CPDPRGB= <>
##$CPDPRGT= <>
##$D= (0..31)
0 1 0 0 0 0 0 0 0 0.06 0 0.03 2e-05 3e-06 0 0 0.0002 0 0 0 0 0 0 0 0 0 
0 0 0 0 0 0 
##$DATE= 1737539680
##$DBL= (0..7)
120 120 120 11 120 120 24 19 
##$DBP= (0..7)
150 150 150 150 150 150 150 150 
##$DBP07= 0
##$DBPNAM0= <>
##$DBPNAM1= <>
$$ [...]
##$SUBNAM3= <"">
##$SUBNAM4= <"">
##$SUBNAM5= <"">
##$SUBNAM6= <"">
##$SUBNAM7= <"">
##$SUBNAM8= <"">
##$SUBNAM9= <"">
##$SW= 400.765351723535
##$SWIBOX= (0..15)
0 1 3 0 0 0 0 0 0 0 0 0 0 0 0 0 
##$SW_h= 32467.5324675325
##$TD= 32768
##$TD0= 1
##$TE= 0
##$TE2= 300
##$TE3= 300
##$TEG= 300
##$TL= (0..7)
0 120 53 12 22 120 120 120 
##$TP= (0..7)
150 150 150 150 150 150 150 150 
##$TP07= 0
##$TPNAME0= <>
##$TPNAME1= <>
##$TPNAME2= <>
##$TPNAME3= <>
##$TPNAME4= <>
##$TPNAME5= <>
##$TPNAME6= <>
##$TPNAME7= <>
##$TPOAL= (0..7)
0.5 0.5 0.5 0.5 0.5 0.5 0.5 0.5 
##$TPOFFS= (0..7)
0 0 0 0 0 0 0 0 
##$TUNHIN= 0
##$TUNHOUT= 0
##$TUNXOUT= 0
##$USERA1= <user>
##$USERA2= <user>
##$USERA3= <user>
##$USERA4= <user>
##$USERA5= <user>
##$V9= 5
##$VALIST= <valist>
##$VCLIST= <CCCCCCCCCCCCCCC>
##$VD= 0
##$VDLIST= <DDDDDDDDDDDDDDD>
##$VPLIST= <PPPPPPPPPPPPPPP>
##$VTLIST= <TTTTTTTTTTTTTTT>
##$WBST= 1024
##$WBSW= 4
##$XGAIN= (0..3)
0 0 0 0 
##$XL= 0
##$YL= 0
##$YMAX_a= 4134
##$YMIN_a= -5181
##$ZGOPTNS= <>
##$ZL1= 120
##$ZL2= 120
##$ZL3= 120
##$ZL4= 120
##$ABSF1= 198.0616
##$ABSF2= -202.7028
##$ABSG= 5
##$ABSL= 3
##$ALPHA= 0
##$AQORDER= 0
##$ASSFAC= 0
##$ASSFACI= 0
##$ASSFACX= 0
##$ASSWID= 0
##$AUNMP= <proc_1d>
##$AZFE= 0.1
##$AZFW= 0.5
##$BCFW= 0
##$BC_mod= 2
##$BYTORDP= 0
##$COROFFS= 0
##$CY= -3
##$DATMOD= 1
##$DC= 0
##$DFILT= <>
##$DTYPP= 0
##$F1P= 0
##$F2P= 0
##$FCOR= 1
##$FTSIZE= 65536
##$FT_mod= 6
##$GAMMA= 0
##$GB= 0
##$INTBC= 1
##$INTSCL= 9.790993e-09
##$ISEN= 30
##$LB= 1.5
##$LEV0= 0
##$LPBIN= 0
##$MAXI= 10000
##$MC2= 0
##$MEAN= 0
##$ME_mod= 0
##$MI= 50
##$NCOEF= 0
##$NC_proc= -11
##$NLEV= 6
##$NOISF1= 182.463
##$NOISF2= 159.3651
##$NSP= 0
##$NTH_PI= 0
##$NZP= 0
##$OFFSET= 198.0616
##$PC= 4
##$PHC0= 1827.49
##$PHC1= -90.31367
##$PH_mod= 1
##$PKNL= yes
##$PPARMOD= 0
##$PSCAL= 0
##$PSIGN= 0
##$REVERSE= no
##$SF= 81.0140089999434
##$SI= 65536
##$SIGF1= 159.3651
##$SIGF2= -187.1042
##$SINO= 113.3802
##$SIOLD= 16384
##$SREGLST= <1H.CDCl3>
##$SSB= 0
##$STSI= 65536
##$STSR= 0
##$SW_p= 32467.5324675325
##$SYMM= 0
##$S_DEV= 0
##$TDeff= 32768
##$TDoff= 0
##$TI= <>
##$TILT= no
##$TM1= 0
##$TM2= 0
##$TOPLEV= 0
##$USERP1= <user>
##$USERP2= <user>
##$USERP3= <user>
##$USERP4= <user>
##$USERP5= <user>
##$WDW= 1
##$XDIM= 65536
##$YMAX_p= 528398311
##$YMIN_p= -338022663
$$ End of Bruker specific parameters
$$ ---------------------------------
##NTUPLES= NMR SPECTRUM
##VAR_NAME=  FREQUENCY,     SPECTRUM/REAL,   SPECTRUM/IMAG
##SYMBOL=    X,             R,               I
##VAR_TYPE=  INDEPENDENT,   DEPENDENT,       DEPENDENT
##VAR_FORM=  AFFN,          ASDF,            ASDF
##VAR_DIM=   65536,         65536,           65536
##UNITS=     HZ,            ARBITRARY UNITS, ARBITRARY UNITS
##FACTOR=    0.49542278885378, 1,            1
##FIRST=     16045.7642231865, 0,            0
##LAST=      -16421.768244346, 0,            0
##MIN=       -16421.768244346, -338022663,   0
##MAX=       16045.7642231865, 528398311,    0
$$ Real data points
##PAGE= N=1
##DATA TABLE= (X++(R..R)), XYDATA
$$ [...]
43884a6007850J0154781J2909290J1848520K822247p791009j1021880q017038
43877e102939n967847n373203j316443N221520Q026401O365376M380983J023941
43869G257789p350956j5086959j2294021k912469j459143q325610o726508Q470790
43861c8427087J8419735R044043n990271o905354L631064J1511220J5397482J8916671
43853B5597503J3176069p420496k3494014j3996775O708012P139259j0372451
43846b662893j3404760M228534J0017156j1571915k9935435j6605338J0474487
43839d9460164J8972766J1803581J2271550J9110690J2034307q010408j8553615
43832a831293j2887615p187698q901471n506255R631921K3523530K3900247J5152140
$$ y = [-16007850, -5853069, 7056221, 18904741, 21726988, 13935979, 2914099, -5102939, -11070786, -16443989, -17760432, -12538912, -4512511, 1852865, 6233848, 7257789, -93167, -15180126, -27474147, -30386616, -31845759, -40171369, -46897877, -38427087, -20007352, -10963309, -16953580, -23858934, -20227870, -8716650, 6680832, 25597503, 38773572, 31353076, 7859062, -6137713, 570299, 7709558, -2662893, -16067653, -11839119, -1821963, -13393878, -43329313, -59934651, -49460164, -30487398, -18683817, -6412267, 12698423, 24732730, 16722322, -1831293, -14718908, -21906606, -30808077, -36314332, -26682411, -3158881, 20741366, 35893506]
43824C5893506O129323k679043j1956292j6210829j1592910k486475M620511O676667
43816H394458K139010p572684j4230537j0571597k036312N55509n96993O153860
43808a7765286J8452993J7818766j615237j8695948j2575788O962461J2041077
43801D623038n561433k4172184k0738059J697128K0028163J8636370M525123m568130
43793e529984j440883O167067J0078551J1632074J3478675J0345667k828033j8556419
43785B3346715k3299333j4897715m280741l64979j871666l998879m910188m798609
43777c5075395m740903n901004n266686L170268J6442384J9827671P330008l593744
43769g807401N733751K4783893K6393479O808905j0595549j2948193j3066790
$$ y = [35893506, 42022829, 39343786, 27387494, 11176665, -416245, -2902720, 1717791, 8394458, 10533468, 2960784, -11269753, -21841350, -23877662, -23322153, -23919146, -17765286, 687707, 18506473, 16891236, -1804712, -14380500, -7418039, 4623038, -938395, -25110579, -45848638, -44151510, -24123347, -5486977, -961854, -5529984, -6970867, -803800, 9274751, 20906825, 34385500, 44731167, 41903134, 23346715, 47382, -14850333, -19131074, -19496053, -21367719, -25366598, -30276786, -35075395, -39816298, -45717302, -50983988, -47813720, -31371336, -11543665, -4213657, -7807401, -2073650, 22710243, 49103722, 55912627, 45317078, 32368885, 19302095]
43762A9302095j9813163j9917851l990603J1959492R840266l003679q822669p276576
43754b1722688q022157q247003N7043R391200O367539l154843j153051J2259399
43746a4224561J7639336P179334l443206j09538R139591P197415q298561k1715269
43738f635459j6390310O488086K4005915J2545988k1228851m0165077j9645130
43731f1024838J8509451L2550306J4304480n643780m006545Q632053J2197801
43724A5518928N076448l078773q372723r627717j876141J4208935K6152958K4137983
43716F2139898J3839894N926478J080467n421582j2006841j3314041q808318j392474
43708D2043481O841811J1591594O683912n810817j3718158j0343723l924066l856349
$$ y = [19302095, -511068, -20428919, -24419522, -12460030, -2619764, -5623443, -14446112, -21722688, -29744845, -37991848, -37934805, -28543605, -22176066, -25330909, -26483960, -14224561, 3414775, 10594109, 7150903, 7041365, 16180956, 23378371, 15079810, -6635459, -23025769, -16537683, 7468232, 20014220, -1214631, -41379708, -61024838, -42515387, -9965081, 4339399, -1304381, -5310926, 3321127, 15518928, 20595376, 17516603, 9143880, -483837, -2359978, 11848957, 38001915, 62139898, 75979792, 81906270, 82986737, 77565155, 65558314, 52244273, 43435955, 42043481, 48885292, 60476886, 67160798, 61349981, 47631823, 37288100, 33364034, 29507685]
43700B9507685o306409l055553L368770M353120j137555p935918j4014172j8272093
43692a3492125j4993262j808716J1737298J4867946J0278626P094350M815330
43685A8499447k231904r126886n060929P482464J3969040R131776K205879q71148
43677C3997739n027300j1800806j2735071l999217N337735P591937P567787J0807505
43669C1740309J1617223L474253p186777r388201m260120j987205n607707q606604
43661I795171p128557m659737m042797l090616j23765K014281k07738o471681
43653a3915439j2880923j4590907q821265K002279J0588339J0697977K799580
43646b4120359o749301j0884652o619999K070051O435447K820964j26918Q338451
$$ y = [29507685, 23201276, 20145723, 23514493, 27867613, 26730058, 18794140, 4779968, -13492125, -28485387, -30294103, -18556805, -3688859, 6589767, 13684117, 18499447, 16267543, 7140657, 2079728, 9562192, 23531232, 32663008, 34868887, 33997739, 28970439, 17169633, 4434562, 435345, 5773080, 13365017, 20932804, 31740309, 43357532, 46831785, 39645008, 30256807, 25996687, 24009482, 18401775, 9795171, 2666614, -1993123, -6035920, -9126536, -9250301, -7236020, -7443758, -13915439, -26796362, -41387269, -50208534, -48206255, -37617916, -26919939, -24120359, -30869660, -41754312, -48374311, -46304260, -39868813, -37047849, -37174767, -28836316]
43638b8836316K3034615K6071479J2656983Q93299N758149J5203959P909177j3216162
43630D9475183k4975503j8845556j0641865j1630821j1124091J672870J5989994
43623a0079789J5090787K120181n901954l031221K348364M988388P535507Q903218
43615B1973481L610593m945947n167865L470333N015142j0223920k7640879k4851299
43607c8760361j340105K0131502K1353250P936405k073981r94160L432673K414790
43599A2100013k135996k798960J340046L950066K047724M34873K449796K640272
43591B0027834m654579j3573306j2749147k323629M711538N92819o629035n364403
43583a9961908L951668J1825198J2596599P298831k144055j3471664k0666996
$$ y = [-28836316, -5801701, 20269778, 32926761, 33820060, 39578209, 54782168, 62691345, 49475183, 24499680, 5654124, -4987741, -16618562, -27742653, -26069783, -10079789, 5010998, 7131179, 1229225, -1801996, 546368, 5534756, 13070263, 21973481, 25584074, 20638127, 15470262, 18940595, 23955737, 13731817, -13909062, -38760361, -40100466, -19968964, 1384286, 9320691, 7246710, 6252550, 9685223, 12100013, 9964017, 7165057, 8505103, 12455169, 14502893, 14937766, 17387562, 20027834, 15373255, 1799949, -10949198, -13272827, -8561289, -7968470, -14597505, -19961908, -16010240, -4185042, 8411557, 15710388, 13566333, 94669, -20572327]
43576b0572327j7890186p560613J284869L879160M586477R739599J8975948K4948722
43568A7391649K0213870N053295j0348615j4321833p073135k014194r045232k0078168
43560b0222363j8357435p06318J7510267K0623020Q840015n926844j4004154j3905821
43552b6149633q742769j467211O662604J4353130J7696487J2316543O16003p210195
43544H074959m968858J90991k247910r797350j0579991k175136N155944N763731
43536a0583620O230215J0814230J2018757M106500m792060m915709j066660m529611
43528G282042j4110300j7499512r260781L271896J1177531J1967958P161823J84734
43520A75391l460873r19096L514254M099014J714707O84447J396012K707389O532959
$$ y = [-20572327, -38462513, -46023126, -44738257, -40859097, -36272620, -26533021, -7557073, 17391649, 37605519, 42658814, 32310199, 17988366, 10915231, 8901037, -144195, -20222363, -38579798, -39286116, -21775849, -1152829, 7687186, 1760342, -12243812, -26149633, -34892402, -36359613, -29697009, -15343879, 2352608, 14669151, 15285154, 8074959, 3106101, 3297092, 1049182, -8748168, -19328159, -21503295, -16347351, -10583620, -4353405, 6460825, 18479582, 22586082, 17794022, 12878313, 11811653, 7282042, -6828258, -24327770, -33588551, -30316655, -19139124, -7171166, -9343, 175391, -3285482, -4204578, -690324, 3408690, 5123397, 5807844, 7203856, 9911245, 16444204]
43511A6444204J1639022R205890l844217j3126779l825736J3967592J5207130
43504D5667106l975556j9197550j2348821M707684J0344376J970161p252969r098497
43496A0815934n335739j8375K542676j639195r171761r734341j159978M451959
43488i248820j762704j1151699j0944544k635180M827606J1096815J9394499K2883233
43480B2459206J2501309n428599j4997565j2128409o203849k756414P59741L708513
43472b086067K258916K14967M655005J0904610P720098k389378n617070j168781
43464A4492300l430708j5099503j8861742n220902J0402376J0802380O74113o630684
43456a2872370j0605767j5417117j3389956L834402K5413863L1161089J7625229
$$ y = [16444204, 28083226, 37289116, 33444899, 20318120, 16492384, 30459976, 45667106, 41691550, 22494000, 10145179, 14852863, 25197239, 27167400, 19914431, 10815934, 5480195, 5461820, 8004496, 6365301, -2806460, -12540801, -13700779, -9248820, -11011524, -22163223, -33107767, -35742947, -30915341, -19818526, -424027, 22459206, 34960515, 29531916, 14534351, 2405942, -3797907, -6554321, -5794580, -2086067, 172849, 387816, 5042821, 15947431, 23667529, 21278151, 15661081, 14492300, 11061592, -4037911, -22899653, -28120555, -17718179, -6915799, -6241686, -12872370, -23478137, -38895254, -52285210, -48450808, -23036945, 8124144, 25749373]
43449B5749373m86655j0950167j2535800p738408j055264k32060n880478n399599
43441a8529058Q549147K0976510J4017606l333672p192607L418777O621580l700437
43433B0827846p813191L800221J2459975L731172p259423k406141Q523606O836172
43425C8700237j984421m93757O977144J546440j4542395j8525299m296347Q411996
43417A5793598P462688M909174J0051275J0427674l863497j6706407q116961J2832300
43409C2789844J9655056O410220q028556j1811085j3971150k1870676k4844461
43402b1670808j1760933Q522179J7720516J1789972J870173l710361o035265o020271
43394i294798r44746O926712Q839251J871160n036059l378812K837869M317884
$$ y = [25749373, 25262718, 14312551, 1776751, -5961657, -7016921, -7248981, -13129459, -18529058, -9979911, 10996599, 25014205, 21680533, 14487926, 17906703, 24528283, 20827846, 13014655, 16814876, 29274851, 33006023, 25746600, 23340459, 31864065, 38700237, 36715816, 36222059, 43199203, 44745643, 30203248, 11677949, 7381602, 15793598, 23256286, 28165460, 38216735, 48644409, 44780912, 28074505, 19957544, 32789844, 52444900, 58855120, 50826564, 39015479, 25044329, 3173653, -21670808, -33431741, -24909562, -7189046, 4600926, 6471099, 2760738, -3274527, -9294798, -10239544, -3312832, 5526419, 7397579, 2361520, -1017292, 1820577, 6138461]
43386F138461P69336o13896J638879J040296n320361j1464720j1440111o912559
43378b6164675k670046k21904O67152o60724k824707j551483L786287O971287
43370b2668813L054655m129603p570742o419922l980470p1356P154139J3659272
43362b0972840J1811294R58749j0264335j3151628o141414O370499J7148049J8986870
43354D745244J0753847N46348l037289k142698n321532j2723304j4668325o564426
43346b8412135L921866Q146621O872102N206023M546437M049103L443900O73974
43338H447891n852855r687765j431719J3498973J5015560m077097k3107764j9988229
43330b7183005j950135P633866M693791M815652J1874752J1677157Q70129k579408
$$ y = [6138461, 6907797, 6293901, 7932780, 8973076, 3652715, -7812005, -19252116, -26164675, -28834721, -29056625, -28389473, -29050197, -31874904, -33426387, -29640100, -22668813, -19614158, -23743761, -31314503, -37734425, -41714895, -41786251, -34632112, -20972840, -9161546, -8202797, -18467132, -31618760, -37760174, -31389675, -14241626, 4745244, 15499091, 16045439, 13008150, 10865452, 5543920, -7179384, -21847709, -28412135, -24490269, -16343648, -9471546, -4265523, 280914, 4330017, 7773917, 8447891, 2595036, -7092729, -8524448, 4974525, 19990085, 15912988, -7194776, -27183005, -29133140, -21499274, -16805483, -11989831, -115079, 11562078, 12432207, 9852799]
43322I852799J1201375K5126686K0959513O901659J328686K724133k781154j2883892
43314F2429805j2043273n28970K964933q421945j7453745r085440P416380J3111700
43306C8389445L852681j0317180k0165175k1228944j1642470K628167P514197
43299a0969279k310768j2128149n318571J2084430J9544380J1930014M315966
43292A7148023N592696N715109l169674r697841j265494J2317396J0216677q906191
43284B7950701k4049964j9952592m122615P259612Q486105M178124r2021k42469
43276e85119N885066J3521807J2181331j013663j3962128j3168461j315385O573821
43268H117269K539235o461537r386621k652155R210276J7912109J6218492M860407
$$ y = [9852799, 21054174, 46180860, 67140373, 74042032, 75370718, 78094851, 75313697, 62429805, 50386532, 49857562, 52822495, 44400550, 26946805, 17861365, 25277745, 38389445, 42242126, 31924946, 11759771, -9469173, -21111643, -18483476, -10969279, -13280047, -25408196, -30726767, -18642337, 902043, 12832057, 17148023, 22740719, 28455828, 25286154, 15588313, 14322819, 26640215, 36856892, 27950701, 3900737, -16051855, -20174470, -12914858, -4428753, -250629, -342650, -585119, 5299947, 18821754, 31003085, 29989422, 16027294, 2858833, 1543448, 8117269, 10656504, 4194967, -5191654, -7843809, 1366467, 19278576, 35497068, 40357475]
43260D0357475n005358k996101O330746Q313803j287511r788854n974559L824067
43252C3773708N589582k649942r900358p972335K19820P219717Q708604M347608
43244C9336404l185931r168682j1150434j2223754j5709389j7461812r430485
43237c8994083Q143740K3779419K6759008J8336619Q279876K960287k03419p330324
43229D1731123j8936796k6913522k1974752n030768J1455811J6383814J1758988
43222H473898P093484M651954k133945j4934131k3717931j8798488m288036P040473
43214c6612722J0050683J1863274J9554460K8655104K7644683J2301001q051054
43207F5405429j9856583j8836558j1897262p028183n560621n086981m851528m797997
$$ y = [40357475, 35352117, 32356016, 38686762, 47000565, 45713054, 35924200, 29949641, 33773708, 39363290, 36713348, 26812990, 18840655, 19060475, 26280192, 34988796, 39336404, 36150473, 26981791, 15831357, 3607603, -12101786, -29563598, -38994083, -30850343, -7070924, 19688084, 38024703, 46304579, 49264866, 49061447, 41731123, 22794327, -4119195, -26093947, -31124715, -19668904, -3285090, 8473898, 15567382, 20219336, 18085391, 3151260, -20566671, -39365159, -43653195, -36612722, -26562039, -14698765, 4855695, 33510799, 61155482, 73456483, 65405429, 45548846, 26712288, 14815026, 7786843, 2226222, -2860759, -7712287, -12510284]
43199a2510284l322002m62934P158l328515m830513M63718P449292P100761n5371
43190i488690n527180o738129q812785j1829426q139135L770770J3894896J5001875
43182a7867804J2040207J0251458M480902r373683k0956833j6755571o22348R713518
43174b9090154N639876l755811o620294k309518J793179N87316m001141m966938
43166d2723485K780547J4504742J8107777R125436j479728j294440O766777J0559984
43158A6347610O963521K712094N1611n000961j0152325o664873M932468J1594923
43150B0784068N761756l833758n462175M10571N467487N216025N1544q240136
43142B0155382j4590537j1547190J257794J3452095J5552549R812314M532924
$$ y = [-12510284, -15832286, -16295220, -16288062, -19616577, -24447090, -23983372, -16534080, -9433319, -9488690, -15015870, -21753999, -30566784, -42396210, -50535345, -46764575, -32869679, -17867804, -5827597, 4423861, 8904763, -468920, -21425753, -38181324, -38803672, -29090154, -23450278, -27206089, -33826383, -36135901, -34342722, -33755406, -37756547, -42723485, -39942938, -25438196, -7330419, 1795017, 315289, -979151, 5787626, 16347610, 23311131, 26023225, 26074836, 21073875, 10921550, 4256677, 9189145, 20784068, 26545824, 22712066, 17249891, 17660462, 23127949, 28343974, 28395518, 20155382, 5564845, -5982345, -4724551, 8727544, 24280093, 34092407, 38625331]
43135C8625331K463628K17233m856855j1996604j7797401j6781031o228501O782490
43127i571710R705958r3047j0678106j0424486j014816Q217128J1032761N032603
43119B206285q771439k0713186j6816224K914535J9628419J8554547P528327J869002
43111F400266J248219l500507r392227o002866L229892M442294k142772j184936
43103f902637J0450382J4759448p4425j9325964k1137434n736378P648860P113704
43095a3204444o33129l244630K933522J2749767J9799360K0871989J5667764N945704
43087F0885903l636738o553636j221984L483084l334138j8322100k4786998j4905649
43079h392256r27517M105842N346392J2427292J7539231O742230j2799135j9276905
$$ y = [38625331, 41088959, 41306192, 36449337, 24452733, 6655332, -10125699, -16354200, -9571710, 134248, 41201, -10636905, -21061391, -22076207, -13859079, -2826318, 2206285, -6565154, -27278340, -44094564, -41180029, -21551610, -2997063, 4531264, 6400266, 7648485, 4147978, -5244249, -11247115, -8017223, -3574929, -5717701, -6902637, 3547745, 18307193, 18232768, -1093196, -22230630, -27967008, -20318148, -13204444, -13837573, -17082203, -14148681, -1398914, 18400446, 39272435, 54940199, 60885903, 57249165, 50695529, 49473545, 52956629, 49622491, 31300391, 6513393, -8392256, -9319773, -5213931, 132461, 12559753, 30098984, 36841214, 24042079, 4765174]
43071D765174r112083n94757j932932L82281J3301540K0519430P948096j2679489
43063B2597260k1679701j8277237j3270568p277863N685547K0922246K6372614
43056A5072298J9270992O958094m158048j0037905o533154L133334N876534m298154
43048B5283991j4671971j1812359k523467j902425q577094r208463j772024M084411
43040b1099401O153993J0321623J4033933Q338001l081966n521832L677008J0974615
43032B3795974Q536174L294209M92025m123296r915310o872882N672781J1728108
43024C2607783J259932j2715092j1881264K136070J2107753P886703n758881j8731300
43016F911704k3508824j6970637k465332J1125582J6808846J4545385Q177085
$$ y = [4765174, -4346909, -4941666, -6874598, -6492317, 6809223, 27328653, 35276749, 22597260, 917559, -17359678, -30630246, -37908109, -32222562, -11300316, 15072298, 34343290, 41301384, 37143336, 27105431, 20572277, 23705611, 29582145, 25283991, 10612020, -1200339, -3723806, -5626231, -14203325, -23411788, -25183812, -21099401, -14945408, -4623785, 9410148, 17748149, 14666183, 9144351, 12821359, 23795974, 32332148, 35626357, 36118382, 31995086, 22079776, 15206894, 20879675, 32607783, 33867715, 21152623, 9271359, 11407429, 23515182, 31401885, 25643004, 6911704, -16597120, -33567757, -36033089, -24907507, -8098661, 6446724, 14623809]
43009A4623809J798138n91929J802458L508886q7281l644220O03457P898089O670818
43000C2582225j165291k174831L933682J257215j3318187j8958410k581828J6649539
42992A6224114J3368820p198276j9531444j5401605q673646p412184m216823M495644
42984b8345400R794488O169273R44240J761895N932591P083971L326554m390010
42976B277602j3558603j7685712j1380190J11056N247059K224404J760323J0917636
42968b0086425K2562780K4952368J5327756P70908q899978p309844L126574J0420393
42960D0864532M303001r857869j5564682o047936O877788Q735047L74560n525391
42952B4159050j526240O831107R048433J734713p855247j0146266n083707k527299
$$ y = [14623809, 16421947, 15830018, 17632476, 21141362, 21054081, 17409861, 18013318, 25911407, 32582225, 31416934, 29242103, 33175785, 34433000, 21114813, 2156403, -425425, 16224114, 29592934, 22394658, 2863214, -12538391, -21212037, -28624221, -32841044, -28345400, -18550912, -12381639, -11437399, -9675504, -3742913, 3341058, 6667612, 2277602, -11281001, -28966713, -40346903, -40235847, -34988788, -32764384, -31004061, -20086425, 2476355, 27428723, 42756479, 43527387, 34627409, 27317565, 30444139, 40864532, 45167533, 35309664, 19744982, 13697046, 20574834, 29309881, 29684441, 24159050, 22632810, 29463917, 38512350, 40247063, 32391816, 22245550, 17161843, 14634544]
42944A4634544q096007j3385909p110035P454007J5843310J2673190P752870R339532
42936C9105502J1877790O668570l400696q300982n718418l045347n426535q723499
42928B3036385o217290J776036Q021125P199550K079269o52170P32608J608262
42920C7583775j345313n374796o402443m344555j322608P12177j935114j2320440
42912E250683k4247443k4148939q875874O413180P873962K545703N491941J4518174
42904a5178613J4681592M484751j658998K052485N323845L213367N459363J5456942
42896C3834734J7959013J425943k0583397k5348829r830358R519744J8712161
42889B5689011J5631502L992678q799140j1725549p95305J1981487J0738219m319834
$$ y = [14634544, 6538537, -6847372, -13957407, -6503400, 9339910, 22013100, 29765970, 39105502, 50983292, 57651862, 54251166, 45950184, 40231766, 37186419, 31759884, 23036385, 16819095, 18595131, 26616256, 33815806, 35895075, 35242905, 35975513, 37583775, 36238462, 30863666, 24461223, 20116668, 18794060, 19506237, 17571123, 5250683, -18996760, -43145699, -52021573, -45608393, -37734431, -35188728, -29696787, -15178613, -497021, 3987730, 2328732, 4381217, 9705062, 12918429, 18377792, 33834734, 51793747, 53219690, 32636293, 7287464, -2542894, 6976850, 25689011, 41320513, 45313191, 36514051, 24788502, 23993197, 35974684, 46712903, 42393069]
42881D2393069j7969818j9043672r766393J779973R121235Q375911J001100m126719
42873A1764686P60967J1262635J5231451Q369515j593897o735034p649739q298083
42865B3112501q381082m760795K407478Q179368P537589J067021n036060o224846
42857A7901174n299543o767215p340064O8975J2310793J6179390O822099m214103
42849B9661506o028022l394698n420868q631014m192286M373456N163849k901078
42841H630845q368670m742704K116008N124199M045695P62306m184380q021457
42833d638158o389489K40892O465313Q735107P302182L135828j261896j155943
42825A2433836L062225K078010r341153j9966286j4982363J518980J0898334O273152
$$ y = [42393069, 24423251, 5379579, -4386814, -2606841, 6514394, 14890305, 15891405, 11764686, 12525653, 23788288, 39019739, 47389254, 45795357, 39060323, 31410584, 23112501, 14731419, 9970624, 12378102, 20557470, 28095059, 29162080, 24126020, 17901174, 12601631, 5834416, -1505648, -1436673, 10874120, 27053510, 33875609, 29661506, 23633484, 20238786, 14817918, 6186904, 1994618, 6368074, 11531923, 8630845, 262175, -4480529, -2364521, 2759678, 6805373, 7567679, 3383299, -4638158, -11027647, -10786755, -4321442, 4413665, 11715847, 14851675, 13589779, 12433836, 15496061, 17574071, 8232918, -11733368, -26715731, -25196751, -14298417, -8025265]
42817h025265l21810J118731N407899M520012l06242m747433q004363p437248
42809a7795719J886312J5626723J9190503O232999j1126936j8009209j3799403
42802a7794730o354001J154368Q691214J2999704J2366780J1191256J1322926
42795C3577517N926497q728512k2196147k1399018q586017K562820N150042L469306
42787a0223512K263439J892563L110657P499209J2880998J5056308J3478474R588671
42779E5546807J977984r844464j9148612j7613392o936093K305244L780065J368422
42771A1435961J423439M318018N068848m91671j0399414j6469063j2132442j488479
42763a8734803M414360K412393J169267O119174R362975K458738q895200j3551664
$$ y = [-8025265, -8347075, -7228344, -1820445, 2699567, 2393325, -2354108, -10358471, -17795719, -15909407, -282684, 18907819, 25140818, 14013882, -3995327, -17794730, -24148731, -22994363, -14303149, -1303445, 11063335, 22254591, 33577517, 39504014, 30775502, 8579355, -12819663, -21405680, -18842860, -13692818, -10223512, -7960073, -6067510, -2956853, 4542356, 17423354, 32479662, 45958136, 55546807, 57524791, 47680327, 28531715, 10918323, 3982230, 6287474, 10067539, 11435961, 12859400, 17177418, 22246266, 21754595, 11355181, -5113882, -17246324, -18734803, -14320443, -11908050, -10738783, -4619609, 4743366, 7202104, -1693096, -15244760]
42755a5244760j1539214r481418m976221Q873402K5249573K6806497R991622q452016
42747B1227465j4096787j0714865p615528m377873K429526Q046135O694637L174055
42739D766765N892236J2424817J2816207N374704q12237N88832N316671N656929
42731E2024924p23752j0404337j7758565j8140685j2029045o135205n616650n752530
42723b4535845J929264J4670030J8487712P547358m845205k863221R864784J5482410
42715C5737287O893177m196852n778804n32183K801914K731866J598664k765265
42707C6489804j1437068j6284371r503069J782841L194404n214993q214738J350586
42699g836604J1670130J0018904M85570m461135j915962Q73854j038812m985227
$$ y = [-15244760, -26783974, -36265392, -41241613, -32368211, -7118638, 19687859, 29679481, 21227465, 7130678, -3584187, -11199715, -15577588, -13148062, -5101927, 1592710, 4766765, 10659001, 23083818, 35900025, 41274729, 40462492, 41051324, 46367995, 52024924, 51301172, 40896835, 23138270, 4997585, -7031460, -13166665, -18783315, -24535845, -22606581, -7936551, 10551161, 18098519, 13253314, 10390093, 20254877, 35737287, 42630464, 38433612, 32654808, 32122625, 34924539, 37656405, 39255069, 36489804, 25052736, 8768365, -734704, 1048137, 4242541, -972452, -9187190, -7836604, 3833526, 13852430, 14338000, 9876865, 7960903, 8834757, 7795945, 2810718]
42691B810718n334673J272622J2655301K0710231J8788472J0723715N865356M478363
42683G1970105j662921j1856860j3428931k827127M730953k055641j1592304q133664
42675B5143610J841584P97869r800998j1682498M64675J2249159J4106158J2809143
42667D5928702J3590903R052430n452802j9936534k3270708j7697668j0842125
42660h627802l204085O338409J0815816K992604j0591578j4096210j563867J5125432
42652b811281J9467173Q250763n825228r176593k922489K90398m756422p351146
42644d834825L246714J9992059K5382011J3120630o730881k1472988k5176345
42637C526375j7415306l808072L655704j969580j1659754j1333677j173205P989099
$$ y = [2810718, -2523955, -1251333, 11403968, 32114199, 50902671, 61626386, 67491742, 71970105, 70307184, 58450324, 45021393, 42194266, 46925219, 44869578, 33277274, 25143610, 26985194, 27783063, 17982065, 6299567, 6764242, 19013401, 33119559, 45928702, 59519605, 68572035, 63119233, 43182699, 19911991, 2214323, -8627802, -11831887, -5493478, 5322338, 8314942, -2276636, -16372846, -17936713, -2811281, 16655892, 24906655, 19081427, 9904834, 6982345, 7272743, 2516321, -4834825, -1588111, 18403948, 43785959, 56906589, 50175708, 28702720, 3526375, -13888931, -17697003, -14041299, -16010879, -27670633, -39004310, -40177515, -32188416]
42629c2188416J3508847J9904286K1881926R290493r136254r858491J0037779
42622B3440170K3184217R869014j3398785j8667699m460022Q216581O420270n073668
42614B9530078j6726526k1573000j5414160k457110M649646O33776l920704M22023
42606b4855977O642435N188813K468183R786917K2112013K4697959J5457977M945251
42598F6443571j460459o281769r167077q176139p728553j1109719j0468392L84862
42590A2436325R796920L346363j0540307j1523823n28609K444290n770277m697860
42582e036978J3333023K5862823J3958782p409785j1330809K594901J1616650
42575D3588607M525174n870738m823736M143568O068870n103701j8363312j8427878
$$ y = [-32188416, -18679569, 1224717, 23106643, 32397136, 23260882, 13402391, 23440170, 46624387, 56493401, 43094616, 24426917, 19966895, 28183476, 34603746, 29530078, 12803552, -8769448, -24183608, -26640718, -21991072, -21357296, -25278000, -24855977, -18213542, -13024729, -10556546, -769629, 21342384, 46040343, 61498320, 66443571, 64983112, 58701343, 49534266, 41358127, 33629574, 22519855, 12051463, 12436325, 22233245, 25579608, 15039301, 3515478, 2986869, 5431159, -339118, -5036978, 8296045, 34158868, 48117650, 40707865, 29377056, 31971957, 43588607, 48113781, 42243043, 37419307, 41562875, 47631745, 42528044, 24164732, 5736854]
42567E736854n013501N786819L055320k919813L793242J8237962J9087807J98153
42559D7962843j9008649k0377898r169302m83989L022994P431486J1290540P631645
42551B8299670j844472p313899m974005j030613j012914k644035j046133L928306
42543A2361905P656079O192587J140623j101610L290821R454513Q877643R64210
42535D8836771n222076k568041N251001R276987O090854J06770k827866j516171
42527E7428229O03469P15873O40378K843462L163687n667038k0481797k6206086
42519A3040177j4835244J692065O607790n85011q475637j1909983j2707219q665341
42511c5838403K525554J2864414J4017765J3659875K3436029L4274072K5864071
$$ y = [5736854, 723353, 6510172, 9565492, 6645679, 10438921, 28676883, 47764690, 47962843, 28954194, 8576296, -593006, -1076995, 1945999, 9377485, 20668025, 28299670, 26455198, 19141299, 14167294, 13136681, 12123767, 9479732, 8433599, 12361905, 20017984, 26210571, 27351194, 26249584, 29540405, 38994918, 47872561, 48836771, 43614695, 41046654, 46297655, 55574642, 61665496, 61772266, 58944400, 57428229, 58031698, 58747571, 59387949, 62231411, 65395098, 59728060, 39246263, 13040177, -1795067, -103002, 6504788, 5919777, -2555860, -14465843, -27173062, -35838403, -33312849, -20448435, -6430670, 7229205, 30665234, 64939306, 90803377]
42504I0803377K97329j7858640j7838005j3792350j4289940q468013O524489J2193039
42496C7571286k25516j0269216n55627J3256883Q456088p392745j1362428k915574
42488B6563151Q53496k590104j711412K604167j784526j2882062j5025893m572018
42480h545201O808705J4065579K2488222K9410089K4089248Q291654l115615n068640
42472H8424041o847628j1180374q616836K767624J1047508R750705O257238N314025
42464I6916303J499360n397186m943857N464332J2635409P699511l5835N16321
42456A14354358M822506K706295m826035r574434q925424n530254j203112J385836
42448I3209736k183815j0681500j5401480j1063793k105138N522673J1013135
$$ y = [90803377, 91100706, 73242066, 55404061, 41611711, 27321771, 18853758, 25378247, 37571286, 37345770, 27076554, 26520927, 39777810, 48233898, 40841153, 29478725, 26563151, 27416647, 24826543, 23115131, 25719298, 23934772, 11052710, -3973183, -8545201, -1736496, 12329083, 34817305, 64227394, 88316642, 96608296, 93492681, 88424041, 81576413, 70396039, 61779203, 64546827, 75594335, 85345040, 91602278, 96916303, 98415663, 93018477, 88074620, 93538952, 106174361, 113873872, 113838037, 114354358, 119176864, 121883159, 117057124, 107482690, 98557266, 93027012, 91823900, 93209736, 91025921, 80344421, 64942941, 53879148, 51774010, 57296683, 68309818]
42441F8309818J4011611J2380016Q213012O684561N910534j169418j1613030j2145376
42433I0581728O25038J2796060J2952588O532166K496621j033080p514138j0607275
42425A06829708m572144L305321L056933k372445l022409K776410Q762011J0425883
42417A25189268O236846l425601j0922228m544653J3609438K3400269J1749690
42410A61293029q186497j6023919j2054242j0074399j1084349l893006J1509400
42403A11486017K0648031J5887402N210774k477232o963162r020272n930744J030324
42395A29871138M605525J227092m315302n915753j967398N634146J2035049J0589440
42387A51763937N08135q872794q653028j765324L866141P891176J2711075J2426835
$$ y = [68309818, 82321429, 94701445, 102914457, 109599018, 115509552, 114340134, 102727104, 90581728, 91206766, 104002826, 116955414, 123487580, 125984201, 124951121, 117436983, 106829708, 102257564, 105562885, 108619818, 106247373, 103224964, 106001374, 114763385, 125189268, 131426114, 128000513, 117078285, 112533632, 126143070, 149543339, 161293029, 153106532, 137082613, 125028371, 114953972, 103869623, 99976617, 111486017, 132134048, 148021450, 153232224, 150754992, 143791830, 134771558, 128840814, 129871138, 134476663, 135703755, 131388453, 125472700, 123505302, 129139448, 141174497, 151763937, 152272072, 143399278, 134746250, 132980926, 136847067, 144738243, 157449318, 169876153]
42379A69876153J250925j0917593q097353P311966J6482534J1479747L057722
42372A90444101j542999r115060k1470248k4639024r694756R564392J3843412
42365A47389818L947409l642524J25725R638114J5130286J0751698k775803j5314321
42357A65250402j3406263K335421J3276127N980266q588755j1289126k480050
42350A51078022K508262O18401M278473J6368256K1677085J0940060k631152k192359
42342B02645048Q921368J4996344J1393114O050692J968868o475507j8826179
42335B20673748k4123266j6729811o341725m724106r533760r597691j650037P010426
42327A54983778J0325641R178311N504824o93675o383485n081752M588647J5115799
$$ y = [169876153, 171127078, 160209485, 152112132, 159424098, 175906632, 187386379, 190444101, 188901102, 179786042, 158315794, 133676770, 123982014, 133546406, 147389818, 151337227, 147694703, 147820428, 157458542, 172588828, 183340526, 180564723, 165250402, 151844139, 154179560, 167455687, 173435953, 164847198, 153558072, 151078022, 153586284, 154204685, 158483158, 174851414, 196528499, 207468559, 204837407, 202645048, 211566416, 226562760, 237955874, 244006566, 245975434, 239499927, 220673748, 196550482, 179820671, 173478946, 168754840, 159221080, 149623389, 147973352, 154983778, 165309419, 174487730, 179992554, 179298879, 172915394, 167833642, 172422289, 187538088]
42319A87538088J8602308J4994234R084710M182162K242394N186329J1148681
42312B52978906J3331597P751496q00844n035887m262003k757952k717844m097090
42304B54390379p970836j3884427j6563500j1599863k459400L882051N876581
42297B11670985O228068N181358K282588J814208P765122J5011801J4539622P008832
42289B71502584K351752N564559J1119915J1918327O094984m613428j4928633
42282B89010060j5683853l515885R903904R901968k13577l734276L132676O110328
42274B94911345j720432p704554k251652L860372j001639p582569j712222R214718
42266B86013367P025475n878956q463304N392741J6224492P513865j1874268k2017562
$$ y = [187538088, 206140396, 221134630, 230219340, 234401502, 236643896, 241830225, 252978906, 266310503, 274061999, 273261155, 268225268, 263963265, 261205313, 258487469, 254390379, 246419543, 232535116, 215971616, 204371753, 201912353, 205794404, 211670985, 217899053, 223080411, 225362999, 227177207, 234942329, 249954130, 264493752, 271502584, 273854336, 279418895, 290538810, 302457137, 308552121, 303938693, 289010060, 273326207, 269810322, 279714226, 289616194, 289402617, 285668341, 288801017, 294911345, 293190913, 285486359, 283234707, 287095079, 286093440, 278510871, 276798649, 286013367, 293038842, 287159886, 278696582, 284089323, 300313815, 307827680, 295953412, 273935850]
42258B73935850j6355079l421276O401314P700208N19735q626100j0946457n739570
42250B43468625j886256n233583j0485482j0062888m661125M29334L366759L860686
42242B18796070o55489r018338j1613025j389393J3207475J6633966O963807k107234
42234B30817839j089104M345230O115459O597265J0810865J4063257Q193767m014927
42226B75839651j1634649j1438675j0349958j1614466r609892j714571N125086
42219B24602526N511828M260272O636666Q093790K913497l876273m323373j960085
42211B41858848n459641j1179290p118453N351377R629580j490871j3807674j2184099
42203B05599777n88949Q308786J2658637J7556234J9267587Q766571j0455931
$$ y = [273935850, 257580771, 254159495, 260560809, 268261017, 268780752, 260154652, 249208195, 243468625, 241582369, 236348786, 225863304, 215800416, 211139291, 211568625, 214935384, 218796070, 218140581, 209122243, 197509218, 196119825, 209327300, 225961266, 232925073, 230817839, 229728735, 234073965, 240189424, 246786689, 257597554, 271660811, 279854578, 275839651, 264205002, 252766327, 242416369, 230801903, 221192011, 219477440, 224602526, 230114354, 234374626, 241011292, 249105082, 252018579, 248142306, 243818933, 241858848, 236399207, 225219917, 218101464, 223452841, 233082421, 231591550, 217783876, 205599777, 205010828, 213319614, 225978251, 243534485, 262802072, 271568643, 261112712]
42196B61112712k1533513j4076445L497358J4157736R515056m139640j2909003
42189B35624261q498525K779058O575809j183367q360781m706074J629332l431696
42181B20428017j6228369j8913413o120470P335202R239440N905643P540863J0212455
42173B19399368M195936p547521j2374075o788520r05112l456857j0977879j3997166
42165A67548174q052247L333874J2167213J1183489k62312j3857200j9167686
42158A52893305j4203440o347224k061731L77491N790380J3583547J8306854J6801137
42150A85140319J0676798K448163o375471j2853674j3084451p809145l995124
42143A54147415p105217j3991692j7085938j3455308n446772N049233J6331221
$$ y = [261112712, 239579199, 225502754, 229000112, 243157848, 252672904, 248533264, 235624261, 227125736, 229904794, 236480603, 235297236, 226936455, 222230381, 223859713, 220428017, 204199648, 185286235, 179165765, 186500967, 195740407, 201646050, 209186913, 219399368, 223595304, 216047783, 203673708, 196885188, 195980076, 192523219, 181545340, 167548174, 159495927, 162829801, 174997014, 186180503, 185918191, 172060991, 152893305, 138689865, 132342641, 130280910, 130658401, 136448781, 150032328, 168339182, 185140319, 195817117, 198265280, 191889809, 179036135, 165951684, 158142539, 154147415, 147042198, 133050506, 115964568, 102509260, 97062488, 102111721, 118442942]
42136A18442942K1908890J4376146l015524j5801320j3657570j108485J0528391
42129A31673470J5606400J3969899N521166p221478j6052295j5273487j0295580
42122A17928095j0266549j4628141j5075862q666959j68036P111487J3275514
42115H9509549J5270353Q902895j141418l518252M371751J2098219J0738461L155841
42107A39387399m025864r857196j5001588j5858743r340090J257413R550142J0791166
42099A06902639K011799j4210750k3881665j1533162J6999267L3583866K0674322
42092A30546316m242324j0619991N439200J8991476J1045243j0216716k4624839
42085A16318365k2892187j0058485L380736Q386751K463224p735276j2970638
$$ y = [118442942, 140351832, 154727978, 151712454, 135911134, 122253564, 121145079, 131673470, 147279870, 161249769, 166770935, 159549457, 143497162, 128223675, 117928095, 107661546, 93033405, 77957543, 69290584, 69122548, 76234035, 89509549, 104779902, 113682797, 112541379, 109023127, 113394878, 125493097, 136231558, 139387399, 135361535, 125504339, 110502751, 94644008, 85303918, 86561331, 96111473, 106902639, 108914438, 94703688, 70822023, 59288861, 76288128, 109871994, 130546316, 126303992, 115684001, 121123201, 140114677, 151159920, 140943204, 116318365, 93426178, 83367693, 86748429, 95135180, 97598404, 89863128, 76892490]
42078G6892490j1277922o331844J609474J3627407K1764509J3543556q807244
42071A01020426k5049774k0272191l085421P333901N189026q0759p67440P13456
42063F5001224n86449m674180q308647r070846o342856j165265M247858Q286912
42055D7387751J0780492J1771291J1588105J2029495J3451433J0483717k916499
42048A14575785k1693123l0312049k0502255k349657Q636584R770138Q551919
42041F6677342P138485P53062r553024j4009588p341020K985635N911102p00806
42033E1861188r799116j3592995r734915j929120L627363L884014J243642p80924
42025B4779137j773368j546085K906744J1752158J6869863J0293137k836032q459642
$$ y = [76892490, 65614568, 59282724, 60892198, 74519605, 96284114, 109827670, 101020426, 75970652, 55698461, 52613040, 59946941, 65135967, 65055208, 64287768, 65001224, 64414775, 59740595, 51431948, 42361102, 36018246, 34852981, 39100839, 47387751, 58168243, 69939534, 81527639, 93557134, 107008567, 117492284, 114575785, 92882662, 62570613, 42068358, 39718701, 48355285, 58125423, 66677342, 73815827, 74568889, 65015865, 51006277, 43665257, 46650892, 52561994, 51861188, 42062072, 28469077, 18734162, 16805042, 20432405, 24316419, 25560061, 24779137, 23005769, 21459684, 24366428, 36118586, 52988449, 63281586, 60445554, 51985912]
42017E1985912j735676P227625P759183R51999n137447n260004J259195J1360773
42009F8411560J7009456R944305p533133k1836844k2286148j1553469K58500N920698
42001C8334925L494158l824476p367245p34374R452062J0640823N020357Q866010
41993F3882240K4464993K9600661Q905666j9035225k5050863r471725K939697
41986G6235444J642012n91339L673614M121314n050370j2409935q768904j815652
41978E7036184p33909j605878N67407m93418r526316j6336464r578040M634107
41970B3963673J1554328Q461128L533730K15897l662923n512612o53427O599706
41962D4499500P368972K984804K987058P878693O544120n356571j5283154r284274
$$ y = [51985912, 50250236, 57477861, 65237044, 66189043, 61051596, 55791592, 57050787, 68411560, 85421016, 95365321, 87832188, 65995344, 43709196, 32155727, 32414227, 38334925, 41829083, 38004607, 30637362, 29902988, 39355050, 49995873, 55016230, 63882240, 88347233, 117947894, 126853560, 107818335, 82767472, 73295747, 76235444, 77877456, 77286117, 80959731, 85081045, 80030675, 67620740, 58851836, 57036184, 56302275, 54696397, 55263804, 54770386, 45244070, 28907606, 19329566, 23963673, 35518001, 43979129, 47512859, 47728756, 44065833, 38553221, 37899794, 44499500, 51868472, 54853276, 57840334, 65719027, 72263147, 66906576, 51623422, 42339148]
41954D2339148Q322792J8133145P840601j3069693k3010160j2334810N411911
41947C3632934R968959n48273r089501m585242L746353K824685m139025m651936
41939B7158954K594352O935370L390878l99552L521416J2229689J5680284P752391
41931G8863782p171895j7107327j4163557m053441J381166J475316O549095J7521840
41923F3294979J9993981P408381m919547l292788P28924j0003837k5806072k2402584
41915B5001437o80888J3008152P724704J914848R018872J4683493K363825j8232786
41907E4801657k5084748j2922299O160006K0057603K1735086Q089454j2366657
41900F0470102k0136590p119876R533854R433768l306200r579813n607711n348650
$$ y = [42339148, 50661940, 68795085, 76635686, 63565993, 40555833, 28221023, 33632934, 43601893, 43053620, 33964119, 29378877, 33125230, 35949915, 31810890, 27158954, 29753306, 36688676, 40079554, 39680002, 43201418, 55431107, 71111391, 78863782, 71691887, 54584560, 40421003, 36367562, 37748728, 39224044, 45773139, 63294979, 83288960, 90697341, 85777794, 82485006, 83213930, 73210093, 47404021, 25001437, 24320549, 37328701, 45053405, 46968253, 55987125, 70670618, 73034443, 54801657, 29716909, 16794610, 22954616, 43012219, 64747305, 72836759, 60470102, 40333512, 33213636, 42747490, 52181258, 48875058, 39295245, 33687534, 28338884]
41892B8338884j4334292j9283145q390006J0858536K0569387J2219187o322465
41885B3656086j8965394j5167133N01825J2615037J1869173N108605L908037P813247
41877C1339483P268513N35465k878658K641793R167613N441364q126988j9297982
41869B6090603j7341580m045644Q391801R644706Q89922q332450j1107905p862594
41861c673141j739751M700353P672633M150889j803245j520130O192561J2541035
41853B6521204J2011989R601628R240352M890826p181792j5655565o974422J3083411
41845D5537631K4300954J8050262N805950k81006l093894j0883129k0899769k1639554
41837C6897445q597331R291129J9653108J8986132J3221939R025629Q702496J3291918
$$ y = [28338884, 14004592, -5278553, -13668559, -2810023, 17759364, 29978551, 23656086, 4690692, -10476441, -9974616, 2640421, 14509594, 19618199, 23526236, 31339483, 38607996, 39143461, 36264803, 38906596, 48074209, 53515573, 45388585, 26090603, 8749023, 4703379, 13095180, 22739886, 23629808, 15297358, 4189453, -3673141, -5412892, -712539, 6960094, 11110983, 9307738, 7787608, 13980169, 26521204, 38533193, 48134821, 57375173, 62265999, 55084207, 39428642, 32454220, 45537631, 69838585, 87888847, 93694797, 93413791, 90319897, 79436768, 58536999, 36897445, 28300114, 37591243, 57244351, 76230483, 89452422, 98478051, 107180547, 120472465]
41829A20472465K4418250L8919276M6846159M1805063L0043415K1984241J8828408
41822C43317277J6712465J8050394K3818122J9358085j0406653n0303269o4472651
41815B96073770m4999298k5580658l2155909m5772181l7400824j6277971j1239728
41808H2647201j9083526r757284K0173591L6609210J7926703j4742178k9594884
41801H4178833k2468007r532724j561819n50641p269896j7385218j9469002q270766
41793b329240O846306J3688696R889051l16384j1702958j5987785n762580J3283539
41785G608645K4276459J9018450O738511o06959j089455K075911N680028L384970
41777F7086560q944141k1156717j7202326L53615J1422755Q973345Q017505J5830627
$$ y = [120472465, 144890715, 183809991, 230656150, 272461213, 302504628, 324488869, 343317277, 360029742, 378080136, 401898258, 421256343, 410849690, 360546421, 296073770, 251074472, 225493814, 193337905, 147565724, 110164900, 93886929, 82647201, 63563675, 53806391, 73979982, 110589192, 128515895, 113773717, 84178833, 61710826, 52178102, 50616283, 50065642, 42795746, 25410528, 5941526, -2329240, 4517066, 18205762, 28094813, 27778429, 16075471, 87686, -5674894, 7608645, 31885104, 50903554, 57642065, 57035106, 55945651, 58021562, 63701590, 67086560, 58142419, 36985702, 19783376, 20136991, 31559746, 40533091, 48550596, 64381223]
41769F4381223J6632454O90842j3627355p332253P939432R228996j951940p828070
41761F8133329o355817q253919j0480616j116563J2992975J1855568l889145j1870002
41753E1015810m013126K810725j473082m232098K930895O140746n360964j6371870
41745C1447036q845733O834500O432724j0230286j8638733n881521J2416754J6284809
41737B9819550P149846N59218K659126M929376K56075n211259p94949J1953387
41729E1320370J8230785Q220850q732992j4339557m048924P517952N138304r254924
41721E4051864k0852307j9772518j0249351l481465m456439o670865k82515J4389467
41713B675871K4539070J9386033M329457m977055j389798P603827J2457938J2055533
$$ y = [64381223, 81013677, 81704519, 68077164, 60744911, 68684343, 77913339, 75961399, 68133329, 61777512, 53523593, 43042977, 41926414, 54919389, 66774957, 62885812, 51015810, 47002684, 49813409, 48340327, 44108229, 47039124, 53179870, 47818906, 31447036, 22601303, 29435803, 35868527, 25638241, 6999508, 1117987, 13534741, 29819550, 36969396, 37528614, 40187740, 45117116, 45373191, 40161932, 39366983, 51320370, 69551155, 77772005, 69039013, 54699456, 50650532, 58168484, 63306788, 54051864, 33199557, 13427039, 3177688, -303777, -4760216, -11431081, -11713596, 2675871, 27214941, 46600974, 50930431, 45953376, 44563578, 52167405, 64625343, 76680876]
41705G6680876Q923206K252758q005108j5719600j5196179j0742188j1605188
41698B6588577j7202114j5432495K73049J8107144J9643851L597217j0193562
41691B5381667m920513J0858563J3694779l260413k0150463j6735254O41915Q769638
41683A4279919o96723j2329068j0477516J272224J0233652J3508699J6175203
41676C1966390J6807982Q173306p198140j4144125l400439J4418903K0574199
41669F7198076J0117130m744326j1213057q852211n587227o809360j0894216j2325613
41661A6889196p746704n49124J843142j763041k279069O821933J6103651J0772992
41653D0092976n812085j3437427l709808P942372P211908K012089N068032R915638
$$ y = [76680876, 85604082, 87856840, 79851732, 64132132, 48935953, 38193765, 26588577, 9386463, -6046032, -5772983, 12334161, 31978012, 35575229, 25381667, 20461154, 31319717, 45014496, 41754083, 21603620, 4868366, 5510281, 14279919, 13583196, 1254128, -9223388, -7951164, 2282488, 15791187, 31966390, 48774372, 56947678, 49749538, 35605413, 32204974, 46623877, 67198076, 77315206, 72570880, 61357823, 52505612, 46918385, 40109025, 29214809, 16889196, 9142492, 8593368, 10436510, 8673469, 6394400, 13216333, 29319984, 40092976, 34280891, 20843464, 17133656, 25076028, 32287936, 34300025, 39368057, 49283695]
41645D9283695L507697p372018m837392R713529J6741079R175633k50506l483503
41637G2478214o529995j0786631p704811J567439L351420l736159l451083Q694556
41629E3882950J4005213J847482j0764113p666964L83863j713955n441682K777572
41621D7310366J2823146P623590n171248o304872J163190R0907o922476k789865
41613D7822738R390797Q644853o446886j3208200k287732Q640415O011633k94439
41605E8273179J912073Q907896J3480543J5787008J3374969j79180j8094619k1042911
41597G2418958m314706J3694812J8850490J8358006K1037452K0441198J0497111
41590A70983321M87131N16739O651809J2426657J9796775K6964727K2653881O979954
$$ y = [49283695, 52791392, 45419374, 40581982, 50295511, 67036590, 76212223, 75961717, 72478214, 65948219, 55161588, 47456777, 49024216, 52375636, 48639477, 45188394, 53882950, 67888163, 69735645, 58971532, 51304568, 51688431, 49974476, 44532794, 47310366, 60133512, 67757102, 62585854, 56280982, 57444172, 57535079, 50612603, 47822738, 57213535, 65858388, 59411502, 46203302, 43915570, 52555985, 58567618, 58273179, 60185252, 69093148, 82573691, 98360699, 111735668, 111556488, 93461869, 72418958, 68104252, 81799064, 100649554, 119007560, 140045012, 160486210, 170983321, 171470452, 171987191, 178639000, 191065657, 210862432, 237827159, 260481040, 267460994]
41582B67460994Q86173J7336471L8487662M1041157L0559411K8266471L4592817
41575D58631156L1462686J6039163O005999Q673722P585585j1570063l8013564
41568D78814684m9973369m2618095l1333005l0124719l5366524l3975849k3465191
41561B31957932j6115769k0294668k6322034k0987397r663384q400956j6366908
41554A13806816j5166633J605083J7741162J9801800J3890954Q533838R44965
41547A61157985q118976o857289M620891M546651j7415848l6613591k7116653
41540G4203170k273401O469383k185304m501604L336832J350982j3231830j6938364
41532D6229864n73599J2758678M576360r929105p769238O646912J1997629K711873
$$ y = [267460994, 268347167, 285683638, 324171300, 365212457, 395771868, 424038339, 458631156, 490093842, 506133005, 512139004, 520812726, 528398311, 516828248, 478814684, 428841315, 386223220, 354890215, 324765496, 289398972, 255423123, 231957932, 215842163, 195547495, 169225461, 148238064, 138574680, 130173724, 113806816, 98640183, 100245266, 117986428, 137788228, 151679182, 160213020, 161157985, 153039009, 146181720, 150802611, 155349262, 137933414, 101319823, 74203170, 71929769, 78399152, 76213848, 71712244, 75049076, 76400058, 63168228, 46229864, 45656265, 58414943, 62991303, 53062198, 45292960, 51939872, 63937501, 66649374]
41524F6649374p921877j0339943q265134q172628j0701541j2031320p478776M087343
41516E825498J5503518J5617025K847067j0321623j1127946o34537J0081807J3281982
41508D1072791R180536R74940q455777j5193144j4491639n342501N897694R873605
41500B3516505N058984J341103O987891J4645982J0598076k325566o000953M034336
41492E7856358Q658330l908721j4965173k888660J9849110K3115690N686177l489811
41484H9913300Q605858K0657955J3368035j607377m216422K322531J178190r337943
41476A20884127j5563187j1091043l528030m15056r89087k670332o211025j1304635
41468F9111732j2458694l764210J1818202K0729822J1655032q459088j8601878
$$ y = [66649374, 58727497, 48387554, 40122420, 31949792, 21248251, 9216931, 1738155, 5825498, 21329016, 36946041, 39793108, 29471485, 18343539, 17709002, 27790809, 41072791, 50253327, 51228267, 42772490, 27579346, 13087707, 7745206, 13642900, 23516505, 28575489, 29916592, 36904483, 51550465, 62148541, 59822975, 53822022, 57856358, 66514688, 62605967, 47640794, 44752134, 64601244, 87716934, 93403111, 89913300, 98519158, 119177113, 132545148, 130937771, 126721349, 129043880, 130222070, 120884127, 105320940, 94229897, 90701867, 90286811, 89297724, 86627392, 80416367, 69111732, 56653038, 52888828, 64707030, 85436852, 97091884, 88632796, 70030918]
41461G0030918r326921M251239M431414l408694k351514N946597L621475j1802831
41453F1391683k0745302j1920533J485643N355717N232938J0191542J2594757
41446F3586445J264117j5819200j9904501p650237O188985R902651N704449J07676
41438D3380385m887693q500271p278611R76792J2171195J7745129J2572342J204230
41430F7383498n975294m679785j154492j393960k128901O60800J691087m114156
41422E0288797q946631l670203L621203j219754j2547843j1918157L21207N442762
41414B1371381N50939L601840J6226255J3020998j5183249l7007470k4245143
41407b1664449M487164J3362063L288077K197083J4071181J5530933Q05197o588390
$$ y = [70030918, 60703997, 64955236, 69386650, 65977956, 63626442, 69573039, 73194514, 61391683, 40646381, 28725848, 30211491, 35567208, 40800146, 50991688, 63586445, 64850562, 49031362, 29126861, 21476624, 27665609, 37568260, 43272709, 43380385, 38492692, 29992421, 22713810, 23690602, 35861797, 53606926, 66179268, 67383498, 61408204, 56728419, 55573927, 54179967, 52051066, 52711866, 54402953, 50288797, 41342166, 37671963, 41293166, 40073412, 27525569, 15607412, 15928619, 21371381, 21922320, 25524160, 41750415, 54771413, 39588164, 2580694, -21664449, -17177285, -3815222, -527145, 1669938, 15741119, 31272052, 32077249, 25488859]
41399B5488859N781811J8062356J0379850p132803j2192437k161703P396094O448814
41391E2070841J6795j685971N129478J3592539J1141752o747057k7388456l2095645
41383A4034276j7304406K259736J1659059R456083L094901j067528j018174J242680
41375B2356627J303358k617873p058254q997622r933642r324725r36254J5464003
41367B55618K5845203J7845415J14026q117155l290964J950046K222129N382403
41359D2206721J3337500J5342209O899169n14264K579108Q935737P459665q4327
41351I6161518n434173p907603j1291638j3509808j0552358o373339q049570j2968334
41343B0074695j0869095N31695J0038238O169890q727774k0591758j7917157k261817
$$ y = [25488859, 31270670, 49333026, 59712876, 52580073, 40387636, 38225933, 45622027, 52070841, 52087636, 50401665, 55531143, 69123682, 80265434, 73518377, 46129921, 14034276, -3270130, -1010394, 10648665, 20104748, 23199649, 22132121, 21113947, 22356627, 23659985, 21042112, 13983858, 4986236, -4947406, -14272131, -15208385, 255618, 26100821, 43946236, 44060262, 35943107, 32652143, 34602189, 36824318, 42206721, 55544221, 70886430, 77785599, 77271335, 79850443, 88786180, 96245845, 96161518, 90727345, 82819742, 71528104, 58018296, 47465938, 41092599, 33043029, 20074695, 9205600, 9737295, 19775533, 25945423, 17217649, -3374109, -21291266, -23553083]
41335b3553083J4109169J9414427J1838330N9975m551096K088529J2553023J4990799
41327D6950073O779942j479026k2334N571346K425218q807098j2992795k573391
41319C5851935J1850870J7902651J5870008J0005682r87372j4650206j9135014
41312E6708554r900151k01445o56288r76294J0196101K0121936J0444308q108806
41304G7627915p782837J1913308K1639098Q070060o611110j804730J0571412Q652872
41296A22275988n371752j2855027p955965j472250j952588p034867j0319328p689279
41288F7624932L8001N570434J507985q384499j1850201n186741J707112R02904
41280E1929927l442374n004887m385465l106229M83579L813527k13449j0394883
$$ y = [-23553083, -9443914, 9970513, 21808843, 21868818, 17317722, 19406251, 31959274, 46950073, 53730015, 52250989, 52228655, 57800001, 60225219, 51418121, 38425326, 35851935, 47702805, 65605456, 81475464, 91481146, 90493774, 75843568, 56708554, 46808403, 46606958, 45950670, 44974376, 55170477, 75292413, 85736721, 77627915, 69845078, 81758386, 103397484, 111467544, 104856434, 103051704, 113623116, 122275988, 116904236, 104049209, 96093244, 94620994, 92668406, 85633539, 75314211, 67624932, 67662933, 73233367, 74741352, 66356853, 54506652, 49319911, 51027023, 51929927, 48487553, 43482666, 39097201, 35990972, 36474551, 40288078, 40074629, 29679746]
41272B9679746j5397800j0357317l440383n39902K984872Q924820R535182K524293
41264B3913511k259764l94459j490255r752826j2832077l166833O622050N337548
41256E976895L214334J1733168J9936138J3257962J473846K085419P548328j840476
41248F3385614k0024720k2057847p036274j450923j4988271k4285597j1675871
41241c8133889P405724J1081638K532590k712742k887192m309815l141625P156609
41233b3008702J8135806J4922844n67582j0395726m214028R707749J7485858J4218069
41225C6284288M500800m422450q213264q058362q231301r490359p468807M6080
41217e053375P959651R537754M213602l191094p607305n718245K135935Q562841
$$ y = [29679746, 14281946, 3924629, 484246, -55656, 2929216, 11854036, 21389218, 23913511, 21653747, 21259288, 19769033, 10016207, -2815870, -5982703, 639347, 5976895, 9191229, 20924397, 40860535, 54118497, 55592343, 57677762, 65226090, 63385614, 43360894, 21303047, 14266773, 12815850, -2172421, -26458018, -38133889, -30728165, -19646527, -17113937, -19826679, -22713871, -27023686, -30165311, -23008702, -4872896, 10049948, 9482366, -913360, -5127388, 4580361, 22066219, 36284288, 40785088, 36362638, 28149374, 20091012, 11859711, 2369352, -5099455, -5053375, 2906276, 12444030, 16657632, 13466538, 5859233, 140988, 2276923, 10839764]
41209A0839764L603538j1754564k1996787j4596621K767461J1366383N809190
41202a3961636p69026L006744J1366220J1373041Q84854j0634768j5134731j2364916
41194b6234218n024585M822008J3401509J5644563J0843233L854456j450656n782924
41186A0073386r542703r921504o823549o083785j0786402j4147448q754627P48652
41178e5237980L658501J45652J426305J1786077K0957774J8554018P627512j438254
41170G479605m225846m184592n604900q971109j0717575o092443M749872J4541651
41162a3025337J7565787J7472888J8661694J4438970l016985k3401833k6609297
41155B085887j2180226j007438j958915J644040K0634305L6508771K7926429L948858
$$ y = [10839764, 14443302, 2688738, -19308049, -33904670, -31137209, -19770826, -13961636, -14730662, -11723918, -357698, 11015343, 11900197, 1265429, -13869302, -26234218, -31258803, -26436795, -13035286, 2609277, 13452510, 17306966, 15856310, 10073386, 530683, -9390821, -16214370, -22298155, -33084557, -47232005, -55986632, -55237980, -51579479, -51433827, -50007522, -38221445, -17263671, 1290347, 8917859, 7479605, 3253759, -930833, -6535733, -15506842, -26224417, -32316860, -27566988, -13025337, 4540450, 22013338, 40675032, 55114002, 52097017, 28695184, 2085887, -10094339, -11101777, -13060692, -11416652, 9217653, 45726424, 73652853, 77601711]
41147G7601711j1074583j3469863j7273297k3560445j8544790p52871J3281584
41140F207446J3334796O820766K886221J628651J858438M268956M105132n023075
41132C6087331j7470037j9294897p893010M971822J0708604J0834449O210873
41125B4155135m772572j5353875j4102480l087259L127932K1291j835787J689686
41117a0157929K75270r754498j4530903m313342R092724R742025O23464l869489
41109b2892678L80672N648374O299389L397236o21649l732869l829373j337755
41101a6688653J158744L422173N882428M388320l637586q955378r7140J6159094
41093A632002K0148432Q002367l054307l042744k594922r306536j2067114k715172
$$ y = [77601711, 66527128, 53057265, 35783968, 12223523, -6321267, -7074138, 6207446, 19542242, 26363008, 29249229, 30877880, 32736318, 37005274, 41110406, 36087331, 18617294, -677603, -8570613, -3598791, 7109813, 17944262, 24155135, 19382563, 4028688, -10073792, -13161051, -10033119, -10011828, -11847615, -10157929, -9882659, -19637157, -34168060, -38481402, -29388678, -19646653, -19023189, -22892678, -22512006, -16863632, -10564243, -7167007, -7788656, -11521525, -15350898, -16688653, -15529909, -12107736, -6225308, -1836988, -5474574, -14429952, -14527092, 1632002, 21780434, 29782801, 26728494, 23685750, 21090828, 11784292, -282822, -2997994]
41085b997994O124877J933082n598539j871126P730816R698792O008497N237480
41077B6265885K147815j0979931k2169200j3515879Q535229K0584197J6526426
41070B7394542J1148694J1570165R076551N34180n094137n568859j0193192k0912933
41062A7955011k6874133k2508456j4200413n626090N864405J5068283J0568486
41055a9752907m238483j0952074l157034N783693Q253249J3443765K2905360J9015546
41047C1301115n454375k7276710k3500174n747294l80304p413661n776262P782593
41039c6465072J3291584J373136j2900613j5239171r832634m394519L272315J3450472
41031d7444502J5723696N237801m536278M26901J2874282J4926982M877223k127338
$$ y = [-2997994, 3126883, 5059965, -538574, -2409700, 5321116, 15019908, 21028405, 26265885, 28413700, 17433769, -4735431, -18251310, -9716081, 10868116, 27394542, 38543236, 50113401, 59189952, 59724132, 54629995, 49061136, 38867944, 17955011, -8919122, -31427578, -45627991, -51254081, -45389676, -30321393, -19752907, -23991390, -34943464, -38100498, -32316805, -24063556, -10619791, 12285569, 31301115, 25846740, -1429970, -24930144, -30677438, -31057742, -38471403, -44247665, -36465072, -23173488, -21800352, -34700965, -49940136, -59772770, -64167289, -60894974, -47444502, -31720806, -26483005, -31019283, -30592382, -17718100, -2791118, 2086105, -41233]
41023d1233J707102P188641M785654k764897r458579j5633483k1056611j8565771
41015e3839177m804659R835428J3272938Q857720Q426216J1990440R099387m3393
41007B794900k076678N741209O386762j0818162k8787930k3732404M70039J6980180
40999c3042084J2429269Q77265p91108N085433O723291K175685j498241j399467
40991i439957j063978j977522p47774M488775R388849P245579k945140j2928908
40983g980076j1718293K254407J7405910K0790041J1998630J333419l752638m518925
40975B5812475m324787l412268j846387j683779l638589n644014o275947n938758
40967f952054m182703k32841L506697L460560Q57112L87209K488732L104603K007734
$$ y = [-41233, 1665869, 8854510, 13640164, 10875267, 1416688, -14216795, -35273406, -53839177, -58643836, -48808408, -35535470, -26677750, -18251534, -6261094, 2838293, 2794900, 718222, 6459431, 12846193, 2028031, -26759899, -50492303, -50022264, -33042084, -20612815, -19735550, -20526658, -15441225, -8717934, -6542249, -8040490, -9439957, -10503935, -12481457, -13229231, -8740456, 648393, 7893972, 4948832, -7980076, -19698369, -17443962, -38052, 20751989, 32750619, 34084038, 30331400, 25812475, 21487688, 18075420, 16229033, 14545254, 10906665, 5262651, -1013296, -6952054, -11134757, -11367598, -7860901, -4400341, -3543229, -3156020, -667288, 2437315, 4445049]
40958D445049M184635J0396715J3384406P669827k405641q882128r920826r020164
40950I851873q302671p050167m612961j564984L72876j401038o807416r480033
40942b8994521k510260J0317458J5841942Q162277k435298l112914M181792O607156
40934H057632j133545j0241240r985778j83529J0459820J4653739J2715200R636690
40926C3978989P606018K994066p480186j8850908k0780319r992923M221846R849542
40918A546125M519789m590470r860932q701800k910235K887012L686773o58494
40910a4082232l347707K146847J2705434J7369612R844628l925134j3027620j4337532
40902f653704j4187921j7090150j7757257r201248L861059Q056397J01906o151034
$$ y = [4445049, 8629684, 19026399, 32410805, 40080632, 37674991, 28792863, 18872037, 9851873, 1549202, -5500965, -10113926, -11678910, -11306034, -12707072, -19514488, -28994521, -31504781, -21187323, -5345381, 2816896, 381598, -2731316, 1450476, 8057632, 6924087, -3317153, -13302931, -13486460, -3026640, 11627099, 24342299, 33978989, 41585007, 44579073, 37098887, 18247979, -2532340, -12525263, -8303417, 1546125, 6065914, 1475444, -8385488, -17087288, -19997523, -17110511, -13423738, -14082232, -17429939, -15283092, -2577658, 14791954, 24636582, 20711448, 7683828, -6653704, -20841625, -37931775, -55689032, -64890280, -61029221, -52972824, -52870918, -59021952]
40894e9021952J620389J5332279J6953142M415185n864756l433601K390443j024162
40886b8633033j0245887j2213161l484855O794724J0357856P856084M312529L382243
40878b1873500O409386J1850575J4782706J0899395J984363n116429n478110m41144
40870A3017242M738570O054436L844297J685879J884855K336159m42417n478138
40862B7640883p485888l536959L241277P594263P100579K466525l998097q935586
40854B4086997r773731p264490l938067J67337P018957J5482777K0473375J8374536
40846F4627691J0516517J070561n577098o418114l211841l221896j1073035k0744343
40838B5968442k2139802j4887639p780443m769891j294574L948472M848497J33272
$$ y = [-59021952, -57401563, -42069284, -25116142, -20700957, -26565713, -29999314, -27608871, -28633033, -38878920, -51092081, -54576936, -47782212, -37424356, -29568272, -25255743, -21873500, -15464114, -3613539, 11169167, 22068562, 24052925, 18936496, 13458386, 13017242, 17755812, 23810248, 27654545, 29340424, 31225279, 33561438, 33119021, 27640883, 20154995, 16618036, 19859313, 27453576, 34554155, 37020680, 33022583, 24086997, 14313266, 7048776, 3110709, 3278046, 10297003, 25779780, 46253155, 64627691, 75144208, 76214769, 70637671, 64219557, 61007716, 57785820, 46712785, 25968442, 3828640, -11058999, -18839442, -23609333, -24903907, -20955435, -16106938, -15973666]
40830a5973666j125697O105269J1941869M824984j0292816j7122625q633051O090528
40822b4185205J4361518J2198859M343259k247569l642883p02312K814092L320330
40814F260089j626912j1920994k0797265j7069048M63385J4952614R595547q214137
40806b8356721j5005950l542387R648994J1848736J0200063J3060473J5011032
40799A2864240J2148760J3549335K2032039K0885827r57418k5068929k6519734
40792B8934120r256953M106453P722006J2321306J6769458Q234095j0170945j8991519
40784C9668021j2819732o868527r100927r402273k255337L072048K776208O507700
40776A1577181J5710319J6060549L208274n353820J611292R429508K998623o890115
$$ y = [-15973666, -17099363, -10994094, 947775, 5772759, -4520057, -21642682, -30275733, -24185205, -9823687, 2375172, 6718431, 4470862, 827979, 125667, 2939759, 6260089, 4633177, -7287817, -28085082, -45154130, -44690745, -29738131, -20142584, -28356721, -43362671, -46905058, -37256064, -25407328, -15207265, -2146792, 12864240, 25013000, 38562335, 60594374, 81480201, 80522783, 55453854, 28934120, 19677167, 23783620, 31505626, 43826932, 60596390, 68830485, 58659540, 39668021, 26848289, 19979762, 10878835, 1476562, -778775, 2293273, 5069481, 11577181, 27287500, 43348049, 46556323, 41202503, 42813795, 52243303, 55241926, 48351811]
40768D8351811l438069N485998P07108j4117534j6950792k498531J0394234P996295
40760C5930520j480511n141935l533603m178970p862820r046654m637720K351826
40752B400133N552236J096210o832346q687851j692577M689021J417078o151815
40744h209911n336940N318214J4100388J2807336O453143M089049P111609J0187939
40736D6520827R028554L829888k282066n753140m989373j638251J122345J704470
40728D7543254R55692L68108O6557j580737n693114r505528p634246M59648P012767
40719C1992401M800537k940689p628969p743481p470261n060572N139877J7593909
40711B8682752J6495204j822722j9498050j9306388o666189O57336l034369q708312
$$ y = [48351811, 44913742, 50399740, 51106848, 36989314, 20038522, 17539991, 27934225, 35930520, 34450009, 29308074, 25774471, 21595501, 13732681, 4686027, 48307, 2400133, 7952369, 9048579, 2216233, -6471618, -8164195, -3475174, -2058096, -8209911, -13546851, -8228637, 5871751, 18679087, 25132230, 29221279, 36332888, 46520827, 55549381, 59379269, 57097203, 51344063, 46354690, 44716439, 45838784, 47543254, 48498946, 48867054, 48933611, 47352874, 41659760, 32154232, 24519986, 24979634, 31992401, 36792938, 33852249, 26223280, 18479799, 11009538, 5948966, 11088843, 28682752, 45177956, 43355234, 23857184, 4550796, -2115393, -1458057, -4492426, -13200738]
40703a3200738r012324n425277r54460M121874Q929643J1533093J2148642J2336929
40695B0477382J1882798R395606L735274o396154j9146264k4932690j4313796
40688a9297844N841142J4934290M620229q341727n075722R235960J4705398N033762
40680B1655488p447495j1089519o284169Q36531N286485M783467K356065M683714
40672A4780567J1497990J2789353M127374m056079k830837j94835o112804j2333853
40664A7666876n628695O498617N132090q464028j3356580j837880J0010577Q521504
40656A8542481o56942p224825r592961p552369J443387J2331642J4496238R032757
40648C0819408P729031J0579076L639813j4190220k3571637j4420968k467167
$$ y = [-13200738, -22213062, -27638339, -28592799, -24470925, -15541282, -4008189, 8140453, 20477382, 32360180, 41755786, 45491060, 39094906, 19948642, -4984048, -19297844, -13456702, 1477588, 6097817, -2243910, -7319632, 1916328, 16621726, 21655488, 14207993, 3118474, -3165695, -2329164, 2957321, 7740788, 10096853, 14780567, 26278557, 39067910, 43195284, 39139205, 36308368, 36113533, 30000729, 17666876, 12038181, 18536798, 23668888, 15204860, 1848280, 10400, 10020977, 18542481, 17885539, 10660714, 1067753, -6484616, -5041229, 7290413, 21786651, 30819408, 38548439, 49127515, 52767328, 38577108, 15005471, 584503, -1882664]
40641a882664k550552n388477J889159J0314846N346308n487197m295932O867268
40633D812759J0121334J158065o707890o008119l537449m890084o927841p220381
40625a9199606p637939p447333l982325J83288Q17120L61702K232455J354770
40617c3317868o434179j0278086L294644K5058511K8932053P295448j5965691
40610a415168j5497322M714877J9551803J3881578l027575j1076459k099456J1220782
40602A6253060J0127426o045381j7190642r119405O215612Q276704k396795q112601
40594a992022k958145J185975k340582n296998k263138k76328l604555m634589
40586b2180382J244846N590346J733996k392615K828883J2730441J6118490J1254897
$$ y = [-1882664, -4433216, -9821693, -7932534, 2382312, 7728620, 2241423, -2054509, 4812759, 14934093, 16092158, 9384268, 3376149, -161300, -5051384, -11979225, -19199606, -26837545, -34284878, -38267203, -38083915, -37266795, -36905093, -34672638, -33317868, -39752047, -50030133, -46735489, -21676978, 7255075, 14550523, -1415168, -16912490, -12197613, 7354190, 21235768, 18208193, 7131734, 5032278, 16253060, 26380486, 20335105, 3144463, -5974942, 240670, 8517374, 6120579, -1992022, -4950167, -3764192, -6104774, -11401772, -13664910, -13941238, -17545793, -22180382, -20935536, -15345190, -13611194, -16003809, -13174926, -444485, 15674005, 26928902]
40578B6928902M292069j318011m693908l286024K203982M018499l512707j5536682
40570I096120k3163362k2577876j3329981L549757J9753573K2397347J0806698
40563F532276O73394K643009P754864M537905k011957k518909j962351q498787
40555G149444j4022515p071890K564966l661820j9886802k1606919n408344M996503
40547e6947377j180188m124768J0550393K3983205J3286586j0550783j8617616
40540d3600548o298408N239069M101623L12448L428168Q824311J0897411J2957366
40532d138560J7275109J8072569J1291630J853337m350734p583188r172471p812062
40524A5435630n443480q067816j4977172j5617387m508984Q100879R412411K245744
$$ y = [26928902, 31220971, 29902960, 25209052, 21923028, 24127010, 28145509, 24632802, 9096120, -14067242, -36645118, -49975099, -46425342, -26671769, -4274422, 6532276, 7205670, 9848679, 17603543, 22141448, 20129491, 17610582, 15648231, 7149444, -6873071, -13944961, -11379995, -15041815, -34928617, -56535536, -61943880, -56947377, -58127565, -62252333, -51701940, -27718735, -14432149, -24982932, -43600548, -49898956, -44659887, -40558264, -40245816, -36817648, -27993337, -17095926, -4138560, 13136549, 31209118, 42500748, 44354085, 40003351, 32420163, 23247692, 15435630, 9992150, 1924334, -13052838, -28670225, -33179209, -25078330, -15665919, -13420175]
40516a3420175j64631N820649J0614732P506058J316946k033820m713747r515089
40508d589077j0692070j272334J3492755J9124231R547489m990725j0436243m601666
40500E582360L018234L450636l884192j3240060j7788552j3235850o17570J2935289
40492b3779705J8623041J3059884R47986q947324j0348237m061626K399805J946136
40484a0160040l502217m717848K011560Q929665Q948836P318645J1203343J2975638
40476C3007582m13619k1708415k6018821o152878J3224361R934561l635644j961890
40468c724763J2605005J5250918J56592j0740403m052121N335711J085363r320788
40460F595514j0611602m562796k335544m010091k550754M69255n08699j221690
$$ y = [-13420175, -13584806, -7764157, 2850575, 10356633, 11673579, 9639759, 4926012, -4589077, -15281147, -16553481, -3060726, 16063505, 25610994, 20620269, 10184026, 5582360, 8600594, 12051230, 8167038, -5073022, -22861574, -36097424, -36714994, -23779705, -5156664, 7903220, 8851206, -96118, -10444355, -14505981, -12106176, -10160040, -13662257, -18380105, -16368545, -7438880, 1509956, 8828601, 20031944, 33007582, 32593963, 10885548, -15133273, -21286151, -8061790, 1872771, -1762873, -3724763, 8880242, 24131160, 24287752, 13547349, 9495228, 14830939, 15916302, 6595514, -4016088, -8578884, -10914428, -14924519, -17475273, -17006018, -17514717, -18736407]
40452a8736407N367900J3084074J0130415k82056l652601K435898N618126O88115
40444A4653464k812363R25863M158013J164792r98995L352075O232024o47675
40436B6027198r848540q540273J073723M820743k022202q224670k984153R919981
40428A0221807J7552670J2355338j468165j3403392j6497100j2440632p498745
40421a1178219m747387k760631j130062k461954p157309j0304039o568514L922897
40413d2385218J5474457K0196417J2791575k908300j3376711q834751K940734
40406a6101797N677806j744233l459840P075890J3924868K834679j4251623j5063216
40398b1107466N70217J2500107J1110535O993305Q189292P102018k225037r833629
$$ y = [-18736407, -13368507, -284433, 9845982, 9563926, 5911325, 8347223, 13965349, 14653464, 11841101, 12766964, 16924977, 18089769, 17090774, 20442849, 26674873, 26027198, 16178658, 7638385, 8712108, 13532851, 11510649, 3285979, 301826, 10221807, 27774477, 40129815, 38661650, 25258258, 8761158, -3679474, -11178219, -15925606, -18686237, -19816299, -22278253, -29435562, -39739601, -46308115, -42385218, -26910761, -6714344, 6077231, 3168931, -10207780, -19042531, -16101797, -10423991, -12168224, -15628064, -8552174, 5372694, 8207373, -6044250, -21107466, -20537249, -8037142, 3073393, 10066698, 18255990, 25358008, 23132971, 13299342]
40390A3299342m848544O035288Q321122J740193p70334N907126J1380517N322403
40382D6387113q390470j7521919j5987947q200068k134745j910936n504069o717493
40374a9980534p58744R203189J2717311L753965r001571r934119L544969J5974942
40366E519408J3657189K188374m379671n362986j0798726j9419627j6525581J446552
40358c3675068J6333692J2418888j197457n013366L289589R722662O500184o65507
40350G713617m976643n230655j234652N963259R898322N040803l485210n885928
40342G802913j524441K643826M306450N850478N833755K201739j16709K067680
40334B9065691n78186j5380502k7745630j7078927R500075K3208130J4543562
$$ y = [13299342, 8450798, 14486086, 22807208, 24547401, 23777067, 29684193, 41064710, 46387113, 37996643, 20474724, 4486777, -3713291, -5848036, -7758972, -13263041, -19980534, -20739278, -11536089, 1181222, 4935187, -4066384, -14000503, -10455534, 5519408, 19176597, 21364971, 16985300, 11622314, 823588, -18596039, -35121620, -33675068, -17341376, -4922488, -6119945, -11133311, -7843722, 1878940, 8379124, 7713617, 2736974, -2493681, -3728333, 2234926, 12133248, 17174051, 13688841, 7802913, 6278472, 8922298, 13228748, 19079226, 24912981, 27114720, 26998011, 29065691, 28487505, 13107003, -14638627, -31717554, -22217479, 990651, 15534213]
40327A5534213K592059l81078m526982j3101867q564792J4204902K8713646J4391949
40319D8862050r827045j5239930o011957l280224n149113L571246J4745703P164849
40311C4835579j2507153j5979938k23878P679263l410282j2797649o875210m80154
40303i759422n524274q374186L639820J8317679K0081345J3951539R649154K019762
40295D4001417j2929177k1145041j1446373K292368J918549n791250l442449N807624
40287g34332O179540p28412L58511R781558J2888748O370752J371529J142347
40279C6630241j752787n733603r19955Q091462L659627j5240204k7266178k0468870
40271b3000267q326463m009775J21041J3103686K4252200J9719071O811676K884721
$$ y = [15534213, 18126272, 17745194, 13218212, 116345, -8448447, 5756455, 34470101, 48862050, 39035005, 23795075, 17783118, 14502894, 9353781, 12925027, 27670730, 34835579, 22328426, 6348488, 6124610, 13803873, 10393591, -2404058, -9279268, -9759422, -15283696, -23657882, -20018062, -1700383, 18380962, 32332501, 41981655, 44001417, 31072240, 9927199, -1519174, 773194, 2691743, -3099507, -6541956, -734332, 5445208, 4716796, 5075307, 14856865, 27745613, 34116365, 35487894, 36630241, 34877454, 29143851, 28223896, 36315358, 39974985, 24734781, -2531397, -23000267, -31326730, -35336505, -35215464, -22111778, 2140422, 21859493, 28671169, 31555890]
40263C1555890Q759840J0941088M268433m296198j0295723j4286447j2602326
40256A4044557j643490R367772N833526j0144884j9952977j4381880m871288k523044
40248b4271708j78165J2885159K8390889K6798774N487489j4758542j5258591
40241A9095305j747982N390773k506462j4090506j4989802m951432N388130Q833539
40233D21563O154713o92600j0915927j8876604j4628663L145260K0381336K2135183
40225G124261J1354170M482881Q730525J3467984P416108m998672j1770095j1189035
40217B4618127j1341729j3979780j0386524L137129J4863378J0612722o946931
40210A0576392k0242504j7705287n509478L472658N625312O336940Q295988P875145
$$ y = [31555890, 40315730, 51256818, 55525251, 51229053, 40933330, 26646883, 14044557, 12401067, 21768839, 27602365, 17457481, -2495496, -16877376, -21748664, -24271708, -24449873, -11564714, 16826175, 43624949, 49112438, 34353896, 19095305, 17347323, 22738096, 20231634, 6141128, -8848674, -13800106, -8411976, 421563, 6576276, 5883676, -5032251, -23908855, -38537518, -35392258, -15010922, 7124261, 18478431, 22961312, 31691837, 45159821, 52575929, 47577257, 35807162, 24618127, 13276398, -703382, -11089906, -7952777, 6910601, 17523323, 10576392, -9666112, -27371399, -32880877, -29408219, -23782907, -17445967, -9149979, -1274834]
40202a274834L392999q2769K053281O380586O313850K445901J998634P338216
40194B8565864J0996539N777702m380502r284120o562546m330206q433310j3208924
40186h59503r556150J392637Q813065O340375M60050J942118J1120842J5423638
40178C5077072L682805j7789658k7692316j2878877J3097486K2657794P239722
40171B3394028j1883617j2006645J741590P487526l00946n940961M31547R368280
40163A2290802J0178673N417718n68616j1110992k3822782k3536438m533516J3472252
40155b2212899J0952792n40599L778096K0428693K1743970J178088j4951720q883184
40147A1493237L207248K017216l072351N739036K0740458K0236645L894908q044991
$$ y = [-1274834, 2118165, 2035396, 4088677, 10469263, 16783113, 19229014, 21227648, 28565864, 39562403, 45340105, 40959603, 31675483, 25112937, 20782731, 12349421, -859503, -10415653, -9023016, -209951, 6130424, 6590474, 8532592, 19653434, 35077072, 38759877, 20970219, -6722097, -19600974, -6503488, 16154306, 23394028, 11510411, -496234, 1245356, 8732882, 8431936, 2490975, 2922522, 12290802, 22469475, 27887193, 27318577, 16207585, -7615197, -31151635, -35685151, -22212899, -11260107, -11800706, -8022610, 12406083, 34150053, 35328141, 20376421, 11493237, 14700485, 16717701, 13645350, 19384386, 40124844, 60361489, 64256397, 56211406]
40139E6211406o502684j885367j622595p57776K126211j479333j4483839k6946974
40131D659049k9921456k4216800j1823020P373267K5383669K7634329J2983327
40124A2072365n66915P98602R490647J2038734R041466P064209K723669q380489
40116D4282288j5607900n880976J1674664J4611893J492113m076925R650533K1977715
40108G8123405R859910j6572615k7196436j3197965M155829N688841k603701m826924
40100C3430344L25470J810343l869423p722433l650416J128229l711504j5970194
40092A770416k2281274j4864826j198752O098775N270359N698628J2624601J8210001
40084A1327928J2153012k645806j1739271o833188M050784P363765R54904n082726
$$ y = [56211406, 49708722, 47823355, 46200760, 45442984, 47569195, 46089862, 31606023, 4659049, -25262407, -49479207, -61302227, -53928960, -28545291, -910962, 12072365, 11505450, 12304052, 21794699, 33833433, 42874899, 49939108, 52662777, 44282288, 28674388, 22793412, 34468076, 49079969, 50572082, 46495157, 56145690, 78123405, 87983315, 71410700, 44214264, 31016299, 35172128, 40860969, 38257268, 33430344, 33755814, 35566157, 31696734, 23974301, 20323885, 21452114, 17740610, 1770416, -20510858, -35375684, -36574436, -30475661, -25205302, -19506674, -6882073, 11327928, 23480940, 20835134, 9095863, 2262675, 6313459, 13677224, 14632128, 9549402]
40076I549402l310940J582228J157443l439116k822178O110399J3551790Q713160
40068C1092188n787292j7393130j9411641j5930864j0787597j204449J2352254
40061b7070531J8594736Q110677j0165472j6967276p665168K176031k05733p441945
40053d0634681n548436M121300Q084635K034763l357371Q10599R068125J0073986
40045a5347080J582996p694116q104821J891712J4295993J7768281Q274033n175879
40037G491119q971861q22122O817330K312900r892281j4837981o604726L854650
40029b0652972L287899n555736o505310Q185342K4986277K4436863O340557r653633
40021B4869287r904515k629169j737229n065482j030050Q711736R075529m590559
$$ y = [9549402, 6238462, 7820690, 8978133, 5539017, 2716839, 8827238, 22379028, 31092188, 25304896, 7911766, -11499875, -27430739, -38218336, -39422785, -27070531, -8475795, -365118, -10530590, -27497866, -35163034, -32987003, -33192736, -40634681, -46183117, -42061817, -33977182, -31942419, -35299790, -34489191, -25421066, -15347080, -13764084, -21458200, -29563021, -27671309, -13375316, 4392965, 12666998, 7491119, -1480742, -2302864, 4514466, 6827366, -3064915, -17902896, -24507622, -20652972, -17365073, -22920809, -29426119, -21240777, 3745500, 28182363, 34522920, 24869287, 14964772, 12335603, 10598374, 5532892, 4502842, 13214578, 22290107, 17699548]
40013A7699548j6631374j1482527N760795J6760839J2070963o60590p108215l70415
40005A6039024J2848151J8215038R069439m870849r906288p434796j0048674j8543238
39997E367807j7826623j830030J2541747Q161578p103718j2416368l428348N876279
39989a0657676O533668L990382M452334N722996M152519M77353l618406p131916
39981C921254p315057k548645L078083M721251M003102M239916K935363j618746
39973A1416521j838784P969510J6151899N745761j8652202l3111955k6105989
39966c8425239j1673542o020390o638680k218467R868350K4009690L3205949K9112655
39958C1220326P370084k0006974l0304533j7101307O2373K107960n653950o765760
$$ y = [17699548, 1068174, -10414353, -4653558, 12107281, 24178244, 23517654, 16409439, 16039024, 28887175, 47102213, 56171652, 51300803, 41394515, 33959719, 23911045, 5367807, -12458816, -14288846, -1747099, 6414479, -689239, -13105607, -16533955, -10657676, -4124008, -133626, 4318708, 10041704, 14194223, 14671576, 11053170, 3921254, -3393803, -5942448, -2864365, 1856886, 5859988, 10099904, 13035267, 11416521, 9577737, 17547247, 33699146, 39444907, 20792705, -12319250, -38425239, -50098781, -56119171, -62757851, -64976318, -55107968, -31098278, 2107671, 31220326, 38590410, 18583436, -11721097, -28822404, -28760031, -26652071, -32306021, -39071781]
39950c9071781J375152R482542J3818099J6778230J6326708Q762305j913662q669104
39942A6888489j1133111j1283233o487661K518932N291454l283335r798017j60801
39934a7447283J6134903J7838505L766154o873732m549122P33467J579729M512471
39926A5695092J2739577J6026662P506593l695984o777677m820284o435436j1445001
39918A8793542j4248192j3794862j1954773q595517n169476o328327j1485912
39911e2783517j1970951l253409P240642J1286385J0898986J0319947N618250
39904b2643667o403060j5212096o453228J6054821L0676126K3374203L995358
39897B3388457p235985l856583J405781o112586k4069559l3840463k1094561O536844
$$ y = [-39071781, -37696629, -28214087, -14395988, 2382242, 18708950, 27471255, 25557593, 16888489, 5755378, -5527855, -12015516, -9496584, -4205130, -7488465, -17286482, -17447283, -1312380, 16526125, 20292279, 13418547, 8869425, 9602892, 11182621, 15695092, 28434669, 44461331, 51967924, 48271940, 41494263, 36673979, 30238543, 18793542, 4545350, -9249512, -21204285, -29799802, -34969278, -41297605, -52783517, -64754468, -68007877, -60767235, -49480850, -38581864, -28261917, -22643667, -29046727, -44258823, -50712051, -34657230, -3981104, 19393099, 23388457, 16152472, 12295889, 13701670, 7589084, -16480475, -50320938, -71415499, -64878655]
39889f4878655K6612210K6378971J4204493M993776J970500j107134n772407o529469
39881d127715j523125L529233M694315O300764J2880303J8478838J1443711q610234
39873D3066090k4968285k1340976k889579Q787012L320159n499597r52379J1663081
39865A1185526J3535547Q73804j0372759r091949l012987k231348k044813P044847
39857E885868K0327780K2304833P600396j0669184j5459721m526378P641516O519981
39849C9625091m963452r924812r07115Q036382J817648j0623838q434795O457889
39841B1082998Q581916j1278279k7625212j5824974J1512826K2682239R266169
39834A8397683j0131225k0432591k2260048j6687682l20014K0948637L1390845
$$ y = [-64878655, -38266445, -11887474, 2317019, 7310795, 9281295, 8174161, 2401754, -4127715, -5650840, -2121607, 2572708, 8873472, 21753775, 40232613, 51676324, 43066090, 18097805, -3243171, -6132750, 2654262, 5974421, 474824, -477555, 11185526, 24721073, 25594877, 15222118, 6130169, 3117182, 885834, -1158979, 5885868, 26213648, 48518481, 56118877, 45449693, 29989972, 25463594, 33105110, 39625091, 34661639, 24736827, 23829712, 31866094, 33683742, 23059904, 14625109, 21082998, 29664914, 18386635, -9238577, -25063551, -13550725, 9131514, 18397683, 8266458, -12166133, -34426181, -51113863, -51433877, -30485240, 905605]
39827I05605K4707890J0729734j086180j1699420k1542930k3023673j1719995
39820c2728969M465640J4410522J5121397R674271J680455m032338l340304L03606
39812E554280j095449o700345o278108K339893O643291j762794j2445060j1170374
39804b4914666j138249L761300J047749M24657M651758M721633l439691j0471327
39796b5356836p359963K000255Q443592J0058066J0012947Q044460K325566m068316
39788D099771o806029p780918j0400025r737335J360971J5955106J6658443J396288
39780D746272q466605K413546J7646073J0934335j3139301k3174978p202648R455716
39772f787590K978423j3897812j3870754L103039J2782356M348385p742933r237558
$$ y = [905605, 25613495, 36343229, 35257049, 23557629, 2014699, -21008974, -32728969, -28263329, -13852807, 1268590, 10942861, 12623316, 8590978, 5250674, 5554280, 4458831, -2241514, -8519622, -6179729, 463562, -1299232, -13744292, -24914666, -26052915, -22291615, -21243866, -20819209, -16167451, -11445818, -14885509, -25356836, -32716799, -30716544, -22272952, -12214886, -2201939, 5842521, 8168087, 4099771, -2706258, -10487176, -20887201, -30624536, -29263565, -13308459, 3349984, 4746272, -3720333, -1306787, 16339286, 27273621, 14134320, -9040658, -16243306, -6787590, -3809167, -17706979, -31577733, -28474694, -15692338, -11343953, -19086886, -28324444]
39764b8324444l169028K302549O109530Q192370M914236k495305n688418j486391
39756a9644901L161516L702198N404686J2114039J7219665J3382893L526274n042825
39748C3823545j0463279j3388848j1173773k674549O649819J1412482J2903918
39741B7089315J2980752Q082785k749304j0323607n975113M070924N515813m322602
39733C4368963j3440176j2136305m292694N79880l31588k469148j656622J120000
39725A742310K020216j40174j802392O78292N341246O778098L593402m59070k405965
39716A5345963j596355M009249J4716096K1336943J1562768j1234592k6554481
39709B7585591k1539943o854345J311689L819501R616605J3907394M106970j5814940
$$ y = [-28324444, -31493472, -29190923, -23081393, -14889023, -9974787, -12470092, -18158510, -19644901, -16483385, -12781187, -7376501, 4737538, 21957203, 35340096, 38866370, 33823545, 23360266, 9971418, -1202355, -3876904, 2772915, 14185397, 27089315, 40070067, 48152852, 45403548, 35079941, 29104828, 33175752, 38691565, 34368963, 20928787, 8792482, 4499788, 5079668, 4748080, 2278932, 622310, 1742310, 3762526, 3622352, 1819960, 2498252, 7839498, 14617596, 18210998, 17751928, 15345963, 13749608, 17758857, 32474953, 53811896, 65374664, 54140072, 27585591, 6045648, -808697, 502992, 4322493, 13939098, 27846492, 31953462, 16138522]
39701A6138522k6183751j8782765o503722j896775j768728O18869L020563L398523
39693c1959264Q826935K2665123L1769416K0611343n689386k4772054k2459841
39686a007728n124378J2111333J9381905J3928835j337615j6815057k1279595
39679a42300j3280291l005743P72291M76749K230185M723874L344906J476099
39671c404230P069027J7453361J8560177M403743j1733773j3731251l556121M390467
39663A9451400N085817O034050R665900P575508l071806j1109814q451518m706563
39655B0472974j2471329k5299199k4744022o838113J2611559K0407731K0465566
39648D605167K1136895J9547486P930128j0417499k1728105j8305922p676853
$$ y = [16138522, -10045229, -28827994, -35331716, -37228491, -38997219, -38378350, -35357787, -31959264, -23132329, -467206, 31302210, 51913553, 46224167, 21452113, -1007728, -6132106, 5979227, 25361132, 39289967, 37952352, 21137295, -142300, -13422591, -16428334, -15656043, -15179294, -12949109, -8225235, -4880329, -3404230, 3664797, 21118158, 39678335, 44082078, 32348305, 18617054, 15060933, 19451400, 24537217, 30571267, 40237167, 47812675, 44740869, 33631055, 25179537, 20472974, 8001645, -17297554, -42041576, -48879689, -36268130, -15860399, 4605167, 25742062, 45289548, 53219676, 42802177, 21074072, 2768150, -4908703]
39641d908703k941709p735592j3890710j2779904n357101Q19911J995715J659162
39633d3138931L947952Q076727J0675927R762807M796702k961867q163177m423285
39625b1427145P165911J7158471J8454498J2830777M351152n765592j2934614
39618A9833458q016156Q107971J7770269P724006r281521j0274878L855324Q866213
39610C8584686o359507k3293793k1862171q257192j560058m585867m257060M466543
39602b7124419J1104008P037250j779170l868189L231456J1939601J4014093P092491
39594B1647121n555757j7276968j9993086q851476J0731691K3109730J6756142
39587B0567397o878n767013O715113J8712248J0164784j1376606k0234030p615634
$$ y = [-4908703, -7850412, -15586004, -29476714, -42256618, -47613719, -46793808, -44798093, -43138931, -39190979, -31114252, -20438325, -10675518, -5878816, -8840683, -17003860, -21427145, -14261234, 2897237, 21351735, 34182512, 38533664, 32768072, 19833458, 11817302, 19925273, 37695542, 45419548, 36138027, 25863149, 29718473, 38584686, 32225179, 8931386, -12930785, -21187977, -22748035, -27333902, -31590962, -27124419, -16020411, -8983161, -10762331, -14630520, -11399064, 540537, 14554630, 21647121, 16091364, -1185604, -21178690, -30030166, -19298475, 3811255, 20567397, 20560519, 14793506, 21508619, 40220867, 50385651, 39009045, 18775015, 11159381]
39579A1159381Q947042J2549514O861165K780844p3035p339274j5229191j4647190
39571E009256n803261J738857K248058o03962j046561J458983L027124J138839
39563G167333j076861K022157R069168R433058k986518j7706859j9765073j1318921
39555b5162516p572389j1405745q848546N926011J8593300J6467648O831762K659620
39547b510855L943595N003713O842441R112437L314367j1012048j6827002l857563
39539e990915J0667492O208394p909928p966847M539518P205164l236944o054196
39531b538262N277481J0316020k870573j5970498r242573Q510745J5588962Q079433
39523A7150735j191751l713682j018820L178937N153715J121562p138301j2364062
$$ y = [11159381, 20106423, 32655937, 39517102, 42297946, 42224911, 34885637, 19656446, 5009256, -794005, 944852, 3192910, 2588948, 1542387, 3001370, 6028494, 7167333, 6090472, 8112629, 17181797, 26614855, 23628337, 5921478, -13843595, -25162516, -32734905, -44140650, -52989196, -47063185, -28469885, -12002237, -5170475, -2510855, 1432740, 6436453, 13278894, 22391331, 25705698, 14693650, -2133352, -5990915, 4676577, 10884971, 2975043, -4991804, -452286, 6752878, 3515934, -2538262, 2739219, 13055239, 10184666, -5785832, -15028405, -6517660, 9071302, 17150735, 15958984, 12245302, 11226482, 14405419, 19559134, 20680696, 13542395, 1178333]
39515A178333j1822107r226252m718124M732246J2312847N188310j2576334j8924066
39507c3855147n321777Q973237P206582J142611Q801847K2253216K0118658J850833
39499C1170060j3434997j6481808j4621463j2402134o559816j07350k183953j1293481
39491d5914942j4331786n107130Q708628J8103363K0567586J5833493N461577
39484C320789l955431p504970q953361j0889131n066596J2738869K6265302J7312810
39476B3268281m189352j1545283q53570N747718j960046p959297q11351P193919
39468H891019L991930j636948J659624P467593M867555l449125j0216141j5761553
39460d186046j8045031o989230J5898685K8299808J5354839o574633j2703998
$$ y = [1178333, -10643774, -19870026, -24588150, -19855904, -7543057, -2354747, -14931081, -33855147, -39176924, -30203687, -22997105, -21854494, -13052647, 9200569, 29319227, 31170060, 17735063, 1253255, -13368208, -25770342, -32330158, -32437508, -34621461, -45914942, -60246728, -65353858, -56645230, -38541867, -17974281, -2140788, 3320789, -634642, -8139612, -17092973, -27982104, -33048700, -20309831, 5955471, 23268281, 19078929, 7533646, 6680076, 12427794, 10467748, 2508451, 1697100, 8891019, 12882949, 11246001, 12905625, 20373218, 25240773, 21791648, 11575507, -4186046, -22231077, -29220307, -13321622, 14978186, 30333025, 23758392, 11054394]
39453A1054394l583013L095005K105693P16685q12386o132012p587738L412874
39445B269502J6425322J4496762J883383l283186K36768k240080j1678545j2639117
39437E470809j997880M946088J757523L17061O286296P857708k092576j2974024
39429I571005j4957693j1945823p694779J902998J3775495J4905374N151881K559631
39421A3268089J3523497J8668770M374537j1891978p925642Q292923J2614905
39414E0925101J301563r343170j1306849j0564043r801142o103487k996373o657094
39406d545494j2153852r189324J166136R776381J4846603J9012719J6868565K926286
39398C8708020j2321600j2793222o52301Q233167R775621J2963261J7441086J1773551
$$ y = [11054394, 7471381, 10566386, 12672079, 13388764, 12576378, 6444366, -1143372, 2269502, 18694824, 33191586, 35074969, 31791783, 32028551, 29788471, 18109926, 5470809, 3472929, 8419017, 10176540, 10493601, 16779897, 24637605, 22545029, 9571005, -5386688, -17332511, -25027290, -23124292, -9348797, 5556577, 10708458, 13268089, 26791586, 45460356, 49834893, 37942915, 30017273, 38310196, 50925101, 52226664, 42883494, 31576645, 21012602, 11211460, 5107973, 2111600, -4545494, -16699346, -25888670, -24722534, -14946153, -99550, 18913169, 35781734, 38708020, 26386420, 13593198, 12940897, 21174064, 30949685, 43912946, 61354032, 73127583]
39390G3127583l711998j3584348j1747889r639533j3699549j3585797j835210
39383E323259J1015624J1325102Q2963j2500084j9143498j6184954l886528Q425638
39375a5542478R566719L266474M083615J2499601J1118668o955857k3861548k2341267
39367b8166073r392293j431062p7993K566291O552154P514852Q010112J0772109
39359c651903R009469k524589j4628065j5569381q342089k622749K066330J0282524
39351b5980453J6009317J1127934K369609K105002O723174K528818r509778j3959344
39343h585721n885760K806517M265083M494520Q007968Q838599L331863j742743
39335A5530326j145220M7187l260015o880099n717557l372838n791036j0913090
$$ y = [73127583, 69415585, 55831237, 44083348, 34443815, 20744266, 7158469, 5323259, 16338883, 27663985, 27746948, 15246864, -3896634, -20081588, -23968116, -15542478, -5975759, -2709285, 1374330, 13873931, 24992599, 18036742, -5824806, -28166073, -37558366, -38989428, -39067421, -36501130, -29948976, -22434124, -14424012, -3651903, 5357566, 2832977, -11795088, -27364469, -35706558, -38329307, -36262977, -25980453, -9971136, 1156798, 3526407, 5631409, 12354583, 14883401, 5373623, -8585721, -14471481, -11664964, -7399881, -2905361, 5102607, 13941206, 17273069, 15530326, 14385106, 14432293, 11172278, 4292179, -1425378, -4798216, -10589252, -21502342]
39327b1502342j1390673m502164N017251J0088664P696540K484091L088320J1222793
39319B202480J6883360J0220072m448573j3763994j2028560m467586L655061J1049989
39311I302249J4834670J1870900N846245K873016N61968p285858j6009898j4055073
39303G938219k804140K860374k226548n282059K712011J2097632J1035433L747006
39295C0077928M46028k83923n871050j4086265j6094381j0559953l420052K675858
39287a7115810Q441422J0982565O996283O45623r42965K016866M441063O006992
39279B1472039Q827779Q505004p02486j2094148j0662267N147850J6806482Q030447
39271D5330700j3689542k6500786k1155298r182977m090380l904425J565561J1628455
$$ y = [-21502342, -32893015, -37395179, -32377928, -22289264, -14592724, -12108633, -9020313, 2202480, 19085840, 29305912, 24857339, 11093345, -935215, -5402801, -1747740, 9302249, 24136919, 36007819, 41854064, 44727080, 45289048, 38003190, 21993292, 7938219, 5134079, 7994453, 5767905, 485846, 3197857, 15295489, 26330922, 30077928, 30523956, 30240033, 24368983, 10282718, -5811663, -16371616, -19791668, -17115810, -8674388, 2308177, 9304460, 9950083, 9007118, 11023984, 15465047, 21472039, 30299818, 38804822, 38102336, 26008188, 15345921, 20493771, 37300253, 45330700, 31641158, 5140372, -16014926, -25197903, -29288283, -33192708, -31627147, -19998692]
39263a9998692J2950384j350364j9221522k2767300r534114O444006J2741053
39256d0736549J0074699N969484M565923M951976M057980j098593j0097450j7173894
39248c9486424j6645313j0159320l937957J25328M712722R818752J2673094J3984107
39240b8915011J5816128J4096131L510461r883831j2841079m062075L032050L87918
39232a8859308m572578m367025l529791o836473p784008J45194J0226857J1847623
39224b3729509N806888k749l269584n577782m888113j85808K407001j506856n218253
$$ y = [-19998692, -7048308, -8398672, -27620194, -50387494, -59921608, -53477602, -40736549, -30661850, -24692366, -20126443, -15174467, -11116487, -12215080, -22312530, -39486424, -56131737, -66291057, -70229014, -70103686, -65390964, -55572212, -42899118, -28915011, -13098883, 997248, 4507709, -5376122, -18217201, -22279276, -19247226, -18859308, -23431886, -27798911, -31328702, -38165175, -45949183, -45803989, -35577132, -23729509, -17922621, -17925370, -21194954, -26772736, -31660849, -31846657, -29439656, -30946512, -36164765]
$$ [...]
##END NTUPLES=NMR SPECTRUM
##END=
