##TITLE=31Pdec_LR-784-R2-REG1
 CDCl3, 24 sc
 22.1.2025
##JCAMPDX= 6.0         $$ Bruker NMR JCAMP-DX V2.0
##DATA TYPE= NMR SPECTRUM
##DATA CLASS= NTUPLES
##ORIGIN= UXNMR, Bruker Analytische Messtechnik GmbH
##OWNER= root
$$ XWIN-NMR		Version 3.5
$$ Wed Jan 22 14:02:01 2025 Russian Standard Time (UT+4h)  she@DPX200
##.OBSERVE FREQUENCY= 81.013821
##.OBSERVE NUCLEUS= ^31P
##.ACQUISITION MODE= SIMULTANEOUS
##.ACQUISITION SCHEME= undefined
##.AVERAGES= 24
##.DIGITISER RES= 17
##SPECTROMETER/DATA SYSTEM= spect
##.PULSE SEQUENCE= zgpg30
##.SOLVENT NAME= CDCl3
##.SHIFT REFERENCE= (INTERNAL, CDCl3, 0, 198.062)
##AUDIT TRAIL= $$ (NUMBER, WHEN, WHO, WHERE, WHAT)
$$ ##TITLE= Audit trail, XWIN-NMR		Version 3.5
$$ ##JCAMPDX= 5.01
$$ ##ORIGIN= Bruker BioSpin GmbH
$$ ##OWNER= she
$$ F:/spectra/data/she/nmr/P31/2/pdata/1/auditp.txt
$$ ##AUDIT TRAIL=  $$ (NUMBER, WHEN, WHO, WHERE, WHAT)
(   1,<2025-01-22 14:00:59.34 +0400>,<she>,<DPX200>,
      <created by zg, POWCHK disabled, PULCHK disabled
       configuration hash MD5:
       00 E9 B6 7A A2 85 ED C7 34 08 36 98 17 FE 4E 26
       data hash MD5: 32K
       DF EE 1F 46 C6 1E 06 B1 E2 C8 8B CE 96 77 30 1B>)
(   2,<2025-01-22 14:01:02.07 +0400>,<she>,<DPX200>,
      <Start of raw data processing
       efp BC_mod = 2 LB = 1.5 FT_mod = 6 PKNL = 1 PHC0 = 1827.49 PHC1 = -90.31367 SI = 64K 
       data hash MD5: 64K
       B6 B0 E9 0A 5C E3 40 47 63 CA B6 6A 69 3F F4 C2>)
(   3,<2025-01-22 14:01:27.56 +0400>,<she>,<DPX200>,
      <pk PHC0 = -103.8276 PHC1 = 282.4002 
       data hash MD5: 64K
       F9 E0 B7 C6 B2 C6 DE 29 7F DB 5E 82 2A EC 41 49>)
(   4,<2025-01-22 14:01:33.15 +0400>,<she>,<DPX200>,
      <abs ABSG = 5 
       data hash MD5: 64K
       0B 33 3D C2 B0 85 98 F4 F0 93 5A 58 93 D5 01 F9>)
$$ ##END=
$$ 
$$ hash MD5
$$ 39 01 94 9E 54 07 16 91 5A 6A 7A 14 85 9F D7 29
##$RELAX= 
##$RELAX= 
##$RELAX= 
##$RELAX= 
##$RELAX= 
##$RELAX= 
##$RELAX= 
##$RELAX= 
$$ Bruker specific parameters
$$ --------------------------
##$DU= <F:/spectra>
##$EXPNO= 2
##$NAME= <P31>
##$PROCNO= 1
##$TYPE= <nmr>
##$USER= <she>
##$AMP= (0..31)
100 100 100 100 100 100 100 100 100 100 100 100 100 100 100 100 100 100 
100 100 100 100 100 100 100 100 100 100 100 100 100 100 
##$AQSEQ= 0
##$AQ_mod= 1
##$AUNM= <au_zg>
##$AUTOPOS= <>
##$BF1= 81.014009
##$BF2= 200.13
##$BF3= 200.13
##$BF4= 200.13
##$BF5= 200.13
##$BF6= 200.13
##$BF7= 200.13
##$BF8= 200.13
##$BYTORDA= 1
##$CFDGTYP= 0
##$CFRGTYP= 5
##$CHEMSTR= <none>
##$CNST= (0..31)
1 1 145 1 1 1 1 1 1 1 1 1 1 1 1 1 1 1 1 1 1 1 1 1 1 1 1 1 1 1 1 1 
##$CPDPRG= <waltz16>
##$CPDPRG1= <>
##$CPDPRG2= <waltz16>
##$CPDPRG3= <>
##$CPDPRG4= <mlev>
##$CPDPRG5= <mlev>
##$CPDPRG6= <mlev>
##$CPDPRG7= <mlev>
##$CPDPRG8= <mlev>
##$CPDPRGB= <>
##$CPDPRGT= <>
##$D= (0..31)
0 1 0 0 0 0 0 0 0 0.06 0 0.03 2e-05 3e-06 0 0 0.0002 0 0 0 0 0 0 0 0 0 
0 0 0 0 0 0 
##$DATE= 1737540058
##$DBL= (0..7)
120 120 120 11 120 120 24 19 
##$DBP= (0..7)
150 150 150 150 150 150 150 150 
##$DBP07= 0
##$DBPNAM0= <>
##$DBPNAM1= <>
$$ [...]
##$SUBNAM3= <"">
##$SUBNAM4= <"">
##$SUBNAM5= <"">
##$SUBNAM6= <"">
##$SUBNAM7= <"">
##$SUBNAM8= <"">
##$SUBNAM9= <"">
##$SW= 400.765351723535
##$SWIBOX= (0..15)
0 1 3 0 0 0 0 0 0 0 0 0 0 0 0 0 
##$SW_h= 32467.5324675325
##$TD= 32768
##$TD0= 1
##$TE= 0
##$TE2= 300
##$TE3= 300
##$TEG= 300
##$TL= (0..7)
0 120 53 12 22 120 120 120 
##$TP= (0..7)
150 150 150 150 150 150 150 150 
##$TP07= 0
##$TPNAME0= <>
##$TPNAME1= <>
##$TPNAME2= <>
##$TPNAME3= <>
##$TPNAME4= <>
##$TPNAME5= <>
##$TPNAME6= <>
##$TPNAME7= <>
##$TPOAL= (0..7)
0.5 0.5 0.5 0.5 0.5 0.5 0.5 0.5 
##$TPOFFS= (0..7)
0 0 0 0 0 0 0 0 
##$TUNHIN= 0
##$TUNHOUT= 0
##$TUNXOUT= 0
##$USERA1= <user>
##$USERA2= <user>
##$USERA3= <user>
##$USERA4= <user>
##$USERA5= <user>
##$V9= 5
##$VALIST= <valist>
##$VCLIST= <CCCCCCCCCCCCCCC>
##$VD= 0
##$VDLIST= <DDDDDDDDDDDDDDD>
##$VPLIST= <PPPPPPPPPPPPPPP>
##$VTLIST= <TTTTTTTTTTTTTTT>
##$WBST= 1024
##$WBSW= 4
##$XGAIN= (0..3)
0 0 0 0 
##$XL= 0
##$YL= 0
##$YMAX_a= 6441
##$YMIN_a= -7714
##$ZGOPTNS= <>
##$ZL1= 120
##$ZL2= 120
##$ZL3= 120
##$ZL4= 120
##$ABSF1= 198.0616
##$ABSF2= -202.7028
##$ABSG= 5
##$ABSL= 3
##$ALPHA= 0
##$AQORDER= 0
##$ASSFAC= 0
##$ASSFACI= 0
##$ASSFACX= 0
##$ASSWID= 0
##$AUNMP= <proc_1d>
##$AZFE= 0.1
##$AZFW= 0.5
##$BCFW= 0
##$BC_mod= 2
##$BYTORDP= 0
##$COROFFS= 0
##$CY= -3
##$DATMOD= 1
##$DC= 0
##$DFILT= <>
##$DTYPP= 0
##$F1P= 0
##$F2P= 0
##$FCOR= 1
##$FTSIZE= 65536
##$FT_mod= 6
##$GAMMA= 0
##$GB= 0
##$INTBC= 1
##$INTSCL= 9.790993e-09
##$ISEN= 30
##$LB= 1.5
##$LEV0= 0
##$LPBIN= 0
##$MAXI= 10000
##$MC2= 0
##$MEAN= 0
##$ME_mod= 0
##$MI= 50
##$NCOEF= 0
##$NC_proc= -9
##$NLEV= 6
##$NOISF1= 182.463
##$NOISF2= 159.3651
##$NSP= 0
##$NTH_PI= 0
##$NZP= 0
##$OFFSET= 198.0616
##$PC= 4
##$PHC0= 1723.662
##$PHC1= 192.0865
##$PH_mod= 1
##$PKNL= yes
##$PPARMOD= 0
##$PSCAL= 0
##$PSIGN= 0
##$REVERSE= no
##$SF= 81.0140089999434
##$SI= 65536
##$SIGF1= 159.3651
##$SIGF2= -187.1042
##$SINO= 113.3802
##$SIOLD= 16384
##$SREGLST= <1H.CDCl3>
##$SSB= 0
##$STSI= 65536
##$STSR= 0
##$SW_p= 32467.5324675325
##$SYMM= 0
##$S_DEV= 0
##$TDeff= 32768
##$TDoff= 0
##$TI= <>
##$TILT= no
##$TM1= 0
##$TM2= 0
##$TOPLEV= 0
##$USERP1= <user>
##$USERP2= <user>
##$USERP3= <user>
##$USERP4= <user>
##$USERP5= <user>
##$WDW= 1
##$XDIM= 65536
##$YMAX_p= 322851725
##$YMIN_p= -65651513
$$ End of Bruker specific parameters
$$ ---------------------------------
##NTUPLES= NMR SPECTRUM
##VAR_NAME=  FREQUENCY,     SPECTRUM/REAL,   SPECTRUM/IMAG
##SYMBOL=    X,             R,               I
##VAR_TYPE=  INDEPENDENT,   DEPENDENT,       DEPENDENT
##VAR_FORM=  AFFN,          ASDF,            ASDF
##VAR_DIM=   65536,         65536,           65536
##UNITS=     HZ,            ARBITRARY UNITS, ARBITRARY UNITS
##FACTOR=    0.49542278885378, 1,            1
##FIRST=     16045.7642231865, 0,            0
##LAST=      -16421.768244346, 0,            0
##MIN=       -16421.768244346, -65651513,    0
##MAX=       16045.7642231865, 322851725,    0
$$ Real data points
##PAGE= N=1
##DATA TABLE= (X++(R..R)), XYDATA
$$ [...]
44842A607625J117027m85640k981870m074875l042721p82312J037805J137782
44834f467179l15062j924134k603739k410632j592731K61962L305103O334078
44826e412334P683392O930674M831983J948143j458040m284768m875448l040820
44818B322782o60420N37628Q53087J333689J652782Q59068l43275k12198Q78377
44809G221520K42550k866062m872297k063569M024585Q094059P489293M258962
44801B1529041Q88040k455125n285764n223085j811545R72193l97147l606812
44793D609796l942020j588381p90094k323306k276112P18845K582797O98384j254343
44784c564434O27658L479813J913341l037452m822272q28934M109484M598310
$$ plain form
44842 1607625 2724652 2239012 -742858 -4817733 -7860454 -8642766 -7604961 -6467179
44834 -6467179 -6782241 -8706375 -11310114 -13720746 -15313477 -15051515 -11746412 -5412334
44826 -5412334 2271058 9201732 14033715 15981858 14523818 10239050 5363602 2322782
44818 2322782 1662362 2199990 3053077 4386766 6039548 6898616 6555341 6343143 7221520
44809 7221520 7464070 4598008 -274289 -2337858 1686727 9780786 17270079 21529041
44801 21529041 22417081 19961956 14676192 9453107 7641562 8613755 8216608 4609796
44793 4609796 667776 -920605 -1710699 -4034005 -6310117 -5591272 -3008475 -2310091 -3564434
44784 -3564434 -2936776 543037 2456378 -581074 -5403346 -6232280 -2122796 2475514
44776B475514J078670k225248k727034r47031J412888K936252K911482J523726
44768F439219n38912k690609m153828l756646j337136J183366J711841N91135
44760b551570k70053k98733l75119n61594K2077J216922J937872K163542K574833
44751C858177K454190N95549j756288j951564l30164k59504k713328m102427j402523
44742e607882L248497N374895L708844P91530n99036K00946J929786K523360Q75806
44733A2446746j720496k918893k354607j682699j443779k95362K000451L453229
44725G484590K785835J037309p70642k843566m425362l605136q97809K88709j268394
44716b214466k460893j055360O68945M37401K84384K409708M182152K041124k218400
$$ plain form
44776 2475514 3554184 1328936 -1398098 -2345129 -932241 2004011 4915493 6439219
44768 6439219 5900307 3209698 -944130 -4700776 -6037912 -4854546 -3142705 -2551570
44760 -2551570 -2821623 -3120356 -3495475 -4057069 -4034992 -2818070 -880198 1283344 3858177
44751 3858177 6312367 6907916 5151628 3200064 2869900 2610396 -102932 -4205359 -5607882
44742 -5607882 -2359385 3015510 6724354 7515884 6916848 7117794 9047580 11570940 12446746
44733 12446746 10726250 7807357 5452750 3770051 2326272 2030910 4031361 7484590
44725 7484590 10270425 11307734 10537092 7693526 3268164 -336972 -1234781 -946072 -2214466
44716 -2214466 -4675359 -5730719 -5061774 -4624373 -4339989 -1930281 2251871 4292995 2074595
44707B074595m041405k980701j951200j389651M02035K273918J343991j243579
44699e511997j230566J926818M470041M888472N461028O367819M114571k072574
44691A8413612p396471p715184m550706j584528q2194k4488j727754l692818k609086
44682a0969617J660930M569038L158033L71627Q7201J414914J537208R10091J400898
44673D140323J885031K42461k123909k269160q97931j109376k690604k105300
44665d928465J724797N545901O305280M433420K023243M32133J84897Q43634O04199
44656A7169039j751959m411983m465761k378985j734786l914681n875874m485112
44648a1850102o28344K640405M020165M038080K772122N4191k511057k267149
$$ plain form
44707 2074595 -1966810 -4947511 -6898711 -8288362 -7886327 -5612409 -4268418 -5511997
44699 -5511997 -6742563 -4815745 -345704 4542768 10003796 16371615 20486186 18413612
44691 18413612 11017141 3301957 -1248749 -2833277 -2915471 -2939959 -4667713 -8360531 -10969617
44682 -10969617 -9308687 -4739649 -1581616 -1209989 -1122788 292126 1829334 2739425 4140323
44673 4140323 6025354 6267815 4143906 1874746 976815 -132561 -2823165 -4928465
44665 -4928465 -3203668 2342233 8647513 13080933 15104176 15536309 15721206 16564840 17169039
44656 17169039 15417080 11005097 6539336 4160351 2425565 -1489116 -7364990 -11850102
44648 -11850102 -12478446 -9838041 -5817876 -1779796 992326 1046517 -1464540 -3731689
44640c731689R36022L580179K316725j759792m273967l002240m21517j1653j644030
44631h011962k391819r04782J242309K229014J791185L42250j486010k269641
44623i459456j057481O23722N86316j30236J488944M860767N714133L032594J319136
44614F978439L096504M060728K98063l962593k191775L440162M277588j905334
44606A4091782p335295n290259J248555M922798L493415N60592l35953Q70469
44598A2226104J871043N53018k588662m228646k268994J40225j983997p577042
44590c856951r389198l676982M060504O145310K240929j870444k516761r77622
44582i841215M79539J219142J097670R3674o35447J44299J487192J354583q7056
$$ plain form
44640 -3731689 -2795667 784512 3101237 1341445 -2932522 -5934762 -6356279 -6367932 -8011962
44631 -8011962 -10403781 -11308563 -10066254 -7837240 -6046055 -5703805 -7189815 -9459456
44623 -9459456 -10516937 -9893215 -9306899 -9437135 -7948191 -3087424 2626709 5659303 6978439
44614 6978439 10074943 14135671 14433734 10471141 8279366 11719528 15997116 14091782
44606 14091782 6756487 1466228 2714783 7637581 11130996 11691588 11355635 12226104
44598 12226104 14097147 14650165 12061503 7832857 5563863 5704088 3720091 -3856951
44590 -3856951 -13246149 -16923131 -12862627 -6717317 -4476388 -6346832 -8863593 -9841215
44582 -9841215 -9361676 -8142534 -7044864 -6951190 -7586637 -7442338 -5955146 -4600563 -4687619
44573d687619n15007J077427L073859L672707K748056J023613p72556j563261
44565D057219n02338J490961K212522Q17485j097963j457312J92296K629348L937438
44556A2279656K585880j117190m518002m932432k719216p56824p22850j441047
44548a342025j276401m57989j82937p68726j587745j799917o03972J973360M063376
44539a982976L398012N40350j211164k58309J103527N79593m64214Q5638P68744
44530B559201q96863k859056n47190N188393P405905K585833l733825m480526
44522E221872p41603P70074k052028m353622k188652K113164M055960K945136
44514E770301J504628J614769K475013K065367o68059m392961o034426m106058
$$ plain form
44573 -4687619 -5202626 -4125199 -1051340 2621367 5369423 6393036 5620480 4057219
44565 4057219 3554881 5045842 7258364 8075849 6977886 5520574 5712870 8342218 12279656
44556 12279656 14865536 13748346 9230344 4297912 1578696 821872 99022 -1342025
44548 -1342025 -2618426 -3076415 -3259352 -4028078 -5615823 -7415740 -8019712 -6046352 -1982976
44539 -1982976 1415036 1955386 744222 485913 1589440 2169033 1704819 1790457 2559201
44530 2559201 1662338 -1196718 -1743908 3444485 10850390 13436223 9702398 5221872
44522 5221872 4480269 5250343 3198315 -1155307 -3343959 -1230795 2825165 5770301
44514 5770301 7274929 8889698 11364711 13430078 12762019 8369058 2334632 -1771426
44506a771426j104643n10315j669633p25846K916319M864939K304822j331379
44498B972838j310591J572723K846305J198262n61022n39849J25427K08845M7816
44489F560754j49491p23248p94626J179419M391236N717065L628018j9223k721883
44480A7068021l753375l329492j729068j20775l1680r66372o50220J341802K438192
44471A0267033Q77339j508036k018431p84255J16249k06816j022686j556347j361823
44462B802227j10391J558161J990592O51135q27407j005210o61317r13611q59005
44453B625174P62813K690261K389827k72768k796857l285865k017369k675K050357
44444B142898L279458K957988J522488M5846j149691k017726j536310R86364L552487
$$ plain form
44506 -1771426 -2876069 -3386384 -5056017 -5781863 -2865544 1999395 4304217 2972838
44498 2972838 1662247 3234970 6081275 7279537 6718515 6178666 6304093 6512938 6560754
44489 6560754 6411263 5688015 4893389 6072808 10464044 16181109 19809127 19789904 17068021
44480 17068021 13314646 9985154 8256086 8135311 8103631 7137259 6487039 7828841 10267033
44471 10267033 11144372 9636336 7617905 6833650 6949899 6743083 5720397 4164050 2802227
44462 2802227 2691836 4249997 6240589 6891724 6064317 5059107 4397790 3484179 2625174
44453 2625174 3387987 6078248 8468075 8195307 5398450 2112585 95216 92541 2142898
44444 2142898 5422356 8380344 9902832 9948678 8798987 6781261 5244951 6231315 9783802
44435I783802K909322j035760m401220l923185n50136K596311L977741L781912
44427A3138787J925279j725040n529990o610082l846941O37933L452722K885331
44419D327999j03471l061143l929514k352505L29866K379794L083043K908612
44411C582681K484677J837484P39013o09604j625085j930499j564278p18026K99672
44402B496035Q81983N25960l71495p50093l11338o0143q53796k089580k615542
44393c148009k231089j255888N68803L195355M910576L898032J025070j073704
44385E889146j742778k625391l897353l358936o24492J085304k51189j853614
44377g379303o33851J329149J91628k527141j634790L043335N353549J901600
$$ plain form
44435 9783802 12693124 11657364 7256144 3332959 2782823 5379134 9356875 13138787
44427 13138787 15064066 13339026 7809036 1198954 -2647987 -2010054 1442668 4327999
44419 4327999 4224528 1163385 -2766129 -5118634 -4788768 -2408974 674069 3582681
44411 3582681 6067358 7904842 8643855 8034251 6409166 4478667 2914389 2196363 2496035
44402 2496035 3378018 3903978 3532483 2782390 2471052 2410909 1557113 -532467 -3148009
44393 -3148009 -5379098 -6634986 -6066183 -2870828 2039748 5937780 6962850 5889146
44385 5889146 4146368 1520977 -2376376 -5735312 -6359804 -5274500 -5525689 -7379303
44377 -7379303 -8013154 -6684005 -6492377 -9019518 -10654308 -7610973 -2257424 -355824
44369c55824k609943k281254J635381L305597P79972k321438k474692J87017L656803
44360d78381O090876N905575K742418j119017k668879j970038j857642l458362
44352C186550m548743l317805j246347n67350q30453m0856K080969L991011M590090
44343C297066L729274J257414k292292m503909l025389Q76835K849351N20908
44335B709258l512927m862763k300224J597701L758307L228203J083620q59960
44327H41215j276724k64438Q37831J109442J251404K378783L918082L842031J257731
44318A3895357k107305l555958k225701Q1650P61499r29761k971339k592082N36127
44309H92487L554453L481567O54540j809708j856378o13061k82094j043972j123430
$$ plain form
44369 -355824 -2965767 -5247021 -3611640 -306043 473929 -1847509 -4322201 -4135184 -478381
44360 -478381 5612495 11518070 14260488 13141471 10472592 8502554 6644912 3186550
44352 3186550 -1362193 -4679998 -5926345 -6493695 -7324148 -7365004 -5284035 -1293024 3297066
44343 3297066 7026340 8283754 5991462 1487553 -1537836 -661001 2188350 2709258
44335 2709258 -803669 -5666432 -7966656 -6368955 -2610648 617555 1701175 841215
44327 841215 -435509 -699947 137884 1247326 2498730 4877513 8795595 12637626 13895357
44318 13895357 11788052 8232094 6006393 6088043 6849542 5919781 2948442 356360 892487
44309 892487 4446940 7928507 8583047 6773339 4916961 4303900 4021806 2977834 1854404
44300A854404M80476K482621K855070J205819r87547k265624k536733k317863
44292G70623j490096K02356J757563J395094j123608l704989m138520k317394
44284h648971L32858K629018L897260L461456J317157j082268k029996j474754
44276a598240p88898q81929j458485j826202j508076l85606R50710J535555J482954
44267d478217K129818L657069L944958J603233j150176j149295R57459J467086
44259F981935j009456l800644m132462k189156L33508K247150K760979J684189
44251B876043M45049P47325J771101J114131j149159k244478j154249r1386m51864
44242A862513o20357O27807J753108J384092O47467O22685M17982k90568j8875
$$ plain form
44300 1854404 2334880 4817501 7672571 8878390 7890843 5625219 3088486 770623
44292 770623 -719473 -517117 1240446 2635540 1511932 -2193057 -6331577 -8648971
44284 -8648971 -8316113 -5687095 -1789835 1671621 2988778 1906510 -123486 -1598240
44276 -1598240 -2387138 -3269067 -4727552 -6553754 -8061830 -8447436 -7496726 -5961171 -4478217
44267 -4478217 -2348399 1308670 5253628 6856861 5706685 4557390 5514849 6981935
44259 6981935 5972479 2171835 -1960627 -4149783 -3816275 -1569125 1191854 2876043
44251 2876043 3321092 4068417 5839518 6953649 5804490 3560012 2405763 2314377 1862513
44242 1862513 1242156 1869963 3623071 5007163 5654630 6277315 6695297 6404729 6385854
44233F385854J100122K18261l268541n358589l179313O52761K876658M526004
44225C953217O509100M869233k972150j0592952r048218L03216P039670N579639
44217E640755M78928k711312m128275m975205l502749N01738K805298O66072k342402
44208g567152j405045K771771N749830N288821K466236p84030k617587j918048
44200A984796j24261j64225j944103j839776J518015M470252L842522J712885
44192I456105J528970K691602K645484J569911R96430O2103k590076m882745l703233
44183G774551k98450R49292j157408l360492l110273j524329o05835m21146k1504
44174a775594P91562J407972J028738o05102k198145j487101J800284M658852
$$ plain form
44233 6385854 7485976 7704237 4435696 -922893 -4102206 -3449445 -572787 3953217
44225 3953217 10462317 15331550 12359400 1766448 -7281770 -6978554 61116 5640755
44217 5640755 6119683 3408371 -719904 -5695109 -9197858 -8696120 -5890822 -5224750 -7567152
44208 -7567152 -8972197 -6200426 -450596 4838225 7304461 6520431 3902844 1984796
44200 1984796 1860535 1696310 -247793 -2087569 -569554 3900698 7743220 9456105
44192 9456105 10985075 13676677 16322161 17892072 18888502 18950605 16360529 11477784 7774551
44183 7774551 7476101 8425393 7267985 3907493 797220 -727109 -1332944 -1754090 -1775594
44174 -1775594 -984032 423940 1452678 847576 -1350569 -2837670 -1037386 3621466
44166C621466M183905J205154j199589j626480q53040K21175Q52448m6050k150991
44157D207998k726439k14873K387703J158044k572885l631408o27405J982170
44149c7095N95615k518891l049013o74092J412728J424220P24758J026152J986597
44140H90979K204333J426690O92772L89673o47123l058830m785397l022928J428226
44131d481605M130402K468719r72052k036491L1192L087272N377619N866737L352226
44122A6824019j544651m940176l665350K17050K151830J378786P48775J025627
44114A2195910l5774k522419k997159j23653K209114P3951m728072o828375l900813
44105f657290J041058L433897J954474m20571r705K789722L596119K04772l365384
$$ plain form
44166 3621466 7805371 9010525 7810936 6184456 5331416 5552591 6405039 6358989 4207998
44157 4207998 1481559 1266686 3654389 4812433 2239548 -1391860 -2019265 -37095
44149 -37095 558520 -1960371 -5009384 -5683476 -4270748 -2846528 -2121770 -1095618 890979
44140 890979 3095312 4522002 5214774 5604447 4957324 1898494 -2886903 -5909831 -4481605
44131 -4481605 -351203 2117516 1145464 -891027 -859835 2227437 7605056 13471793 16824019
44122 16824019 15279368 10339192 6673842 6890892 9042722 10421508 11170283 12195910
44114 12195910 12160136 9637717 6640558 6516905 8726019 8799970 4071898 -2756477 -6657290
44105 -6657290 -5616232 -2182335 -227861 -648432 -658137 2131585 5727704 5932476 2567092
44096B567092k063896K446797L703953r4312l599647k558761M47190J178913K75672
44087B303001P54066K156573J689553m96880j497964n95898k36105j754984l182144
44078h60782k232298N36057K529092J974681n67817k839771k810399m64274K267308
44069b468203L441808K641477P87284o24812k24701J866216L293827J908779p70647
44060I851028r09044J928301L212456l21139n355986o095829k294455N36986j011747
44051d59429l761629k893676J141337L358881J192767k044942j823058J342303
44043c947446K827920P78895j215905J23827K452177J628319j217231j168189
44035B62367K409370M511182K353332m95561l74911O47654j030556m152456m930411
$$ plain form
44096 2567092 503196 2949993 6653946 6559634 2959987 401226 848416 2027329 2303001
44087 2303001 3057067 5213640 6903193 6406313 4908349 4312451 4076346 2321362 -860782
44078 -860782 -3093080 -2557023 -27931 1946750 1378933 -1460838 -4271237 -4735511 -2468203
44069 -2468203 973605 3615082 4402366 3777554 3552853 5419069 8712896 10621675 9851028
44060 9851028 8941984 10870285 14082741 13761602 8405616 2309787 15332 552318 -459429
44051 -459429 -4221058 -7114734 -5973397 -2614516 -1421749 -3466691 -5289749 -3947446
44043 -3947446 -1119526 -340631 -1556536 -1432709 1019468 2647787 1430556 262367
44035 262367 2671737 7182919 9536251 9040690 8665779 9313433 8282877 4130421 -799990
44026g99990l313534k187637j868620k48353K232687K583595N03281p84791J91772
44017c691590J072301K10163m58015Q51852K301302J334030j077261j793189Q026
44008a242381J944026J515661j413813m709362n517221k586912J914954L925765
44000f169283K014717p04208o30450J563295K377981R32682J15641J867006M045476
43991E412857L539223N29868k321093l538278l444611k185046P0734J390164k11132
43982g57314k912202k428641J485956L545976L87553m003563m011514n84689J128626
43973h149812K97862P00007L113941L772953J405272l15070M33415J44316l384334
43964a981450o158500m049499N20032K716995K563660K950112L404779J538680
$$ plain form
44026 -799990 -4113524 -6301161 -8169781 -8418134 -6185447 -3601852 -3098571 -3883362 -3691590
44017 -3691590 -2619289 -2409126 -2867141 -2015289 286013 1620043 542782 -1250407 -1242381
44008 -1242381 701645 2217306 803493 -3905869 -9423090 -12010002 -10095048 -6169283
44000 -6169283 -4154566 -4858774 -5489224 -3925929 -1547948 -615266 -499625 1367381 5412857
43991 5412857 8952080 9481948 7160855 3622577 177966 -2007080 -1936346 -546182 -757314
43982 -757314 -3669516 -6098157 -4612201 -1066225 -678672 -4682235 -8693749 -9278438 -8149812
43973 -8149812 -7851950 -7151943 -4038002 -265049 1140223 825153 1258568 1402884 -1981450
43964 -1981450 -8139950 -12189449 -11669417 -8952422 -6388762 -3438650 -33871 1504809
43956A504809j338714j832657m70735n53898j912546j470938N25029Q76259L8163
43947d635228J881228N863750O227545J428032k129400L31327M245034K705489
43939A5917777k977725n574813k441850J990174L423078K250696M72346j684700
43931A1374983m468203o554081o062123k727285J585629M116898L315490M62415
43923A043723j358113o57289R42281J386877J016173J248940J747080J033648
43915F403320o58366j391402m84509M21132j90745j601473j995861q92587M15199
43906B4708O94983M22691J068907K705486L206118Q16957l047055n136774m404047
43897c648026k866116k162219j457889K10193J694480J623125Q74368J114700
$$ plain form
43956 1504809 166095 -1666562 -2137297 -2691195 -4603741 -6074679 -5549650 -4673391 -4635228
43947 -4635228 -2754000 3109750 9337295 10765327 8635927 8967254 13212288 15917777
43939 15917777 12940052 7365239 4923389 6913563 10336641 12587337 13059683 11374983
43931 11374983 6906780 352699 -5709424 -8436709 -6851080 -2734182 581308 1043723
43923 1043723 -314390 -971679 -29398 1357479 2373652 3622592 5369672 6403320
43915 6403320 5744954 4353552 3869043 4290175 4099430 2497957 502096 -390491 24708
43906 24708 719691 1142382 2211289 4916775 8122893 8939850 5892795 756021 -3648026
43897 -3648026 -6514142 -8676361 -10134250 -9924057 -8229577 -6606452 -5732084 -4617384
43889d617384K063906K345427K155049K792576L989321L928083J888559r75860
43881A3569677l378059m611667l844556r67761J787586J595114r62261k070290
43873A117783O1267K553943K158567p1611q93271L6761L85422k42988M95886L211295
43863H813054M718362K259917k422097n317217m916515k680018j02088K134165
43855B487563K880126J333029p92705o36304J662748K700404O17840k273227l033648
43846D945826j953595j014119m80435O56583K168087K820069K325877J184208
43838A0652501o09514k951188m648096m739113l766249k236424M91155L807349
43830c999579M548569J121517k996632l589768j862173j831315k958858j064279
$$ plain form
43889 -4617384 -2553478 -208051 1946998 4739574 8728895 12656978 14545537 13569677
43881 13569677 10191618 5579951 1735395 767634 2555220 4150334 3188073 1117783
43873 1117783 1179050 3732993 5891560 5819949 4926678 4963439 5348861 5105873 5601759 8813054
43863 8813054 13531416 15791333 13369236 8052019 3135504 455486 353398 2487563
43855 2487563 5367689 6700718 5908013 5271709 6934457 9634861 10252701 7979474 4945826
43846 4945826 2992231 1978112 1497677 2154260 4322347 7142416 9468293 10652501
43838 10652501 10042987 7091799 2443703 -2295410 -6061659 -8298083 -7806928 -3999579
43830 -3999579 548990 1670507 -1326125 -4915893 -6778066 -8609381 -11568239 -12632518
43822a2632518L513600M994498J077765l050010k478115P71006K386133K473247
43814b944394L256953L816662K070871n38399j183026o34088j477392k833104
43806d65917j650060J563292L030505J531103m48668j409989k287581k801780
43798b939095r53336K537663L522319K52042l515668l614652q78100J064567J112055
43789c412205J045590K037496L431772M266377L936985J923760j326192l716888
43781H186695l445449j422952k47596q84534j839137j706295j033126j075139
43773c467533j851739k322548j898030r84870l35515m60086j350788k131946j409973
43764a6213028J021474L135933K763869P10756j09778R00994R86151j173196k518701
$$ plain form
43822 -12632518 -9118918 -4124420 -3046655 -6096665 -8574780 -7803774 -5417641 -2944394
43814 -2944394 312559 4129221 6200092 5661693 4478667 3844579 2367187 -465917
43806 -465917 -2115977 -552685 2477820 4008923 3560255 2150266 -137315 -2939095
43798 -2939095 -3892431 -1354768 2167551 2419593 -1096075 -4710727 -5588827 -4524260 -3412205
43789 -3412205 -2366615 -329119 3102653 7369030 11306015 13229775 11903583 8186695
43781 8186695 4741246 3318294 3070698 2186164 347027 -1359268 -2392394 -3467533
43773 -3467533 -5319272 -7641820 -9539850 -10524720 -10860235 -11320321 -12671109 -14803055 -16213028
43764 -16213028 -15191554 -12055621 -9291752 -8580996 -8690774 -7789780 -6803629 -7976825 -10495526
43755a0495526l58128K512014J770609r67573k24379L982678N276043J236891
43747B732629j911842J028761N441738L613827l499597p894089o081154k401096
43739h970823r83898n86347J226397L686858M655061L495201O56223k876269m874065
43730d571662l437902K598J939393J380611L31759k32420j174629j726992L65872
43721g123372M053155M816970J376142j598266j57761L240140L872591J398814
43713I878413j070817j926470j524524J42929K613941L437306J002660k377253
43705A0176185l457703k807491l110956l916519k086977K712643O658228O405883
43697A0573293K371355k717328n910700m905444K1556M644356M426082J56644
$$ plain form
43755 -10495526 -10853654 -8341640 -6571031 -7538604 -7762983 -3780305 1495738 2732629
43747 2732629 820787 1849548 7291286 10905113 7405516 -488573 -6569727 -8970823
43739 -8970823 -9954721 -10541068 -9314671 -5627813 -972752 2522449 3178672 302403 -4571662
43730 -4571662 -8009564 -8006966 -6067573 -4686962 -4355203 -4587623 -5762252 -7489244 -7123372
43721 -7123372 -3070217 1746753 3122895 1524629 1366868 4607008 8479599 9878413
43713 9878413 8807596 6881126 5356602 5499531 8113472 11550778 12553438 10176185
43705 10176185 6718482 3910991 800035 -3116484 -5203461 -2490818 4167410 10573293
43697 10573293 12944648 10227320 4316620 -588824 -567268 4077088 8503170 8659814
43689H659814k902932k097694l71110j008351k751147k430039M9149K057826K091487
43680A297003Q51492n47256j374085j009074L43163J295927J114055R88676J871446
43671D831347K217007J20496l155560m449067l140760j485525m76257J332242
43663d206077M002053M731403K306716K4488J117636L511550K875222m65416j988461
43654A1909114k18859R70535j379522m655476m678713j510193J546062K758336
43646D741284K907682K697139K075844J590913J929299K253345J001068j714376
43638A7482198m134273n052454m474425k542598L83070K709349K435733o43737
43630F162863m485800o454624m987167o90575L296535L557092M74264j618169
$$ plain form
43689 8659814 5756882 3659188 3288078 2279727 -471420 -2901459 -2852310 -794484 1297003
43680 1297003 2148495 1601239 227154 -781920 -438757 857170 1971225 2959901 4831347
43671 4831347 7048354 7168850 4013290 -435777 -3576537 -5062062 -5538319 -4206077
43663 -4206077 -204024 4527379 6834095 6858583 7976219 11487769 14362991 13897575 11909114
43654 11909114 11690255 12660790 11281268 6625792 1947079 436886 1982948 4741284
43646 4741284 7648966 10346105 12421949 14012862 15942161 18195506 19196574 17482198
43638 17482198 13347925 8295471 3821046 1278448 1661518 4370867 6806600 6162863
43630 6162863 1677063 -4777561 -9764728 -10455303 -7158768 -3601676 -3127412 -4745581
43622d745581j76351J805888N43900k227960j748037K211206M942201L887522
43614D492788J544682N59536K70622m35813p44868k79945n77002k278486l621717
43605a070203l318495k270807j179758N40023K217570J695945q10260k127288
43597f323273j034567L4296n2306R92489L544264L734398K03588j961324Q16331
43588d6104L485449j16939o362921o480075j38787M275071K930546J283361L477079
43579B306680N349657K387138k012193k041588J252631K403787N17679m22304
43571I741487P25033L03646l365165o295457m513010o5362J905007L09329j148897
43562b403389l3849J482008N66186j695473j988838N21539L684706N578181N589147
$$ plain form
43622 -4745581 -4921932 -3116044 -2572144 -4800104 -6548141 -4336935 605266 4492788
43614 4492788 6037470 6597006 6867628 6431815 5686947 5407002 4830000 2551514 -1070203
43605 -1070203 -4388698 -6659505 -7839263 -7299240 -5081670 -3385725 -4195985 -6323273
43597 -6323273 -7357840 -7323544 -7375850 -6383361 -2839097 895301 1098889 -862435 -46104
43588 -46104 3439345 3322406 -3040515 -9520590 -9659377 -5384306 -2453760 -1170399 2306680
43579 2306680 7656337 10043475 8031282 5989694 7242325 9646112 10163791 9741487
43571 9741487 10466520 10770166 7405001 1109544 -3403466 -3468828 -1563821 -1254492 -2403389
43562 -2403389 -2437238 -955230 -389044 -2084517 -4073355 -3551816 132890 5711071 11300218
43553A1300218L128784j408662m643342l043529J563883L250520J1212l581496
43545F577588l576083j951143j784883j676098P04892L269334K786482O40112
43537D990201R4237L42397j085184k300202K8527L312797J957285k682741l059597
43528A597720K593264O698416L613146k321195m043429j510938N20010K36707
43520G383701n62474p65881o59421j56279N42106L23928m80296L95321K971943
43511H992648L422811l37455m430593m038678k51547K027061J204371m2428J41623
43502F687813P25159O53702M29917L94842j87718j763014l530581m018689k193891
43493b802460J172215L094193J228632k386487l093069o9079K295073J204443
$$ plain form
43553 11300218 14429002 13020340 8376998 5333469 6897352 10147872 10159084 6577588
43545 6577588 3001505 1050362 -734521 -2410619 -1705727 1563607 4350089 4990201
43537 4990201 5084438 5426835 4341651 2041449 2069976 5382773 7340058 4657317 1597720
43528 1597720 4190984 10889400 14502546 12181351 8137922 6626984 7146994 7383701
43520 7383701 6821227 6055346 5395925 5239646 5781752 6105680 5625384 6020705 8992648
43511 8992648 12415459 12078004 7647411 3608733 3357186 5384247 6588618 6546190 6687813
43502 6687813 7412972 8066674 8496591 8891433 8703715 6940701 3410120 -608569 -2802460
43493 -2802460 -1630245 1463948 2692580 306093 -2786976 -2856055 -560982 643461
43485F43461k47967J308273L340897J445602k940224m169919q59793K264391J334065
43476B118786j966088l621636k137902P95837K348594Q52715k189737k738068
43468f537499J150160N987983O637768K850994p97923j306485n19919j461873
43460F003206m009361n400039l621731M15352L440627K876053k2037j269648N98557
43451i89021K418151J382475m02364M12147K361899J265078k605604m402835k173257
43442b733331K21245p74061l202231k850444Q27334M330904M341283Q91783k863296
43433a810814l548313j075576J072859K77794j596845j162425J181980K147754
43425d513586J099560Q04776K370829L338360J909456l66048j526669j791794
$$ plain form
43485 643461 395494 1703767 5044664 6490266 3550042 -619877 -1479670 784721 2118786
43476 2118786 152698 -3468938 -5606840 -4811003 -2462409 -1609694 -3799431 -6537499
43468 -6537499 -5387339 600644 7238412 10089406 9291483 7984998 7465079 6003206
43460 6003206 1993845 -3406194 -7027925 -6612573 -3171946 -295893 -317930 -1587578 -989021
43451 -989021 1429130 2811605 2409241 2821388 5183287 6448365 3842761 -560074 -2733331
43442 -2733331 -2512086 -3286147 -6488378 -9338822 -8511488 -4180584 160699 1052482 -1810814
43433 -1810814 -5359127 -6434703 -5361844 -5084050 -6680895 -7843320 -6661340 -4513586
43425 -4513586 -3414026 -2609250 -238421 3099939 5009395 4643347 3116678 1324884
43417A324884j768075q74223Q62917J877107J371033M08242k75373j153006j832207
43408e8701r76181P04097N26387j767413k947768j245757R96776J561684J713355
43399a493521K835548L211371J350661n30452N5116J544776J205018j0447L86262
43390H554332J378080J97201k106369j778754J190870K545532M01311j936033
43382H446170j293399Q89538J459846J44253j050828j135550o00950K92170J676521
43373H827771K909952K771718J008006j106028k024906j506257p12319o90611
43365I477326j093680r53403m03741m78155j142519j042668K76303J509669J772131
43356G921263J922816K586907K694938J545859M96423O35087N28595j317270l324467
$$ plain form
43417 1324884 -443191 -1317414 -454497 1422610 2793643 3201885 2926512 1773506 -58701
43408 -58701 -1034882 -330785 195602 -1571811 -4519579 -5765336 -4768560 -3206876 -1493521
43399 -1493521 1342027 4553398 5904059 5373607 5428723 6973499 8178517 8168070 8554332
43390 8554332 9932412 10129613 8023244 6244490 7435360 9980892 10382203 8446170
43382 8446170 7152771 8042309 9502155 9646408 8595580 7460030 6859080 7151250 8827771
43373 8827771 11737723 14509441 15517447 14411419 12386513 10880256 10167937 9477326
43365 9477326 8383646 7430243 7026502 6548347 5405828 4363160 4639463 6149132 7921263
43356 7921263 9844079 12430986 15125924 16671783 17168206 17803293 18331888 17014618 13690151
43347A3690151l004283j035088p2901l97368j80357M20540o92123l162314l775029
43338A791228j524231N71449L63101j64193J151268K485200R91242k143825l124760
43329C96479j112036R01236P01302m84211n19307O41904J472760R88931n32500
43320B454558k039410k306011q43402J252769K072058J061776j77731J24619J656883
43311C256109K521650J702926J61198o08167l02020L17839P10241J074057J719731
43302A0553564K380572K220989N07905k403007m682932m340994j444436J570461
43294D362122K444757J306959l77418k018981l608131m027391j792127K470025
43286a240185O094886P133198N488208J667670l214466o214362m489312M71749
$$ plain form
43347 13690151 10685868 9650780 9577879 9180511 9000154 9420694 8728571 5566257 1791228
43338 1791228 266997 838446 1201547 1037354 2188622 4673822 5665064 3521239 396479
43329 396479 -715557 185679 886981 402770 -116537 525367 1998127 2987058 2454558
43320 2454558 415148 -1890863 -2734265 -1481496 590562 1652338 1474607 1599226 3256109
43311 3256109 5777759 7480685 7641883 7033716 6731696 7049535 7759776 8833833 10553564
43302 10553564 12934136 15155125 15663030 13260023 8577091 4236097 2791661 4362122
43294 4362122 6806879 8113838 7736420 5717439 2109308 -1918083 -3710210 -1240185
43286 -1240185 4854701 11987899 17476107 19143777 15929311 9714949 5225637 5697386
43278E697386L464681J991112p10864r58731M6699r36293l528925m581508l254110
43269b770553j643499j032365p48807l94251l24034j95291M15487M91165q02794
43260g004942j848142p47670J298745K033164K270545L924837N073775K232221
43252G232533k674418l611087J75947K255625j035987m782814l514872L98679
43244e556394J619189P44869K017818M875290M610173O07789k407989j781611
43236D729134l7014M72324Q89894K004054J711823r52337k992546j872929J13231
43227D065634n06790k402184j247140L097456N357042J934677l829659n627562
43219H41474j774537L449837N434895L868556J294591p87954k632011m092414
$$ plain form
43278 5697386 9162067 11153179 10442315 9483584 9530283 8593990 5065065 483557 -2770553
43269 -2770553 -4414052 -5446417 -6195224 -6589475 -6913509 -7108800 -6693313 -6202148 -7004942
43260 -7004942 -8853084 -9600754 -8302009 -6268845 -3998300 -73463 5000312 7232533
43252 7232533 4558115 947028 1122975 3378600 2342613 -2440201 -5955073 -5556394
43244 -5556394 -3937205 -3192336 -1174518 3700772 8310945 8918734 6510745 4729134
43236 4729134 4692120 5164444 6054338 8058392 9770215 8817878 5825332 3952403 4065634
43227 4065634 3558844 1156660 -90480 3006976 8364018 10298695 6469036 841474
43219 841474 -933063 2516774 7951669 11820225 13114816 12326862 9694851 5602437
43211E602437m032952k283044o00830p22995k205809k985350j736690P88890K616007
43202e560336K647724J965476K433028L658041K809315j006240l833141j450171
43194A663696L833922N078443J57929n008276m785959j278344k5594j670544k456015
43185d490742q80078J064302K297471L525757L997970K050427q32650j097429
43177E635028R72175J054600k164423m523696l217231j403121k520628m036505
43169a0203801j505764L751113O120230L810801Q08702O00995J930715J727578
43161G040569p20509l662429m914146l279290L64461L065736K577610K54107o29934
43152I6175O43916J729469J324746R90014J893154K461471J084425r64718j526224
$$ plain form
43211 5602437 1569485 -713559 -1314389 -2037384 -4243193 -7228543 -8965233 -8176343 -5560336
43202 -5560336 -2912612 -947136 1485892 5143933 7953248 6947008 3113867 1663696
43194 1663696 5497618 10576061 10733990 5725714 939755 -338589 -364183 -2034727 -4490742
43185 -4490742 -5370820 -4306518 -2009047 1516710 5514680 7565107 6732457 5635028
43177 5635028 6607203 7661803 5497380 973684 -2243547 -3646668 -6167296 -10203801
43169 -10203801 -11709565 -7958452 -1838222 1972579 2781281 3382276 5312991 7040569
43161 7040569 6320060 2657631 -2256515 -5535805 -5171344 -2105608 472002 726109 96175
43152 96175 740091 2469560 3794306 4784320 6677474 9138945 10223370 9258652 7732428
43143G732428r87397j297119k374567k025759M98827K998576L118557J305939
43135H969485N0999P59608K137045J782200q11585l305982l176578j041362l0503
43126E333327j525088l188537k356881J96803J720713J496538J000511O98004
43118C375390n03523k397714k883544j191779P41269J471558K330624M627798
43110E570079O513978N141608R16267k788430l672563k249651k9010J883801K464281
43101A3750360J120117j217074k728987k585271j196041P55333K021461N52527
43093A0472425l958917p810804o565399p76393M498225O189410N741369M433027
43085A2222943P01603n252228q336471m506098K512782N211260K080187j136424
$$ plain form
43143 7732428 6745031 5447912 3073345 1047586 1546413 4544989 7663546 8969485
43135 8969485 9020484 9780092 11917137 13699337 12887752 9581770 6405192 5363830 5333327
43126 5333327 3808239 619702 -1737179 -1540376 180337 1676875 2677386 3375390
43118 3375390 2871867 474153 -2409391 -3601170 -2859901 -1388343 942281 5570079
43110 5570079 12084057 17225665 18141932 15353502 11680939 9431288 9402278 11286079 13750360
43101 13750360 14870477 13653403 10924416 8339145 7143104 7898437 9919898 10472425
43093 10472425 6513508 -1297296 -7862695 -8639088 -4140863 2048547 7789916 12222943
43085 12222943 12924546 7672318 -664153 -5170251 -2657469 2553791 4633978 3497554
43077C497554K8446L376665M351099K082350q57814k318101k164118j385490j045831
43068E564760j326523j133498K70505J408053L12150j918190k037673J67132P85739
43059B092455k333443n603809m550003m92721J320843n88792j962358Q89484N968225
43050e260119Q336975O012824J456010j682382j789664J45951J811035J326789
43042A0357419j373095m480169n826673m720298k379253n66771J77867P32641
43034h078332J655710J829561j28863l195532m238986j829408J609643K860002
43026i516205K015208J582391K209048J956475J14663j053093K08028K190243
43018b93242K343414J166723R16902J541934R73970q01692j321884J6359M98913
$$ plain form
43077 3497554 3526000 6902665 11253764 13336114 12478300 10160199 7996081 6610591 5564760
43068 5564760 4238237 3104739 3375244 4783297 5095447 3177257 1139584 1306716 2092455
43059 2092455 -240988 -5844797 -10394800 -10887521 -9566678 -10155470 -12117828 -11228344 -5260119
43050 -5260119 3076856 9089680 10545690 8863308 7073644 7219595 9030630 10357419
43042 10357419 8984324 4504155 -1322518 -6042816 -8422069 -8988840 -8810973 -8078332
43034 -8078332 -6422622 -4593061 -4721924 -7917456 -12156442 -13985850 -12376207 -9516205
43026 -9516205 -7500997 -5918606 -3709558 -1753083 -1638420 -2691513 -2483485 -293242
43018 -293242 2050172 3216895 4133797 5675731 6649701 5848009 4526125 4542484 5041397
43009E041397j399678l124888k187821n32407j276018l052863k014514J343401
43001g203391K360820j10129j261875K146281O198230N334685L46571l228669
42993D582523k777868o25827N32502L52558n47698j236162j1717L433949N758370
42984I460630L408944j794630m311507k369939K20757M76231J14445J350845K862876
42975I418652K433258M54720j563855l155555l551707j425647J774541J913333
42967F297740j501800k994491R78349N610197M339147j233065m067893k270379
42959E157805k51892k39500J61838J344396o0726m008890m748771N40669O228668
42950D123597N891844J342223q96077R06955K808787K032005j55104j703761j898932
$$ plain form
43009 5041397 3641719 516831 -1670990 -2203397 -3479415 -6532278 -8546792 -7203391
43001 -7203391 -4842571 -4952700 -6214575 -4068294 2129936 7464621 7811192 4582523
42993 4582523 1804655 1178828 1711330 2063888 1516190 280028 268311 3702260 9460630
42984 9460630 12869574 11074944 6763437 4393498 4614255 5090486 5204931 6555776 9418652
42975 9418652 11851910 12306630 10742775 7587220 4035513 2609866 4384407 6297740
42967 6297740 4795940 1801449 2779798 8389995 12729142 11496077 7428184 5157805
42959 5157805 4905913 4666413 4828251 6172647 6111921 2103031 -2645740 -2105071 4123597
42950 4123597 10015441 11357664 10461587 11368542 14177329 16209334 16054230 14350469 12451537
42941A2451537n12848J770461K438661j39564l434495l433271l96852J500094
42933A0243723M39163q63794k20675M69215j205209l909236m588685k914481r15539
42924c465518O86275K734054M407910K944318j988605n893201l963440K599574
42916a938633P312514O037537J665645l34581R06487J691165J0676j872239j774408
42907A1704163r98194j368208j751585m51582J028075J52138j894314j496688
42899D923805J525261L231070J516848q84170j020890j48354r68057k733332k289546
42890C152635Q86302L599799L129154M66567j292568n96715J244051J906480O56821
42881A3152526j166569k276690l172560m596635m993337j969223L183999N253120
$$ plain form
42941 12451537 11938689 13709150 16147811 16008247 12573752 9140481 8743629 10243723
42933 10243723 10682886 9819092 9598417 10067632 8862423 4953187 364502 -2549979 -3465518
42924 -3465518 -2779243 -45189 4362721 7307039 5318434 -574767 -4538207 -1938633
42916 -1938633 5373881 11411418 13077063 12742482 13648969 15340134 15350810 13478571 11704163
42907 11704163 10705969 9337761 7586176 7134594 8162669 8314807 6420493 4923805
42899 4923805 6449066 9680136 11196984 10312814 9291924 9143570 8175513 5442181 3152635
42890 3152635 4038937 7638736 10767890 11234457 9941889 9345174 10589225 12495705 13152526
42881 13152526 11985957 9709267 6536707 1940072 -3053265 -5022488 -1838489 3414631
42873C414631J415284m340444n898069k740977L30820N97875N33560K567981M563721
42864D44382L240387k12723j329484J434964M651440M584227J741819m11725m4468
42855A4098819J200823Q17357j176157k201411m69504K363347K777612m10902
42847A6999984m472766n839893l825534o13985J441496J442254j83961j883292
42839C064303j608226J001689L312743K448117o64677k121801k56416K379730
42831G555462L099202K437018J695764j20268l901364o893981n481717r51773
42823b561657J457281k06383k006351j74367L492613M620052K343046k55280n49082
42814F159872J117589K686348K370570r5318k831191l121686n25003K283276K931771
$$ plain form
42873 3414631 4829915 489471 -5408598 -8149575 -7818755 -7220880 -6687320 -4119339 444382
42864 444382 3684769 3472046 2142562 3577526 8228966 12813193 14555012 14143287 14098819
42855 14098819 15299642 16116999 14940842 12739431 12269927 14633274 17410886 16999984
42847 16999984 12527218 6687325 2861791 2247806 3689302 5131556 4947595 3064303
42839 3064303 1456077 2457766 5770509 8218626 7553949 5432148 5175732 7555462
42831 7555462 10654664 13091682 14787446 14667178 10765814 3871833 -1609884 -2561657
42823 -2561657 -1104376 -1310759 -3317110 -3491477 1136 4621188 6964234 6708954 6159872
42814 6159872 7277461 9963809 12334379 12239061 9407870 6286184 5761181 8044457 10976228
42805A0976228K240840K128953K239752R78872j273356k665398k881299k925360
42797H819232k425590j67842K758242L503822J581484n86411j807674l427690
42789H247573n325395m327660Q05249N709750N167209N3506l688699k510513J069416
42780E200436K429276M01059j847589o17086L977528P519429N872812J53188m457304
42771A8631749n027543l639058l038511k631560r68405O31492J58716j434356
42763B682524k147589k725393m506995m997778p57923N500300O454920M86721
42755a1213m761071k342871M490615O953130K429559l049760l399279N27791L508332
42746D345233K836398Q04785R90349L425740M395249J284492l514782n204752
$$ plain form
42805 10976228 13217068 15346021 17585773 18564645 17291289 14625891 11744592 8819232
42797 8819232 6393642 6225800 8984042 12487864 14069348 13482937 11675263 8247573
42789 8247573 2922178 -1405482 -600233 5109517 10276726 10330232 6641533 4131020 5200436
42780 5200436 7629712 8030771 6183182 5566096 9543624 17063053 22935865 23089053 18631749
42771 18631749 13604206 9965148 6926637 4295077 3326672 3958164 4116880 2682524
42763 2682524 534935 -2190458 -6697453 -11695231 -12453154 -6952854 -497934 -11213
42755 -11213 -4772284 -7115155 -2624540 4328590 6758149 3708389 309110 836901 4345233
42746 4345233 7181631 7986416 8976765 12402505 16797754 18082246 14567464 9362712
42738I362712k612680O99482J581632Q21279M33664K14615q90896k103111k029899
42729E476798j215071j093472j474454j330583j058898j490376j458057Q99149
42721b744964M626066O379460M715058J836636N86603J354765K381558J820662
42713B0955844o68936l325814l576251j079188J218534N89288j802686k689580
42705I621211j221305P83771K305874L740032M344687K589428n03711j858281
42697A9801706j105677j343729l773972n267634l453400o91336L9429M8696J822624
42688F076707L469218J175696l707236n133286p42111M475400M785938Q36501
42680A1236827k242653j724850M95850J700961J670401J648583J729878P46642
$$ plain form
42738 9362712 6750032 7449514 9031146 9852425 10286089 10500704 9609808 7506697 5476798
42729 5476798 4261727 3168255 1693801 363218 -695680 -2186056 -3644113 -2744964
42721 -2744964 1881102 8260562 12975620 14812256 15398859 16753624 19135182 20955844
42713 20955844 20286908 16961094 13384843 12305655 13524189 14113477 12310791 9621211
42705 9621211 8399906 9183677 11489551 15229583 19574270 22163698 21659987 19801706
42697 19801706 18696029 17352300 13578328 8310694 4857294 4165958 4205387 4254083 6076707
42688 6076707 9545925 10721621 7014385 1881099 1138988 5614388 10400326 11236827
42680 11236827 8994174 7269324 7765174 9466135 11136536 12785119 14514997 15261639
42672A5261639j431400k782548j355126J751865L040791P76972k719413l952695
42664H590085k440419o39660l21871p14557k97092J036291K155934K166452J187368
42655A0722531P7200m13294m22795p73097j741102k422473j726072L35455K597896
42646F234249L511173K014962j233935l403347j984387J610428L006273O23980
42638A0379396j881011r15650J828842K516838J335886J342685K476642J754805
42630A8838433n98966n82377K633982M273436J128877l176747l588609p88438
42622A8139591R85865N76214P2248K37320J81268M93240K362581M047078K422261
42613B9517666j829649m449085l396371p77018J366651L136820L807838J263845
$$ plain form
42672 15261639 13830239 11047691 9692565 11444430 14485221 15262193 12542780 8590085
42664 8590085 6149666 5510006 5188135 4473578 4176486 5212777 7368711 9535163 10722531
42655 10722531 10799731 10386437 9963642 9190545 7449443 5026970 3300898 3636353 6234249
42646 6234249 9745422 11760384 10526449 7123102 5138715 6749143 9755416 10379396
42638 10379396 8498385 7582735 9411577 11928415 13264301 14606986 17083628 18838433
42630 18838433 18239467 17657090 20291072 24564508 25693385 22516638 18928029 18139591
42622 18139591 19125456 19701670 19773918 20011238 20192506 20685746 23048327 27095405 29517666
42613 29517666 27688017 23238932 19842561 19065543 20432194 23569014 27376852 28640697
42605B8640697l521124n514005k157470K341547K618912o42361k891926k848630
42597A6025640k851705l182849j164765L347987O045246L813855p32189k723152
42589A8578068j043247J347870J768648L65987j059289j088571K32195J309935
42581B0411596M34810j899282k892422p46291K676342L839904J684798j579834
42573B1929621l434112l258183j735728K37929J659691J817732J107188L66714
42565A8690852p62917l221794n793258n131916j99489M954545N329246J308595
42557A5173864j691827j38759L528644M748697K596471k05521j615233k098918
42549B0297418k369252j795260n7192J361676R73579k51140J3865J979874L134031
$$ plain form
42605 28640697 25119573 19605568 17448098 19789645 22408557 21766196 18874270 16025640
42597 16025640 13173935 9991086 8826321 12174308 18219554 22033409 21301220 18578068
42589 18578068 17534821 18882691 20651339 21017326 19958037 18869466 19101661 20411596
42581 20411596 20846406 18947124 16054702 15308411 17984753 21824657 23509455 21929621
42573 21929621 18495509 15237326 13501598 13739527 15399218 17216950 18324138 18690852
42565 18690852 17927935 14706141 8912883 3780967 3581478 8536023 13865269 15173864
42557 15173864 13482037 13343278 16871922 21620619 24217090 24011569 22396336 20297418
42549 20297418 17928166 16132906 16075714 17437390 18410969 18159829 18173694 20153568 23287599
42540B3287599J745383n65538j138786j29539r2679j907182l277451k069897P00153
42531A6552063K626136L250605L758190M179813L175777O21328j698152k592319
42523B9873441k941026l762257m261389l048543l55647K209604L598988L990646
42515B5303817L903770L551041K866072J528293p77395l587877n465656n094745
42507B2227320k421977J330155M204365M236430J072464k673783l337435n66873
42499B4070666J812000P93476j640756j642972O56618J718722N56394K73594K626127
42490B9223869M627227K960498p68069k252230o18902Q26965k39815k120863j919282
42481B9719398O95654L666861N124964M625028K658268J13414j978171k948180
$$ plain form
42540 23287599 25032982 24467444 23328658 23199119 23106440 21199258 17921807 15851910 16552063
42531 16552063 19178199 22428804 26186994 30366807 33542584 34163912 32465760 29873441
42523 29873441 26932415 23170158 18908769 15860226 15504579 17714183 21313171 25303817
42515 25303817 29207587 32758628 35624700 37152993 36375598 32787721 27322065 22227320
42507 22227320 19805343 21135498 25339863 29576293 30648757 27974974 24637539 24070666
42499 24070666 25882666 26676142 25035386 23392414 24049032 25767754 26324148 26597742 29223869
42490 29223869 33851096 36811594 36043525 33791295 33172393 33999358 33759543 31638680 29719398
42481 29719398 30415052 34081913 39206877 43831905 46490173 46603587 44625416 41677236
42473D1677236k865826k225264j426179o51197J09835J090655K387891L362940
42465D1460091K991027J297374j32028O2742J053961Q49337o23689r63008J229179
42456D7224986L648899K967566l07575k066952l27745J645329j77182m582164
42448D8025162o287843k844339K239739M007536J677090j469264k371600q55806
42440D2120675J240097K210000J912724J823621L304292N325317M844172N68585
42432F3349483m416979n397059j311434M117620O650297N517995K878693R59025
42424G2347641P49071K214186M228256M875362L362147J506868J920734M629568
42416I5833833O955227P070559O024275N451567N125730M447520M738905P357070
$$ plain form
42473 41677236 38811410 36586146 35159967 34508770 34618605 35709260 38097151 41460091
42465 41460091 44451118 45748492 45616464 45679206 46733167 47582504 46958815 45995807 47224986
42456 47224986 50873885 53841451 53533876 51466924 51139179 52784508 52607326 48025162
42448 48025162 41737319 38892980 41132719 45140255 46817345 45348081 42976481 42120675
42440 42120675 43360772 45570772 47483496 49307117 52611409 57936726 62780898 63349483
42432 63349483 58932504 53535445 52224011 56341631 62991928 68509923 71388616 72347641
42424 72347641 73096712 75310898 79539154 84414516 87776663 89283531 91204265 95833833
42416 95833833 102789060 109859619 115883894 121335461 126461191 130908711 135647616 143004686
42408A43004686J0243364R646765N807061L640756O111798R785874R565468N698490
42400B03504262K912884L935989P280788J0694180J3032019J2695272Q221644
42393B62277038J598876k479964k299998j029029j309308j415774N80543K208440
42385B58130824J72297l648010m374375j525123K23017k042635n792095p355497
42377B33788403o488550n087221m160008l969687n043627p054707q164169p184842
42369A86635592n249472l948422l060390j666815m12736q25833k830358m477717
42361A64163849m173223k290517o23029o44309k005844k709980j528406n1368
42353A50137173p67466l001764l107858K72035L697446L725357J920093K081423
$$ plain form
42408 143004686 153248050 162894815 168701876 172342632 178454430 188240304 197805772 203504262
42400 203504262 206417146 210353135 217633923 228328103 241360122 254055394 262277038
42393 262277038 263875914 261395950 259095952 258066923 256757615 255341841 255922384 258130824
42385 258130824 258303121 254655111 250280736 248755613 248978630 246935995 241143900 233788403
42377 233788403 227299853 222212632 218052624 214082937 209039310 201984603 193820434 186635592
42369 186635592 181386120 177437698 174377308 172710493 172297757 171471924 168641566 164163849
42361 164163849 159990626 157700109 157077080 156432771 154426927 151716947 150188541 150137173
42353 150137173 149369707 146367943 143260085 143532120 147229566 150954923 152875016 154956439
42345A54956439M159995M798663L330846K858550M485159M712884J005997l302083
42337A77006450l052177J653985N964450P065694O873274P673271Q476350P269378
42329B18930675M562875K703207K944825M876515P652540R995162R930839O875103
42321B68471741L751880M442300Q392908J0201243O312458L38441q78882M051589
42313C05083678R019290P737457J011300m844013n607121l144164j841340k968293
42305C04446794l940111k511396L1638O20469j653875m662279o077591n743597
42297B80510052m971885m835211n813662p876302r967272j0566076r847028r980846
42289B16651770j1829795j2830866j0428666o434891m965765o524698p586469
$$ plain form
42345 154956439 159116434 163915097 167245943 170104493 174589652 179302536 180308533 177006450
42337 177006450 173954273 175608258 181572708 188638402 195511676 203184947 211661297 218930675
42329 218930675 223493550 226196757 229141582 234018097 241670637 251665799 261596638 268471741
42321 268471741 272223621 276665921 285058829 295260072 301572530 301910971 301032089 305083678
42313 305083678 314102968 321840425 322851725 318007712 312400591 309256427 307415087 304446794
42305 304446794 300506683 297995287 298026925 298647394 296993519 292331240 286253649 280510052
42297 280510052 275538167 270702956 264889294 257012992 247045720 236479644 226632616 216651770
42289 216651770 204821975 191991109 181562443 175127552 170161787 163637089 156050620
42282A56050620o377661n293338o160113o774316m776688k089137k128878m400132
42274A18050357n344248l705617j834885j916871l694783n913182p520797p395105
42266H0724869n239520k873094k388509l024317k306404l24891Q1786j927187
42258F2722733l347750j761521R85595J583204k11798k060196k673006k669563
42250E2567698k558415k002226j007906l07028m32305j318436k645352l831269
42242C8464761m024183k843736q90788Q85692J825897J350506q20585l570075
42234C0377489m570483k635724P10807K801432K383963J67512k179268k951204
42226B4104524j566238K88140n8429k736147m506248k910700J70082J102237m19167
$$ plain form
42282 156050620 149672959 144379621 138219508 131445192 126668504 124579367 122450489 118050357
42274 118050357 112706109 109000492 107165607 105248736 101553953 95640771 88119974 80724869
42266 80724869 75485349 72612255 70223746 67199429 64893025 64568134 64649920 62722733
42258 62722733 59374983 57613462 58599057 60182261 59970463 57910267 55237261 52567698
42250 52567698 50009283 48007057 46999151 46692123 46259818 44941382 42296030 38464761
42242 38464761 34440578 31596842 30706054 31591746 33417643 34768149 33947564 30377489
42234 30377489 25807006 23171282 23882089 26683521 29067484 29234996 27055728 24104524
42226 24104524 22538286 22826426 22767997 20031850 15525602 12614902 12784984 13887221 13468054
42217A3468054j243560O74996L841616N432422M126921O55687k830053l924617
42209B0201466k160223q3731n44624k962968m065275k301737N22728K256632K793111
42200A3655379K749833J936648L95222o71796l44503P46218J494958J509843N86327
42191B2058129j448640l461532l280363n70625K021576K088597N41071q8024P94844
42182A8655033J740541J732378R21735l48672j451459j130374Q30535K272282
42174B3221999J177043r74293q82222J608204L026145J357685j219375k053307
42166B5261879j849786k524359l202195j462024K070390L523918Q88157l057482
42158A9648498m259528k183622N41977K092140K870671L227235K153050p16021
$$ plain form
42217 13468054 12224494 12899490 16741106 22173528 26300449 26956136 24126083 20201466
42209 20201466 18041243 17957512 17412888 14449920 10384645 8082908 8605636 10862268 13655379
42200 13655379 16405212 18341860 18737082 18065286 17720783 18467001 19961959 21471802 22058129
42191 22058129 20609489 17147957 13867594 13296969 15318545 17407142 17948213 17860189 18655033
42182 18655033 20395574 22127952 23049687 22701015 21249556 20119182 20949717 23221999
42174 23221999 24399042 23424749 22542527 24150731 27176876 28534561 27315186 25261879
42166 25261879 23412093 20887734 17685539 16223515 18293905 21817823 22705980 19648498
42158 19648498 15388970 13205348 13747325 15839465 18710136 21937371 24090421 23374400
42150B3374400l500939m107358k910021j726922p74099J265877M183168N571104
42142B1375210M075052J424702j7904k35800p15584j948280l304829m307553m496841
42133A1848173l184671j027717m60156k264088l056780N86266O169478P354923
42125A5965428K539163k600877k803383J68124J318798j60915r90262L88739K118223
42116A5943038K693237K754672K534380O85220k940684n683423n039597j884733
42108I062110P95004J442896P90642j03305j025350j783931j618912k13557J298555
42099H644152J270382l61575j622533p81853J307497K146115Q25170r58922j545643
42090H922790j441205j675616j470678M72727L085107L626512J392926j257286
$$ plain form
42150 23374400 19873461 15766103 12856082 11129160 10355061 11620938 15804106 21375210
42142 21375210 25450262 26874964 26857060 26621260 25905676 23957396 20652567 16345014 11848173
42133 11848173 8663502 7635785 7175629 4911541 1854761 2441027 8610505 15965428
42125 15965428 18504591 15903714 13100331 13268455 14587253 14426338 13436076 13824815 15943038
42116 15943038 18636275 21390947 23925327 24610547 21669863 15986440 10946843 9062110
42108 9062110 9857114 11300010 12090652 11987347 10961997 9178066 7559154 7345597 8644152
42099 8644152 9914534 9552959 7930426 7148573 8456070 10602185 11427355 10468433 8922790
42090 8922790 7481585 5805969 4335291 4808018 7893125 11519637 12912563 11655277
42082A1655277j998406r02549P09316J814010J310725j736879n921076p325375
42074b394957l715361K018738M694731K708962p61005k135105j041453O17267
42066h183J306019P93251k55229p63469q7981J095063J395781M73629n97669r45620
42056B405592q70447p72953j90233J279457K825134L093448J705864m14714j904061
42047G157087j890438o49112M45715L70463l8428P51190K044349J146295k281929
42038G055192m276234j499067L334015M331918M03699l320015k828487k68374
42030B932647M43236k62163O20981K727935K369340j573041n431969n462755k139742
42021e775531J487830L594311M211014L673083K236439N82995n54988r84130p70071
$$ plain form
42082 11655277 9656871 8754322 9463638 11277648 12588373 10851494 4930418 -2394957
42074 -2394957 -6110318 -4091580 603151 3312113 2551108 416003 -625450 -8183
42066 -8183 1297836 2091087 1835858 1072389 984408 2079471 3475252 3948881 3351212 2405592
42056 2405592 1535145 762192 571959 1851416 4676550 7769998 9475862 9061148 7157087
42047 7157087 5266649 4617537 5063252 5433715 5395287 6146477 8190826 9337121 7055192
42038 7055192 2778958 1279891 4613906 8945824 9349523 6029508 3201021 2932647
42030 2932647 3375883 3113720 3734701 6462636 8831976 7258935 1826966 -3635789 -5775531
42021 -5775531 -4287701 -693390 3517624 7190707 9427146 10010141 9455153 8471023 7700952
42012G700952q5126L36805k55938j149967o87102R66881J333083p72472k940125
42003D446991k449007k59791Q72026J039994K538453M869180M324851j83324m284497
41994A0914876l537735O06198K960406J375524j411874k175748q29885O23812
41986H525574P56778l52045j570663j647339o31296l69848k312509m767360m101035
41977f469743N33066N207504N362662J085852l148405l536797l46879L500078
41969B187338N566753N119716K699532k27539j786429j177146K93548N80537n83326
41960A2672984j472685r64141k38623j004707k828671l549936k122248K74955
41952G66928K058365K814382K584048R95106j723268l735892l089450j32508K579782
$$ plain form
42012 7700952 7615826 7952631 7696693 6546726 5859624 6826505 8159588 7387116 4446991
42003 4446991 1997984 1738193 2610219 3650213 6188666 11057846 15382697 15199373 10914876
41994 10914876 7377141 7983339 10943745 12319269 10907395 8731647 7901762 8525574
41986 8525574 9282352 8930307 7359644 5712305 5081009 4711161 2398652 -2368708 -6469743
41977 -6469743 -5936677 -729173 4633489 5719341 2570936 -965861 -1312740 2187338
41969 2187338 7754091 12873807 15573339 15345800 13559371 12382225 12675773 13256310 12672984
41960 12672984 11200299 10236158 9997535 8992828 6164157 2614221 491973 766928
41952 766928 2825293 5639675 8223723 9218829 7495561 3759669 670219 537711 3117493
41943C117493K897813R62136j349399k099330n74578K223997M325204M686045
41935A4189381M178622L941779L323567J012644k003408k891041j215113m38045
41927B0098386l249517p107137p167102k903144J278996K260010J854111K856355
41919G920958M270697L100269o71575l782983l954450k016618J60501J560951
41911F587750J554384k06961k605922l603823k823136j900328j504922j33757
41903d636715K735425M471142K588527j232783l096750k157916j297216k618121
41895e244407m700701m814778k047839K182808N284304N126501K123703m30489
41887b520898J14264K173754K047236o56541k599681j966632p89440r63171j335379
$$ plain form
41943 3117493 6015306 6977442 5628043 3528713 2954135 5178132 9503336 14189381
41935 14189381 18368003 22309782 25633349 26645993 24642585 21751544 20536431 20098386
41927 20098386 16848869 9741732 2574630 -328514 950482 3210492 5064603 7920958
41919 7920958 12191655 15291924 14620349 10837366 6882916 4866298 5026799 6587750
41911 6587750 8142134 7935173 5329251 1725428 -1097708 -2998036 -4502958 -4636715
41903 -4636715 -1901290 2569852 5158379 3925596 828846 -1329070 -2626286 -5244407
41895 -5244407 -9945108 -14759886 -16807725 -14624917 -9340613 -4214112 -2090409 -2520898
41887 -2520898 -2406634 -232880 1814356 1157815 -1441866 -3408498 -4197938 -5161109 -6496488
41878f496488o23806q0187p61659r05248J073269L310842L361555K225257K090582
41869C194117J993890k90841l463071m140014k245168n09643Q05239L664148O692822
41860E701479N550915K98228l193249j829991j12247k598872o180750n004644
41852g369131J10243L050234J697257k0549N96831J194403n63700k510349j377077
41843e191838K006537L901686K910216J505017K269516M330466M482748J433953
41835A7648301k205201l055420j470756j012883l023501m114392r25320M461719
41827F302547O646380L672352j146670m010408m376747l387002j374196J406820
41819C733076L344067K749951J07384k201490k378266q86417L09674P179q59522
$$ plain form
41878 -6496488 -7120294 -7200481 -7962140 -8867388 -7794119 -4483277 -1121722 1103535 3194117
41869 3194117 5188007 4897166 1434095 -2705919 -4951087 -5460730 -4655491 -991343 5701479
41860 5701479 11252394 11550622 8357373 6527382 6415135 3816263 -2364487 -7369131
41852 -7369131 -7258888 -4208654 -2511397 -2531946 -1935115 -740712 -1304412 -3814761 -5191838
41843 -5191838 -3185301 716385 3626601 5131618 7401134 11731600 16214348 17648301
41835 17648301 15443100 12387680 10916924 9904041 6880540 2766148 1840828 6302547
41827 6302547 12948927 16621279 15474609 11464201 7087454 3700452 2326256 3733076
41819 3733076 7077143 9827094 9934478 7732988 5354722 4468305 4777979 4785158 3925636
41810C925636n43808Q83141J468037M54304l59791K60129N16668j212788k377662
41801C013866P71246O705741R362305O254066J958790J710499M857842P127649
41793D1762004O682409N086472M180931M790975P086359R541537Q735290K960402
41785I0826379m661983r149726r200454p549622o539362n923505m812549l288287
41777C9700891j875568j266492k397659n018343o789067n969947m247089m221983
41769G914743m890118l114681O79564K468808R54454m73370L11916P55873j141049
41760C466140k481493l57796K442558J583250j449336j759730N33455N52013k489357
41751C9704l169674J277383N708415M342673r74698m048179k842572k60270J482563
$$ plain form
41810 3925636 3381828 4264969 5733006 6187310 5827519 6087648 6604316 5391528 3013866
41801 3013866 3785112 10490853 19853158 26107224 28066014 29776513 34634355 41762004
41793 41762004 48444413 53530885 57711816 62502791 69589150 79130687 87865977 90826379
41785 90826379 86164396 77014670 67814216 60264594 53725232 47801727 42989178 39700891
41777 39700891 37825323 36558831 34161172 29142829 22353762 16383815 12136726 7914743
41769 7914743 3024625 -90056 589508 3058316 4012770 3539400 3851316 4607189 3466140
41760 3466140 984647 626851 3069409 4652659 3203323 1443593 1977048 2529061 39704
41751 39704 -3129970 -1852587 3855828 8198501 7223803 3175624 333052 72782 1555345
41742A555345K554060K587592O38631j915706k371936r64821n73828j775388j972992
41733b239043k95645P00115j09691N5624K737472M327125J264200l514425m111052
41724a185320m34397J581109j205554m827529m411964q34725J597665J541936
41716h178779J355803K436108K961627Q70988k784945m583370k382619K240163
41708h065024N255946M080356K86508j997953o26590K168132K386691j098254
41700B389812n127862n524764j459611L636540N550984L458255J62386j669344
41692A416396k288980l138636l718569k194240J203311L639118L195105J148480
41684g38015k30636n75141p77094p54705L25742K155940L315369L158281K358816
$$ plain form
41742 1555345 4109405 6696997 7335628 5419922 3047986 2083165 1509337 -266051 -2239043
41733 -2239043 -2534688 -1834573 -1944264 -1888640 848832 5175957 6440157 2925732 -1185320
41724 -1185320 -1619717 -38608 -1244162 -6071691 -10483655 -11318380 -9720715 -8178779
41716 -8178779 -6822976 -4386868 -1425241 -554253 -3339198 -7922568 -10305187 -8065024
41708 -8065024 -2809078 1271278 1557786 -440167 -1066757 1101375 3488066 2389812
41700 2389812 -2738050 -8262814 -9722425 -6085885 -534901 2923354 3085740 1416396
41692 1416396 -872584 -4011220 -7729789 -9924029 -8720718 -5081600 -1886495 -738015
41684 -738015 -968651 -1543792 -2320886 -3075591 -2749849 -593909 2721460 5879741 8238557
41675H238557J572933Q46384M95628J119248K039652J054511k823052o947165
41667E596696p140796k695225K171642L008986K90702j768065r64079O89124R03473
41658I2458N67727J474695K724236K148925K45967l35813R34896J597284N9854
41649I510229k235017l337723l207965k589802j536827k29467N43465Q31024J714431
41640e37652L089306L245409J774085O26120P79940L41700j894165l449062j744313
41631B231368J160455J065392j912129l073371L30551N361458P170993M370879
41623A6705596l83275l677450m247215l355401k819551k670518j420459J100735
41615g67538K749866K039984M47264N1816M91374M03317L09598J371898K557803
$$ plain form
41675 8238557 9811490 10657874 11153502 12272750 14312402 15366913 12543861 5596696
41667 5596696 -1544100 -4239325 -2067683 941303 1232005 -536060 -1500139 -811015 92458
41658 92458 660185 2134880 4859116 7008041 7254008 6918195 7853091 9450375 9510229
41649 9510229 7275212 3937489 729524 -1860278 -3397105 -3626572 -3083107 -2252083 -537652
41640 -537652 2551654 5797063 7571148 8197268 8977208 9318908 7424743 3975681 2231368
41631 2231368 3391823 4457215 2545086 -528285 -197734 5163724 12334717 16705596
41623 16705596 16322321 12644871 8397656 5042255 2222704 -447814 -1868273 -767538
41615 -767538 1982328 4022312 4469576 4521392 5012766 5416083 5725681 7097579 9655382
41606I655382K081778P36169O36657J472942J436395J139024K588150M489012
41598B4235509L060497j783406n408286m867892k255168j73289J839026M114797
41590A8761788M265343J040398k378164k336078L90313K622345L381944L440857
41582B9188746K597206Q92259P30339M060270Q455055R353833N660483M56872
41574F1395063k989033l366307o98678L380256N584514M265754K194846L267847
41566G3034262P168479J0285235J1145004J1410350J1708949J0189714N871606
41559A40813599L80038m369429p639640q717092p188947m943581m971878p277084
41551I6085986q655378p433677n663695n474190o035655n764747n118379n306717
$$ plain form
41606 9655382 11737160 12473329 13109986 14582928 16019323 17158347 19746497 24235509
41598 24235509 27296006 25512600 20104314 15236422 12981254 12807965 14646991 18761788
41590 18761788 23027131 24067529 21689365 19353287 19743600 22365945 25747889 29188746
41582 29188746 31785952 32678211 33408550 37468820 45923875 55277708 60938191 61395063
41574 61395063 58406030 55039723 54341045 57721301 63305815 67571569 69766415 73034262
41566 73034262 80202741 90487976 101632980 113043330 124752279 134941993 140813599
41559 140813599 141193637 136824208 129184568 120467476 113278529 108334948 103363070 96085986
41551 96085986 87430608 79996931 74333236 68859046 62823391 57058644 51940265 46633548
41543D6633548o065942o392543n961418m553422j837741J033338J648600k79436
41535B4224984j778513p17350R29222J82207k298585l387457k167136n86194j1520
41526A4389658P4437k5738r50218k367578k608969j101533O00897J137241J103024
41517A0251221J397977J265207m29033k793305l525261j786016R93286L238106
41509H612182M598604M716549K487385j815436m949629l744474L75526K520845
41501A2801552P75416j114739P41449M540350N383392K339016o20880o09257P40838
41492B4977137P68188l52151j037820j301108k033937k632012j636157O88385
41484A7440525K222295J472211r68209l340483m114182k558863R95075N016518
$$ plain form
41543 46633548 40567606 34175063 28213645 23660223 21822482 22855820 24504420 24224984
41535 24224984 22446471 21729121 22658343 22840550 20541965 17154508 14987372 14401178 14389658
41526 14389658 14464095 14438357 13488139 11120561 8511592 7410059 8010956 9148197 10251221
41517 10251221 11649198 12914405 12485372 9692067 6166806 4380790 5374076 8612182
41509 8612182 13210786 17927335 20414720 18599284 13649655 9905181 10280707 12801552
41501 12801552 13576968 12462229 13203678 17744028 23127420 25466436 24845556 24236299 24977137
41492 24977137 25745325 25393174 24355354 23054246 21020309 18388297 16752140 17440525
41484 17440525 19662820 21135031 20166822 16826339 12712157 10153294 11148369 16164887
41476A6164887P378200O704622L514290R8532j248977m43594K84738q45263k752508
41467B8854927k878782p15372J344494Q33356k143481n248098o063951l990590
41459I992503q66462N42959m56025j647070j155387k53604q35281j392523J098674
41450E027784N534460O833019K822402k436315l963669j689456R30734J608054
41442A4667013M29041j518837k672934j879753l19370n43834k317559k207118
41434C636649R60670L621954L033981J647252K216597K143431k031169p004632
41426H224733o001639Q98169N986262M391872k40442k335354j652553j188739
41418H082309j787710k299619k642652l465204m068351l195682j202905K90705
$$ plain form
41476 16164887 23543087 30247709 33761999 33860531 32611554 32167960 32452698 31607435 28854927
41467 28854927 25976145 25260773 26605267 27438623 25295142 20047044 13983093 9992503
41459 9992503 9126041 9669000 9212975 7565905 6410518 6156914 5321633 3929110 5027784
41450 5027784 10562244 17395263 20217665 17781350 13817681 12128225 13058959 14667013
41442 14667013 15096054 13577217 10904283 9024530 8705160 8161326 5843767 3636649
41434 3636649 4597319 8219273 11253254 12900506 15117103 17260534 15229365 8224733
41426 8224733 2223094 3121263 9107525 13499397 13258955 10923601 9271048 8082309
41418 8082309 6294599 3994980 1352328 -2112876 -6181227 -9376909 -10579814 -10289109
41410a0289109M17559k84975n96504N67754L189395N648610O105577M390539J567276
41401A0716122j670736m470137m701525j208931L167323M029401J134833j511293
41393E485057j593413q39156o52200M04339K884532M170745K580249M23222O8426
41384A2931801P1711j497144k774807j079538K011941K728890Q74953m16405K46122
41375A3097524J415033K051424K232079J212180j495117l504620j972702J328643
41367A4364444J430067k644072o028215m693287m65562K393751K586004J642575
41359H585705Q46495N91901J132299J915300J375467r35879l033644k744199m55052
41350G278393J485992J413353l07147j750329r25298K067292M272386K895969
$$ plain form
41410 -10289109 -9871550 -10156525 -10753029 -10185275 -6995880 -1347270 4758307 9148846 10716122
41401 10716122 9045386 4575249 -126276 -1335207 1832116 5861517 6996350 5485057
41393 5485057 3891644 3052488 2400288 2804627 5689159 9859904 12440153 12863375 12931801
41384 12931801 13003512 11506368 8731561 7652023 9663964 12392854 13267807 12851402 13097524
41375 13097524 14512557 16563981 18796060 20008240 18513123 15008503 13035801 14364444
41367 14364444 15794511 13150439 7122224 2428937 1963375 4357126 6943130 8585705
41359 8585705 9432200 10024101 11156400 13071700 14447167 13511288 10477644 7733445 7278393
41350 7278393 8764385 10177738 9870591 8120262 7194964 9262256 13534642 16430611
41342A6430611p76126k553781p77368J932237K992139K831608K176594j27815
41334B2128099l930151n547687k490914J738514J786431j882328l863513j855404
41326F083047Q21360J193650M86602M77213K42727r44463r70915J684581M401026
41317A3474828L697778L72050j969534k293798k600434l652130l872986k745184
41309D10590j966610k312584k185607n45711J142387J326432N98677k1313r62288
41300d516027k389684k560599k84136K448708K971036J994759K149142L102745
41292B915944J731202k390570n263707l896757n61652P22192j99512l31039J434787
41283e839112L023865K694998J218781J41277q4669L18640J019187J117748k87286
$$ plain form
41342 16430611 15654485 13100704 12323336 14255573 17247712 20079320 22255914 22128099
41334 22128099 18197948 12650261 10159347 11897861 13684292 11801964 7938451 6083047
41326 6083047 6904407 8098057 8584659 9061872 9304599 8360136 7389221 9073802 13474828
41317 13474828 17172606 17544656 15575122 13281324 10680890 7028760 3155774 410590
41309 410590 -1556020 -3868604 -6054211 -6599922 -5457535 -4131103 -3532426 -3553739 -4516027
41300 -4516027 -6905711 -9466310 -9750446 -7301738 -4330702 -2335943 -186801 2915944
41292 2915944 4647146 2256576 -3007131 -6903888 -7465540 -6743348 -6942860 -7273899 -5839112
41283 -5839112 -2815247 -120249 1098532 1239809 1155140 1473780 2492967 3610715 3323429
41274C323429k342946k744096p34583J534667J776457N01883j82405K77886O32848
41265B043140K26705j14572L39861J185620J655288J319522j1494j825925k381895
41256B436250l72471K460329K355480j685391n926523o333405l393247l87173
41248a0846151J664795M180130O662719N996790J298108l597740m546926j943597
41240a131872P81759J655716J015365m15528j726928j371815P62407J894661l6457
41231A427308k262620m38043M302050N960080K284355j742258j226416J935378
41223A0239834L000301J558457L72118n70948l561335p433064p656376l125273
41215g176286J664880L030948K788576L986580N345436L608839n77514l185251
$$ plain form
41274 3323429 980483 -1763613 -2498196 -963529 812928 1314811 1132406 1410292 2043140
41265 2043140 2269845 2155273 2495134 3680754 5336042 6655564 6644070 4818145 2436250
41256 2436250 2063779 4524108 6879588 5194197 -732326 -7065731 -10458978 -10846151
41248 -10846151 -9181356 -5001226 1661493 7658283 8956391 5358651 811725 -1131872
41240 -1131872 -350113 1305603 2320968 1905440 178512 -1193303 -430896 1463765 1427308
41231 1427308 -835312 -1273355 3028695 8988775 11273130 9530872 8304456 10239834
41223 10239834 13240135 14798592 15170710 14599762 11038427 3605363 -4051013 -7176286
41215 -7176286 -5511406 -2480458 308118 4294698 9640134 13248973 12671459 9486208
41207I486208k663407j614825k233679l411399l648493l868376m993991m838665
41199a7786627o90538N575798Q336140N117132L1899j443607Q42362K668262J801041
41190D451862K46153J12592N03742K3414j76229J625859L988241L338281j193371
41181A2920544o061100p099949l774437R19995L779194L908588K563052J326298
41173H482185O09737k35137j623800l001040l434705k409518K9686L066964M809943
41164F294315L494412q6097k496959j362131J645631K952370J517879n65965j405127
41155I988328j227492r87673j017702j435890k133920j909934N44517M076014
41147E896248N360679K909070q55009k862209l134376l440531l655792k121605
$$ plain form
41207 9486208 6822801 5207976 2974297 -437102 -4085595 -7953971 -12947962 -17786627
41199 -17786627 -18477165 -12901367 -4565227 551905 583804 -859803 -17441 2650821 4451862
41190 4451862 4698015 4810607 5314349 5337763 5161534 6787393 10775634 14113915 12920544
41181 12920544 6859444 -240505 -4014942 -3094947 684247 4592835 7155887 8482185
41173 8482185 9091922 8856785 7232985 4231945 797240 -1612278 -1582592 1484372 6294315
41164 6294315 9788727 9702630 7205671 5843540 7489171 10441541 11959420 11393455 9988328
41155 9988328 8760836 7773163 6755461 5319571 3185651 1275717 1820234 5896248
41147 5896248 11256927 14165997 13310988 10448779 7314403 3873872 218080 -1903525
41139a903525P57636K110480N84381j505658j449025Q4862M57607p43437j286942
41130b893621o6054J120668N88902m06556L09064K252547K957752J668134j2845
41121E517991j118750k398036l791214l495023j015630J116317P01397q19347
41113e302295o71375J047422K012945J578529J308650J955178K451014J995635
41105F375703R87539k01605j441228j945376j175418l84702j000842j777304k93213
41096h56446K734083L752410J478401j485712k936998l518010l557058j303543
41088e692873L145264N529129K542322l037969n934351n284143m108347l255130
41080a6096098n81020L715435N616090K927767j064328k027936k50557Q40944
$$ plain form
41139 -1903525 -1145889 964591 1548972 43314 -1405711 -1320849 -863242 -1606679 -2893621
41130 -2893621 -2959675 -1839007 -1250105 -1656661 -1347597 904950 3862702 5530836 5517991
41121 5517991 4399241 2001205 -1790009 -5285032 -6300662 -5184345 -4482948 -5302295
41113 -5302295 -5973670 -4926248 -2913303 -1334774 -26124 1929054 4380068 6375703
41105 6375703 7363242 7161637 5720409 3775033 2599615 2214913 1214071 -563233 -856446
41096 -856446 1877637 5630047 7108448 5622736 2685738 -832272 -4389330 -5692873
41088 -5692873 -2547609 2981520 5523842 2485873 -3448478 -8732621 -12840968 -16096098
41080 -16096098 -16677118 -12961683 -7345593 -4417826 -5482154 -7510090 -7760647 -6919703
41072f919703J92529l8844J214905J964971M72121j950122l165295l328138l362718
41063a4920294j875273K736108P401468O318342m23114m785355j176840M935793
41055a789165M390031k219577n642713k203789J135893j412228n020660k083743
41047a4845951N539411Q804617L835069l936780p432972n006729J77349L939827
41039h926159L777656N86387j957937j488597L64323J149388J547000L206736
41031a741203M526543K645918j290798l103908j626493K22276N37172N97143J358411
41022B125061J641500Q79361K50754n6856j468352l694601l992472j253487K090412
41013c478680L766144M330838M417263K426273k365541o745788o793317l093940
$$ plain form
41072 -6919703 -6727174 -6766018 -5551113 -3586142 -3114021 -5064143 -8229438 -11557576 -14920294
41063 -14920294 -16795567 -14059459 -6657991 -339649 -762763 -5548118 -6724958 -1789165
41055 -1789165 2600866 381289 -5261424 -7465213 -6329320 -7741548 -12762208 -14845951
41047 -14845951 -9306540 -501923 3333146 -603634 -8036606 -13043335 -12865986 -8926159
41039 -8926159 -5148503 -4562116 -6520053 -8008650 -7644327 -6494939 -4947939 -1741203
41031 -1741203 2785340 5431258 4140460 1036552 -589941 -367665 169507 766650 2125061
41022 2125061 3766561 4645922 4896676 4839820 3371468 -323133 -4315605 -5569092 -3478680
41013 -3478680 287464 4618302 9035565 11461838 9096297 2350509 -4442808 -7536748
41005g536748J6116Q4886r05553o0819K045725J978230j542683m681856k556892
40996a3159594L811422P611124M931282J81490m14479K107963J803282k436798
40988D435692n521056m589780k630199k179896j329848J239468K509684J88957
40980g876978k643297k050191Q22634K290833J885515J593617J632994R88943
40972c355930M26135J152904J842521N40210j611124j893871k55227J105502J423460
40963f25420J640275J908412J691392J443704J507183N01678k334612m485903
40955A246709l073843N17735K173507N16286k161827l638054l371698j249312
40947i040497K006338L861592K660787N92112O95182J893573Q75985j893056k620867
$$ plain form
41005 -7536748 -7520632 -7435746 -8341299 -8402118 -6356393 -4378163 -5920846 -10602702 -13159594
40996 -13159594 -9348172 -1737048 3194234 3375724 2961245 5069208 6872490 4435692
40988 4435692 -1085364 -5675144 -8305343 -10485239 -11815087 -10575619 -8065935 -7876978
40980 -7876978 -10520275 -12570466 -11747832 -9456999 -7571484 -5977867 -4344873 -3355930
40972 -3355930 -2929795 -1776891 65630 605840 -1005284 -2899155 -3154382 -2048880 -625420
40963 -625420 1014855 2923267 4614659 6058363 7565546 8067224 5732612 1246709
40955 1246709 -1827134 -1309399 864108 1380394 -781433 -4419487 -7791185 -9040497
40947 -9040497 -7034159 -3172567 -511780 80332 775514 2669087 3545072 1652016 -968851
40938i68851n86639P19916l30971j008356N36488J813867K88493k242416k462946
40929d241415m98525O32020p25734l172677m157144k441258P48215K678104J945760
40920i232654R150j168195j831230k790744k543761O82915M807544N624104K592256
40911c850615q16332k500272l280292k919761L64569N118003O446078K938737
40903A500115p14451p09460O88449J93131o45381R99258L292424K436720p89539
40894F251266k117019m03806J175048K53174j969287l082549j904035J145343
40886f51865L925731L628792N4601l253796l179504p62774J394301L128068M997698
40877I281252M996727J341907k985598l333829l96406P41623j458760l116472
$$ plain form
40938 -968851 -1555490 -835574 -1166545 -2174901 -1638413 175454 463947 -1778469 -4241415
40929 -4241415 -4739940 -4107920 -4833654 -8006331 -12163475 -14604733 -13856518 -11178414 -9232654
40920 -9232654 -9223504 -10391699 -12222929 -15013673 -17557434 -16874519 -12066975 -6442871 -3850615
40911 -3850615 -4666947 -7167219 -10447511 -13367272 -13002703 -7884700 -1438622 1500115
40903 1500115 785664 76204 764653 957784 312403 1311661 4604085 7040805 6251266
40894 6251266 4134247 3730441 4905489 5158663 3189376 106827 -1797208 -651865
40886 -651865 3273866 6902658 6957259 3703463 523959 -238815 1155486 4283554 9281252
40877 9281252 14277979 15619886 12634288 9300459 8904053 9645676 8186916 5070444
40869E070444j843959l99978j415121l003981k523229j059008q30054r24963P09752
40860f220097K907690K705951L26921p91486R11895K982469K758052R76948Q7930
40851F646273L89651k25916k832838n422227n248893k465887Q486L99591L55450
40842h396310K268057N412262O504679L957863m4497k196374j652286k83309o4616
40833E505469r94838j523213n70973J210446K295806K007554Q05234q13784k634101
40824E287600l994483m110013l348545k642982j378246J930007O012870O679756
40816D435964K358468k597446l071036R5533J928004O83900n70123L78837J687065
40807E329166J094061m29772n33496J004405K293742J754429n12516l006023m049078
$$ plain form
40869 5070444 3226485 2826507 1411386 -1592595 -4115824 -5174832 -6004886 -6929849 -6220097
40860 -6220097 -3312407 -606456 -279535 -1071021 -159126 2823343 5581395 6558343 6646273
40851 6646273 7035924 6810008 3977170 -1445057 -6693950 -9159837 -9151351 -8751760 -8396310
40842 -8396310 -6128253 -715991 5788688 9746551 9702054 7505680 5853394 5570085 5505469
40833 5505469 4510631 2987418 2416445 3626891 5922697 7930251 8735485 7921701 5287600
40824 5287600 1293117 -2816896 -6165441 -8808423 -10186669 -8256662 -2243792 4435964
40816 4435964 6794432 4196986 1125950 1221483 3149487 3833387 3263264 3642101 5329166
40807 5329166 6423227 5993455 5459959 6464364 8758106 10512535 10000019 6993996 2944918
40798B944918l386985k377704j937482j375597m92198r77739l289534m086430
40790a4978751n32234M222888M634225J327578M62970L794871N557713J833885
40782F323145k857802k631363Q46853J890192p1635q58987O43218R72953j638037
40773B618537m479763m713275k663054J39854K915717M630027L921412J348728
40765C718183m05114K87135K150489L030465K352103J035568J70508J87179N53090
40756A3079606L49963l02780k08247P58099Q70574q26271k860145l924720m894998
40747B041081n951001m492279L83525L921022J327530m312539n686533k071734
40739a4840928K47504j223428j622300J704542L848047J101933j810574M23281
$$ plain form
40798 2944918 -442067 -2819771 -4757253 -6132850 -6625048 -7602787 -10892321 -14978751
40790 -14978751 -15510985 -11288097 -6653872 -5326294 -4863324 -1068453 4489260 6323145
40782 6323145 3465343 833980 1680833 3571025 3499390 2640403 3283621 4256574 2618537
40773 2618537 -1861226 -6574501 -9237555 -9097701 -6181984 -1551957 2369455 3718183
40765 3718183 3313069 3600204 5750693 8781158 11133261 12168829 12339337 12526516 13079606
40756 13079606 13429569 13126789 12918542 13676641 14547215 13720944 10860799 6936079 2041081
40747 2041081 -3909920 -8402199 -8018674 -4097652 -2770122 -7082661 -12769194 -14840928
40739 -14840928 -14593424 -15816852 -17439152 -15734610 -11886563 -10784630 -12595204 -12171923
40731a2171923M167838K737433k019902k477073K333041N624988M080234J794125
40723D068761J567541K86764l775536o090045l025843J551965K204635L99945
40715b811813J300507M756124N578411J895380k289564l309024k079149j026488
40707B014384m36978M32288J169285R55443M4893p96307j382881j823226j867425
40698a690524j091576O24086K751155L915628K756510k24661k592199k882317
40690A566102k447244k819808k622828L03635M481734N746873K974392j14780
40682G068076N3992K522445L749694K032538j442712m504969n632300m717994
40674h71230l168444k446591k209230j033005J060163K560533K979817L176116
$$ plain form
40731 -12171923 -8004085 -5266652 -7286554 -9763627 -7430586 -1805598 2274636 4068761
40723 4068761 5636302 5923066 2147530 -3942515 -6968358 -5416393 -3211758 -2811813
40715 -2811813 -1511306 3244818 8823229 10718609 8429045 5120021 3040872 2014384
40707 2014384 1577406 2009694 3178979 4134422 4179315 3383008 2000127 176901 -1690524
40698 -1690524 -2782100 -2158014 593141 4508769 7265279 7040618 4448419 1566102
40690 1566102 -881142 -3700950 -6323778 -6020143 -1538409 4208464 7182856 7068076
40682 7068076 7122068 9644513 13394207 15426745 13984033 9479064 3846764 -871230
40674 -871230 -4039674 -6486265 -8695495 -9728500 -8668337 -6107804 -3127987 48129
40666D8129K929801Q89404k321966l800549k354238n3080J385645K572592L326843
40657B622581J477340k638053m397831j293333K366082J552019j731965j996136
40649d039296Q96338K439623J516646J152392J622778l00431m221736m917195
40641e850881n48307L803457L750607J470048N59828l1418k629637n329071m629078
40632i434452j037969K089241L242065K745442L96846l093706m436621j580709
40624a1109863K442637L358811J728358J146353J904191J122034j505235k911279
40616c823993j906634r11410j527511k072964q51229J067246J779080J169007
40608g078408M64482O06728J580997K272055J253461j110386k366015j377034
$$ plain form
40666 48129 2977930 3867334 1545368 -2255181 -4609419 -4662499 -3276854 -704262 2622581
40657 2622581 4099921 1461868 -2935963 -4229296 -1863214 -311195 -2043160 -4039296
40649 -4039296 -3142958 -703335 813311 1965703 3588481 3288050 -933686 -5850881
40641 -5850881 -6399188 -2595731 1154876 2624924 3184752 3153334 523697 -4805374 -9434452
40632 -9434452 -10472421 -8383180 -5141115 -2395673 -1998827 -5092533 -9529154 -11109863
40624 -11109863 -8667226 -5308415 -3580057 -2433704 -529513 592521 -912714 -3823993
40616 -3823993 -5730627 -6642037 -8169548 -10242512 -11093741 -10026495 -8247415 -7078408
40608 -7078408 -6613926 -6007198 -4426201 -2154146 -900685 -2011071 -4377086 -5754120
40600e754120m31897j590942k804946j067379K113838K612199K36247j163484
40592g850484l3373J047923L55210o46287q16575q92504n80406J466885L696342
40583d253269K554205j082704j674763K297953M874188J530029l508393l765519
40575c028273k07927J319084m57747j494119R3270J590435R24340l31501r1082
40566a683520J354236K256895J075288k483668o091234n661282j88829N610565
40558e811549O517732L336101Q55383P41650O15892o39114j320108q26663q32748
40549B636576j813389k157865j468896j181378j230435K48236L078011M570652
40541B681512L866785L077683L045295J869854r11879k682041k168544j658159
$$ plain form
40600 -5754120 -6186017 -7776959 -10581905 -11649284 -9535446 -6923247 -6687000 -7850484
40592 -7850484 -7883857 -6835934 -6480724 -7127011 -7943586 -8836090 -9416496 -7949611 -4253269
40583 -4253269 -1699064 -2781768 -4456531 -2158578 2715610 4245639 737246 -3028273
40575 -3028273 -3236200 -1917116 -2374863 -3868982 -3775712 -2185277 -1260937 -1592438 -1683520
40566 -1683520 -329284 1927611 3002899 519231 -5572003 -11233285 -11422114 -5811549
40558 -5811549 706183 4042284 4897667 5639317 6255209 5616095 4295987 3469324 2636576
40549 2636576 823187 -1334678 -2803574 -3984952 -5215387 -4967151 -1889140 2681512
40541 2681512 6548297 9625980 12671275 14541129 13629250 10947209 8778665 7120506
40533G120506k601651k828597p19291J537635J752331J216018J239496l3428l525599
40524C157420n615001l335687j5501l10613k274524p15794L227353L114141k137853
40515d906059n863314l688980N83701K086796K037363L589060N172750L154648
40507B165965j597682m747962m652418l245838j742763M51231K800637L412973
40499g155857K250248J506266K066187K171763M58919j898203l065504k788111
40491f454292j863566r46482o72123j421115k099840p30776K619209M955158L833307
40482b780520N85580j537808j572852j308150j957410k484706j679486r1779J158139
40473a1668992K263177M038903N931484O149101L880718L48325k608356m112431
$$ plain form
40533 7120506 4518855 1690258 970967 2508602 4260933 5476951 6716447 6683019 3157420
40524 3157420 -2457581 -5793268 -5808769 -6119382 -8393906 -9109700 -5882347 -2768206 -4906059
40515 -4906059 -10769373 -14458353 -13874652 -11787856 -9750493 -6161433 -988683 2165965
40507 2165965 568283 -4179679 -8832097 -12077935 -13820698 -13369467 -10568830 -7155857
40499 -7155857 -4905609 -3399343 -1333156 838607 1297526 -600677 -3666181 -6454292
40491 -6454292 -8317858 -9264340 -9936463 -11357578 -13457418 -14188194 -11568985 -6613827 -2780520
40482 -2780520 -2194940 -3732748 -5305600 -6613750 -8571160 -11055866 -12735352 -12827131 -11668992
40473 -11668992 -9405815 -5366912 564572 6713673 10594391 10942716 8334360 4221929
40465D221929m094618k634821l85017J082534O76887n95981o97757O07501J352177
40456d67166L33072j003373q43517O5485l65284j992755k289786r1350K475820
40447d178854K738549O48029j874475l375877l227285p99101L568087P151772
40439F50845O713967K454971j548289j890816K81764J109783r91609l638191l856261
40430g13836j901733p57428k139071m109536l380675N28611M605099N955021M795452
40421B881904L066332J419578p04761k740956l018330j436114q6622k75504n90829
40412a485302P08295K649594K646235J47974k395794k364896K01511K759764K728070
40403E595451r0991l159148l594345j273102R92392P75563j264576k641857k074482
$$ plain form
40465 4221929 127311 -2507510 -2892527 -1809993 -1133106 -1729087 -2426844 -1819343 -467166
40456 -467166 -134094 -1137467 -1980984 -1915499 -2280783 -4273538 -6563324 -6654674 -4178854
40447 -4178854 -1440305 -792276 -2666751 -6042628 -9269913 -10069014 -6500927 650845
40439 650845 7364812 9819783 8271494 6380678 6662442 7772225 6780616 3142425 -713836
40430 -713836 -2615569 -3372997 -5512068 -9621604 -13002279 -12473668 -7868569 -1913548 2881904
40421 2881904 5948236 7367814 6663053 3922097 903767 -532347 -618969 -894473 -1485302
40412 -1485302 -777007 1872587 4518822 4666796 2271002 -93894 107617 2867381 5595451
40403 5595451 5504460 2345312 -1249033 -2522135 -1529743 -754180 -2018756 -4660613 -6735095
40394f735095k83499J397734J982656J045980o79154j381002j98411J218591O17475
40385c014725j630535k705288p57078L080137O029613N962990K764422j289679
40377H439857l005145j571026K67927n2965j168241k40421K002445K294098M62107
40368G428636l17441N47217k87916l687613n158967j680677K781193K834917n65368
40359A893981k606745k107994j199207L18224M029935P196544M734107k238154
40351A0020691o141925l337349Q32205L78760k902995l351706r4906K687950K115238
40342B05963n98490k595432j952797J041472L367792J886798j920197k641579
40334c206470J459444N075989L464824k51115k60028K463847K130486j893037
$$ plain form
40394 -6735095 -7018594 -5620860 -3638204 -2592224 -3271378 -4652380 -4850791 -3632200 -3014725
40385 -3014725 -4645260 -7350548 -8107626 -5027489 1002124 6965114 9729536 8439857
40377 8439857 5434712 3863686 4131613 4078648 2910407 2669986 4672431 6966529 7428636
40368 7428636 7111195 7658412 7370496 3682883 -1476084 -3156761 -375568 2459349 1893981
40359 1893981 -712764 -2820758 -4019965 -3701741 328194 7524738 12258845 10020691
40351 10020691 3878766 541417 1373622 1752382 -1150613 -4502319 -4597225 -1909275 205963
40342 205963 -392527 -2987959 -4940756 -3899284 -531492 1355306 -564891 -3206470
40334 -3206470 -1747026 3328963 6793787 6542672 6282644 8746491 10876977 8983940
40326H983940l982600j497487J488267J481361N74175J166765Q98474k947139
40318F165756p625968q090753l987535M07383K051237J620838R14396P17590J060863
40309f766193J479730J227369N89590J078906K881095L533244J250373j676087
40301C598027j495320J511116K973708K67916l965871n246717k675380N07012
40293d525509J260776K06104O0813J485557K290962J191224J5416K85564o6769
40284B204138l076810n633594l084292K523193L995805j0308k397744Q41540L637725
40275a000347L5747m918988k568931N199223Q462549M213887n96696j235597j224693
40266F366154l985447o660059n956981l502290j430309J519808N440616O328437
$$ plain form
40326 8983940 5001340 3503853 4992120 6473481 7047656 8214421 9112895 6165756
40318 6165756 -1460212 -9550965 -13538500 -13131117 -11079880 -9459042 -8544646 -7827056 -6766193
40309 -6766193 -5286463 -4059094 -3469504 -2390598 490497 4023741 5274114 3598027
40301 3598027 2102707 3613823 6587531 6855447 2889576 -2357141 -5032521 -4525509
40293 -4525509 -3264733 -3058629 -2997816 -1512259 778703 1969927 1985343 2270907 2204138
40284 2204138 -872672 -6506266 -9590558 -7067365 -3071560 -3081868 -5479612 -4638072 -1000347
40275 -1000347 -964600 -5883588 -8452519 -3253296 5209253 9423140 8826444 7590847 6366154
40266 6366154 2380707 -4279352 -10236333 -13738623 -15168932 -13649124 -8208508 -1880071
40258a880071K401335j468459o55410K052365J449992j567590k243266m5250J330204
40249f26150M65082o23042r02158j205460j402194q12852n74351j719118k107526
40240i507769O03808M158771M301870J221592j128287j316391j278522j461880
40232d406808k18258J947937K557036J937050K821636M553013K974655k479970
40224I686291o667312n849265k533369q40759r47497o91369N84084K245548L740322
40215a273326L961824K006606j76001P11597L811278M139709J15807l204585j299323
40206H793586L302400N105943K915393o37843l863875o319795o630040m011636
40198a345867n35904J349423J985315K409840J386140k003379m863724l605394
$$ plain form
40258 -1880071 521264 -947195 -1602605 449760 1899752 332162 -1911104 -1956354 -626150
40249 -626150 -161068 -784110 -1686268 -2891728 -4293922 -5106774 -5681125 -7400243 -9507769
40240 -9507769 -8903961 -4745190 -443320 778272 -350015 -1666406 -2944928 -4406808
40232 -4406808 -4625066 -2677129 -120093 1816957 4638593 9191606 12166261 9686291
40224 9686291 3018979 -2830286 -5363655 -6204414 -7151911 -7843280 -7259196 -5013648 -1273326
40215 -1273326 2688498 4695104 4519103 5230700 9041978 13181687 13297494 10092909 8793586
40206 8793586 12095986 17201929 20117322 19479479 15615604 9295809 2665769 -1345867
40198 -1345867 -1881771 -532348 1452967 3862807 5248947 3245568 -1618156 -5223550
40190e223550O77070L577422L119455Q87130j323701k621960k054494K5279Q90248
40181b047101p60807j541854J895147O357456N509307o62935n247802m016947
40173e15536m49814N86582m92319m65398R62328J243195q32305l616076m708139
40164h287482l277747p16641O26730q4439j329815j629500j522696j566359j73116
40155a7961065L685450P085812O225126K183687m01387j71294j84034j867803
40147a405508k541167m20335K112108K322240Q16171n17364j176063r23882Q58913
40138h74887K887019K173748j474429m152531l057670o8287J779991K190866J862661
40129A266481L29240j781402j691715J249560L383844K108000K43149J284260
$$ plain form
40190 -5223550 -4546480 -969058 2150397 3037527 1713826 -908134 -2962628 -2937349 -2047101
40181 -2047101 -2807908 -4349762 -2454615 3902841 9412148 8749213 3501411 -515536
40173 -515536 -965350 -378768 -871087 -1336485 -374157 869038 36733 -3579343 -8287482
40164 -8287482 -11565229 -12281870 -11655140 -11739579 -13069394 -14698894 -16221590 -17787949 -17961065
40155 -17961065 -14275615 -7189803 -964677 1219010 817623 646329 462295 -1405508
40147 -1405508 -3946675 -4367010 -2254902 67338 883509 366145 -809918 -1733800 -874887
40138 -874887 2012132 4185880 2711451 -1441080 -4498750 -4567037 -2787046 -596180 1266481
40129 1266481 1595721 -185681 -1877396 -627836 2756008 4864008 5107157 6391417
40121F391417L355180K374963j196881l573953l762266l604389l144446j027702
40113d188077J328564J085596q05410p46138J159749J051705j873422l759736
40105f747169k571495j056670j280189j109573J076059K634028J195395p07790
40097h567404L21440K621470K066850j087287k515277m48786K231272K918953
40089b458769K508288K442797J754081p39768l343490l268666q00873P82542k51950
40080c375808j770818j163485O10996N40771j512386k170433L85242L257602K767293
40071b431026k37937j723081k88840J327298P40035r07931j313523l69417L76090
40062d828332K62123P8434P89019K590461M596598M999735K625185j030017k604506
$$ plain form
40121 6391417 9746597 12121560 10924679 7350726 3588460 -15929 -3160375 -4188077
40113 -4188077 -2859513 -1773917 -2579327 -3325465 -2165716 -1114011 -2987433 -6747169
40105 -6747169 -9318664 -10375334 -11655523 -12765096 -11689037 -9055009 -7859614 -8567404
40097 -8567404 -8245964 -5624494 -3557644 -4644931 -7160208 -7608994 -5377722 -2458769
40089 -2458769 49519 2492316 4246397 3506629 163139 -3105527 -3906400 -3123858 -3375808
40080 -3375808 -5146626 -6310111 -5699115 -5158344 -6670730 -8841163 -8455921 -5198319 -2431026
40071 -2431026 -2668963 -4392044 -4680884 -3353586 -2613551 -3521482 -4835005 -5204422 -4828332
40062 -4828332 -4566209 -4487775 -3698756 -1108295 3488303 8488038 11113223 10083206 7478700
40053G478700q44864J298499O0784m192747p033420n096950J90628M550666N470246
40044A881542L874511J768697j57535j958463k930729k449112j738406k573752
40036d283247l965986k716135J496762M236998J976424k431194l318436r6294
40028i101108K404177J499297K99938K168953N101731M583075J45341l913107
40020C188297l873372n15528K355073J932230j213474m004423l895567j139014
40012g165778K057085M044707M499974L344279P47143j777313k317118j164731
40004B268248o02915j460311j953720q93575K66035J18858j83289O95982J251896
39995d92791o92878l845043m504326j682684J517976K146878P76435k84642l26633
$$ plain form
40053 7478700 6633836 7932335 7993119 3800372 -3233048 -8329998 -8139370 -3588704 1881542
40044 1881542 5756053 7524750 7367215 5408752 2478023 28911 -1709495 -4283247
40036 -4283247 -8249233 -10965368 -9468606 -5231608 -3255184 -5686378 -9004814 -9101108
40028 -9101108 -6696931 -5197634 -4897696 -2728743 2372988 6956063 7101404 3188297
40020 3188297 -685075 -1200603 1154470 3086700 1873226 -2131197 -6026764 -7165778
40012 -7165778 -5108693 -1063986 3435988 6780267 7527410 5750097 3432979 2268248
40004 2268248 1665333 205022 -1748698 -2642273 -2376238 -2257380 -2440669 -1744687 -492791
39995 -492791 -1185669 -5030712 -9535038 -11217722 -9699746 -7552868 -6776433 -7061075 -7387708
39986g387708l46005p61104n38721J285155M029933N821976N509462L673864J488619
39977A2775471q94985m018519p391896r153912p716297l148871K811100P194654
39969i543255O976591J927153l670824m601315p46770K831361K732429J169925
39961b924705J314166K000915M56442k187637k519759p86844m40909j791191j072938
39952g952460K809636N350107L061908q20505j204897R36462L25930l910581o433694
39943g838094l625068J129910K662509J181377N87886J705817J671961k54422
39935b778124r21221J237848K994968J332687j515872j629054L41837Q12869k73825
39926c97887K79533K371801J863253k139838m542616j783235K296123K058437
$$ plain form
39986 -7387708 -7733713 -8494817 -9033538 -7748383 -3718450 2103526 7612988 11286852 12775471
39977 12775471 11880486 7861967 470071 -8683841 -16400138 -19549009 -16737909 -9543255
39969 -9543255 -2566664 -639511 -4310335 -8911650 -9658420 -6827059 -4094630 -2924705
39961 -2924705 -1610539 390376 846818 -1340819 -3860578 -4647422 -5088331 -6879522 -7952460
39952 -7952460 -5142824 207283 3269191 2448686 1243789 2180251 2506181 -1404400 -7838094
39943 -7838094 -11463162 -10333252 -7670743 -6489366 -5901480 -4195663 -2523702 -2778124
39935 -2778124 -3699345 -2461497 533471 1866158 350286 -1278768 -936931 -124062 -397887
39926 -397887 -118354 2253447 4116700 1976862 -2565754 -4348989 -2052866 5571
39918E571j754593l892844k327525N08271K713675M382207M653373K012920k025160
39909D275895l608784j811453K22690K08752o05427p50669j072214k252900k807106
39900h201216j655079k79104j23216N3049J753067L317440J814593k213739m563490
39891a0097695k409013K195332M681225K964878p17162k699626j799268J49025
39883g732304J100907Q84261L29469o6418K83226K150983M630675M734040J023452
39874G338291l510018m665321k279760L30533J317438J538326J332338k03058
39866A198769k206972j864330J532355N104019O055502M331159R78663l081219
39858A2047946n704790m357216j3709K737554J340089j698286l110762l153323
$$ plain form
39918 5571 -1749022 -5641866 -7969391 -7461120 -4747445 -365238 4288135 6301055 4275895
39909 4275895 667111 -1144342 -921652 -712900 -1318327 -2068996 -3141210 -5394110 -8201216
39900 -8201216 -9856295 -10135399 -10258615 -10205566 -8452499 -5135059 -3320466 -5534205 -10097695
39891 -10097695 -12506708 -10311376 -5630151 -2665273 -3382435 -6082061 -7881329 -7732304
39883 -7732304 -6631397 -5747136 -5417667 -5484085 -5200859 -3049876 1580799 6314839 7338291
39874 7338291 3828273 -837048 -3116808 -2786275 -1468837 69489 1401827 1198769
39866 1198769 -1008203 -2872533 -1340178 3763841 9819343 14150502 15129165 12047946
39858 12047946 6343156 1985940 1972231 4709785 6049874 4351588 1240826 -1912497
39850a912497l376362l102302j012221J902116L624930L658419K325748l03451
39842A804380k882060k800532L6032K215843J947975J895372L982152N161914
39834A1361076K483330j160540j532198m26510k531558o839566p779184m231480
39826a0656630q37650m7122O65454K499044K574602k68723k516776j703581l20813
39817a0612195r30568j674731r1503K295781K892981K523212L261664M130451
39809A795092K644278q83765l705209m135917k308484J067858M362331N018251
39801C854435K326318j053202k264190j378926K82237K506616M496459L507478
39793A2277225j395455o193292o247650k437659O47677J374994J855519K830315
$$ plain form
39850 -1912497 -5288859 -8391161 -9403382 -7501266 -3876336 -217917 2107831 1804380
39842 1804380 -1077680 -3878212 -3842180 -1626337 321638 2217010 6199162 11361076
39834 11361076 13844406 12683866 11151668 10725158 8193600 1354034 -6425150 -10656630
39826 -10656630 -11494280 -11541402 -10875948 -8376904 -5802302 -6071025 -8587801 -10291382 -10612195
39817 -10612195 -11542763 -13217494 -13308997 -11013216 -8120235 -5597023 -2335359 1795092
39809 1795092 4439370 3555605 -149604 -4285521 -6594005 -5526147 -1163816 3854435
39801 3854435 6180753 5127551 2863361 1484435 1766672 4273288 8769747 12277225
39793 12277225 10881770 4688478 -1559172 -3996831 -3349154 -1974160 -118641 2711674
39785B711674K311462j96282k121812j641288M8838J285730J884027J535743p79796
39776E038296m335725o187545m857604k377043j016496j5742K409455N338652
$$ plain form
39785 2711674 5023136 4826854 2705042 1063754 1112592 2398322 4282349 5818092 5038296
39776 5038296 702571 -5484974 -10342578 -12719621 -13736117 -13751859 -11342404 -6003752
$$ [...]
##END NTUPLES=NMR SPECTRUM
##END=
