##TITLE=31Pdec_LR-784-R2-C1MM
 CDCl3, 24 sc
 21.1.2025
##JCAMPDX= 6.0         $$ Bruker NMR JCAMP-DX V2.0
##DATA TYPE= NMR SPECTRUM
##DATA CLASS= NTUPLES
##ORIGIN= UXNMR, Bruker Analytische Messtechnik GmbH
##OWNER= root
$$ XWIN-NMR		Version 3.5
$$ Tue Jan 21 14:10:05 2025 Russian Standard Time (UT+4h)  she@DPX200
##.OBSERVE FREQUENCY= 81.013821
##.OBSERVE NUCLEUS= ^31P
##.ACQUISITION MODE= SIMULTANEOUS
##.ACQUISITION SCHEME= undefined
##.AVERAGES= 24
##.DIGITISER RES= 17
##SPECTROMETER/DATA SYSTEM= spect
##.PULSE SEQUENCE= zgpg30
##.SOLVENT NAME= CDCl3
##.SHIFT REFERENCE= (INTERNAL, CDCl3, 0, 198.062)
##AUDIT TRAIL= $$ (NUMBER, WHEN, WHO, WHERE, WHAT)
$$ ##TITLE= Audit trail, XWIN-NMR		Version 3.5
$$ ##JCAMPDX= 5.01
$$ ##ORIGIN= Bruker BioSpin GmbH
$$ ##OWNER= she
$$ F:/spectra/data/she/nmr/P31/2/pdata/1/auditp.txt
$$ ##AUDIT TRAIL=  $$ (NUMBER, WHEN, WHO, WHERE, WHAT)
(   1,<2025-01-21 14:08:55.18 +0400>,<she>,<DPX200>,
      <created by zg, POWCHK disabled, PULCHK disabled
       configuration hash MD5:
       00 E9 B6 7A A2 85 ED C7 34 08 36 98 17 FE 4E 26
       data hash MD5: 32K
       2D 7F F9 9E A8 C6 8E 40 57 37 A8 C7 20 BA B8 D8>)
(   2,<2025-01-21 14:09:00.90 +0400>,<she>,<DPX200>,
      <Start of raw data processing
       efp BC_mod = 2 LB = 1.5 FT_mod = 6 PKNL = 1 PHC0 = 1815.5 PHC1 = -45.91362 SI = 64K 
       data hash MD5: 64K
       DC 9D B8 73 3C EF 27 F0 52 00 45 CD 89 17 C3 AD>)
(   3,<2025-01-21 14:09:30.95 +0400>,<she>,<DPX200>,
      <pk PHC0 = -44.60059 PHC1 = 113.8 
       data hash MD5: 64K
       5C BA CF A3 A0 FB 98 2D DD B3 0F FA E5 68 4A C0>)
(   4,<2025-01-21 14:09:36.98 +0400>,<she>,<DPX200>,
      <abs ABSG = 5 
       data hash MD5: 64K
       6D BA F1 4A 15 88 16 E6 8C E0 7E 7A 28 5D 05 D1>)
$$ ##END=
$$ 
$$ hash MD5
$$ 08 3B 0E EF 79 71 7B 4D 50 07 FF 41 0A D2 FC FD
##$RELAX= 
##$RELAX= 
##$RELAX= 
##$RELAX= 
##$RELAX= 
##$RELAX= 
##$RELAX= 
##$RELAX= 
$$ Bruker specific parameters
$$ --------------------------
##$DU= <F:/spectra>
##$EXPNO= 2
##$NAME= <P31>
##$PROCNO= 1
##$TYPE= <nmr>
##$USER= <she>
##$AMP= (0..31)
100 100 100 100 100 100 100 100 100 100 100 100 100 100 100 100 100 100 
100 100 100 100 100 100 100 100 100 100 100 100 100 100 
##$AQSEQ= 0
##$AQ_mod= 1
##$AUNM= <au_zg>
##$AUTOPOS= <>
##$BF1= 81.014009
##$BF2= 200.13
##$BF3= 200.13
##$BF4= 200.13
##$BF5= 200.13
##$BF6= 200.13
##$BF7= 200.13
##$BF8= 200.13
##$BYTORDA= 1
##$CFDGTYP= 0
##$CFRGTYP= 5
##$CHEMSTR= <none>
##$CNST= (0..31)
1 1 145 1 1 1 1 1 1 1 1 1 1 1 1 1 1 1 1 1 1 1 1 1 1 1 1 1 1 1 1 1 
##$CPDPRG= <waltz16>
##$CPDPRG1= <>
##$CPDPRG2= <waltz16>
##$CPDPRG3= <>
##$CPDPRG4= <mlev>
##$CPDPRG5= <mlev>
##$CPDPRG6= <mlev>
##$CPDPRG7= <mlev>
##$CPDPRG8= <mlev>
##$CPDPRGB= <>
##$CPDPRGT= <>
##$D= (0..31)
0 1 0 0 0 0 0 0 0 0.06 0 0.03 2e-05 3e-06 0 0 0.0002 0 0 0 0 0 0 0 0 0 
0 0 0 0 0 0 
##$DATE= 1737454134
##$DBL= (0..7)
120 120 120 11 120 120 24 19 
##$DBP= (0..7)
150 150 150 150 150 150 150 150 
##$DBP07= 0
##$DBPNAM0= <>
##$DBPNAM1= <>
$$ [...]
##$SUBNAM3= <"">
##$SUBNAM4= <"">
##$SUBNAM5= <"">
##$SUBNAM6= <"">
##$SUBNAM7= <"">
##$SUBNAM8= <"">
##$SUBNAM9= <"">
##$SW= 400.765351723535
##$SWIBOX= (0..15)
0 1 3 0 0 0 0 0 0 0 0 0 0 0 0 0 
##$SW_h= 32467.5324675325
##$TD= 32768
##$TD0= 1
##$TE= 0
##$TE2= 300
##$TE3= 300
##$TEG= 300
##$TL= (0..7)
0 120 53 12 22 120 120 120 
##$TP= (0..7)
150 150 150 150 150 150 150 150 
##$TP07= 0
##$TPNAME0= <>
##$TPNAME1= <>
##$TPNAME2= <>
##$TPNAME3= <>
##$TPNAME4= <>
##$TPNAME5= <>
##$TPNAME6= <>
##$TPNAME7= <>
##$TPOAL= (0..7)
0.5 0.5 0.5 0.5 0.5 0.5 0.5 0.5 
##$TPOFFS= (0..7)
0 0 0 0 0 0 0 0 
##$TUNHIN= 0
##$TUNHOUT= 0
##$TUNXOUT= 0
##$USERA1= <user>
##$USERA2= <user>
##$USERA3= <user>
##$USERA4= <user>
##$USERA5= <user>
##$V9= 5
##$VALIST= <valist>
##$VCLIST= <CCCCCCCCCCCCCCC>
##$VD= 0
##$VDLIST= <DDDDDDDDDDDDDDD>
##$VPLIST= <PPPPPPPPPPPPPPP>
##$VTLIST= <TTTTTTTTTTTTTTT>
##$WBST= 1024
##$WBSW= 4
##$XGAIN= (0..3)
0 0 0 0 
##$XL= 0
##$YL= 0
##$YMAX_a= 5001
##$YMIN_a= -9615
##$ZGOPTNS= <>
##$ZL1= 120
##$ZL2= 120
##$ZL3= 120
##$ZL4= 120
##$ABSF1= 198.0616
##$ABSF2= -202.7028
##$ABSG= 5
##$ABSL= 3
##$ALPHA= 0
##$AQORDER= 0
##$ASSFAC= 0
##$ASSFACI= 0
##$ASSFACX= 0
##$ASSWID= 0
##$AUNMP= <proc_1d>
##$AZFE= 0.1
##$AZFW= 0.5
##$BCFW= 0
##$BC_mod= 2
##$BYTORDP= 0
##$COROFFS= 0
##$CY= -3
##$DATMOD= 1
##$DC= 0
##$DFILT= <>
##$DTYPP= 0
##$F1P= 0
##$F2P= 0
##$FCOR= 1
##$FTSIZE= 65536
##$FT_mod= 6
##$GAMMA= 0
##$GB= 0
##$INTBC= 1
##$INTSCL= 9.790993e-09
##$ISEN= 30
##$LB= 1.5
##$LEV0= 0
##$LPBIN= 0
##$MAXI= 10000
##$MC2= 0
##$MEAN= 0
##$ME_mod= 0
##$MI= 50
##$NCOEF= 0
##$NC_proc= -9
##$NLEV= 6
##$NOISF1= 182.463
##$NOISF2= 159.3651
##$NSP= 0
##$NTH_PI= 0
##$NZP= 0
##$OFFSET= 198.0616
##$PC= 4
##$PHC0= 1770.899
##$PHC1= 67.88638
##$PH_mod= 1
##$PKNL= yes
##$PPARMOD= 0
##$PSCAL= 0
##$PSIGN= 0
##$REVERSE= no
##$SF= 81.0140089999434
##$SI= 65536
##$SIGF1= 159.3651
##$SIGF2= -187.1042
##$SINO= 113.3802
##$SIOLD= 16384
##$SREGLST= <1H.CDCl3>
##$SSB= 0
##$STSI= 65536
##$STSR= 0
##$SW_p= 32467.5324675325
##$SYMM= 0
##$S_DEV= 0
##$TDeff= 32768
##$TDoff= 0
##$TI= <>
##$TILT= no
##$TM1= 0
##$TM2= 0
##$TOPLEV= 0
##$USERP1= <user>
##$USERP2= <user>
##$USERP3= <user>
##$USERP4= <user>
##$USERP5= <user>
##$WDW= 1
##$XDIM= 65536
##$YMAX_p= 337534399
##$YMIN_p= -203957362
$$ End of Bruker specific parameters
$$ ---------------------------------
##NTUPLES= NMR SPECTRUM
##VAR_NAME=  FREQUENCY,     SPECTRUM/REAL,   SPECTRUM/IMAG
##SYMBOL=    X,             R,               I
##VAR_TYPE=  INDEPENDENT,   DEPENDENT,       DEPENDENT
##VAR_FORM=  AFFN,          ASDF,            ASDF
##VAR_DIM=   65536,         65536,           65536
##UNITS=     HZ,            ARBITRARY UNITS, ARBITRARY UNITS
##FACTOR=    0.49542278885378, 1,            1
##FIRST=     16045.7642231865, 0,            0
##LAST=      -16421.768244346, 0,            0
##MIN=       -16421.768244346, -203957362,   0
##MAX=       16045.7642231865, 337534399,    0
$$ Real data points
##PAGE= N=1
##DATA TABLE= (X++(R..R)), XYDATA
$$ [...]
$$ plain form
43996 -2247986 1057357 5275097 8705875 10940807 11775973 9934875 4686905 -1885043
43988 -1885043 -5925244 -5490104 -2670406 -1811566 -5326664 -10817244 -12816863 -8443400
43980 -8443400 -988529 3549296 3282645 1795448 2484354 4206225 4123984 2650745 2866250
43971 2866250 5863416 9279921 10541088 9419342 6839700 3038413 -1875119 -6652853
43963 -6652853 -9645003 -10572866 -10581637 -10528096 -10036402 -8473962 -6131026 -3897220 -2284528
43954 -2284528 -1515747 -2172067 -4502782 -6909420 -6608736 -2981472 579406 -283822 -5945082
43945 -5945082 -11959212 -13409678 -9459287 -3640872 -430883 -1589135 -5064713 -7142818
43937 -7142818 -5930054 -2673998 438081 2953818 5809980 9092905 11562400 12234220
$$ packed form
43996b247986L305343M217740L430778K234932Q35166j841098n247970o571948
43988a885043m040201M35140K819698Q58840l515098n490580j999619M373463
43980h443400P454871M537825k66651j487197O88906J721871q2241j473239K15505
43971B866250K997166L416505J261167j121746k579642l801287m913532m777734
43963f652853k992150r27863q771N3541M91694J562440K342936K233806J612692
43954b284528P68781o56320k330715k406638L00684L627264L560878q63228n661260
43945e945082o014130j450466L950391N818415L209989j158252l475578k078105
43937g142818J212764L256056L112079K515737K856162L282925K469495O71820
$$ plain form
43929 12234220 11184028 8864164 5872212 3376074 2441573 2723102 2898825 2476300 2120366
43920 2120366 2301870 2779892 3167125 2710010 81016 -4713395 -8660979 -8385889 -4427053
43911 -4427053 -354213 2290064 4875204 7135012 6013534 1087468 -2809923 -1668969
43903 -1668969 2006064 3316350 2308219 2830305 5688669 7796742 7715455 7275725 7131327
43894 7131327 5171270 863486 -2607135 -2619605 -632246 605205 772735 721731 -168449
43885 -168449 -2687466 -5389234 -6166700 -5370128 -4988246 -5274587 -4463047 -1745382 1433001
43876 1433001 3245306 3099792 1248628 -1647579 -4090638 -4218626 -1598999 2008195
43868 2008195 4181303 3811092 1525271 -1123830 -2571603 -1996466 198120 2733846
$$ packed form
43929A2234220j050192k319864k991952k496138r34501K81529J75723m22525l55934
43920B120366J81504M78022L87233m57115k628994m794411l947584K75090L958836
43911d427053M072840K644277K585140K259808j121478m926066l897391J140954
43903a668969L675033J310286j008131N22086K858364K108073q1287m39730j44398
43894G131327j960057m307784l470621j2470J987359J237451J67530n1004q90180
43885a68449k519017k701768p77466P96572L81882k86341Q11540K717665L178383
43876A433001J812305j45514j851164k896207k443059j27988K619627L607194
43868B008195K173108l70211k285821k649101j447773N75137K194586K535726
$$ plain form
43860 2733846 4502394 5174495 4883651 3823004 2344036 959103 -114585 -1017869 -1469444
43851 -1469444 -439052 2617576 6402756 8549947 7876648 5182611 1906959 -884861
43843 -884861 -2092757 -905124 1457442 1905953 -917870 -4340059 -4872109 -2692115 -532828
43834 -532828 923392 3184180 5670082 5369307 1948022 -746157 -466308 -88214 -2188240
43825 -2188240 -3682982 -627953 3927581 2659085 -5699727 -14150057 -16692469 -15081865
43817 -15081865 -14283699 -15283444 -15518541 -13676854 -10646791 -7156336 -3535351 -1259838
43809 -1259838 -2173688 -5978234 -10053990 -11926587 -11009020 -8224334 -4977647 -2439884
43801 -2439884 -986086 -73092 1153845 3086144 5172750 5891485 3918065 299870
$$ packed form
43860B733846J768548O72101k90844j060647j478968j384933j073688r03284m51575
43851a469444J030392L056628L785180K147191o73299k694037l275652k791820
43843h84861j207896J187633K362566M48511k823823l422189n32050K179994K159287
43834e32828J456220K260788K485902l00775l421285k694179K79849L78094k100026
43825b188240j494742L055029M555534j268496q358812q450330k542412J610604
43817a5081865P98166r99745k35097J841687L030063L490455L620985K275513
43809a259838r13850l804546m075756j872597R17567K784686L246687K537763
43801b439884J453798R12994J226937J932299K086606P18735j973420l618195
$$ plain form
43793 299870 -1332029 1559655 6892825 10073504 9420010 7116898 4770908 1256424
43785 1256424 -3787725 -7503743 -7372318 -5155839 -4601590 -6497065 -8493863 -8823589 -7567873
43776 -7567873 -4823884 -436213 4099225 5809848 3406234 -916729 -3583406 -2868208
43768 -2868208 273323 3849216 6742534 9119477 11289302 12728698 12789890 11885507 10806658
43759 10806658 9104622 5781393 1729508 -491735 -34966 969962 503173 -894985
43751 -894985 -1950507 -2861867 -3949976 -3959585 -1846011 1095743 2897150 3453540 3497499
43742 3497499 2582351 485668 -704764 1272180 5287388 7933823 7760868 6213226
43734 6213226 4995687 4684241 5130348 4963360 1797623 -4394124 -9387942 -9499151 -7135993
$$ packed form
43793B99870j631899K891684N333170L180679o53494k303112k345990l514484
43785A256424n044149l716018J31425K216479N54249j895475j996798l29726J255716
43776g567873K743989M387671M535438J710623k403614m322963k666677P15198
43768b868208L141531L575893K893318K376943K169825J439396O1192r04383j078849
43759A0806658j702036l323229m051885k221243M56769J004928m66789j398158
43751h94985j055522r11360j088109r609K113574K941754J801407N56390M3959
43742C497499r15148k096683j190432J976944M015208K646435j72955j547642
43734F213226j217539l11446M46107j66988l165737o191747m993818j11209K363158
$$ plain form
43725 -7135993 -7552528 -10763875 -11527120 -7727805 -3656184 -3324619 -5327104 -6921858 -8875490
43716 -8875490 -12581389 -15573285 -14104921 -8550942 -2794477 550888 1390976 37175
43708 37175 -2807719 -4666281 -3177419 522910 2863972 2453260 1440161 2108226 4193966
43699 4193966 6026733 6585380 5894847 4803508 4884358 7356812 11505184 14931757 15720410
43690 15720410 13777722 10087658 5590525 1108495 -2391858 -4116448 -4001359 -2808432
43682 -2808432 -1572737 -759034 41927 1395453 3234542 5178433 7121978 8617867
43674 8617867 8269707 5361993 1932633 1124490 2926793 3704769 1117539 -2564091 -3869763
43665 -3869763 -3178143 -3886815 -7278598 -10719836 -11197168 -8734258 -5621102 -3551468 -2466448
$$ packed form
43725g135993m16535l211347p63245L799315M071621L31565k002485j594754j953632
43716h875490l705899k991896J468364N553979N756465L345365Q40088j353801
43708C7175k844894j858562J488862L700329K341062m10712j013099O68065K085740
43699D193966J832767N58647o90533j091339Q0850K472454M148372L426573P88653
43690A5720410j942688l690064m497133m482030l500353j724590J15089J192927
43682b808432J235695Q13703Q00961J353526J839089J943891J943545J495889
43674H617867l48160k907714l429360q08143J802303P77976k587230l681630j305672
43665c869763O91620p08672l391783l441238m77332K462910L113156K069634J085020
$$ plain form
43656 -2466448 -1684552 -1179935 -1233883 -1104959 782881 4385611 6706906 4766838 -300131
43647 -300131 -4186316 -4687004 -3779744 -3818920 -4227668 -3397195 -1587765 -43030 992123
43638 992123 1539296 902600 -712367 -1375582 -250059 649652 -183923 -669963 1651023
43629 1651023 5094366 5985485 4161349 2759743 3320763 4708931 6293719 8293030
43621 8293030 9170824 6855160 2909388 1335027 2457744 2308564 -595770 -2440288
43613 -2440288 -524217 1720524 -221077 -4831652 -6542670 -3212298 2045954 5655568
43605 5655568 6932694 6953799 6927465 7914054 9976648 11293487 9853948 6385608 4201288
43596 4201288 5713382 10026801 14214557 16193311 16038741 14953649 13479280 11183113
$$ packed form
43656b466448P81896N04617n3948J28924J887840L602730K321295j940068n066969
43647c00131l886185n00688R07260l9176m08748Q30473J809430J544735J035153
43638I92123N47173o36696j614967o63215J125523Q99711q33575m86040K320986
43629A651023L443343Q91119j824136j401606N61020J388168J584788J999311
43621H293030Q77794k315664l945772j574361J122717j49180k904334j844518
43613b440288J916071K244741j941601m610575j711018L330372N258252L609614
43605E655568J277126K1105k6334R86589K062594J316839j439539l468340k184320
43596D201288J512094M313419M187756J978754j54570j085092j474369k296167
$$ plain form
43588 11183113 8191319 5988113 5533764 5419337 3765892 1474150 1108165 2530304
43580 2530304 2706617 781406 112582 3207089 7325610 7900834 4543345 863734 -428312
43571 -428312 461905 2378037 4431375 5557463 5193137 4438487 4943025 6967349 9853576
43562 9853576 13429850 17225590 19449561 18962482 17377669 16929033 17159228 16217855 14488285
43553 14488285 13915836 14362323 13974247 12909158 12967202 13241186 10371329 4665614 1994565
43544 1994565 6690027 15150964 19674321 17317478 12264546 10084630 11965659 14606504
43536 14606504 14196269 10127723 5312728 2843037 2642342 2343055 974368 -250432
43528 -250432 -905265 -2391431 -4853238 -5689443 -3218824 204880 1252180 384356 861920
$$ packed form
43588A1183113k991794k203206m54349j14427j653445k291742l65985J422139
43580B530304J76313j925211o68824L094507M118521N75224l357489l679611j292046
43571d28312Q90217J916132K053338J126088l64326p54650N04538K024324K886227
43562I853576L576274L795740K223971m87079j584813m48636K30195r41373j729570
43553A4488285n72449M46487l88076j065089N8044K73984k869857n705715k671049
43544A994565M695462Q460937M523357k356843n052932k179916J881029K640845
43536A4606504m10235m068546m814995k469691k00695k99287j368687j224800
43528b50432o54833j486166k461807q36205K470619L423704J047300q67824M77564
$$ plain form
43519 861920 3745213 6571177 6984880 5437048 3873342 3369173 3480013 2876207 587672
43510 587672 -2481602 -3655682 -1252003 3106346 6111063 6329910 5057270 4248779 4964765
43501 4964765 7189565 9545016 9704372 6856111 3305983 1775542 1683970 435436 -2003588
43492 -2003588 -2745350 -531420 2355885 3721866 4165610 4705337 4470292 2948697 2258480
43483 2258480 4431200 7846636 9033279 7112294 4038934 1318308 -835709 -1638286
43475 -1638286 -35566 2925013 4718678 4871007 5378917 6952391 7549124 5999773 4545344
43466 4545344 5634175 8063269 8817852 7607238 6932225 8065805 9501420 9587129 8433265
43457 8433265 6592429 3935603 1006296 -189344 1559957 4466840 5435663 3740440
$$ packed form
43519H61920K883293K825964M13703j547832j563706n04169J10840o03806k288535
43510E87672l069274j174080K403679M358349L004717K18847j272640q08491P15986
43501D964765K224800K355451J59356k848261l550128j530441r1572j248534k439024
43492b003588p41762K213930K887305J365981M43744N39727k35045j521595o90217
43483B258480K172720L415436J186643j920985l073360k720626k154017q02577
43475a638286J602720K960579J793665J52329N07910J573474N96733j549351j454429
43466D545344J088831K429094P54583j210614o75013J133580J435615Q5709j153864
43457H433265j840836k656826k929307j195640J749301K906883R68823j695223
$$ plain form
43449 3740440 1708415 1689096 3433687 4717013 3644533 16795 -4673509 -7952020
43441 -7952020 -7858738 -4889546 -2317103 -3379247 -7560155 -10408824 -7972313 -1231905
43433 -1231905 4735533 6187825 4559928 4448634 8382338 14329507 18094471 17316357
43425 17316357 13075072 8479925 6205768 6836748 8833342 10035412 9469206 7709171
43417 7709171 5592784 3202825 493778 -1772583 -2694251 -2602465 -2619623 -2665704 -1226678
43408 -1226678 2031307 4583400 3666180 258963 -1471612 717426 4295789 5446320
43400 5446320 3932505 2449480 1946890 432493 -3001522 -5742051 -5227689 -3152530
43392 -3152530 -3441653 -6712680 -9482711 -9053840 -6519583 -3980204 -1354001 2051256
$$ packed form
43449C740440k032025j9319J744591J283326j072480l627738m690304l278511
43441g952020R3282K969192K572443j062144m180908k848669K436511O740408
43433a231905N967438J452292j627897j11294L933704N947169L764964p78114
43425A7316357m241285m595147k274157O30980J996594J202070n66206j760035
43417G709171k116387k389959k709047k266361r21668R1786j7158m6081J439026
43408a226678L257985K552093r17220l407217j730575K189038L578363J150531
43400E446320j513815j483025n02590j514397l434015k740529N14362K075159
43392c152530k89123l271027k770031M28871K534257K539379K626203L405257
$$ plain form
43384 2051256 4716032 4530188 2608135 2546382 5324136 7455150 5665783 1614136 -130915
43375 -130915 1965301 4676184 4463375 1815385 137641 1471923 4679715 7404561
43367 7404561 8380788 7625738 5697019 3578603 2443044 2476009 2352518 875580 -1166883
43358 -1166883 -1924842 -1134013 -407918 -525169 49527 2825528 6463998 7762717 5324782
43349 5324782 1260564 -837733 861492 4926752 7837253 6979825 3051189 -791748
43341 -791748 -2415846 -2513045 -2476687 -1989458 -247147 1654568 1941106 1382901 2685435
43332 2685435 6218396 8822708 7957476 4911821 2441211 1114698 -61543 -916438
43324 -916438 -473780 640411 574999 -940060 -2227910 -2414268 -2597934 -3505317 -3654487
$$ packed form
43384B051256K664776j85844j922053o1753K777754K131014j789367m051647j745051
43375a30915K096216K710883k12809k647990j677744J334282L207792K724846
43367G404561R76227p55050j928719k118416j135559L2965j23491j476938k042463
43358a166883p57959P90829P26095j17251N74696K776001L638470J298719k437935
43349E324782m064218k098297J699225M065260K910501q57428l928636l842937
43341g91748j624098r7199L6358M87229J742311J901715K86538n58205J302534
43332B685435L532961K604312q65232l045655k470610j326513j176241q54895
43324i16438M42658J114191o5412j515059j287850j86358j83666r07383j49170
$$ plain form
43315 -3654487 -1229912 3025577 6078418 5659200 2390116 -962259 -1817463 447935
43307 447935 4358915 7656883 9001831 8743826 8220299 8282040 8404397 7285756 4425285
43298 4425285 892131 -1839561 -3600030 -5363872 -7353850 -8182552 -6299642 -1651855
43290 -1651855 4404188 10027563 13330220 12976494 9310332 4323563 -102783 -3200846
43282 -3200846 -4311181 -2626451 834296 2822612 1599777 -241123 724599 3499536
43274 3499536 4197771 2398802 1987649 4821874 7554466 6886371 4621125 4519809 6668876
43265 6668876 8463576 9488649 11553347 14509228 15851059 14891163 14061322 15017950 16085512
43256 16085512 14948999 11853475 8601503 5860478 3067555 187388 -1789150 -1889391
$$ packed form
43315c654487K424575M255489L052841m19218l269084l352375q55204K265398
43307D47935L910980L297968J344948k58005n23527O1741J22357j118641k860471
43298D425285l533154k731692j760469j763842j989978q28702J882910M647787
43290a651855O056043N623375L302657l53726l666162m986769m426346l098063
43282c200846j110335J684730L460747J988316j222835j840900R65722K774937
43274C499536O98235j798969m11153K834225K732592o68095k265246j01316K149067
43265F668876J794700J025073K064698K955881J341831r59896q29841R56628J067562
43256A6085512j136513l095524l251972k741025k792923k880167j976538j00241
$$ plain form
43248 -1889391 -121238 2302941 3646066 3275792 2567342 3136229 4295093 3881828 1917773
43239 1917773 1503117 4961953 10585120 14544485 14911406 12444885 8527231 4157908
43231 4157908 583507 -819512 315683 3021906 5746929 7048240 6257605 4297601
43223 4297601 3220848 4010561 5419739 5896223 5871805 6914405 9279728 11697469 13044543
43214 13044543 12767434 10235737 5526505 611194 -2179439 -2936923 -3576995 -4457795 -3870124
43205 -3870124 -1394733 710103 745962 81014 692686 1858794 1298636 -1465536 -4764522
43196 -4764522 -6942158 -7059908 -4379291 530125 4493145 4067518 -149650 -3362736
43188 -3362736 -1660057 3814349 8316968 8103964 3139582 -3582992 -8496467 -9845027
$$ packed form
43248a889391J768153K424179J343125l70274p08450N68887J158864m13265j964055
43239A917773m14656L458836N623167L959365L66921k466521l917654m369323
43231D157908l574401j403019J135195K706223K725023J301311p90635j960004
43223D297601j076753P89713J409178M76484k4418J042600K365323K417741J347074
43214A3044543k77109k531697m709232m915311k790633p57484o40072q80800N87671
43205c870124K475391K104836L5859o64948O11672J166108n60158k764172l298986
43196d764522k177636j17750K680617M909416L963020m25627m217168l213086
43188c362736J702679N474406M502619k13004m964382o722574m913475j348560
$$ plain form
43180 -9845027 -8500865 -6585003 -5452873 -5250247 -5668092 -6000057 -4981369 -2224627 263474
43171 263474 -131026 -2990943 -4968891 -4169479 -2269600 -1159843 34628 2419018 4010918
43162 4010918 2202828 -1619708 -3606928 -3423803 -4732576 -8615835 -10396655 -5732025
43154 -5732025 2722850 8078582 7392549 3959836 2035109 2516634 4225818 6422403
43146 6422403 8618253 9929581 10189963 10401993 10857182 10158536 7543415 4946939 4958940
43137 4958940 7480950 10159339 11495371 11569086 10228880 7232937 4591815 5969912
43129 5969912 12083745 18570164 20427352 17409551 13097415 9715976 6459965 2680179
43121 2680179 -219828 -1176498 -1561302 -3112264 -5082945 -5427590 -4252292 -4011588 -5942357
$$ packed form
43180i845027J344162J915862J132130K02626m17845l31965J018688K756742K488101
43171B63474l94500k859917j977948P99412J899879J109757J194471K384390J591900
43162D010918j808090l822536j987220J83125j308773l883259j780820M664630
43154e732025Q454875N355732o86033l432713j924727M81525J709184K196585
43146F422403K195850J311328K60382K12030M55189o98646k615121k596476J2001
43137D958940K522010K678389J336032P3715j340206k995943k641122J378097
43129E969912O113833O486419J857188l017801m312136l381439l256011l779786
43121B680179k900007r56670l84804j550962j970681l44645J175298K40704j930769
$$ plain form
43112 -5942357 -8023099 -7539592 -4686330 -2243346 -1853550 -1934897 81171 4199836 7593666
43103 7593666 7891605 5844957 4200460 4481898 5706489 6172409 5568144 4756387 3961225
43094 3961225 2053854 -2044431 -7653158 -12547433 -14918374 -14722826 -13000216 -10581563
43086 -10581563 -8184992 -7134676 -8400038 -10555329 -10166606 -5306634 2149909 8691644
43078 8691644 12695358 14596174 14646875 12554108 9041788 5737007 3302661 1369077
43070 1369077 282743 835054 2115072 2212288 1708710 3474737 7483975 9016400 4815883
43061 4815883 -1458953 -3454071 -121071 4280848 6916319 8551456 9224844 6837669
43053 6837669 1606757 -2414455 -2710493 -1723421 -2212589 -2475347 273392 4317055 5486864
$$ packed form
43112e942357k080742M83507K853262K442984L89796q1347K016068M118665L393830
43103G593666K97939k046648j644497K81438J224591M65920o04265q11757p95162
43094C961225j907371m098285n608727m894275k370941J95548J722610K418653
43086a0581563K396571J050316j265362k155291L88723M859972P456543O541735
43078H691644M003714J900816N0701k092767l512320l304781k434346j933584
43070A369077j086334N52311J280018R7216n03578J766027M009238J532425m200517
43061D815883o274836j995118L333000M401919K635471J635137O73388k387175
43053F837669n230912m021212k96038R87072m89168k62758K748739M043663J169809
$$ plain form
43044 5486864 3468655 1834309 2175826 2236309 234593 -2687350 -5278816 -8010222 -10598432
43035 -10598432 -10780077 -7648533 -3792800 -1807616 -705881 1534171 3469095 1636388
43027 1636388 -3747392 -7687749 -6038747 -290732 4342518 4324105 345600 -4344970
43019 -4344970 -6766574 -5731129 -1958371 2590936 5803908 6591511 5581758 4672620
43011 4672620 5400049 7411643 8727495 7608613 3920083 -1154913 -5920703 -8610966
43003 -8610966 -8301437 -6185471 -4881964 -5337091 -5323962 -2487475 1865389 3930632 2093039
42994 2093039 -1638600 -4975465 -7675066 -9643707 -9256855 -5672182 -1234835 853534
42986 853534 516749 165848 546897 -120118 -2477122 -4129173 -2845712 150092 1910539
$$ packed form
43044E486864k018209j634346L41517O0483k001716k921943k591466k731406k588210
43035a0598432j81645L131544L855733J985184J101735K240052J934924j832707
43027A636388n383780l940357J649002N748015M633250j8413l978505m690570
43019d344970k421604J035445L772758M549307L212972P87603j009753r09138
43011D672620P27429K011594J315852j118882l688530n074996m765790k690263
43003h610966L09529K115966J303507m55127J3129K836487M352864K065243j837593
42994B093039l731639l336865k699601j968641L86852L584673M437347K088369
42986H53534l36785l50901L81049o67015k357004j652051J283461K995804J760447
$$ plain form
42977 1910539 1725353 1458273 2352654 3414907 3353280 2654920 2820816 4281280 6065665
42968 6065665 7444960 9088429 12066881 15884834 18169635 16865218 12543451 7850799
42960 7850799 4571373 2013121 -1345147 -5506123 -9097545 -11214230 -11958613 -11397652
42952 -11397652 -9288685 -6145717 -3562990 -2905856 -4174764 -6337632 -8083855 -8075890 -5457770
42943 -5457770 -845920 3640009 5798805 4544613 -25592 -6444731 -11446495 -11546956
42935 -11546956 -6594546 -738242 1766423 1057287 399176 1231533 1801084 694917 -748238
42926 -748238 -445451 1877475 5138882 8250387 9873324 8427229 3946941 -1015474
42918 -1015474 -3665569 -3403153 -1266274 1452432 2736814 80782 -6194693 -11166899
$$ packed form
42977A910539j85186k67080Q94381J062253o1627o98360J65896J460464J784385
42968F065665J379295J643469K978452L817953K284801j304417m321767m692652
42960G850799l279426k558252l358268m160976l591422k116685p44383N60961
42952a1397652K108967L142968K582727O57134j268908k162868j746223P965K618120
42943e457770M611850M485929K158796j254192m570205o419139n001764j00461
42935a1546956M952410N856304K504665p09136o58111Q32357N69551j106167j443155
42926g48238L02787K322926L261407L111505J622937j446095m480288m962415
42918a015474k650095K62416K136879K718706J284382k656032o275475m972206
$$ plain form
42910 -11166899 -10031560 -4231383 235090 660147 367753 2819110 6615754 8496279
42902 8496279 8367666 8323904 8445168 6853134 3343470 117182 -1182361 -950564 4155
42893 4155 1518312 3056764 3384475 1996303 -251088 -2366768 -4048312 -5009615 -4662891
42884 -4662891 -3009164 -1009696 343711 692780 -27269 -1698445 -3580505 -4597255
42876 -4597255 -4325698 -3109712 -1324765 575125 1468984 278400 -2606823 -5713642
42868 -5713642 -8224792 -9941843 -9694669 -6046266 -393734 2847117 927892 -3718258
42860 -3718258 -6451311 -5915492 -4603305 -4592352 -5092712 -4622140 -3586494 -3379590 -3932804
42851 -3932804 -3740486 -2409754 -1865885 -3872209 -6761852 -6356447 -1028349 5525938 8221102
$$ packed form
42910a1166899J135339N800177M466473M25057k92394K451357L796644J880525
42902H496279j28613m3762J21264j592034l509664l226288j299543K31797R54719
42893D155J514157J538452L27711j388172k247391k115680j681544r61303L46724
42884d662891J653727J999468J353407L49069p20049j671176j882060j016750
42876d597255K71557J215986J784947J899890Q93859j190584k885223l106819
42868e713642k511150j717051K47174L648403N652532L240851j919225m646150
42860c718258k733053N35819J312187J0953n00360M70572J035646K06904n53214
42851c932804J92318J330732N43869k006324k889643M05405N328098O554287K695164
$$ plain form
42842 8221102 6396952 3622994 2372938 1807184 1017707 1004838 1920604 1478777 -1475447
42833 -1475447 -4300956 -4268735 -2892270 -3439711 -5818576 -7435387 -7855462 -8665236 -9383097
42824 -9383097 -7786060 -4442555 -2660404 -3104472 -2613826 169404 1967080 -175656
42816 -175656 -4497422 -7514739 -8405049 -7880330 -5690352 -2343124 -716384 -2420167 -4531840
42807 -4531840 -3537658 -824853 -405791 -2559894 -4067343 -4097011 -5220943 -8173663 -9958220
42798 -9958220 -8419575 -5029455 -1644183 2063171 6007031 7698359 5556698 2131020
42790 2131020 1371417 3908462 7088983 8553246 7849740 5508273 2489851 32783
42782 32783 -1488882 -3092010 -5453909 -7435480 -7492230 -5686785 -3116447 -369997 2070961
$$ packed form
42842H221102j824150k773958j250056n65754p89477j2869R15766m41827k954224
42833a475447k825509L2221J376465n47441k378865j616811m20075q09774p17861
42824i383097J597037L343505J782151m44068M90646K783230J797676k142736
42816a75656m321766l017317q90310N24719K189978L347228J626740j703783k111673
42807d531840R94182K712805M19062k154103j507449k9668j123932k952720j784557
42798i958220J538645L390120L385272L707354L943860J691328k141661l425678
42790B131020p59603K537045L180521J464263p03506k341467l018422k457068
42782C2783j521665j603128k361899j981571n6750J805445K570338K746450K440958
$$ plain form
42773 2070961 3015831 1941500 412253 299451 1143354 1074906 -166073 -1099541 -1063714
42764 -1063714 -810801 -554929 483706 2264488 3568328 3890288 3870554 3416385 1498680
42755 1498680 -1320946 -2361551 -411743 1888743 1278665 -1640174 -3369310 -2496695
42747 -2496695 -1446591 -2875174 -6159006 -8508525 -8550559 -7596756 -7522181 -8300595 -8151625
42738 -8151625 -5941426 -2815054 -965516 -1084832 -1822323 -1796112 -1168330 -758504 -507257
42729 -507257 267943 1578576 2689393 3194874 3330771 3086060 1645655 -1783154 -6457329
42720 -6457329 -9577286 -8105509 -2125311 3974208 5332002 2071595 -747181 562413
42712 562413 4056857 5813974 5703462 6563559 8813781 9554698 7174030 3368964 -320937
$$ packed form
42773B070961R44870j074331j529247j12802Q43903o8448j240979r33468L5827
42764a063714K52913K55872J038635J780782J303840L21960j9734m54169j917705
42755A498680k819626j040605J949808K300486o10078k918839j729136Q72615
42747b496695J050104j428583l283832k349519m2034R53803P4575p78414J48970
42738h151625K210199L126372J849538j19316p37491K6211O27782M09826K51247
42729e07257P75200J310633J110817N05481J35897k44711j440405l428809m674175
42720f457329l119957J471777N980198O099519J357794l260407k818776J309594
42712E62413L494444J757117j10512Q60097K250222P40917k380668l805066l689901
$$ plain form
42703 -320937 -4607503 -9354855 -11533962 -9070995 -4663587 -2755330 -3939676 -5161962
42695 -5161962 -4522974 -2921112 -1383051 212912 1591792 2005657 2175690 3764214 6181971
42686 6181971 6377687 2962210 -1546227 -3916326 -3880541 -3309767 -3440223 -4565009 -7104685
42677 -7104685 -11030977 -14785728 -16260104 -14696529 -11036533 -7152134 -5204162 -6357202
42669 -6357202 -9119389 -10314659 -8885904 -7278901 -7643519 -8390870 -6690056 -2983546
42661 -2983546 -258632 479175 1111191 2869941 4726372 5755358 6454693 6801865 5444248
42652 5444248 2245226 -356231 -304795 1119481 1154544 -416551 -881991 1829166 6499418
42643 6499418 9897041 10085586 8068058 6120824 4802085 2513041 -1450141 -4702744
$$ packed form
42703c20937m286566m747352k179107K462967M407408J908257j184346j222286
42695e161962O38988J601862J538061J595963J378880M13865J70033J588524K417757
42686F181971J95716l415477m508437k370099L5785N70774j30456j124786k539676
42677g104685l926292l754751j474376J563575L659996L884399J947972j153040
42669f357202k762187j195270J428755J607003l64618p47351J700814L706510
42661b983546K724914P37807O32016J758750J856431J028986O99335L47172j357617
42652E444248l199022k601457N1436J424276L5063j571095m65440K711157M670252
42643F499418L397623J88545k017528j947234j318739k289044l963182l252603
$$ plain form
42635 -4702744 -4431917 -1656996 -425288 -2389300 -4507736 -3166401 1403352 6115028
42627 6115028 8623546 8378851 5774233 2271656 255148 724390 1838281 1468160 255348
42618 255348 61868 227247 -1972514 -7150409 -12547385 -15365975 -15221965 -12805032 -8485143
42609 -8485143 -3456637 -280284 -533980 -2985022 -5383333 -6955342 -7767050 -6892134 -3382768
42600 -3382768 1269175 3750678 2528278 -550826 -2754217 -3307001 -3066244 -2605693 -1917587
42591 -1917587 -1416211 -1783597 -2712890 -2941361 -1910476 -469671 578029 1690086 3439128
42582 3439128 4881061 4426885 2275648 695163 1435185 3716163 5251011 4599211 2105608
42573 2105608 -802040 -2649646 -2693314 -1283477 511087 1640532 1341854 -641958 -3103425
$$ packed form
42635d702744K70827K774921J231708j964012k118436J341335M569753M711676
42627F115028K508518k44695k604618l502577k016508M69242J113891l70121j212812
42618B55348j93480J65379k199761n177895n396976k818590J44010K416933M319889
42609h485143N028506L176353k53696k451042k398311j572009q11708Q74916L509366
42600c382768M651943K481503j222400l079104k203391n52784K40757M60551O88106
42591a917587N01376l67386r29293k28471J030885J440805J047700J112057J749042
42582C439128J441933m54176k151237j580485P40022K280978J534848o51800k493603
42573B105608k907648j847606m3668J409837J794564J129445k98678j983812k461467
$$ plain form
42564 -3103425 -3214270 761858 6325182 8389157 5135605 430330 -987972 1039423
42556 1039423 3286145 3973289 3612608 2184303 -926231 -3977186 -3396064 1242364 5448536
42547 5448536 5110740 1690456 -190164 922415 2168727 1346109 113646 850530 2222948
42538 2222948 360761 -5601110 -11361318 -12138389 -8244176 -4136177 -2598357 -2443093
42530 -2443093 -2352376 -3868626 -8325330 -12929053 -13068863 -7890738 -852827 4932892 9116224
42521 9116224 11852985 12248392 10124720 6994433 4096645 1312786 -1183223 -2373161
42513 -2373161 -2495978 -3363783 -5194442 -5499712 -3005819 -426956 -835272 -2994879 -3125118
42504 -3125118 -172624 3568188 6407523 8735491 10425854 9692602 5698348 534058
$$ packed form
42564c103425j10845L976128N563324K063975l253552m705275j418302K027395
42556A039423K246722O87144l60681j428305l110534l050955N81122M638428M206172
42547E448536l37796l420284j880620J112579J246312q22618j232463P36884J372418
42538B222948j862187n961871n760208p77071L894213M107999J537820J55264
42530b443093R0717j516250m456704m603723j39810N178125P037911N785719M183332
42521I116224K736761L95407k123672l130287k897788k783859k496009j189938
42513b373161j22817q67805j830659l05270K493893K578863m08316k159607j30239
42504c125118K952494L740812K839335K327968J690363p33252l994254n164290
$$ plain form
42496 534058 -2566096 -2212557 267126 2099549 1150977 -2306164 -5791888 -7171034 -6584363
42487 -6584363 -5117755 -2629370 1357087 5217532 6008904 3160709 -302593 -955571
42479 -955571 1640238 5076785 6632470 5473637 3339608 3212614 6402836 10891653
42471 10891653 13334087 12410563 9317581 5727767 2878450 2068445 3823861 6417196
42463 6417196 7191376 5669264 3573667 1753022 -552138 -2976154 -3328897 -935543
42455 -935543 1684281 2171359 1403320 1423164 2163981 2435054 2639794 3930574 5560867
42446 5560867 5708312 4614228 4441947 5898719 7229733 6976803 5639178 3813057 670249
42437 670249 -4180009 -8512372 -9051308 -5264407 -441366 1450183 -487948 -3719244
$$ packed form
42496E34058l100154L53539K479683J832423r48572l457141l485724j379146N86671
42487f584363J466608K488385L986457L860445P91372k848195l463302o52978
42479i55571K595809L436547J555685j158833k134029j26994L190222M488817
42471A0891653K442434r23524l092982l589814k849317q10005J755416K593335
42463F417196P74180j522112k095597j820645k305160k424016l52743K393354
42455i35543K619824M87078p68039J9844P40817K71073K04740J290780J630293
42446E560867J47445j094084j72281J456772J331014k52930j337625j826121l142808
42437F70249m850258m332363n38936L786901M823041J891549j938131l231296
$$ plain form
42429 -3719244 -5145575 -3731709 -465067 3208449 6122898 7232664 6069757 3597904
42421 3597904 1682972 1336471 2059531 2960360 3715907 4408350 5375634 7202103 9611274
42412 9611274 10358471 6970304 163366 -6122813 -8854515 -8396175 -6186528 -2325494
42404 -2325494 2789936 6674378 7367056 6619492 7706303 10710504 12625387 11706289 8949593
42395 8949593 5403579 1146699 -2433520 -2528790 1119119 4378280 3152556 -1428633
42387 -1428633 -4285032 -2520250 1385152 2821027 397293 -2768808 -2922866 87462
42379 87462 3238379 4384952 4097134 3160464 689096 -3520084 -6826806 -6698601 -4549133
42370 -4549133 -3572520 -3682134 -2274982 295402 405061 -2701261 -4734066 -2421542 1961539
$$ packed form
42429c719244j426331J413866L266642L673516K914449J109766j162907k471853
42421C597904j914932l46501P23060R00829P55547O92443R67284J826469K409171
42412I611274P47197l388167o806938o286179k731702M58340K209647L861034
42404b325494N115430L884442O92678p47564J086811L004201J914883r19098k756696
42395H949593l546014m256880l580219r5270L647909L259161j225724m581189
42387a428633k856399J764782L905402J435875k423734l166101j54058L010328
42379H7462L150917J146573k87818r36670k471368m209180l306722J28205K149468
42370d549133R76613j09614J407152K570384J09659l106322k032805K312524M383081
$$ plain form
42361 1961539 4867869 6932513 10483838 14044795 13715145 9225757 4743079 3552293
42353 3552293 5006373 6987538 8534315 9284284 8626925 6525356 3828395 1120256
42345 1120256 -1685372 -4315702 -5748510 -5196525 -2954816 -410087 540091 -933439
42337 -933439 -2922872 -2121462 2002955 6015662 7070846 6650817 7395505 8349995 6906104
42328 6906104 3928880 2572864 2634332 956198 -2144038 -1960405 3424741 9685868 12367174
42319 12367174 12190477 11292819 8387266 1992069 -4574165 -6354552 -3317474 662583
42311 662583 4113609 8583024 13521334 15541166 13634375 10959401 9989488 9284178 6712874
42302 6712874 2997973 276076 -523489 696180 3858747 7249936 7626256 3974373
$$ packed form
42361A961539K906330K064644L551325L560957l29650m489388m482678j190786
42353C552293J454080J981165J546777P49969o57359k101569k696961k708139
42345A120256k805628k630330j432808N51985K241709K544729R50178j473530
42337i33439j989433Q01410M124417M012707J055184m20029P44688R54490j443891
42328F906104k977224j356016O1468j678134l100236J83633N385146O261127K681306
42319A2367174j76697q97658k905553o395197o566234j780387L037078L980057
42311F62583L451026M469415M938310K019832j906791k674974r69913p05310k571304
42302F712874l714901k721897p99565J219669L162567L391189L76320l651883
$$ plain form
42294 3974373 -502116 -2285108 -1971553 -2544794 -4520958 -5573035 -4451657 -2456454
42286 -2456454 -703982 1561027 4928501 8019693 9190489 8897547 8792659 8949718 7656333
42277 7656333 4357750 1454084 1845197 5012481 7044574 5205875 1310301 -692197
42269 -692197 328781 1975883 2369759 2548543 3828860 4844782 3316458 -194610 -2594159
42260 -2594159 -2375296 -1552971 -2860900 -6321050 -9352963 -9367527 -5533979 1127080 8244485
42251 8244485 13027083 14014059 12454792 11297881 12094344 13118030 11321743 6285872
42243 6285872 1352245 119956 2428467 5005897 5964787 7075160 10729481 15811705
42235 15811705 18154866 15126693 8755973 3962846 4063965 8007639 11602944 11458017
$$ packed form
42294C974373m476489j782992L13555n73241j976164j052077J121378J995203
42286b456454J752472K265009L367474L091192J170796k92942j04888J57059j293385
42277G656333l298583k903666L91113L167284K032093j838699l895574k002498
42269f92197J020978J647102L93876J78784J280317J015922j528324l511068k399549
42260b594159K18863Q22325j307929l460150l031913j4564L833548O661059P117405
42251H244485M782598R86976j559267j156911P96463J023686j796287n035871
42243F285872m933627j232289K308511K577430R58890J110373L654321N082224
42235A5811705K343161l028173o370720m793127J01119L943674L595305j44927
$$ plain form
42227 11458017 8054593 4958424 4917224 7179685 9025613 9217065 8836605 8935052 8784487
42218 8784487 7126289 4194290 1423938 -549693 -2523931 -5058432 -6978967 -6401911
42210 -6401911 -3216124 142181 784378 -1977569 -6162042 -8783382 -7740292 -2980085
42202 -2980085 3095188 6804161 6212995 3221366 1495639 2164892 2949708 1895284 141568
42193 141568 -142577 1003220 1781694 1219306 -341338 -2298670 -3508296 -2028249 2371006
42184 2371006 6066571 4974886 372849 -1695400 2040346 7856961 10206358 8850509
42176 8850509 8210492 10748801 13789836 13118117 7852597 1142432 -2951893 -2813198 -129080
42167 -129080 2118444 2407168 1320655 -51255 -1257867 -1989367 -1851002 -1249353 -1240935
$$ packed form
42227A1458017l403424l096169m1200K262461J845928J91452l80460R8447j50565
42218H784487j658198k931999k770352j973631j974238k534501j920535N77056
42210f401911L185787L358305O42197k761947m184473k621340J043090M760207
42202b980085O075273L708973n91166k991629j725727O69253P84816j054424j753716
42193A41568k84145J145797P78474n62388j560644j957332j209626J480047M399255
42184B371006L695565j091685m602037k068249L735746N816615K349397j355849
42176H850509o40017K538309L041035o71719n265520o710165m094325J38695K684118
42167a29080K247524K88724j086513j371910j206612p31500J38365O01649Q418
$$ plain form
42158 -1240935 -1773325 -1450080 32641 811656 -371561 -1875394 -1546220 -97626 239359
42149 239359 -475388 -122673 1810854 3645822 4803121 6834994 10277000 12977596 12909434
42140 12909434 10666538 7839272 4813243 1784705 223762 1267751 3737968 5656094
42132 5656094 6870796 8322559 9587462 9501184 8915816 10232812 13545022 15456193 13103642
42123 13103642 7892180 3631126 1844449 769144 -1157080 -2861574 -2739659 -1757032
42115 -1757032 -2403303 -4651519 -5143639 -1601993 3577195 6202006 5939558 6476765 9763011
42106 9763011 12781651 11558380 6469249 1585075 -82579 1333690 4381568 7857402
42098 7857402 10521674 11216924 9871598 7365038 4463384 2083650 2111320 5799505 11050145
$$ packed form
42158a240935n32390L23245J482721P79015j183217j503833L29174J448594L36985
42149B39359p14747L52715J933527J834968J157299K031873L442006K700596o8162
42140A2909434k242896k827266l026029l028538j560943J043989K470217J918126
42132E656094J214702J451763J264903q6278n85368J316996L312210J911171k352551
42123A3103642n211462m261054j786677j075305j926224j704494J21915R82627
42115a757032o46271k248216m92120L541646N179188K624811k62448N37207L286246
42106I763011L018640j223271n089131m884174j667654J416269L047878L475834
42098G857402K664272O95250j345326k506560k901654k379734K7670L688185N250640
$$ plain form
42089 11050145 13558158 11758504 8773016 8051457 8864632 8177338 5657469 4035723
42081 4035723 4685997 5642392 4894152 3361837 2954892 3273052 2444073 568988 -95075
42072 -95075 1196497 1933294 -415579 -4769768 -7678753 -7453398 -5238756 -2228883 1945088
42063 1945088 7163600 10980269 10680935 6674132 2373579 700330 1658870 3331556
42055 3331556 4327257 4977456 6532202 9171307 10725754 8220067 1541372 -5180373
42047 -5180373 -7227710 -4085788 588141 3238029 2918590 -1678 -4855164 -9456610
42039 -9456610 -10441179 -6897811 -2142561 253696 1076815 3761825 8822288 12792421
42031 12792421 12916262 10202683 6891125 3371817 -594807 -3504999 -3519451 -1560752
$$ packed form
42089A1050145K508013j799654k985488p21559Q13175o87294k519869j621746
42081D035723O50274R56395p48240j532315m06945L18160q28979j875085o64063
42072i5075J291572P36797k348873m354189k908985K25355K214642L009873M173971
42063A945088N218512L816669k99334m006803m300553j673249R58540J672686
42055C331556R95701O50199J554746K639105J554447k505687o678695o721745
42047e180373k047337L141922M673929K649888l19439k920268m853486m601446
42039i456610r84569L543368M755250K396257Q23119K685010N060463L970133
42031A2792421J23841k713579l311558l519308l966624k910192j4452J958699
$$ plain form
42023 -1560752 -572663 -1549297 -2390027 -1285951 751982 1988602 2887489 4903831 7252328
42014 7252328 7373712 4793385 2084349 914422 -666618 -4931068 -9958877 -11290568
42006 -11290568 -7915854 -3822628 -2756568 -3823050 -3802677 -1895577 37611 889517
41998 889517 1552990 2893494 4518115 5926767 7269447 8407260 8554972 7507781 6087211
41989 6087211 4689123 2560813 -452131 -2446761 -1316117 2159503 4575375 3716638
41981 3716638 1043087 -384566 378916 1778704 2777379 4422919 7467012 10006711
41973 10006711 9657972 7525368 7284272 9723941 11146933 9090715 6856632 8841313
41965 8841313 13057085 13058911 7560539 3160985 5223125 10236231 11113430 7256475 4452826
$$ packed form
42023a560752R88089r76634q40730J104076K037933J236620Q98887K016342K348497
42014G252328J21384k580327k709036j169927j581040m264450n027809j331691
42006a1290568L374714M093226J066060j066482K0373J907100J933188Q51906
41998H89517O63473J340504J624621J408652J342680J137813J47712j047191j420570
41989F087211j398088k128310l012944j994630J130644L475620K415872q58737
41981C716638k673551j427653P63482J399788R98675J645540L044093K539699
41973A0006711l48739k132604k41096K439669J422992k056218k234083J984681
41965H841313M215772J826n498372m399554K062140N013106Q77199l856955k803649
$$ plain form
41956 4452826 5765421 7654561 6089865 2132502 -839951 -2239209 -3587917 -4692308
41948 -4692308 -3741350 -660562 2274452 3276629 2610590 1312900 153548 -11345 1300086
41939 1300086 2971681 3305632 2870665 4382317 8525197 11768126 10471850 6158213
41931 6158213 4237451 7504257 13002939 15796526 13966478 9074233 3503676 -1042600
41923 -1042600 -3418348 -3230407 -1236508 1308314 3549614 4798932 4207047 1794996
41915 1794996 -689337 -1255693 86586 1622794 2252368 2342520 2487312 2872191 3940540
41906 3940540 6130014 8535486 9316726 8085654 6548393 6043879 5834325 4865021 3919408
41897 3919408 4563550 6660174 8238245 7499534 4196102 -276644 -3330918 -2672753 1461962
$$ packed form
41956D452826J312595J889140j564696l957363k972453j399258j348708j104391
41948d692308R50958L080788K935014J002177o66039j297690j159352j64893J311431
41939A300086J671595L33951m34967J511652M142880L242929j296276m313637
41931F158213j920762L266806N498682K793587j830048m892245n570557m546276
41923a042600k375748J87941J993899K544822K241300J249318n91885k412051
41915A794996k484333n66356J342279J536208O29574R0152J44792L84879J068349
41906C940540K189474K405472P81240j231072j537261n04514k09554r69304r45613
41897C919408O44142K096624J578071p38711l303432m472746l054274O58165M134715
$$ plain form
41888 1461962 6163891 8839278 9446018 8897827 6900917 3315055 346456 649322 3537744
41879 3537744 5573094 4966912 3057125 1294512 -577938 -2607681 -3401046 -2079529
41871 -2079529 436252 3174606 6203665 8847709 9027892 6172221 2986260 2315743
41863 2315743 3683258 4933869 5807898 7313647 8586128 7412565 3916105 1091277
41855 1091277 1057216 2781083 4189973 4737631 4907110 4602074 3374129 1713402 1116765
41846 1116765 2762988 6291536 9902131 11920209 12397394 12616618 12878151 11982015 9628301
41837 9628301 7770712 7913098 8269085 5882582 943485 -3508232 -5991596 -7931970
41829 -7931970 -10128973 -10680275 -7789954 -2519189 2793594 7128383 10249961 11227544
$$ packed form
41888A461962M701929K675387O06740n48191j996910l585862k968599L02866K888422
41879C537744K035350o06182j909787j762613j872450k029743p93365J321517
41871b079529K515781K738354L029059K644044J80183k855671l185961o70517
41863B315743J367515J250611Q74029J505749J272481j173563l496460k824828
41855A091277l4061J723867J408890N47658J69479l05036j227945j660727n96637
41846A116765J646223L528548L610595K018078M77185K19224K61533q96136k353714
41837I628301j857589J42386L55987k386503m939097m451717k483364j940374
41829g931970k197003n51302K890321N270765N312783M334789L121578R77583
$$ plain form
41821 11227544 9520912 6670647 5104782 5635370 7284742 8891600 9746441 9535256
41813 9535256 9028456 9944430 12518047 14011404 11675921 6890874 4194619 5862667
41805 5862667 9322139 10649174 9002852 6467782 4711767 3422853 1881577 691908
41797 691908 1147663 3219688 5015926 4703625 2513558 59762 -2024229 -4433370 -6923334
41788 -6923334 -7391616 -4522820 -250365 2062588 1408290 -348597 -1269601 -958136 477364
41779 477364 3156712 6514891 9021703 9592715 8542643 6858858 5382956 4802470 5298971
41770 5298971 5921300 5483664 4432463 4514140 6034302 6844299 5011492 1351773 -1817032
41761 -1817032 -3503921 -4339291 -4674613 -3800140 -1054216 3152924 7443585 10215018 10714374
$$ packed form
41821A1227544j706632k850265j565865N30588J649372J606858Q54841k11185
41813I535256n06800R15974K573617J493357k335483m785047k696255J668048
41805E862667L459472J327035j646322k535070j756015j288914j541276j189669
41797F91908M55755K072025J796238l12301k190067k453796k083991k409141k489964
41788f923334m68282K868796M272455K312953o54298j756887r21004L11465J435500
41779D77364K679348L358179K506812N71012j050072j683785j475902n80486M96501
41770E298971O22329m37636j051201Q1677J520162Q09997j832807l659719l168805
41761a817032j686889q35370l35322Q74473K745924M207140M290661K771433M99356
$$ plain form
41752 10714374 9884759 9596516 10477571 11175777 10393716 8736456 7569379 6958681 6031265
41743 6031265 4534064 2409407 -1430003 -7642967 -13808146 -15654877 -11836306 -5668599
41735 -5668599 -1132223 1179372 2976449 5025547 7061136 9794574 14414884 19939804
41727 19939804 23084764 21565824 16462503 10879121 7300116 6694859 9070625 13863948
41719 13863948 20093237 26735935 32898457 37587218 39827875 39241705 36107414 30853312
41711 30853312 24191819 17831799 13952059 13216583 13967799 14122034 13336008 12586830 12255771
41702 12255771 11777736 11001615 10702515 11402668 12510588 13184419 13611970 14771307 16817631
41693 16817631 18222448 17288161 14734213 13759935 16331060 20040113 20611194 17544407
$$ packed form
41752A0714374q29615k88243Q81055O98206p82061j657260j167077o10698r27416
41743F031265j497201k124657l839410o212964o165179j846731L818571O167707
41735e668599M536376K311595J797077K049098K035589K733438M620310N524920
41727A9939804L144960j518940n103321n583382l579005o05257K375766M793323
41719A3863948O229289O642698O162522M688761K240657n86170l134291n254102
41711C0853312o661493o360020l879740p35476P51216J54235p86026p49178l31059
41702A2255771m78035p76121k99100P00153J107920O73831M27551J159337K046324
41693A6817631J404817r34287k553948r74278K571125L709053N71081l066787
$$ plain form
41685 17544407 14738153 14555503 14241909 10712997 6392993 6402884 11041362 15299450 15906292
41676 15906292 14666696 13920785 12939559 10810330 9150282 9256483 9657749 9365300 10504001
41667 10504001 14183934 16557450 13468578 7185003 3698245 4420522 5653214 5905765
41659 5905765 8114810 13603370 19191791 22415935 24916572 27958110 28974054 26196029
41651 26196029 23117373 24002839 27373600 28374424 26104581 24289519 25481505 28741350
41643 28741350 32798477 37334391 40590026 39660554 34754504 30233067 29591178 31399099
41635 31399099 31694153 28665552 23581745 18623056 15298499 13912627 13298805 11911696
41627 11911696 10128505 10450094 14380154 20120506 24586008 26839837 28134053 29198111
$$ packed form
41685A7544407k806254j82650l13594l528912m320004R891M638478M258088O06842
41676A5906292j239596p45911r81226k129229j660048J06201M01266k92449J138701
41667A0504001L679933K373516l088872o283575l486758P22277J232692K52551
41659E905765K209045N488560N588421L224144K500637L041538J015944k778025
41651B6196029l078656Q85466L370761J000824k269843j815062J191986L259845
41643B8741350M057127M535914L255635r29472m906050m521437o41889J807921
41635C1399099K95054l028601n083807m958689l324557j385872o13822j387109
41627A1911696j783191L21589L930060N740352M465502K253829J294216J064058
$$ plain form
41619 29198111 29211516 27564242 25273117 24131078 25127548 27852016 30682951 31487673 29330644
41610 29330644 26174615 25704070 28974502 31927294 29509305 22680051 18719520 22637411
41602 22637411 30351706 33582402 30414710 26752893 26833172 27205750 23025298 16355673
41594 16355673 13520391 16170074 20046380 22193740 24364861 28281178 32162779 34351374
41586 34351374 36860775 42283560 49456310 55184894 58733806 61708203 64482763 65733814
41578 65733814 65442896 65914643 69311743 75745727 84103661 93502199 103723461 115281306
41570 115281306 129285316 146609890 167356151 191540105 219290733 249023966 276059819
41563 276059819 294659785 301333867 295191142 276310173 246452474 211319227 178869460
$$ packed form
41619B9198111J3405j647274k291125j142039R96470K724468K830935Q04722k157029
41610B9330644l156029m70545L270432K952792k417989o829254l960531L917891
41602B2637411P714295L230696l167692l661817Q0279L72578m180452o669625
41594A6355673k835282K649683L876306K147360K171121L916317L881601K188595
41586C4351374K509401N422785P172750N728584L548912K974397K774560J251051
41578F5733814k90918M71747L397100O433984Q357934R398538J0221262J1557845
41570A15281306J4004010J7324574K0746261K4183954K7750628K9733233K7035853
41563B76059819J8599966O674082o142725j8880969k9857699l5133247l2449767
$$ plain form
41556 178869460 153476265 133222495 114369804 96953726 84040706 76560641 71485320
41549 71485320 65472658 58449509 52742852 49862361 49105649 48624116 46865133 43232983
41541 43232983 38264518 33408812 30178370 29150290 29711591 30697030 31295024 31606472 32431747
41532 32431747 34169975 35784137 35480391 32981537 30549891 30768948 33555161 36473961
41524 36473961 37940354 38764291 40313395 42754069 45899446 50253280 55885822 61443302
41516 61443302 65755475 69472633 73618781 77661653 80975280 85039679 91322678 97405407
41508 97405407 98541291 93686553 86897561 81614051 76697859 70055896 63099456 58392303
41500 58392303 54895357 49448249 42419477 38109059 38751593 41072891 40360917 36095197
$$ packed form
41556A78869460k5393195k0253770j8852691j7416078j2913020p480065n075321
41549G1485320o012662p023149n706657k880491p56712m81533j758983l632150
41541D3232983m968465m855706l230442j028080N61301R85439N97994L11448Q25275
41532C2431747J738228J614162l03746k498854k431646K19057K786213K918800
41524C6473961J466393Q23937J549104K440674L145377M353834N632542N557480
41516F1443302M312173L717158M146148M042872L313627M064399O282999O082729
41508I7405407J135884m854738o788992n283510m916192o641963o956440m707153
41500E8392303l496946n447108p028772m310418O42534K321298p11974m265720
$$ plain form
41492 36095197 31924370 31207348 34155617 38797169 43071983 45611492 45727513 43920048
41484 43920048 42274896 43052832 46136409 48815224 49186655 48806450 50249694 52928067
41476 52928067 54047630 53581050 54863714 59271534 63963455 67025550 71175721 78826905
41468 78826905 86565220 89472208 89353809 93331564 104465351 118943475 133181061 148349448
41460 148349448 166015594 184466687 202743782 224220858 251786334 281885855 307457176
41453 307457176 325108728 335422528 337534399 328253338 307133285 278731952 248644451
41446 248644451 219786303 193212189 169718797 149147880 130254206 112978863 99418202
41439 99418202 90970701 85575217 79381126 70807485 61935799 56150570 55008143 56972158
$$ packed form
41492C6095197m170827p17022K948269M641552M274814K539509J16021j807465
41484D3920048j645152P77936L083577K678815L71431l80205J443244K678373
41476E2928067J119563m66580J282664M407820M691921L062095M150171P651184
41468G8826905P738315K906988j18399L977755J1133787J4478124J4237586J5168387
41460A48349448J7666146J8451093J8277095K1477076K7565476L0099521K5571321
41453C07457176J7651552J0313800K111871r281061k1120053k8401333l0087501
41446B48644451k8858148k6574114k3493392k0570917j8893674j7275343j3560661
41439I9418202q447501n395484o194091q573641q871686n785229j142427J964015
$$ plain form
41431 56972158 58623856 57464627 53915981 50215020 47409683 44454580 40445653 36229957
41423 36229957 32915631 30234530 27796097 26665610 27671507 29022707 28178225 25906591
41415 25906591 25611828 28035222 29749938 28588323 27530806 30179048 34546780 35399164
41407 35399164 32016432 29377733 31113436 35335925 38967734 42320818 46558111 49552633
41399 49552633 47987845 42221229 35777306 30745633 26663949 23457070 22290205 23200793
41391 23200793 24647150 26129633 28948461 33421569 37316027 38368854 37280159 37169961
41383 37169961 40479670 46692981 52769722 56045928 56927100 57763125 58845430 57867342
41375 57867342 54849106 54601054 60872894 70284284 76550393 79338707 83650975 91028745
$$ packed form
41431E6972158J651698j159229l548646l700961k805337k955103m008927m215696
41423C6229957l314326k681101k438433j130487J005897J351200q44482k271634
41415B5906591k94763K423394J714716j161615j057517K648242M367732Q52384
41407C5399164l382732k638699J735703M222489L631809L353084M237293K994522
41399D9552633j564788n766616o443923n031673m081684l206879j166865R10588
41391B3200793J446357J482483K818828M473108L894458J052827j088695j10198
41383C7169961L309709O213311O076741L276206Q81172Q36025J082305r78088
41375E7867342l018236k48052O271840R411390O266109K788314M312268P377770
$$ plain form
41367 91028745 97840603 103569856 114054920 132764964 153939366 168893889 175531751
41360 175531751 177284846 175770764 169375491 157402197 141505734 124128100 108377652
41353 108377652 97358233 90513371 83215983 73528538 66298720 66026467 68878609 67827203
41345 67827203 63397313 62158325 65446418 67371910 65006478 63083776 65951664 71230264
41337 71230264 74927111 77535851 81236707 85550749 89819756 96134137 105445864 113808129
41329 113808129 116864443 115867210 115238471 116154825 116709826 117009123 119837922 126651244 136286484
41320 136286484 147313070 158634458 168156417 174028375 177443671 181535706 186887882 190050250
41312 190050250 187045051 177126818 163028439 148497175 135374106 122429895 107713842
$$ packed form
41367I1028745O811858N729253J0485064J8710044K1174402J4954523O637862
41360A75531751J753095j514082o395273j1973294j5896463j7377634j5750448
41353A08377652j1019419o844862p297388r687445p229818k72253K852142j051406
41345F7827203m429890j238988L288093J925492k365432j922702K867888N278600
41337G1230264L696847K608740L700856M314042M269007O314381R311727Q362265
41329A13808129L056314r97233o28739R16354N55001K99297K828799O813322R635240
41320A36286484J1026586J1321388R521959N871958L415296M092035N352176L162368
41312A90050250l005199r918233j4098379j4531264j3123069j2944211j4716053
$$ plain form
41305 107713842 92274279 79775534 71700672 65487489 59067665 54352858 53405062 53827092
41297 53827092 51935597 48801576 48711598 52404260 56263243 58017113 58673082 58407445 55435063
41288 55435063 50542671 48243259 50863891 55101816 57271997 58745302 62799812 68700481
41280 68700481 72924228 74820647 77136836 81498480 86960665 92904798 99722934 105971748
41272 105971748 108382324 106497662 104716741 107444757 113759050 118998361 120483727 119391681
41264 119391681 117660790 115703199 113538741 111811822 110354903 107175944 100381289 90555003
41256 90555003 80285994 71860378 66065268 62372497 59349890 55752612 52233193 50877226
41248 50877226 51690758 51011179 45836502 38849361 36023401 39109208 43537275 44446545
$$ packed form
41305A07713842j5439563j2498745q074862o213183o419824m714807r47796M22030
41297E3827092j891495l134021q9978L692662L858983J753870O55969k65637k972382
41288E5435063m892392k299412K620632M237925K170181J473305M054510N900669
41280F8700481M223747J896419K316189M361644N462185N944133O818136O248814
41272A05971748K410576j884662j780921K728016O314293N239311J485366j092046
41264A19391681j730891j957591k164458j726919j456919l178959o794655r826286
41256I0555003j0269009q425616n795110l692771l022607l597278l519419j355967
41248E0877226Q13532o79579n174677o987141k825960L085807M428067R09270
$$ plain form
41240 44446545 41702411 37684942 33304334 28525222 24409961 21963190 20567437 19853047
41232 19853047 21351789 25674091 29684355 29629280 26119725 22967725 21805841 21032790
41224 21032790 19667056 18774953 18741252 18352167 17480140 17914521 20353414 22855921 23541549
41215 23541549 22978961 22710099 22964434 23034942 22848779 23245304 25253758 29132408 33308230
41206 33308230 34915858 33050332 30948927 32749437 38269426 43357124 45340630 45400305
41198 45400305 45269931 44662288 43015733 41096611 39582858 38413694 38640992 42241197
41190 42241197 48465521 52818261 51617131 45697748 38046356 29938260 21305978 12912148
41182 12912148 6048966 1606622 924950 5362985 13108436 18894295 19608774 18235535
$$ packed form
41240D4446545k744134m017469m380608m779112m115261k446771j395753p14390
41232A9853047J498742M322302M010264n5075l509555l152000j161884p73051
41224B1032790j365734q92103l3701l89085q72027M34381K438893K502507O85628
41215B3541549n62588k68862K54335P0508j86163L96525K008454L878650M175822
41206C3308230J607628j865526k101405J800510N519989N087698J983506N9675
41198D5400305j30374o07643j646555j919122j513753j169164K27298L600205
41190D2241197O224324M352740j201130n919383p651392q108096q632282q393830
41182A2912148o863182m442344o81672M438035P745451N785859P14479j373239
$$ plain form
41174 18235535 19406262 22936672 25046655 24373010 22847551 21334569 18505164 14473343
41166 14473343 11999726 12799212 15025240 15609494 13587465 10533876 9046016 10941421
41158 10941421 15487299 19336088 19622818 17068436 14699459 13933017 13614650 12524366
41150 12524366 10819885 8993145 7244552 6102316 6211031 7443769 9248210 11216593
41142 11216593 12109868 9781164 4339952 83001 1167253 5972545 9031735 8263561
41134 8263561 6656855 6554435 6295670 3841357 171821 -2806885 -4838210 -5897196
41126 -5897196 -4866874 -1752058 1000253 1426869 385579 -675230 -1994009 -3630916
41118 -3630916 -3767991 -1329460 1783788 3607158 5175238 7856729 9816232 8800460
$$ packed form
41174A8235535J170727L530410K109983o73645j525459j512982k829405m031821
41166A4473343k473617P99486K226028N84254k022029l053589j487860J895405
41158A0941421M545878L848789K86730k554382k368977p66442l18367j090284
41150A2524366j704481j826740j748593j142236J08715J232738J804441J968383
41142A1216593Q93275k328704n441212m256951J084252M805292L059190p68174
41134H263561j606706j02420k58765k454313l669536k978706k031325j058986
41126e897196J030322L114816K752311M26616j041290j060809j318779j636907
41118c630916j37075K438531L113248J823370J568080K681491J959503j015772
$$ plain form
41110 8800460 6860996 8023835 11867152 13832858 12258504 10742597 12125598 14038547
41102 14038547 12903819 9516045 7677940 8866020 10990417 11690437 10474999 7832778
41094 7832778 4399706 1486595 841291 2866343 5605601 6229130 3632773 -490361
41086 -490361 -3130176 -2599380 142873 2678520 3416925 2608878 1604126 1767260 3841200
41077 3841200 7337875 10306433 10655296 8310166 5407216 3752646 2815791 1163808
41069 1163808 -740755 -707090 2002333 5064011 5575798 3264887 70701 -2911699 -6482889
41060 -6482889 -11099958 -15142439 -16568348 -15547677 -14152082 -13569587 -12807091 -10473755
41052 -10473755 -6936468 -4011666 -2880283 -2943908 -2782794 -1836744 -866210 -887446 -2057821
$$ packed form
41110H800460j939464J162839L843317J965706j574354j515907J383001J912949
41102A4038547j134728l387774j838105J188080K124397P00020j215438k642221
41094G832778l433072k913111o45304K025052K739258O23529k596357m123134
41086d90361k639815N30796K742253K535647P38405q08047j004752J63134K073940
41077C841200L496675K968558L48863k345130k902950j654570r36855j651983
41069A163808j904563L3665K709423L061678N11787k310911l194186k982400l571190
41060f482889m617069m042481j425909J020671J395595N82495P62496K333336
41052a0473755L537287K924802J131383o3625J61114R46050R70534k1236j170375
$$ plain form
41043 -2057821 -3771021 -5360403 -6172836 -5420998 -2979226 -155514 1626200 3025779
41035 3025779 6051159 10574698 13519793 12874832 10723956 10216994 10910273 9790148 6279694
41026 6279694 3313608 3161623 4647386 5146755 3373376 -307001 -4369217 -6418006
41018 -6418006 -4983815 -1711277 39669 -757816 -2110276 -2637964 -3283889 -4595089 -5149797
41009 -5149797 -4181109 -3169817 -3048661 -2298853 94534 2107420 1401292 -1528114 -5189511
41000 -5189511 -9625249 -14230058 -15566201 -11311883 -4838613 -1736175 -2656595 -3641251
40992 -3641251 -2863009 -2477990 -3587191 -4003203 -2307742 -169490 1018586 2259459 3792992
40983 3792992 3158771 -1005901 -5758212 -7194011 -5395940 -3772879 -4776798 -8195494
$$ packed form
41043b057821j713200j589382q12433P51838K441772K823712J781714J399579
41035C025779L025380M523539K945095o44961k150876n06962O93279j120125l510454
41026F279694k966086j51985J485763M99369j773379l680377m062216k048789
41018f418006J434191L272538J750946p97485j352460n27688o45925j311200n54708
41009e149797R68688J011292J21156P49808K393387K012886p06128k929406l661397
41000e189511m435738m604809j336143M254318O473270L102438r20420r84656
40992c641251P78242L85019j109201m16012J695461K138252J188076J240873J533533
40983C792992o34221m164672m752311j435799J798071J623061j003919l418696
$$ plain form
40975 -8195494 -12368351 -15105935 -14427174 -10291560 -5113456 -1478533 -191549 -1104220
40967 -1104220 -3884840 -6677233 -6352697 -2471754 825777 -208311 -3291593 -2741832
40959 -2741832 2641124 7705616 7530037 2918216 -1857477 -4271944 -4729990 -4423239 -4276124
40950 -4276124 -5157148 -6976140 -7736389 -5457711 -1425206 360719 -1882937 -4858148
40942 -4858148 -4176730 -380479 1677670 -167903 -1913660 1188848 7880169 12432321
40934 12432321 11900700 8745381 6422408 5535211 5000339 4101895 2148575 -1374639 -4816540
40925 -4816540 -4894413 -1095355 2530821 2163695 -902243 -2510323 -1346437 284097 542490
40916 542490 155212 421320 1263769 1622082 560453 -1861650 -3952277 -3528179 -865284
$$ packed form
40975h195494m172857k737584O78761M135614N178104L634923J286984r12671
40967a104220k780620k792393L24536L880943L297531j034088l083282N49761
40959b741832N382956N064492j75579m611821m775693k414467m58046L06751J47115
40950d276124q81024j818992p60249K278678M032505J785925k243656k975211
40942d858148O81418L796251K058149j845573j745757L102508O691321M552152
40934A2432321n31621l155319k322973q87197n34872q98444j953320l523214l441901
40925d816540p7873L799058L626176l67126l065938j608080J163886J630534K58393
40916E42490l87278K66108Q42449L58313j061629k422103k090627M24098K662895
$$ plain form
40907 -865284 818173 -560911 -2988635 -3641402 -3290691 -4248423 -5487262 -4160219 -1516644
40898 -1516644 -2307969 -7222746 -10716072 -8780241 -4729453 -3780152 -5082589 -3574392
40890 -3574392 1783904 6053845 4644659 -1808191 -9459311 -15393513 -18736197 -19701996
40882 -19701996 -19001565 -17399700 -15052835 -11602590 -7008434 -1865485 2837590 5778223
40874 5778223 5843623 3668327 2034207 3360971 6968699 9889864 9947156 6874567 1347991
40865 1347991 -4944680 -8742014 -7581535 -3395175 -1113995 -2433848 -3489769 -702053
40857 -702053 3407001 3329337 -1723164 -6748376 -7645497 -5672003 -4158926 -3682124 -2614618
40848 -2614618 -614140 1012764 1777228 2567792 3617357 3687421 1927619 -524098 -1531703
$$ packed form
40907h65284J683457j379084k427724o52767L50711r57732j238839J327043K643575
40898a516644p91325m914777l493326J935831M050788R49301j302437J508197
40890c574392N358296M269941j409186o452850p651120n934202l342684r65799
40882a9701996P00431J601865K346865L450245M594156N142949M703075K940633
40874E778223O5400k175296j634120J326764L607728K921165N7292l072589n526576
40865A347991o292671l797334J160479M186360K281180j319853j055921K787716
40857g02053M109054p7664n052501n025212q97121J973494J513077M76802J067506
40848b614618K000478J626904P64464P90564J049565P0064j759802k451717j007605
$$ plain form
40839 -1531703 -161677 2438324 4180812 4033432 2942413 2470748 2573422 1711316 -416699
40830 -416699 -1724322 -664555 933400 -9084 -3570933 -7056743 -9076304 -10501233
40822 -10501233 -11052858 -8332981 -1935030 4276557 6399503 5045276 3300035 2025875
40814 2025875 98355 -2083995 -2709697 -1643993 -292109 1268720 3673051 4822354
40806 4822354 1044567 -7023320 -13276864 -13088897 -8763522 -5677355 -5249188 -4614730 -1734965
40797 -1734965 2372402 5968506 8229381 8324717 5379185 342758 -3692054 -4264649 -2163257
40788 -2163257 -668657 -2243705 -5982414 -8395482 -7207540 -4274773 -3550555 -5858121
40780 -5858121 -7466204 -5074122 -457998 1933514 762170 -1449763 -2713184 -3618317
$$ packed form
40839a531703J370026K600001J742488j47380j091019m71665J02674q62106k128015
40830d16699j307623J059767J597955r42484l561849l485810k019561j424929
40822a0501233n51625K719877O397951O211587K122946j354227j745241j274160
40814B025875j927520k182350o25702J065704J351884J560829K404331J149303
40806D822354l777787q067887o253544J87967M325375L086167M28167O34458K879765
40797a734965M107367L596104K260875R5336k945532n036427m034812n72595K101392
40788b163257J494600j575048l738709k413068J187942K932767P24218k307566
40780e858121j608083K392082M616124K391512j171344k211933j263421r05133
$$ plain form
40772 -3618317 -4604742 -4262431 -1955236 -1251 -1203478 -5293832 -9501555 -11890471
40764 -11890471 -12564573 -12082801 -10455201 -8082735 -6511971 -7298164 -10059386 -12102603
40756 -12102603 -10743186 -6490165 -3205814 -3935022 -7064503 -8369479 -6745110 -5428986
40748 -5428986 -6678857 -8001464 -5942921 -1582337 885854 43807 -1698077 -2823164
40740 -2823164 -4797333 -8279431 -10575485 -9277763 -6260121 -5232795 -6440741 -6580732
40732 -6580732 -3731042 165269 2186048 1786003 393430 -930628 -2321979 -4200967
40724 -4200967 -6229107 -7000663 -4883523 102518 5329031 7555467 6134562 3255280
40716 3255280 856994 -1286740 -3847426 -6028065 -6916537 -7607817 -9862396 -12892999
$$ packed form
40772c618317r86425L42311K307195J953985j202227m090354m207723k388916
40764a1890471o74102M81772J627600K372466J570764p86193k761222k043217
40756a2102603J359417M253021L284351p29208l129481j304976J624369J316124
40748e428986j249871j322607K058543M360584K468191q42047j741884j125087
40740b823164j974169l482098k296054J297722L017642J027326j207946j39991
40732f580732K849690L896311K020779m00045j392573j324058j391351j878988
40724d200967k028140p71556K117140M986041N226513K226436j420905k879282
40716C255280k398286k143734k560686k180639q88472o91280k254579l030603
$$ plain form
40708 -12892999 -13681997 -11184377 -8365060 -8540855 -10751356 -10725468 -6431405 -803524 1945314
40699 1945314 1305471 176666 393065 778818 -9551 -1000292 -756017 -10648 -305200
40690 -305200 -1005074 -233226 1526074 1523298 -1082516 -3773460 -4392982 -3845227 -3732973
40681 -3732973 -3848562 -3986856 -5767888 -9823361 -13108354 -12422960 -9368326 -8131983 -9124474
40672 -9124474 -8996165 -6965526 -6420441 -8847895 -10630954 -8489724 -4423562 -1973151
40664 -1973151 -703821 1493060 2950303 182015 -5311287 -7275474 -2857147 3525160
40656 3525160 6265057 5191464 3783179 3539799 3267524 2400166 1709902 1068627 -618785
40647 -618785 -2938489 -3907363 -3152325 -2931326 -4671720 -6343265 -5203580 -2029476 -417456
$$ packed form
40708a2892999p88998K497620K819317j75795k210501K5888M294063N627881K748838
40699A945314o39843j128805K16399L85753p88369r90741K44275P45369k94552
40690c05200o99874P71848J759300k776k605814k690944o19522N47755J12254
40681c732973j15589j38294j781032m055473l284993O85394L054634J236343r92491
40672i124474J28309K030639N45085k427454j783059K141230M066162K450411
40664a973151J269330K196881J457243k768288n493302j964187M418327O382307
40656C525160K739897j073593j408285k43380k72275q67358o90264o41275j687412
40647f18785k319704r68874P55038K20999j740394j671545J139685L174104J612020
$$ plain form
40638 -417456 -2211226 -5689312 -8406879 -9780532 -10232730 -9784096 -8817264 -8719374 -10062743
40629 -10062743 -10995045 -9012962 -3902015 2151563 6533763 7131383 2745304 -5113123
40621 -5113123 -11569851 -12221652 -7834644 -3148883 -1062182 -392984 564304 1352394 1198749
40612 1198749 672825 -56059 -2091684 -5112055 -6154616 -3340879 1131773 4047985
40604 4047985 5389260 6882166 8042976 6894331 3691813 719680 -1226937 -3095706
40596 -3095706 -4472448 -3454567 -220224 2080816 1054393 -2373405 -5879019 -8256367
40588 -8256367 -9229638 -8655040 -6973743 -5182462 -3727263 -2548443 -2233987 -3472551 -5344161
40579 -5344161 -6192400 -6384077 -7856874 -10450285 -11319851 -9021347 -5620450 -3377043 -1874627
$$ packed form
40638d17456j793770l478086k717567j373653m52198M48634R66832R7890j343369
40629a0062743r32302J982083N110947O053578M382200N97620m386079p858427
40621e113123o456728o51801M387008M685761K086701O69198R57288P88090j53645
40612A198749n25924p28884k035625l020371j042561K813737M472652K916212
40604D047985J341275J492906J160810j148645l202518k972133j946617j868769
40596c095706j376742J017881L234343K301040j026423l427798l505614k377348
40588h256367r73271N74598J681297J791281J455199J178820L14456j238564j871610
40579e344161q48239j91677j472797k593411q69566K298504L400897K243407J502416
$$ plain form
40570 -1874627 -205325 582838 -231700 -360605 2834937 8126091 11747014 12304907 11655665
40561 11655665 11266516 10512426 8809742 6900214 5337605 3776556 2530629 2907284
40553 2907284 4889641 6066930 4340459 848569 -1132311 85526 2910550 4450996
40545 4450996 3530782 1540005 514335 700690 500244 -1006518 -2241436 -823294 3073816
40536 3073816 6161534 5330963 972527 -3385749 -4443706 -1959788 1291978 1951065
40528 1951065 -1260063 -6604041 -10675686 -10917557 -7470094 -3026680 -663509 -1263995
40520 -1263995 -2986856 -3514036 -2549866 -1548263 -1361479 -1277358 -425552 1108208 2903735
40511 2903735 4575737 4893755 2183527 -2919528 -6403117 -4741364 522098 4180716
$$ packed form
40570a874627J669302P88163q14538j28905L195542N291154L620923N57893o49242
40561A1655665l89149p54090j702684j909528j562609j561049j245927L76655
40553B907284J982357J177289j726471l491890j980880J217837K825024J540446
40545D450996r20214j990777j025670J86355k00446j506762j234918J418142L897110
40536C073816L087718q30571m358436m358276j057957K483918L251766O59087
40528A951065l211128n343978m071645k41871L447463M443414K363171o00486
40520a263995j722861n27180R64170J001603J86784Q4121Q51806J533760J795527
40511B903735J672002L18018k710228n103055l483589J661753N263462L658618
$$ plain form
40503 4180716 3589612 1400333 1213389 2547163 2156862 -702855 -3052566 -2767874 -2008257
40494 -2008257 -4102795 -8252849 -10093021 -7803102 -4950522 -5631832 -8867853 -10358713
40486 -10358713 -8568468 -5944671 -4350643 -2718509 -208814 1379674 257621 -2519029
40478 -2519029 -4851006 -6384049 -7482247 -7318914 -5553208 -4315217 -5375350 -6267108
40470 -6267108 -2747865 4870954 11274798 12860453 11870171 12328514 14345013 14595553 11077260
40461 11077260 5432717 1167786 848470 4375593 8749516 9982662 6514304 888884
40453 888884 -2483609 -1269763 3029056 6580075 6192961 1596330 -4471643 -8563468
40445 -8563468 -9197875 -7255391 -4247446 -1149425 1205188 1986321 1283266 260765 -254342
$$ packed form
40503D180716n91104k189279j86944J333774l90301k859717k349711K84692P59617
40494b008257k094538m150054j840172K289919K852580o81310l236021j490860
40486a0358713J790245K623797J594028J632134K509695J588488j122053k776650
40478b519029k331977j533043j098198J63333J765706J237991j060133q91758
40470f267108L519243P618819O403844J585655r90282M58343K016499K50540l518293
40461A1077260n644543m264931l19316L527123M373923J233146l468358n625420
40453H88884l372493J213846M298819L551019l87114m596631o067973m091825
40445h563468o34407J942484L007945L098021K354613P81133p03055j022501n15107
$$ plain form
40436 -254342 -640453 -1369726 -1793180 -877305 1202652 2919055 2853059 1120607 -537889
40427 -537889 -297102 1607854 2609246 689392 -2635875 -3677133 -1206489 1931361
40419 1931361 2708194 1750452 1694024 2918247 3136455 1033216 -1753888 -2822655 -1688721
40410 -1688721 350331 1666332 712820 -3628711 -10357930 -15547566 -15290807 -10031295
40402 -10031295 -4433798 -2077727 -1754174 -441767 1583467 1342190 -1511141 -3239201
40394 -3239201 -1173374 2375997 3452118 1596344 -952256 -3424708 -6244760 -7216340
40386 -7216340 -2338869 8049711 17160686 18353808 12357385 5846157 3799868 5210422
40378 5210422 5936609 3917038 910628 -218463 784232 1133235 -1387370 -5219725
$$ packed form
40436b54342l86111p29273m23454R15875K079957J716403o5996j732452j658496
40427e37889K40787J904956J001392j919854l325267j041258K470644L137850
40419A931361P76833r57742n6428J224223K18208k103239k787104j068767J133934
40410a688721K039052J316001r53512m341531o729219n189636K56759N259512
40402a0031295N597497K356071L23553J312407K025234k41277k853331j728060
40394c239201K065827L549371J076121j855774k548600k472452k820052r71580
40386g216340M877471J0388580R110975J193122n996423o511228k046289J410554
40378E210422P26187k019571l006410j129091J002695L49003k520605l832355
$$ plain form
40370 -5219725 -6834879 -5411349 -3716598 -3793570 -3783167 -498166 6021087 12056982 13944811
40361 13944811 11438046 7777146 6787449 9201513 11705341 10677589 6784474 4030648
40353 4030648 4009971 3736652 555305 -3386056 -4015073 -903706 2821949 5010558 5994758
40344 5994758 6102362 4706187 2151907 186107 -297512 -199612 -427846 -815960 -1239298
40335 -1239298 -2105196 -3100419 -2978754 -1364509 495848 1498395 2038097 2860734 3625867
40326 3625867 3515561 2566863 1590513 1113473 804627 -366672 -3356259 -7684854 -10851982
40317 -10851982 -10205943 -5911939 -1334212 18097 -2480547 -6571910 -9291562 -8977672
40309 -8977672 -6106000 -2735950 -641906 320247 1584397 3674787 5430788 5543208
$$ packed form
40370e219725j615154J423530J694751p6972J0403L285001O519253O035895J887829
40361A3944811k506765l660900r89697K414064K503828j027752l893115k753826
40353D030648k0677k73319l181347l941361o29017L111367L725655K188609R84200
40344E994758J07604j396175k554280j965800m83619R7900k28234l88114m23338
40335a239298q65898r95223J21665J614245J860357J002547N39702Q22637P65133
40326C625867j10306r48698r76350m77040l08846j171299k989587m328595l167128
40317a0851982O46039M294004M577727J352309k498644m091363k719652L13890
40309h977672K871672L370050K094044R62153J264150K090390J756001J12420
$$ plain form
40301 5543208 3988311 1664603 -547250 -2013066 -2470716 -2383890 -2451518 -2372785 -940814
40292 -940814 2051409 4818209 5364545 3767848 1818868 755701 430921 800706 3033492
40283 3033492 8041620 14064822 16868739 13345453 4908604 -3343319 -7083175 -6110827
40275 -6110827 -3509249 -2346433 -3412284 -5256209 -5798854 -4382042 -2525139 -2058686
40267 -2058686 -2575115 -2006156 121332 1911811 2352190 3068757 5138828 6265814 3682733
40258 3682733 -1569567 -5947855 -7776724 -7508612 -5095066 -921007 1589849 -902845
40250 -902845 -5646476 -5969913 -917526 2410804 -1049278 -6657805 -6776275 -1527047 2421520
40241 2421520 1786497 -176797 -60526 1290732 1736951 1142654 163375 -1238941 -2511902
$$ packed form
40301E543208j554897k323708k211853j465816m57650Q6826o7628P8733J431971
40292i40814K992223K766800N46336j596697j948980j063167l24780L69785K232786
40283C033492N008128O023202K803917l523286q436849q251923l739856R72348
40275f110827K601578J162816j065851j843925n42645J416812J856903M66453
40267b058686n16429N68959K127488J790479M40379P16567K070071J126986k583081
40258C682733n252300m378288j828869K68112K413546M174059K510856k492694
40250i02845m743631l23437N052387L328330l460082n608527j18470N249228L948567
40241B421520o35023j963294J16271J351258M46219n94297r79279j402316j272961
$$ plain form
40232 -2511902 -2169547 -240645 942927 -141391 -1988425 -2332593 -1098425 404217
40224 404217 1893620 3853674 5450614 4568729 407482 -4802957 -7379815 -5682658
40216 -5682658 -1864909 442008 320614 348803 2461790 4581254 3345138 -816065 -4091517
40207 -4091517 -4678199 -4798429 -6618329 -9059561 -10165364 -10058058 -9498452 -7736740 -4411255
40198 -4411255 -1947566 -3060292 -6646071 -8984491 -8677359 -7712292 -7729145 -8025270 -7667414
40189 -7667414 -6932432 -5854472 -3760314 -1259178 -367684 -1379026 -1884582 -564866 233398
40180 233398 -2080028 -6096375 -8179682 -7315544 -5525897 -4207169 -2898620 -1572080
40172 -1572080 -1441612 -3012331 -5376792 -7736264 -9682949 -9951497 -7243831 -2625907
$$ packed form
40232b511902L42355J928902J183572j084318j847034l44168J234168J502642
40224D04217J489403J960054J596940q81885m161247n210439k576858J697157
40216e682658L817749K306917j21394K8189K112987K119464j236116m161203l275452
40207d091517n86682j20230j819900k441232j105803J07306N59606J761712L325485
40198d411255K463689j112726l585779k338420L07132R65067j6853k96125L57856
40189g667414P34982J077960K094158K501136Q91494j011342n05556J319716P98264
40180B33398k313426m016347k083307Q64138J789647J318728J308549J326540
40172a572080J30468j570719k364461k359472j946685k68548K707666M617924
$$ plain form
40164 -2625907 1284135 3885351 6634174 8962975 7602702 1727828 -4362913 -6295805
40156 -6295805 -4994726 -4386012 -5914080 -8279320 -10675555 -12849627 -13308243 -11031587
40148 -11031587 -8093761 -7141426 -7121590 -5239444 -2369814 -2026578 -3994769 -4018789 -993964
40139 -993964 541938 -2429272 -6097250 -5185658 -474100 2922755 2812932 1644645 1892786
40130 1892786 3141133 3841480 3585385 3143051 3313601 3667945 2268105 -2029294 -6664271
40121 -6664271 -7115586 -2759189 1567492 1746546 -434493 -749490 1404610 3768745 5839713
40112 5839713 8395961 9500303 5760790 -1878345 -7590335 -7280277 -2946904 677457
40104 677457 1303780 -355225 -2918104 -5372840 -6808806 -6470021 -4078294 -225100 3234768
$$ packed form
40164b625907L910042K601216K748823K328801j360273n874874o090741j932892
40156f295805J301079O08714j528068k365240k396235k174072m58616K276656
40148a1031587K937826R52335J9836J882146K869630L43236j968191k4020L024825
40139i93964J535902k971210l667978R11592M711558L396855j09823j168287K48141
40130A892786J248347P00347k56095m42334J70550L54344j399840m297399m634977
40121f664271m51315M356397M326681J79054k181039l14997K154100K364135K070968
40112E839713K556248J104342l739513p639135n711990L10058M333373L624361
40104F77457O26323j659005k562879k454736j435966L38785K391727L853194L459868
$$ plain form
40095 3234768 4247069 3124325 2636218 3763218 3133478 -2373596 -9882564 -13292704
40087 -13292704 -11285659 -8266439 -7081657 -5658716 -2513563 -822451 -3668222 -8557459
40079 -8557459 -10502452 -8634362 -6248853 -5487343 -5312693 -4380651 -3085832 -2482749 -3045871
40070 -3045871 -4634254 -6321837 -6396805 -3786755 535186 4289455 5649561 3903158
40062 3903158 -358705 -4620775 -5296428 -1011474 5340274 9166341 8632742 5795180
40054 5795180 3932077 4699259 7264961 9143217 8215086 4714158 905617 -1501638
40046 -1501638 -2830081 -4117181 -5671287 -7488413 -9574270 -11063003 -10715200 -9287955
40038 -9287955 -9393783 -11509592 -12330148 -9376952 -5287424 -4431849 -6446825 -6623785 -2610222
$$ packed form
40095C234768J012301j122744m88107J127000o29740n507074p508968l410140
40087a3292704K007045L019220J184782J422941L145153J691112k845771m889237
40079h557459j944993J868090K385509P61510J74650R32042J294819O03083n63122
40070c045871j588383j687583p4968K610050M321941L754269J360106j746403
40062C903158m261863m262070o75653M284954O351748L826067n33599k837562
40054E795180j863103P67182K565702J878256r28131l500928l808541k407255
40046a501638j328443j287100j554106j817126k085857j488733L47803J427245
40038i287955j05828k115809q20556K953196M089528Q55575k014976j76960M013563
$$ plain form
40029 -2610222 2478994 4267924 1926965 -1961041 -4217410 -2995342 1149067 5108121
40021 5108121 5598117 2550464 -917909 -2230857 -1712258 -1048088 -1194948 -2424505 -4611208
40012 -4611208 -6446334 -5998768 -3363758 -1355656 -2004687 -3472422 -2325554 1656743
40004 1656743 4856436 4084024 -106595 -4712640 -7412139 -7658783 -6007967 -3804754
39996 -3804754 -2948920 -4346010 -6461868 -6795088 -5104276 -3590180 -3121976 -1315011 3576948
39987 3576948 8345883 7591648 783573 -6496214 -9201083 -7907311 -5950461 -4462192
39979 -4462192 -2800945 -1734259 -2816140 -5275432 -6423488 -5242094 -3430885 -2777156
39971 -2777156 -3254029 -3817669 -3599447 -2317578 -748535 -504985 -2192034 -4444913 -6050464
$$ packed form
40029b610222N089216J788930k340959l888006k256369J222068M144409L959054
40021E108121M89996l047653l468373j312948N18599O64170j46860j229557k186703
40012d611208j835126M47566K635010K008102o49031j467735J146868L982297
40004A656743L199693p72412m190619m606045k699499k46644J650816K203213
39996c804754Q55834j397090k115858l33220J690812J514096M68204J806965M891959
39987C576948M768935p54235o808075p279787k704869J293772J956850J488269
39979d462192J661247J066686j081881k459292j148056J181394J811209O53729
39971b777156m76873n63640K18222J281869J569043K43550j687049k252879j605551
$$ plain form
39962 -6050464 -7841559 -10610070 -12456805 -10925961 -6962023 -3700540 -1739924 1036739
39954 1036739 4914520 7336084 7255028 6916756 7892362 8695756 8156956 7863845 8791274
39945 8791274 8491143 4788067 52734 -1543619 518147 3530043 5892411 7443252
39937 7443252 6660043 1965117 -3942431 -5279197 -224604 6374163 9101456 8127670
39929 8127670 7177894 7612805 7377934 4860204 1130024 -1656402 -2179759 -148228 3735462
39920 3735462 7511041 9021360 8052727 6713977 7130827 9262398 11238782 11134294 8193956
39911 8193956 3459500 -114244 506907 4918542 8372657 6381379 107498 -4875866
39903 -4875866 -5411830 -3932593 -3917373 -4974359 -4797155 -3908298 -4957755 -7876511 -9239399
$$ packed form
39962f050464j791095k768511j846735J530844L963938L261483J960616K776663
39954A036739L877781K421564q1056l38272R75606Q03394n38800k93111R27429
39945H791274l00131l703076m735333j596353K061766L011896K362368J550841
39937G443252p83209m694926n907548j336766N054593O598767K727293r73786
39929H127670r49776M34911k34871k517730l730180k786426n23357K031531L883690
39920C735462L775579J510319r68633j338750M16850K131571J976384j04488k940338
39911H193956m734456l573744O21151M411635L454115j991278o273881m983364
39903d875866n35964J479237J5220j056986J77204Q88857j049457k918756j362888
$$ plain form
39894 -9239399 -7140552 -3849467 -2380335 -2770503 -3368323 -3835335 -4753793 -5529936 -5036335
39885 -5036335 -3886896 -3862300 -4864679 -4440638 -1276774 2299433 2868145 359520 -1879496
39876 -1879496 -1799233 -1509446 -3787732 -7031171 -6556082 -1186126 4456650 5873592 4411888
39867 4411888 4535063 7226259 9363968 8743812 6240834 3149949 -58624 -1870587
39859 -1870587 -330239 3102105 3710186 -292711 -4576693 -4361894 -1030017 59094
39851 59094 -2987571 -6533070 -6396631 -2173488 3528088 7862799 9257522 7902288 5502148
39842 5502148 3636776 2121673 -166619 -2838318 -3492126 -271722 5466006 9501310
39834 9501310 8115125 1573220 -5690994 -8900686 -7110218 -3264336 -558469 215013
$$ packed form
39894i239399K098847L291085J469132l90168n97820m67012r18458p76143M93601
39885e036335J149439K4596j002379M24041L163864L576207N68712k508625k239016
39876a879496Q0263K89787k278286l243439M75089N369956N642776J416942j461704
39867D411888J23175K691196K137709o20156k502978l090885l208573j811963
39859a870587J540348L432344O08081m002897m283982K14799L331877J089111
39851E9094l046665l545499J36439M223143N701576M334711J394723j355234k400140
39842E502148j865372j515103k288292k671699o53808L220404N737728M035304
39834I501310j386185o541905p264214l209692J790468L845882K705867P73482
$$ plain form
39826 215013 -3497 -237751 -73418 229094 -124974 -1206098 -1463274 309805 2353397
39817 2353397 1560786 -2050846 -5030149 -5314500 -4676270 -5229599 -6173584 -5599272 -3170515
39808 -3170515 603714 5432370 9975785 12038385 11813615 12289667 14467062 15083768 11441245
39799 11441245 5466684 337143 -3619645 -6578596 -6667219 -4071893 -3931268 -9474518
39791 -9474518 -15181819 -13345505 -5637057 -1089322 -3274696 -6811475 -7021146 -5548035
39783 -5548035 -4551059 -2491673 972032 1895303 -2082439 -7313660 -9360080 -8773396 -8246638
39774 -8246638 -7815905 -6647988 -6268908 -8047579 -10023188 -9828322 -8530049 -8339481 -8747047
39765 -8747047 -8055169 -6531502 -5022105 -2829217 -193961 -383308 -5456758 -11820444
$$ packed form
39826B15013k18510k34254J64333L02512l54068j081124k57176J773079K043592
39817B353397p92611l611632k979303k84351O38230n53329r43985N74312K428757
39808c170515L774229M828656M543415K062600k24770M76052K177395O16706l642523
39799A1441245n974561n129541l956788k958951q8623K595326J40625n543250
39791i474518n707301J836314P708448M547735k185374l536779k09671J473111
39783e548035R96976K059386L463705R23271l977742n231221k046420N86684N26758
39774h246638M30733J167917L79080j778671j975609J94866J298273J90568m07566
39765h747047O91878J523667J509397K192888K635256j89347n073450o363686
$$ plain form
39757 -11820444 -13847998 -10611348 -5629188 -1476545 1660014 3341866 2801282 1153960
39749 1153960 504038 1175754 2284820 3958249 6317774 7769576 7467207 7887856 11230872
39740 11230872 14614360 13130327 6975104 1267529 -863772 -701202 328770 2540593
39732 2540593 4944882 5022522 3112963 3019513 6326880 9520653 8816758 5063618 1970337
39723 1970337 1890635 4888143 9442610 12481374 11226606 6816759 3889683 4933838
39715 4933838 7315341 7552059 5967133 4803340 3984431 1695209 -2086244 -5388675
39707 -5388675 -7030424 -7416572 -6929886 -5512100 -3899656 -3722396 -5855412 -9206925 -11300054
39698 -11300054 -10178477 -6338750 -2756072 -2178328 -4460644 -7443078 -9870554 -11791947
$$ packed form
39757a1820444k027554L236650M982160M152643L136559J681852n40584j647322
39749A153960o49922O71716J109066J673429K359525J451802l02369M20649L343016
39740A1230872L383488j484033o155223n707575k131301J62570J029972K211823
39732B540593K404289P7640j909559r3450L307367L193773p03895l753140l093281
39723A970337p9702K997508M554467L038764j254768m409847k927076J044155
39715D933838K381503K36718j584926j163793q18909k289222l781453l302431
39707e388675j641749l86148M86686J417786J612444J77260k133016l351513k093129
39698a1300054J121577L839727L582678N77744k282316k982434k427476j921393
$$ plain form
39690 -11791947 -12582355 -11009636 -7468894 -3737486 -150138 4318951 8614335 9473596
39682 9473596 6166076 2274530 773427 259576 -1420591 -2635420 -525542 3781887
39674 3781887 6279717 5664956 4572331 5461968 7998404 10497178 11713217 11181838 9561279
39665 9561279 8357250 7856918 6296451 2848925 2692 404518 2601675 3082667 1683931
39656 1683931 1362113 2942208 4087463 3921266 4589484 6952550 8587323 8095875 7955425
39647 7955425 10386230 13135913 12474752 8524702 4677621 3117390 3655763 5689910
39639 5689910 8309923 9339464 7363041 4372341 3611746 5169539 6687483 8026554
39631 8026554 11289365 15534259 15806285 9832897 2259012 -1092133 -766391 -1731596 -5459183
$$ packed form
39690a1791947p90408J572719L540742L731408L587348M469089M295384Q59261
39682I473596l307520l891546j501103n13851j680167j214829K109878M307429
39674C781887K497830o14761j092625Q89637K536436K498774J216039n31379j620559
39665I561279j204029n00332j560467l447526k846233M01826K197157M80992j398736
39656A683931l21818J580095J145255j66197O68218K363066J634773m91448j40450
39647G955425K430805K749683o61161l950050l847081j560231N38373K034147
39639E689910K620013J029541j976423k990700p60595J557793J517944J339071
39631H026554L262811M244894K72026n973388p573885l351145L25742r65205l727587
$$ plain form
39622 -5459183 -8287424 -7464959 -4516455 -1533291 2021723 6661592 10082416 9955421
39614 9955421 7678328 6471844 6934891 7341134 7482964 8865391 10885884 10102888 4765063
39605 4765063 -2112697 -5898557 -5314681 -2914221 -1566353 -1750520 -1827179 -97960 3070705
39596 3070705 4903889 2885756 -1888190 -5346898 -5211984 -3707471 -4203542 -6435487
39588 -6435487 -7007925 -4086260 481297 3842488 5082207 4826528 3429351 813233
39580 813233 -2497798 -5293001 -6609194 -6197732 -4264249 -1525140 373870 -521972 -4508603
39571 -4508603 -9223006 -11686272 -11370976 -10060095 -8529490 -5284642 216877 5074844
39563 5074844 6213933 5156097 6509489 11655831 16850080 18217299 15802241 11625662
$$ packed form
39622e459183k828241Q22465K948504K983164L555014M639869L420824j26995
39614I955421k277093j206484M63047M06243J41830J382427K020493p82996n337825
39605D765063o877760l785860N83876K400460J347868j84167p6659J729219L168665
39596C070705J833184k018133m773946l458708J34914J504513m96071k231945
39588f435487n72438K921665M567557L361191J239719k55679j397177k616118
39580H13233l311031k795203j316193M11462J933483K739109J899010q95842l986631
39571d508603m714403k463266L15296J310881J530605L244848N501519M857967
39563E074844J139089j057836J353392N146342N194249J367219k415058m176579
$$ plain form
39555 11625662 6770789 2357910 677356 2435599 4468834 3036968 -1462888 -5367272
39547 -5367272 -6398788 -5213471 -3375516 -2389055 -3892967 -7863255 -10948144 -9571580
39539 -9571580 -4826765 -1485195 -1834561 -3365223 -3220652 -1969915 -1605056 -2359622 -3383649
39530 -3383649 -4735528 -6757258 -8601957 -9033850 -8085335 -6884282 -6360842 -6538980 -6259913
39521 -6259913 -3654034 1477718 5632085 4339495 -2056922 -7666998 -7722741 -4021867
39513 -4021867 -1824943 -3152605 -5588456 -6427587 -5232058 -2743686 153684 2203331
39505 2203331 2495054 1766998 1643195 2644570 4236930 6344985 9043745 11160365 11412378
39496 11412378 10958023 12363646 15472156 16810956 14292824 10095702 7015882 4205184
$$ packed form
39555A1625662m854873m412879j680554J758243K033235j431866m499856l904384
39547e367272j031516J185317J837955R86461j503912l970288l084889J376564
39539i571580M744815L341570l49366j530662J44571J250737L64859p54566j024027
39530c383649j351879k021730j844699m31893R48515J201053N23440j78138K79067
39521f259913K605879N131752M154367j292590o396417n610076n5743L700874
39513d021867K196924j327662k435851q39131J195529K488372K897370K049647
39505B203331K91723p28056j23803J001375J592360K108055K698760K116620K52013
39496A1412378m54355J405623L108510J338800k518132m197122l079820k810698
$$ plain form
39488 4205184 -521887 -5435060 -5725828 -156962 6335204 8408215 6360934 4099407
39480 4099407 2776622 -175912 -5712735 -10253207 -9894304 -5614673 -2087656 -2057635 -3755155
39471 -3755155 -3698082 -571680 3694079 5608408 3064300 -2301662 -6086667 -5804347 -4057193
39462 -4057193 -5117465 -8692235 -9861387 -5990839 -903495 -173107 -4180629 -8281741
39454 -8281741 -8838182 -6621309 -4475050 -3781019 -3728427 -2806961 -600081 1419602 1336970
39445 1336970 -299281 -150823 3779902 8675000 9816813 6565924 2773382 986486
39437 986486 -664828 -4243657 -7383969 -5855173 286061 6011676 6982607 3694461
39429 3694461 -548312 -3661156 -5385975 -5399675 -3111020 534847 2752153 1439457
$$ packed form
39488D205184m727071m913173k90768N568866O492166K073011k047281k261527
39480D099407j322785k952534n536823m540472L58903M279631L527017L0021j697520
39471c755155N7073L126402M265759J914329k544108n365962l785005K82320J747154
39462d057193j060272l574770j169152L870548N087344P30388m007522m101112
39454h281741n56441K216873K146259O94031N2592R21466K206880K019683q2632
39445A336970j636251J48458L930725M895098J141813l250889l792542j786896
39437I86486j651314l578829l140312J528796O141234N725615R70931l288146
39429C694461m242773l112844j724819j3700K288655L645867K217306j312696
$$ plain form
39421 1439457 -2524654 -6172144 -7333579 -6188704 -4384578 -3371445 -3459264 -3703245 -2605276
39412 -2605276 324394 3438395 4132770 1703614 -1503316 -2453114 -625486 1800977
39404 1800977 2788959 2640009 3039063 4490189 5503666 4570248 2406996 1454105 3043238
39395 3043238 5849779 7613638 7589282 6423044 4384928 1268537 -2064661 -3675496
39387 -3675496 -2615919 114850 3076490 5673842 7495421 7727947 6117365 3567653
39379 3567653 1092322 -904969 -1914358 -1353383 -38089 130762 -819138 -72773 3916068
39370 3916068 8064837 7858971 3078940 -2140787 -4476263 -4089198 -2377745 28624
39362 28624 2339876 3143624 2060056 158542 -2084653 -5363344 -9045731 -10151026 -6755200
$$ packed form
39421A439457l964111l647490j161435J144875J804126J013133q7819k43981J097969
39412b605276K929670L114001O94375k429156l206930r49798J827628K426463
39404A800977R87982j48950L99054J451126J013477r33418k163252r52891J589133
39395C043238K806541J763859k4356j166238k038116l116391l333198j610835
39387c675496J059577K730769K961640K597352J821579K32526j610582k549712
39379C567653k475331j997291j009389N60975J315294J68851r49900P46365L988841
39370C916068M148769k05866m780031n219727k335476L87065J711453K406369
39362B8624K311252Q03748j083568j901514k243195l278691l682387j105295L395826
$$ plain form
39353 -6755200 -1319898 1313115 -1010040 -5982290 -9880355 -11162139 -10904583 -10595697
39345 -10595697 -10175954 -8464100 -5406238 -3101219 -3579551 -5835588 -6502950 -3880677
39337 -3880677 36626 2317727 2651894 2839551 3480679 2949264 70065 -3430281 -4302945
39328 -4302945 -1488631 2490499 4345220 3557006 2178514 1619694 1325557 906829 1499279
39319 1499279 3616874 5310259 4507949 2232758 1385587 2873751 4886211 5467136 3841982
39310 3841982 -43917 -4841347 -7299535 -5444519 -2041266 -1632242 -4056520 -4675055
39302 -4675055 -1716563 888255 -128568 -2283079 -1657745 902726 1513319 -974358
39294 -974358 -4323208 -6446450 -6502263 -3990204 67810 2369304 1008584 -1184884 -279502
$$ packed form
39353f755200N435302K633013k323155m972250l898065j281784K57556L08886
39345a0595697M19743J711854L057862K305019m78332k256037o67362K622273
39337c880677L917303K281101L34167J87657O41128n31415k879199l500346q72664
39328d302945K814314L979130J854721p88214j378492n58820k94137m18728N92450
39319A499279K117595J693385q02310k275191q47171J488164K012460N80925j625154
39310C841982l885899m797430k458188J855016L403253M09024k424278o18535
39302d675055K958492K604818j016823k154511O25334K560471O10593k487677
39294i74358l348850k123242n5813K512059M058014K301494j360720k193468R05382
$$ plain form
39285 -279502 2750923 3182481 -851667 -6431749 -10287712 -11712270 -11096266 -9085376 -7530755
39276 -7530755 -7955495 -8655164 -6608014 -2641899 -1030818 -3160806 -5496167 -5262303 -4225079
39267 -4225079 -4631352 -5053756 -3320750 -742229 22864 -570651 47804 2250419 3891356
39258 3891356 3703482 2572844 1867926 2451238 4678868 7458708 8054995 4891533 32747
39249 32747 -3027651 -3488171 -3199656 -3123056 -2254645 -205692 1372057 787000 -1520294
39240 -1520294 -3434362 -3140238 -596466 2299901 3201733 1572012 -942423 -2822976
39232 -2822976 -4335573 -6062811 -7211497 -6957787 -6264281 -6310539 -5969225 -3169303 1684914
39223 1684914 6114561 9271478 12606964 16421522 18476030 17373912 15247479 15298488
$$ packed form
39285b79502L030425M31558m034148n580082l855963j424558O16004K010890J554621
39276g530755m24740o99669K047150L966115J611081k129988k335361K33864J037224
39267d225079m06273m22404J733006K578521P65093n93515O18455K202615J640937
39258C891356j87874j130638p04918N83312K227630K779840N96287l163462m858786
39249C2747l060398m60520K88515P6600Q68411K048953J577749n85057k307294
39240a520294j914068K94124K543772K896367R01832j629721k514435j880553
39232b822976j512597j727238j148686K53710O93506m6258L41314K799922M854217
39223A684914M429647L156917L335486L814558K054508j102118k126433N1009
$$ plain form
39215 15298488 17835931 20296129 20446676 18160357 14323185 9250086 2664929 -4946361
39207 -4946361 -11278486 -13223926 -9714077 -3255168 2208630 4736783 4954445 3955544
39199 3955544 2331455 1105312 1626813 3803634 5724059 5683043 3702734 929745 -1287595
39190 -1287595 -1743314 -394158 787987 -267971 -2758850 -4083266 -4297914 -6701999
39182 -6701999 -12578768 -18112635 -18958385 -15846656 -12873232 -11751334 -10959360 -9781529
39174 -9781529 -9681732 -11268442 -12762121 -12425343 -10489902 -7977237 -5544635 -4237653 -5370943
39165 -5370943 -8419992 -10561251 -9681509 -6862890 -4817324 -4804320 -6158210 -7947849 -9730680
39156 -9730680 -10986073 -10955740 -9260335 -6318611 -3216139 -1141305 -448022 -247238 421458
$$ packed form
39215A5298488K537443K460198J50547k286319l837172n073099o585157p611290
39207d946361o332125j945440L509849O458909N463798K528153K17662r98901
39199C955544j624089j226143N21501K176821J920425m1016j980309k772989k217340
39190a287595m55719J349156J182145j055958k490879j324416k14648k404085
39182f701999n876769n533867q45750L111729K973424J121898P91974J177831
39174i781529R9797j586710j493679L36778J935441K512665K432602J306982j133290
39165e370943l049049k141259Q79742K818619K045566J3004j353890j789639j782831
39156i730680j255393L0333J695405K941724L102472K074834O93283K00784O68696
$$ plain form
39147 421458 1103177 606896 -875745 -1753916 -1404030 -806586 -86928 2529019 7625549
39138 7625549 12150076 12531622 9546701 7591145 9091712 11879007 12537586 10278781
39130 10278781 6579620 2765898 -575298 -2754303 -3011539 -1276874 1715082 4793839
39122 4793839 6605165 6224712 4062534 1610332 -166089 -1671052 -3659597 -6163423
39114 -6163423 -8818241 -11263851 -12485335 -10756724 -5507938 1133501 5802169 6916423
39106 6916423 5589272 3745027 2111357 102562 -2872626 -6204274 -8299204 -8436583
39098 -8436583 -8201098 -9865359 -13012845 -14334265 -11834515 -7706556 -5300708 -4491071
39090 -4491071 -2406709 1833503 5758866 7128550 6516019 5681538 5390385 5652934 6360496
$$ packed form
39147D21458O81719m96281j482641q78171L49886N97444P19658K615947N096530
39138G625549M524527L81546k984921j955556J500567K787295O58579k258805
39130A0278781l699161l813722l341196k179005k57236J734665K991956L078757
39122D793839J811326l80453k162178k452202j776421j504963j988545k503826
39114f163423k654818k445610j221484J728611N248786O641439M668668J114254
39106F916423j327151j844245j633670k008795k975188l331648k094930j37379
39098h436583K35485j664261l147486j321420K499750M127959K405848Q09637
39090d491071K084362M240212L925363J369684o12531q34481k91153K62549P07562
$$ plain form
39081 6360496 6830604 6236920 5022862 4128530 2535313 -1734803 -7164072 -8516188 -3488521
39072 -3488521 3045699 4660802 1387368 -1496533 -1389176 -819942 -2033290 -3432883
39064 -3432883 -2897312 -1424888 -1482742 -3763232 -7152152 -10222570 -11475722 -9830087 -6272690
39055 -6272690 -3512904 -2675525 -1817692 951939 4464852 6200355 5586418 3812998 1561768
39046 1561768 -1064344 -3109298 -3233344 -1385980 1283706 3646926 4672000 3447576
39038 3447576 664170 -1245271 -1485628 -3032005 -8484171 -14659839 -15005939 -7808923
39030 -7808923 1409409 6730655 7791234 7238487 5620525 2012658 -2248094 -4131202
39022 -4131202 -2903039 -798186 303410 487367 -75518 -2153978 -5656675 -8654966
$$ packed form
39081F360496M70108n93684j214058q94332j593217m270116n429269j352116N027667
39072c488521O534220J615103l273434k883901J07357N69234j213348j399593
39064c432883N35571J472424n7854k280490l388920l070418j253152J645635L557397
39055f272690K759786Q37379Q57833K769631L512913J735503o13937j773420k251230
39046A561768k626112k044954j24046J847364K669686K363220J025074j224424
39038C447576k783406j909441k40357j546377n452166o175668l46100P197016
39030g808923R218332N321246J060579n52747j617962l607867m260752j883108
39022d131202J228163K104853J101596J83957n62885k078460l502697k998291
$$ plain form
39014 -8654966 -9449655 -8462201 -7036300 -5373717 -2854150 231410 2505440 2976190 1915945
39005 1915945 358896 -691467 -697805 145857 991316 959312 -325452 -2780348 -5903245
38996 -5903245 -8558706 -9553075 -9064110 -8670310 -8987614 -8190411 -4518084 303151 2334565
38987 2334565 285365 -3172973 -5521719 -7122497 -8360102 -7014754 -1564455 4821079
38979 4821079 7436901 6442774 6148552 7942877 8297068 4927971 584298 -1630881 -2786578
38970 -2786578 -4687509 -5293822 -1922958 3208147 5416774 4324809 3334103 2935999 42669
38961 42669 -5234431 -7789425 -5090388 -1911027 -3854048 -9494356 -12967723 -11994489 -9076551
38952 -9076551 -6192292 -2830089 874447 3186904 3845501 4836444 6846204 7561808 5042137
$$ packed form
39014h654966p94689R87454J425901J662583K519567L085560K274030M70750j060245
39005A915945j557049j050363o338Q43662Q45459l2004j284764k454896l122897
38996e903245k655461r94369M88965L93800l17304P97203L672327M821235K031414
38987B334565k049200l458338k348746j600778j237605J345348N450299O385534
38979D821079K615822r94127k94222J794325L54191l369097m343673k215179j155697
38970b786578j900931o06313L370864N131105K208627j091965r90706l98104k893330
38961D2669n277100k554994K699037L179361j943021n640308l473367R73234K917938
38952i076551K884259L362203L704536K312457O58597R90943K009760P15604k519671
$$ plain form
38943 5042137 786717 -2165649 -2720994 -1797129 -205506 1683876 2817464 1965538 -289206
38934 -289206 -1303708 1175347 6723385 12751144 16943256 18721566 18480202 16231153
38926 16231153 11735463 5755560 313751 -2642873 -2499761 -27901 3012646 4328960
38918 4328960 2470746 -1485653 -4536280 -4843751 -3477624 -2428173 -2049608 -1621863 -1344267
$$ packed form
38943E042137m255420k952366n55345R23865J591623J889382J133588q51926k254744
38934b89206j014502K479055N548038O027759M192112J778310k41364k249049
38926A6231153m495690n979903n441809k956624J43112K471860L040547J316314
38918D328960j858214l956399l050627l07471J366127J049451L78565M27745K77596
$$ [...]
##END NTUPLES=NMR SPECTRUM
##END=
