##TITLE=31Pdec_LR-784-R2-C1MK
 CDCl3, 64 sc
 21.1.2025
##JCAMPDX= 6.0         $$ Bruker NMR JCAMP-DX V2.0
##DATA TYPE= NMR SPECTRUM
##DATA CLASS= NTUPLES
##ORIGIN= UXNMR, Bruker Analytische Messtechnik GmbH
##OWNER= root
$$ XWIN-NMR		Version 3.5
$$ Tue Jan 21 14:19:02 2025 Russian Standard Time (UT+4h)  she@DPX200
##.OBSERVE FREQUENCY= 81.013821
##.OBSERVE NUCLEUS= ^31P
##.ACQUISITION MODE= SIMULTANEOUS
##.ACQUISITION SCHEME= undefined
##.AVERAGES= 64
##.DIGITISER RES= 17
##SPECTROMETER/DATA SYSTEM= spect
##.PULSE SEQUENCE= zgpg30
##.SOLVENT NAME= CDCl3
##.SHIFT REFERENCE= (INTERNAL, CDCl3, 0, 198.062)
##AUDIT TRAIL= $$ (NUMBER, WHEN, WHO, WHERE, WHAT)
$$ ##TITLE= Audit trail, XWIN-NMR		Version 3.5
$$ ##JCAMPDX= 5.01
$$ ##ORIGIN= Bruker BioSpin GmbH
$$ ##OWNER= she
$$ F:/spectra/data/she/nmr/P31/2/pdata/1/auditp.txt
$$ ##AUDIT TRAIL=  $$ (NUMBER, WHEN, WHO, WHERE, WHAT)
(   1,<2025-01-21 14:17:32.17 +0400>,<she>,<DPX200>,
      <continue with go, POWCHK disabled, PULCHK disabled
       configuration hash MD5:
       00 E9 B6 7A A2 85 ED C7 34 08 36 98 17 FE 4E 26
       data hash MD5: 32K
       5D 00 40 92 25 BF F2 0E EE 89 1F F2 DD 11 7A A3>)
(   2,<2025-01-21 14:18:05.18 +0400>,<she>,<DPX200>,
      <Start of raw data processing
       efp BC_mod = 2 LB = 1.5 FT_mod = 6 PKNL = 1 PHC0 = 1770.899 PHC1 = 67.88634 SI = 64K 
       data hash MD5: 64K
       AA 8F EC E4 FB F6 47 D8 53 DF E4 EA 09 B6 AC 64>)
(   3,<2025-01-21 14:18:33.09 +0400>,<she>,<DPX200>,
      <pk PHC0 = -31.3333 PHC1 = 88.6 
       data hash MD5: 64K
       68 D6 4F 7D 38 64 8A 28 03 2A 01 FC 3D 06 2D 40>)
(   4,<2025-01-21 14:18:36.42 +0400>,<she>,<DPX200>,
      <abs ABSG = 5 
       data hash MD5: 64K
       76 85 6C F1 25 2F 85 77 38 9B B9 D7 23 9A B4 C1>)
$$ ##END=
$$ 
$$ hash MD5
$$ 29 E8 26 C3 12 11 16 DA 91 E6 96 20 05 3D C4 0F
##$RELAX= 
##$RELAX= 
##$RELAX= 
##$RELAX= 
##$RELAX= 
##$RELAX= 
##$RELAX= 
##$RELAX= 
$$ Bruker specific parameters
$$ --------------------------
##$DU= <F:/spectra>
##$EXPNO= 2
##$NAME= <P31>
##$PROCNO= 1
##$TYPE= <nmr>
##$USER= <she>
##$AMP= (0..31)
100 100 100 100 100 100 100 100 100 100 100 100 100 100 100 100 100 100 
100 100 100 100 100 100 100 100 100 100 100 100 100 100 
##$AQSEQ= 0
##$AQ_mod= 1
##$AUNM= <au_zg>
##$AUTOPOS= <>
##$BF1= 81.014009
##$BF2= 200.13
##$BF3= 200.13
##$BF4= 200.13
##$BF5= 200.13
##$BF6= 200.13
##$BF7= 200.13
##$BF8= 200.13
##$BYTORDA= 1
##$CFDGTYP= 0
##$CFRGTYP= 5
##$CHEMSTR= <none>
##$CNST= (0..31)
1 1 145 1 1 1 1 1 1 1 1 1 1 1 1 1 1 1 1 1 1 1 1 1 1 1 1 1 1 1 1 1 
##$CPDPRG= <waltz16>
##$CPDPRG1= <>
##$CPDPRG2= <waltz16>
##$CPDPRG3= <>
##$CPDPRG4= <mlev>
##$CPDPRG5= <mlev>
##$CPDPRG6= <mlev>
##$CPDPRG7= <mlev>
##$CPDPRG8= <mlev>
##$CPDPRGB= <>
##$CPDPRGT= <>
##$D= (0..31)
0 1 0 0 0 0 0 0 0 0.06 0 0.03 2e-05 3e-06 0 0 0.0002 0 0 0 0 0 0 0 0 0 
0 0 0 0 0 0 
##$DATE= 1737454572
##$DBL= (0..7)
120 120 120 11 120 120 24 19 
##$DBP= (0..7)
150 150 150 150 150 150 150 150 
##$DBP07= 0
##$DBPNAM0= <>
##$DBPNAM1= <>
$$ [...]
##$SUBNAM3= <"">
##$SUBNAM4= <"">
##$SUBNAM5= <"">
##$SUBNAM6= <"">
##$SUBNAM7= <"">
##$SUBNAM8= <"">
##$SUBNAM9= <"">
##$SW= 400.765351723535
##$SWIBOX= (0..15)
0 1 3 0 0 0 0 0 0 0 0 0 0 0 0 0 
##$SW_h= 32467.5324675325
##$TD= 32768
##$TD0= 1
##$TE= 0
##$TE2= 300
##$TE3= 300
##$TEG= 300
##$TL= (0..7)
0 120 53 12 22 120 120 120 
##$TP= (0..7)
150 150 150 150 150 150 150 150 
##$TP07= 0
##$TPNAME0= <>
##$TPNAME1= <>
##$TPNAME2= <>
##$TPNAME3= <>
##$TPNAME4= <>
##$TPNAME5= <>
##$TPNAME6= <>
##$TPNAME7= <>
##$TPOAL= (0..7)
0.5 0.5 0.5 0.5 0.5 0.5 0.5 0.5 
##$TPOFFS= (0..7)
0 0 0 0 0 0 0 0 
##$TUNHIN= 0
##$TUNHOUT= 0
##$TUNXOUT= 0
##$USERA1= <user>
##$USERA2= <user>
##$USERA3= <user>
##$USERA4= <user>
##$USERA5= <user>
##$V9= 5
##$VALIST= <valist>
##$VCLIST= <CCCCCCCCCCCCCCC>
##$VD= 0
##$VDLIST= <DDDDDDDDDDDDDDD>
##$VPLIST= <PPPPPPPPPPPPPPP>
##$VTLIST= <TTTTTTTTTTTTTTT>
##$WBST= 1024
##$WBSW= 4
##$XGAIN= (0..3)
0 0 0 0 
##$XL= 0
##$YL= 0
##$YMAX_a= 15885
##$YMIN_a= -19558
##$ZGOPTNS= <>
##$ZL1= 120
##$ZL2= 120
##$ZL3= 120
##$ZL4= 120
##$ABSF1= 198.0616
##$ABSF2= -202.7028
##$ABSG= 5
##$ABSL= 3
##$ALPHA= 0
##$AQORDER= 0
##$ASSFAC= 0
##$ASSFACI= 0
##$ASSFACX= 0
##$ASSWID= 0
##$AUNMP= <proc_1d>
##$AZFE= 0.1
##$AZFW= 0.5
##$BCFW= 0
##$BC_mod= 2
##$BYTORDP= 0
##$COROFFS= 0
##$CY= -3
##$DATMOD= 1
##$DC= 0
##$DFILT= <>
##$DTYPP= 0
##$F1P= 0
##$F2P= 0
##$FCOR= 1
##$FTSIZE= 65536
##$FT_mod= 6
##$GAMMA= 0
##$GB= 0
##$INTBC= 1
##$INTSCL= 9.790993e-09
##$ISEN= 30
##$LB= 1.5
##$LEV0= 0
##$LPBIN= 0
##$MAXI= 10000
##$MC2= 0
##$MEAN= 0
##$ME_mod= 0
##$MI= 50
##$NCOEF= 0
##$NC_proc= -9
##$NLEV= 6
##$NOISF1= 182.463
##$NOISF2= 159.3651
##$NSP= 0
##$NTH_PI= 0
##$NZP= 0
##$OFFSET= 198.0616
##$PC= 4
##$PHC0= 1739.566
##$PHC1= 156.4863
##$PH_mod= 1
##$PKNL= yes
##$PPARMOD= 0
##$PSCAL= 0
##$PSIGN= 0
##$REVERSE= no
##$SF= 81.0140089999434
##$SI= 65536
##$SIGF1= 159.3651
##$SIGF2= -187.1042
##$SINO= 113.3802
##$SIOLD= 16384
##$SREGLST= <1H.CDCl3>
##$SSB= 0
##$STSI= 65536
##$STSR= 0
##$SW_p= 32467.5324675325
##$SYMM= 0
##$S_DEV= 0
##$TDeff= 32768
##$TDoff= 0
##$TI= <>
##$TILT= no
##$TM1= 0
##$TM2= 0
##$TOPLEV= 0
##$USERP1= <user>
##$USERP2= <user>
##$USERP3= <user>
##$USERP4= <user>
##$USERP5= <user>
##$WDW= 1
##$XDIM= 65536
##$YMAX_p= 178457660
##$YMIN_p= -452970271
$$ End of Bruker specific parameters
$$ ---------------------------------
##NTUPLES= NMR SPECTRUM
##VAR_NAME=  FREQUENCY,     SPECTRUM/REAL,   SPECTRUM/IMAG
##SYMBOL=    X,             R,               I
##VAR_TYPE=  INDEPENDENT,   DEPENDENT,       DEPENDENT
##VAR_FORM=  AFFN,          ASDF,            ASDF
##VAR_DIM=   65536,         65536,           65536
##UNITS=     HZ,            ARBITRARY UNITS, ARBITRARY UNITS
##FACTOR=    0.49542278885378, 1,            1
##FIRST=     16045.7642231865, 0,            0
##LAST=      -16421.768244346, 0,            0
##MIN=       -16421.768244346, -452970271,   0
##MAX=       16045.7642231865, 178457660,    0
$$ Real data points
##PAGE= N=1
##DATA TABLE= (X++(R..R)), XYDATA
$$ [...]
##PAGE= N=2
##DATA TABLE= (X++(I..I)), XYDATA
$$ plain form
7374 -2202885 -9880674 -11762648 -10457172 -11458815 -14366305 -15553328 -15484315 -16960579 -18022440
7365 -18022440 -13526209 -4223974 2210091 1637255 -495009 2625331 9224909 12329079
7357 12329079 10301382 7958745 8021300 7786681 5571206 4593729 7170844 9462549 6524675
7348 6524675 176187 -2735339 881997 7137235 10663323 10131106 7776661 6001662
7340 6001662 5356215 4416971 1265952 -3917849 -8100239 -8365868 -4879996 308208 5756489
7331 5756489 9770881 9159512 2821401 -4202413 -4841978 1076030 6022782 4269461 -1400616
7322 -1400616 -4287376 -1859489 2882582 5344606 2491873 -5252710 -12898571 -14196899
7314 -14196899 -8646734 -2908031 -2690448 -5898516 -7064381 -5752199 -5826891 -7966175 -8324049
$$ packed form
7374b202885p677789j881974J305476j001643k907490j187023O9013j476264j061861
7365a8022440M496231R302235O434065n72836k132264L120340O599578L104170
7357A2329079k027697k342637O2555k34619k215475r77477K577115K291705k937874
7348F524675o348488k911526L617336O255238L526088n32217k354445j774999
7340F001662o45447r39244l151019n183801m182390k65629L485872N188204N448281
7331E756489M014392o11369o338111p023814o39565N918008M946752j753321n670077
7322a400616k886760K427887M742071K462024k852733p744583p645861j298328
7314a4196899N550165N738703K17583l208068j165865J312182p4692k139284l57874
$$ plain form
7305 -8324049 -4843232 -153765 2800155 3851483 3038868 -821210 -6676059 -10059210
7297 -10059210 -8670530 -6500326 -8628507 -13489208 -14329521 -7986658 1597121 9048318
7289 9048318 12937998 14019464 12003468 7592754 5218110 8844371 15269052 16493864
7281 16493864 10346767 4236147 5168146 9935731 10150739 4438102 -782409 -2114195
7273 -2114195 -3547228 -7876267 -10542274 -6799639 -173897 2234290 89068 -690283
7265 -690283 2612280 6826418 9662332 12845455 16617040 16453901 8660409 -4076624
7257 -4076624 -15823227 -23717362 -28388303 -30138228 -28002239 -22100043 -14660733 -8623581
7249 -8623581 -5946560 -6348935 -7048115 -5264989 -1892814 -826225 -3545718 -6744265 -7084261
$$ packed form
7305h324049L480817M689467K953920J051328q12615l860078n854849l383151
7297a0059210J388680K170204k128181m860701q40313O342863R583779P451197
7289I048318L889680J081466k015996m410714k374644L626261O424681J224812
7281A6493864o147097o110620R31999M767585K15008n712637n220511j331786
7273b114195j433033m329039k666007L742635O625742K408187k145222p79351
7265f90283L302563M214138K835914L183123L771585j63139p793492j2737033
7257d076624j1746603p894135m670941j749925K135989N902196P439310O037152
7249h623581K677021m02375o99180J783126L372175J066589k719493l198547l39996
$$ plain form
7240 -7084261 -5597145 -4554044 -2630652 2497938 8249446 9067741 4600721 998879
7232 998879 2462072 5912918 6534850 4499324 2554938 261845 -4528823 -10119151 -11903818
7223 -11903818 -8768473 -4402340 -2065207 -2038432 -4423291 -9519839 -13948370 -11602453
7215 -11602453 -1757968 8006389 11152745 10902639 14501699 21573018 24832917 21765024
7207 21765024 18567702 20680576 25402078 27361997 26650661 26801581 27469041 24466671 16991823
7198 16991823 10605048 11216560 17890482 23394583 21893929 15100348 9666600 8620572
7190 8620572 7747721 2264738 -5441543 -8829048 -6939519 -5916046 -9789758 -14758889
7182 -14758889 -15109420 -10634517 -5125804 -1238428 -399028 -4282482 -11817706 -17168414
$$ packed form
7240g084261J487116J043101J923392N128590N751508Q18295m467020l601842
7232I98879J463193L450846O21932k035526j944386k293093m790668n590328j784667
7223a1903818L135345M366133K337133K6775k384859n096548m428531K345917
7215a1602453R844485R764357L146356k50106L599060P071319L259899l067893
7207B1765024l197322K112874M721502J959919p11336J50920O67460l002370p474848
7198A6991823o386775O11512O673922N504101j500654o793581n433748j046028
7190H620572q72851n482983p706281l387505J889529J023473l873712m969131
7182a4758889l50531M474903N508713L887376Q39400l883454p535224n350708
$$ plain form
7174 -17168414 -15557913 -9845039 -6956737 -8691062 -10320574 -7945454 -3175898 -135651
7166 -135651 -855636 -3883895 -5350824 -2169314 3726373 6066718 1904652 -3803205 -5068340
7157 -5068340 -3636307 -5470238 -10404701 -12093958 -8138482 -3379681 -1758684 -1251820
7149 -1251820 757234 2736993 2650631 1627123 1026351 58287 -967963 503048 4073661
7140 4073661 4729510 493116 -2465797 2407041 11999187 16771063 12822539 5775236
7132 5775236 2681238 4122157 5292832 2471989 -2729653 -5163454 -2480470 897085
7124 897085 -1329195 -8211864 -11242823 -5133509 4975245 10315942 9112000 6192399
7116 6192399 4653240 3178166 877625 -235400 1408180 4515306 7162677 9327743
$$ packed form
7174a7168414J610501N712874K888302j734325j629512K375120M769556L040247
7166a35651p19985l028259j466929L181510N895687K340345m162066n707857j265135
7157e068340J432033j833931m934463j689257L955476M758801J620997N06864
7149a251820K009054J979759q6362j023508o00772r68064j026250J471011L570613
7140D073661O55849m236394k958913M872838R592146M771876l948524p047303
7132E775236l093998J440919J170675k820843n201642k433801K682984L377555
7124H97085k226280o882669l030959O109314J0108754N340697j203942k919601
7116F192399j539159j475074k300541j113025J643580L107126K647371K165066
$$ plain form
7108 9327743 11967700 14490710 14031257 7966721 -1912345 -8791149 -7315441 -716051
7100 -716051 2257642 -1727494 -7273137 -9546762 -11292094 -16736889 -23615479 -26637253
7092 -26637253 -24986401 -20636100 -12916037 -1689131 6863634 5662518 -3033904 -10395129
7084 -10395129 -13467086 -16668908 -20522619 -18358164 -7583550 4032271 8489317 7660036
7076 7660036 7878540 9990818 11162446 12241903 15750219 18548142 14168721 3038403
7068 3038403 -5996523 -6678344 -3398942 -5201483 -14460535 -24827485 -29299086 -27100492
7060 -27100492 -22135963 -17505093 -13847293 -11610987 -11392156 -11331200 -7578903 256472 6586591
7051 6586591 5969465 292614 -3450104 -1464914 4218751 10300236 14914193 15972654
$$ packed form
7108I327743K639957K523010m59453o064536r879066o878804J475708O599390
7100g16051K973693l985136n545643k273625j745332n444795o878590l021774
7092b6637253J650852M350301P720063J1226906Q552765j201116q696422p361225
7084a0395129l071957l201822l853711K164455J0774614J1615821M457046q29281
7076G660036K18504K112278J171628J079457L508316K797923m379421j1130318
7068C038403r034926o81821L279402j802541r259052j0366950m471601K198594
7060b7100492M964529M630870L657800K236306K18831O0956L752297P835375O330119
7051F586591o17126n676851l742718J985190N683665O081485M613957J058461
$$ plain form
7043 15972654 11881327 5434563 2822726 6592102 12646947 15848894 15429076 13352291
7035 13352291 11026517 9919742 11872414 15732080 16523308 11239577 3319987 -1590970
7027 -1590970 -2246629 -1218163 -3797 1622749 3048768 3580546 4835034 8422079 11682861
7018 11682861 10050846 4390377 1863395 7284433 16496358 21233274 18961350 14584419
7010 14584419 12521271 10697797 4721832 -4087758 -8733719 -5062953 3160933 9490016
7002 9490016 12050198 12671304 11536335 7351007 1930674 -164259 2870133 8678311
6994 8678311 15066231 21650871 26756437 27291840 23106512 17337328 11290328 3663672
6986 3663672 -3895511 -6437651 -3750002 -2714096 -7404697 -12576818 -12564223 -11314445 -16124716
$$ packed form
7043A5972654m091327o446764k611837L769376O054845L201947m19818k076785
7035A3352291k325774j106775J952672L859666P91228n283731p919590m910957
7027a590970o55659J028466J214366J626546J426019N31778J254488L587045L260782
7018A1682861j632015n660469k526982N421038R211925M736916k271924m376931
7010A4584419k063148j823474n975965q809590m645961L670766Q223886O329083
7002I490016K560182O21106j134969m185328n420333k094933L034392N808178
6994H678311O387920O584640N105566N35403m185328n769184o047000p626656
6986C663672p559183k542140K687649J035906m690601n172121J2595J249778m810271
$$ plain form
6977 -16124716 -25009071 -28796425 -24616958 -19283580 -18741285 -21168827 -22081410 -20331020
6969 -20331020 -16967661 -13018643 -10550226 -11891274 -15764374 -17535712 -15004665 -11046913
6961 -11046913 -9280181 -9890430 -10684256 -9646643 -6033393 -1655250 -768217 -5107066 -9490125
6952 -9490125 -7023874 1249614 7338938 7692136 7206260 9534714 10261192 4699831 -2803956
6943 -2803956 -3948264 1753198 6431634 4380004 -1738481 -5149446 -1686731 7704841
6935 7704841 17922229 22954314 20783988 15366738 12181078 12495182 13676713 13664922 12411002
6926 12411002 9902903 6034927 2562281 2496458 6761207 12789815 16483843 14680608
6918 14680608 6829304 -3847480 -11560599 -12364608 -7273069 -95572 6331379 10196842
$$ packed form
6977a6124716q884355l787354M179467N333378N42295k427542r12583J750390
6969b0331020L363359L949018K468417j341048l873100j771338K531047L957752
6961a1046913J766732o10249p93826J037613L613250M378143Q87033m338849m383059
6952i490125K466251Q273488O089324L53198m85876K328454P26478n561361p503787
6943b803956j144308N701462M678436k051630o118485l410965L462715R391572
6935G704841J0217388N032085k170326n417250l185660L14104J181531j1791j253920
6926A2411002k508099l867976l472646o5823M264749O028608L694028j803235
6918A4680608p851304j0676784p713119q04009N091539P177497O426951L865463
$$ plain form
6910 10196842 9401895 3735347 -2571189 -4062282 128714 6482375 12599919 18950971
6902 18950971 25023010 27810337 25856335 22025274 20435981 22291262 25562569 26921752
6894 26921752 23609844 15916189 8446202 6099305 7778110 7084987 689116 -7145458
6886 -7145458 -10436901 -8880241 -6598947 -5966870 -5974512 -5250069 -3478283 -370629 4380706
6877 4380706 10430565 17244106 23799634 26782191 22063359 10687602 569360 -1662460
6869 -1662460 1415650 2238125 -1591330 -6273854 -9440849 -12550162 -15271747 -13697021
6861 -13697021 -6460667 1999062 6814481 7796935 7402526 7311606 8724258 12006001 14055495
6852 14055495 10324117 1848924 -4259034 -4219851 -2502946 -3419630 -2997745 4836409 17584829
$$ packed form
6910A0196842p94947n666548o306536j491093M190996O353661O117544O351052
6902A8950971O072039K787327j954002l831061j589293J855281L271307J359183
6894B6921752l311908p693655p469987k346897J678805o93123o395871p834574
6886g145458l291443J556660K281294O32077p642P24443J771786L107654M751335
6877D380706O049859O813541O555528K982557m718832j1375757j0118242k231820
6869a662460L078110Q22475l829455m682524l166995l109313k721585J574726
6861a3697021P236354Q459729M815419R82454l94409r0920J412652L281743K049494
6852A4055495l731378q475193o107958L9183J716905r16684M21885P834154J2748420
$$ plain form
6843 17584829 26252268 26274929 20676715 13954606 8660352 7083778 10473636 16360019
6835 16360019 20895103 23117481 23034066 17984890 6788987 -4549207 -8436856 -6104621
6827 -6104621 -5131669 -7337347 -7645830 -5267548 -6188396 -11874163 -14963734 -10677434 -4127853
6818 -4127853 -1044385 895798 5391375 9701474 10836690 12894335 19622697 24846331
6810 24846331 19696600 6259982 -4800438 -8107478 -6850678 -4296465 -912402 818649
6802 818649 -2403550 -7917798 -9222082 -5890665 -4221325 -6921682 -9410966 -8079150
6794 -8079150 -5006231 -1888303 3792145 12702441 19436380 18710734 11825837 3500563
6786 3500563 -3974605 -10102459 -13264298 -12216470 -8302382 -3518577 1440552 5337342
$$ packed form
6843A7584829Q667439K2661n598214o722109n294254j576574L389858N886383
6835A6360019M535084K222378q3415n049176j1195903j1338194l887649K332235
6827f104621R72952k205678l08483K378282r20848n685767l089571M286300O549581
6818d127853L083468J940183M495577M310099J135216K057645O728362N223634
6810B4846331n149731j3436618j1060420l307040J256800K554213L384063J731051
6802H18649l222199n514248j304284L331417J669340k700357k489284J331816
6794h079150L072919L117928N680448Q910296O733939p25646o884897q325274
6786C500563p475168o127854l161839J047828L914088M783805M959129L896790
$$ plain form
6778 5337342 5644523 2239278 -789753 161891 3689472 5984172 6050459 5724235 5857470
6769 5857470 5166024 2722091 -72517 -612808 1626269 2998494 -1450641 -11634965
6761 -11634965 -20972553 -23774581 -21876381 -20347738 -19083230 -14064792 -5564523 1329849
6753 1329849 4250661 5031077 3241416 -4240335 -15218226 -21387201 -19256158 -15122575
6745 -15122575 -14777633 -14732368 -9258734 -512136 4956356 5566575 3921508 92302 -7075368
6736 -7075368 -13835878 -13887083 -6972082 156666 1723153 -1918021 -6577986 -8047158 -4401861
6727 -4401861 2027736 5812310 4336735 777973 -1683724 -5437395 -13561525 -22234276
6719 -22234276 -24251711 -18966568 -12604283 -8978083 -5937002 -1478580 2781103 5987792
$$ packed form
6778E337342L07181l405245l029031R51644L527581K294700O6287l26224J33235
6769E857470o91446k443933k794608n40291K239077J372225m449135j0184324
6761a1634965r337588k802028J898200J528643J264508N018438Q500269O894372
6753A329849K920812P80416j789661p481751j0977891o168975K131043M133583
6745a5122575L44942M5265N473634Q746598N468492O10219j645067l829206p167670
6736g075368o760510n1205O915001P128748J566487l641174m659965j469172L645297
6727d401861O429597L784574j475575l558762k461697l753671q124130q672751
6719b2234276k017435N285143O362285L626200L041081M458422M259683L206689
$$ plain form
6711 5987792 10495322 17290273 23132137 24984659 23956218 22117399 18255067 10047949
6703 10047949 -970435 -9540543 -11806131 -8950574 -5665783 -5576518 -8196765 -10236069
6695 -10236069 -9372915 -5746802 -252633 6070193 10245900 8261172 281286 -7353013
6687 -7353013 -8214736 -2320490 5549753 11519832 13681411 10483288 2674808 -4688679
6679 -4688679 -6756391 -4716466 -3293264 -3531673 -2310793 1880203 7217528 12018837
6671 12018837 15398925 14995355 9057289 852482 -4051894 -5355862 -7833006 -12887380
6663 -12887380 -15791840 -13157925 -8189659 -5952585 -7331585 -9935232 -11308231 -9059700
6655 -9059700 -1570715 8594854 14877082 13000587 5054028 -4224293 -12433044 -18939749
$$ packed form
6711E987792M507530O794951N841864J852522j028441j838819l862332q207118
6703A0047949j1018384q570108k265588K855557L284791Q9265k620247k039304
6695a0236069Q63154L626113N494169O322826M175707j984728p979886p634299
6687g353013q61723N894246P870243N970079K161579l198123p808480p363487
6679d688679k067712K039925J423202k38409J220880M190996N337325M801309
6671A2018837L380088m03570n938066q204807m904376j303968k477144n054374
6663a2887380k904460K633915M968266K237074j379000k603647j372999K248531
6655i059700P488985J0165569O282228j876495p946559r278321q208751o506705
$$ plain form
6647 -18939749 -22357871 -21503585 -17483726 -12936626 -10034883 -9613160 -10517430 -9827111 -6192440
6638 -6192440 -2769156 -3581105 -7033552 -7176079 -2074150 3472214 4728927 1963213 -2959359
6629 -2959359 -9731950 -16539248 -18690657 -14342857 -8055019 -4749845 -3177454 646422
6621 646422 6117535 8483812 5286313 -919078 -5213995 -3665414 3779464 11513941
6613 11513941 12207544 5366435 -940246 -149876 4226989 4430337 -1688 -2122791 2101338
6604 2101338 8843518 12070657 9578315 2575564 -6627561 -14685379 -17732590 -14138822
6596 -14138822 -6310525 756574 2742536 -817240 -5383249 -4872979 1952513 9712013
6588 9712013 12504990 10031121 5812104 1874954 -1521175 -2911336 -756859 3094465
$$ packed form
6647a8939749l418122Q54286M019859M547100K901743M21723r04270O90319L634671
6638f192440L423284q11949l452447j42527N101929N546364J256713k765714m922572
6629b959359o772591o807298k151409M347800O287838L305174J572391L823876
6621F46422N471113K366277l197499o205391m294917J548581P444878P734477
6613A1513941O93603o841109o306681P90370M376865K03348m432025k121103M224129
6604B101338O742180L227139k492342p002751r203125q057818l047211L593768
6596a4138822P828297P067099J985962l559776m566009N10270O825492P759500
6588I712013K792977k473869m219017l937150l396129j390161K154477L851324
$$ plain form
6580 3094465 5272948 6263663 9807188 16222617 20519866 19112510 14910841 12756334
6572 12756334 12087334 7859928 -1644072 -11350076 -15129755 -12947474 -10021754 -9634781
6564 -9634781 -9760570 -7979380 -6897861 -11236600 -20182437 -26291720 -23253726 -12521088
6556 -12521088 -1077485 5547429 6958316 6367568 6901378 8806798 9892700 9117988
6548 9117988 8493662 9590518 9855675 5884293 -769675 -5515189 -7835774 -10949845 -14207190
6539 -14207190 -12728734 -6745679 -4062041 -8886186 -14496039 -12622869 -4870197 1630921
6531 1630921 5490025 10467119 16454721 18908605 16480784 12614435 9897604 8580124
6523 8580124 9900325 14658755 18776427 16737975 10066940 6317283 8614797 12095085
$$ packed form
6580C094465K178483R90715L543525O415429M297249j407356m201669k154507
6572A2756334o69000m227406r504000r706004l779679K182281K925720L86973
6564i634781j25789J781190J081519m338739q945837o109283L037994J0732638
6556a2521088J1443603O624914J410887n90748N33810J905420J085902p74712
6548I117988o24326J096856K65157l971382o653968m745514k320585l114071l257345
6539a4207190J478456N983055K683638m824145n609853J873170P752672O501118
6531A630921L859104M977094N987602K453884k427821l866349k716831j317480
6523H580124J320201M758430M117672k038452o671035l749657K297514L480288
$$ plain form
6515 12095085 12236306 10847479 11279663 12906343 13687595 14234278 15877613 17531282 17566672
6506 17566672 16841172 17338376 19135727 20450203 19524340 15394458 8148053 -519215 -7821214
6497 -7821214 -11425639 -10279029 -5061477 1053198 3915584 2827268 1721725 3523735
6489 3523735 5643652 4419481 1466445 904476 2213814 1454998 -1378975 -2199537 3973
6480 3973 1622108 634641 -1091352 -2358883 -3971437 -4768722 -2247486 1638593 1446942
6471 1446942 -3157975 -5929944 -3483967 -13892 276722 -876871 -1056049 -2042746 -4730108
6462 -4730108 -4913203 180619 5867356 6424763 3582785 2553176 3052597 883696 -3954610
6453 -3954610 -7447915 -8546550 -9616014 -10416911 -7678825 -1213950 4641750 6711707
$$ packed form
6515A2095085J41221j388827M32184J626680P81252N46683J643335J653669L5390
6506A7566672p25500M97204J797351J314476r25863m129882p246405q667268p301999
6497g821214l604425J146610N217552O114675K862386j088316j105543J802010
6489C523735K119917j224171k953036n61969J309338p58816k833973q20562K203510
6480C973J618135r87467j725993j267531j612554p97285K521236L886079j91651
6471A446942m604917k771969K445977L470075K90614j153593j79178r86697k687362
6462d730108j83095N093822N686737N57407k841978j029609M99421k168901m838306
6453c954610l493305j098635j069464q00897K738086O464875N855700K069957
$$ plain form
6445 6711707 6169014 5399973 5172891 5348510 5201256 2923599 -1962188 -5859598 -4521708
6436 -4521708 449961 2404509 -2050924 -9055921 -13093946 -13093954 -10989767 -7564534 -3115672
6427 -3115672 -392797 -2834405 -9419680 -14126284 -12059465 -4723396 2231219 5415640
6419 5415640 5896164 5607691 4610889 3044115 2942363 5379163 7325285 4307410 -4327021
6410 -4327021 -14946720 -23337025 -26551602 -23067598 -15049809 -9239171 -10809621 -16408835
6402 -16408835 -17817885 -12523049 -5717068 -1615591 1302457 5003337 7877953 8633063
6394 8633063 8995056 9781768 9185774 7519691 8251817 11357658 11576400 7071106 3590320
6385 3590320 5182458 7143506 4450725 1177603 3559773 8342785 7035379 -955319
$$ packed form
6445F711707n42693p69041k27082J75619j47254k277657m885787l897410J337890
6436d521708M971669J954548m455433p004997m038025qK104187L425233M448862
6427c115672K722875k441608o585275m706604K066819P336069O954615L184421
6419E415640M80524k88473r96802j566774j01752K436800J946122l017875q634431
6410d327021j0619699q390305l214577L484004Q017789N810638j570450n599214
6402a6408835j409050N294836O805981M101477K918048L700880K874616P55110
6394H633063L61993P86712n95994j666083P32126L105841K18742m505294l480786
6385C590320J592138J961048k692781l273122K382170M783012j307406p990698
$$ plain form
6377 -955319 -8289108 -11291794 -12968004 -14852900 -14271104 -10720921 -7732071 -6800879 -5441071
6368 -5441071 -2348403 1111355 5188040 11560296 18029420 19560664 16008904 12833465
6360 12833465 12420176 10710233 4821917 -1788957 -5024217 -6072779 -7999517 -10240592
6352 -10240592 -10084597 -6977821 -2672836 522698 -259403 -7330344 -18954629 -28987087
6344 -28987087 -31820170 -26552058 -16408414 -6647238 -2592614 -5587404 -9978605 -7850594
6336 -7850594 2063057 13245000 19305273 19108103 14159530 6406874 -91970 -1110607
6328 -1110607 1411785 -15660 -8293277 -16698935 -17584984 -12146472 -7619500 -8096480 -12216858
6319 -12216858 -17302450 -21499242 -23265880 -22196394 -19596930 -16348963 -11835148 -6454377
$$ packed form
6377i55319p333789l002686j676210j884896N81796L550183K988850R31192J359808
6368e441071L092668L459758M076685O372256O469124J531244l551760l175439
6360A2833465m13289j709943n888316o610874l235260j048562j926738k241075
6352a0240592J55995L106776M304985L195534p82101p070941j1624285j0032458
6344b8987087k833083N268112J0143644R761176M054624k994790m391201K128011
6336g850594R913651J1181943O060273j97170m948573p752656o498844j018637
6328a110607K522392j427445q277617q405658q86049N438512M526972m76980m120378
6319a2216858n085592m196792j766638J069486K599464L247967M513815N380771
$$ plain form
6311 -6454377 -2570552 -986704 661759 3724110 5896522 5659500 6216366 11118701 18043942
6302 18043942 20934871 17441049 11144762 7127002 7807965 12249511 17044684 18262663
6294 18262663 14375311 7313913 295647 -4472117 -6316906 -6554766 -8105267 -11660448
6286 -11660448 -12832533 -7596170 -351398 -206735 -7671010 -12318884 -7522500 -332074
6278 -332074 -631674 -6607307 -8937221 -5097681 -408236 3029803 8865889 17354369 22136135
6269 22136135 18927768 11433922 5821719 3885526 4054305 5100395 6275550 6833770
6261 6833770 7578554 10413866 14758654 16846628 14229865 9028105 5312979 4765245 5833083
6252 5833083 5847754 3373329 -532061 -3445331 -4856954 -7247942 -12285471 -17465095 -19028390
$$ packed form
6311f454377L883825J583848J648463L062351K172412k37022N56866M902335O925241
6302A8043942K890929l493822o296287m017760O80963M441546M795173J217979
6294A8262663l887352p061398p018266m767764j844789k37860j550501l555181
6286a1660448j172085N236363P244772J44663p464275m647874M796384P190426
6278c32074k99600n975633k329914L839540M689445L438039N836086Q488480M781766
6269B2136135l208367p493846n612203j936193J68779J046090J175155N58220
6261F833770P44784K835312M344788K087974k616763n201760l715126n47734J067838
6252E833083J4671k474425l905390k913270j411623k390988n037529n179624j563295
$$ plain form
6243 -19028390 -16794171 -13108629 -8654357 -3417220 -550832 -3718840 -10026172 -11200177
6235 -11200177 -4144884 4192829 5509313 32936 -5744499 -8169783 -8808697 -9206844
6227 -9206844 -8074341 -4496721 -512556 1363457 1309485 1024170 537476 -1502199 -4457502
6218 -4457502 -5290470 -2986130 -1115130 -3103088 -6276005 -4564185 2814533 9700677
6210 9700677 11290850 9647545 8478484 6974683 3115433 -337980 1382338 7702615
6202 7702615 12908252 13001076 8418917 1093479 -6733774 -11579295 -11440039 -9446784 -10478616
6193 -10478616 -14273464 -16343610 -15383967 -14380220 -13903498 -10356578 -3039881 2372649
6185 2372649 673778 -6382900 -13322927 -17281644 -18249466 -16247632 -11779696 -7179888
$$ packed form
6243a9028390K234219L685542M454272N237137K866388l168008o307332j174005
6235a1200177P055293Q337713J316484n476377n777435k425284o38914l98147
6227i206844J132503L577620L984165J876013n3972k85315m86694k039675k955303
6218d457502q32968K304340J871000j987958l172917J711820P378718O886144
6210I700677J590173j643305j169061j503801l859250l453413J720318O320277
6202G702615N205637R2824m582159p325438p827253m845521J39256J993255j031832
6193a0478616l794848k070146R59643J003747M76722L546920P316697N412530
6185B372649j698871p056678o940027l958717r67822K001834M467936M599808
$$ plain form
6177 -7179888 -4582972 -3635775 -2830931 -1464354 1010310 5438035 11301229 16547199 20032934
6168 20032934 21744492 20030234 12422018 1067196 -6542540 -5427349 1059092 6273825
6160 6273825 8385462 9693809 10064259 6044012 -2963188 -11165638 -11120407 -1612078 9840039
6151 9840039 13186777 5672483 -5235263 -10555660 -10163893 -10852173 -14905892 -16564991
6143 -16564991 -11788506 -5604477 -5263088 -10180797 -13945291 -13821770 -12953618 -14173721 -16375944
6134 -16375944 -17096000 -15229429 -11074706 -6177383 -2772341 -1421253 -302285 1280816
6126 1280816 763456 -3542035 -8358984 -9174714 -6500591 -4471902 -4251276 -2948580 1169422
6117 1169422 6089195 8782390 7693846 3024204 -2590019 -4645904 -1374132 3130144
$$ packed form
6177g179888K596916R47197Q04844J366577K474664M427725N863194N245970L485735
6168B0032934J711558j714258p608216j1354822p609736J115191O486441N214733
6160F273825K111637J308347L70450m020247r007200q202450M5231R508329J1452117
6151I840039L346738p514294j0907746n320397L91767o88280m053719j659099
6143a6564991M776485O184029L41389m917709l764494J23521Q68152j220103k202223
6134a6375944p20056J866571M154723M897323L405042J351088J118968J583101
6126A280816n17360m305491m816949q15730K674123K028689K20626J302696M118002
6117A169422M919773K693195j088544m669642n614223k055885L271772M504276
$$ plain form
6109 3130144 3843480 1670995 1276208 3319671 3992385 1802195 -870084 -3406889 -8059303
6100 -8059303 -13740245 -14682665 -8484453 -764239 1775286 -842954 -4384866 -7085455
6092 -7085455 -9770193 -12017115 -12477529 -11668157 -11111744 -10767707 -9881771 -9016940 -8825992
6083 -8825992 -8250446 -6135879 -2979505 865186 6258227 11981936 13257247 7328525
6075 7328525 -1613519 -7148679 -8419045 -8810000 -8785880 -5883638 -1267282 315719 -1455161
6066 -1455161 -695054 5388517 10646696 7883068 -984307 -7606629 -8090003 -6352104 -7195452
6057 -7195452 -10499035 -13167241 -13630013 -12880888 -12637146 -13337525 -13177696 -9486141 -2373929
6048 -2373929 3812489 4906108 2308444 1157052 3032308 3912008 640984 -4063586
$$ packed form
6109C130144P13336k172485l94787K043463O72714k190190k672279k536805m652414
6100h059303n680942r42420O198212P720214K539525k618240l541912k700589
6092g085455k684738k246922m60414Q09372N56413L44037Q85936Q64831J90948
6083h825992N75546K114567L156374L844691N393041N723709J275311n928722
6075G328525q942044n535160j270366l90955K4120K902242M616356J583001j770880
6066a455161P60107O083571N258179k763628q867375o622322m83374J737899q43348
6057g195452l303583k668206m62772P49125K43742p00379J59829L691555P112212
6048b373929O186418J093619k597664j151392J875256Q79700l271024m704570
$$ plain form
6040 -4063586 -5842495 -5365388 -6975010 -11700864 -15624059 -15784045 -14424762 -15730413 -20415352
6031 -20415352 -25337811 -27366010 -26189422 -23865797 -22446941 -21592733 -18402625 -10861194
6023 -10861194 -1746300 2868129 256895 -5616222 -9241046 -10355431 -12825511 -17698520
6015 -17698520 -21044222 -19533843 -14990571 -11302253 -8893363 -5009264 1247297 6945454
6007 6945454 9080674 8416635 8146271 9498036 10325883 8533398 5728930 5971374 10724403
5998 10724403 16463086 18421668 15913227 12397921 10651712 9961051 8666586 7260824
5990 7260824 7117830 7511562 6317449 3345559 590100 -1187127 -3701302 -7712301 -10402928
5981 -10402928 -8422383 -2675382 2090333 2302238 -1604014 -7094865 -11997802 -14672250
$$ packed form
6040d063586j778909M77107j609622m725854l923195j59986J359283j305651m684939
6031b0415352m922459k028199J176588K323625J418856Q54208L190108P541431
6023a0861194R114894M614429k611234n873117l624824j114385k470080m873009
6015a7698520l345702J510379M543272L688318K408890L884099O256561N698157
6007F945454K135220o64039k70364J351765Q27847j792485k804468K42444M753029
5998A0724403N738683J958582k508441l515306j746209o90661j294465j405762
5990G260824j42994L93732j194113k971890k755459j777227k514175m010999k690627
5981a0402928J980545N747001M765715K11905l906252n490851m902937k674448
$$ plain form
5973 -14672250 -14280295 -12438267 -12718817 -16378776 -19589587 -17015037 -7709220 4276332
5965 4276332 14530199 21351698 24566664 24203869 21431711 18657573 17076116 15339339
5957 15339339 11983084 8130266 6375968 7605475 10109992 11481289 10581215 8243510
5949 8243510 6889528 8781028 13583767 18013746 18693339 14979330 8596325 1741290
5941 1741290 -3281044 -3994205 173877 5795050 7685220 4058853 -2032267 -7013194
5933 -7013194 -10742118 -14760321 -18106244 -17435805 -11534881 -3681869 1602603 2942723
5925 2942723 2007913 167004 -2622543 -5753217 -7314751 -6668234 -5781276 -6338309 -7055773
5916 -7055773 -5958119 -4010668 -3678291 -4450280 -2967526 2078209 8107896 12310187 14038578
$$ packed form
5973a4672250L91955J842028k80550l659959l210811K574550R305817J1985552
5965D276332J0253867O821499L214966l62795k772158k774138j581457j736777
5957A5339339l356255l852818j754298J229507K504517J371297r00074k337705
5949H243510j353982J891500M802739M429979O79593l714009o383005o855035
5941A741290n022334p13161M168082N621173J890170l626367o091120m980927
5933g013194l728924m018203l345923O70439N900924P853012N284472J340120
5925B942723r34810j840909k789547l130674j561534O46517Q86958n57033p17464
5916g055773J097654J947451L32377p71989J482754N045735O029687M202291J728391
$$ plain form
5907 14038578 12597309 6388018 -3199899 -10147443 -9783680 -4923076 -2596280 -5446082
5899 -5446082 -9628200 -10902451 -9323303 -7115113 -4841934 -1574159 2441852 4965727
5891 4965727 3812462 -482401 -4290371 -4077148 -358458 2734776 2598457 1323377 2458711
5882 2458711 6308123 10363094 12938584 14026853 13650162 11887966 9791907 7959820
5874 7959820 5142453 724825 -2701116 -2456629 -446938 -939299 -4248803 -6879680 -7917736
5865 -7917736 -10408069 -15187178 -18120893 -15904457 -10783130 -6755538 -4283086 -1707672
5857 -1707672 736694 1413776 -106364 -3399772 -8109918 -12136849 -11349405 -4368811 3927374
5848 3927374 6843086 2988396 -3244517 -6959277 -6272665 -2287913 1715483 2366331 -197750
$$ packed form
5907A4038578j441269o209291r587917o947544L63763M860604K326796k849802
5899e446082m182118j274251J579148K208190K273179L267775M016011K523875
5891D965727j153265m294863l807970K13223L718690L093234j36319j275080J135334
5882B458711L849412M054971K575490J088269l76691j762196k096059j832087
5874G959820k817367m417628l425941K44487K009691m92361l309504k630877j038056
5865g917736k490333m779109k933715K216436N121327M027592K472452K575414
5857a707672K444366O77082j520140l293408m710146m026931P87444O980594Q296185
5848C927374K915712l854690o232913l714760O86612L984752M003396O50848k564081
$$ plain form
5839 -197750 -2422861 -2929883 -4891129 -9601412 -11586873 -5830635 2835539 4793461 -838213
5830 -838213 -5594742 -5174865 -4872394 -8463954 -10404355 -5419376 819900 -1003763 -9638187
5821 -9638187 -15134272 -13621912 -11532637 -13946472 -16563189 -12771886 -3140689 6252771
5813 6252771 11198135 11182814 6757465 -670457 -7634018 -10619851 -9093402 -4837768 423881
5804 423881 4844053 5683278 1653046 -4730031 -9647030 -12277627 -14408125 -16609233 -17502552
5795 -17502552 -16543302 -15040332 -14416713 -15373203 -18087507 -20869193 -19580296 -11703854 -762458
5786 -762458 6607976 7961255 6161525 3736347 683388 -1711847 -256769 4866413
5778 4866413 8827375 8596447 6256154 3429788 -2261225 -11211211 -17476214 -15947258
$$ packed form
5839a97750k225111n07022j961246m710283j985461N756238Q666174J957922n631674
5830h38213m756529M19877L02471l591560j940401M984979O239276j823663q634424
5821i638187n496085J512360K089275k413835k616717L791303R631197R393460
5813F252771M945364j5321m425349p427922o963561k985833J526449M255634N261649
5804D23881M420172Q39225m030232o383077m916999k630597k130498k201108q93319
5795a7502552R59250J502970O23619r56490k714304k781686J288897P876442J0941396
5786g62458P370434J353279j799730k425178l052959k395235J455078N123182
5778D866413L960962k30928k340293k826366n691013q949986o265003J528956
$$ plain form
5770 -15947258 -9956986 -5839318 -3309199 2200019 10394775 16565393 19315183 20319561
5762 20319561 17740845 8407282 -3395017 -8261286 -4620097 -1077492 -3293494 -6796068
5754 -6796068 -6499166 -5062220 -6323736 -7578501 -4974634 -1032760 -148213 -1221384 -1267720
5745 -1267720 -2048546 -6192868 -10495014 -10402677 -8006681 -7862177 -7649246 -1813440 6857688
5736 6857688 8810009 1804360 -5225951 -4834940 -213438 1499617 -1219771 -5197461
5728 -5197461 -8162801 -9648184 -9797412 -10186966 -12799736 -16200095 -16243382 -12512295 -10141106
5719 -10141106 -12823640 -17707268 -19856942 -18275966 -14786184 -10568757 -7136612 -7464350
5711 -7464350 -12193307 -16910679 -16819900 -12492429 -8017564 -5357184 -3679780 -2460022 -1721551
$$ packed form
5770a5947258N990272M117668K530119N509218Q194756O170618K749790J004378
5762B0319561k578716r333563j1802299m866269L641189L542605k216002l502574
5754f796068K96902J436946j261516j254765K603867L941874Q84547j073171m6336
5745a267720p80826m144322m302146R2337K395996J44504K12931N835806Q671128
5736F857688J952321p005649p030311L91011M621502J713055k719388l977690
5728e197461k965340j485383j49228l89554k612770l400359m3287L731087K371189
5719a0141106k682534m883628k149674J580976L489782M217427L432145l27738
5711g464350m728957m717372R0779M327471M474865K660380J677404J219758P38471
$$ plain form
5702 -1721551 -359332 2531439 5389539 5917771 4260724 2285208 1169742 2101070 7193805
5693 7193805 16052105 22956900 21845770 13730066 5211173 -74844 -4027157 -7665143
5685 -7665143 -7403836 -604057 8705603 13408012 11272626 6579009 4393642 5391729 6296085
5676 6296085 3994698 -1044889 -5068277 -5084320 -2611696 -2112864 -5209948 -8162679 -6495426
5667 -6495426 -812397 3890505 3965253 122444 -4934983 -9472684 -12738567 -14165507 -13912574
5658 -13912574 -12851251 -10803486 -6195128 928934 6872022 7630279 3766236 -386934
5650 -386934 -2144678 -2514908 -2846557 -2763045 -2508153 -3939426 -6975378 -7976481 -4576848
5641 -4576848 260708 2317099 2089457 2761112 4080112 3302085 1482647 3129364 8754720
$$ packed form
5702a721551J362219K890771K858100N28232j657047j975516j115466R31328N092735
5693G193805Q858300O904795j111130q115704q518893n286017l952313l637986
5685g665143K61307O799779R309660M702409k135386m693617k185367R98087R04356
5676F296085k301387n039587m023388j6043K472624M98832l097084k952731J667253
5667f495426N683029M702902P4748l842809n057427m537701l265883j426940K52933
5658a3912574J061323K047765M608358P124062N943088P58257l864043m153170
5650c86934j757744l70230l31649Q3512K54892j431273l035952j001103L399633
5641d576848M837556K056391k27642O71655J319000p78027j819438J646717N625356
$$ plain form
5632 8754720 13236193 13523841 12789672 13850591 13265744 6651764 -3179169 -8411917 -5320884
5623 -5320884 2776473 10614127 15241076 15933092 13873784 12334802 14014090 17421553
5615 17421553 18136057 14063680 7552468 2237072 -300135 -855297 -1645255 -4827779 -9708417
5606 -9708417 -11576489 -6094409 4536797 12312874 11489746 4146354 -3081832 -5799911
5598 -5799911 -4235973 -892975 2044260 3720372 4826813 6865963 10280255 13385297
5590 13385297 13891837 11536100 8601293 7364341 7079734 4277636 -2845617 -10419734
5582 -10419734 -11076739 -1566048 12597693 21563868 20065670 11254022 2677544 -151552
5574 -151552 2816519 6943806 7054830 2438227 -2307839 -2780645 -528723 -1184209 -7103024
$$ packed form
5632H754720M481473K87648p34169J060919n84847o613980r830933n232748L091033
5623e320884Q097357P837654M626949O92016k059308j538982J679288L407463
5615A7421553P14504m072377o511212n315396k537207n55162p89958l182524m880638
5606i708417j868072N482080J0631206P776077q23128p343392p228186k718079
5598e799911J563938L342998K937235J676112J106441K039150L414292L105042
5590A3385297N06540k355737k934807j236952k84607k802098p123253p574117
5582a0419734o57005R510691J4163741Q966175j498198q811648q576478k829096
5574a51552K968071M127287J11024m616603m746066m72806K251922o55486n918815
$$ plain form
5565 -7103024 -14518695 -18512091 -18046430 -14807758 -9823376 -3821641 643639 606145 -3522762
5556 -3522762 -7611096 -7948472 -4683718 -883930 655690 -870982 -4603843 -8814412
5548 -8814412 -11666947 -12358487 -11820168 -11543734 -11564161 -10789980 -9887249 -12016523 -18671389
5539 -18671389 -25922348 -27699612 -22712737 -15127321 -8203142 -1248847 5578910 7970319
5531 7970319 2812142 -6129796 -12360452 -14680224 -16545296 -18830194 -18526288 -14491256
5523 -14491256 -9183475 -3850412 2872616 10010560 13112800 10939932 8846315 11710669
5515 11710669 16754691 17375216 11837799 4455833 15281 625245 6254747 14152815
5507 14152815 18715436 16412799 11112221 10601702 16819666 22768526 20692961 10942308
$$ packed form
5565g103024p415671l993396M65661L238672M984382O001735M465280l7494m128907
5556c522762m088334l37376L264754L799788J539620j526672l732861m210569
5548h814412k852535o91540N38319K76434k0427P74181R02731k129274o654866
5539a8671389p250959j777264M986875P585416O924179O954295O827757K391409
5531G970319n158177q941938o230656k319772j865072k284898L03906M035032
5523a4491256N307781N333063O723028P137944L102240k172868k093617K864354
5515A1710669N044022O20525n537417p381966m440552O09964N629502P898068
5507A4152815M562621k302637n300578n10519O217964N948860k075565r750653
$$ plain form
5499 10942308 869304 -3609779 -3391556 -3351891 -5592220 -6756634 -2685487 5156395
5491 5156395 10092577 7704019 675745 -5211035 -7619306 -7959063 -7476419 -6635925 -7255774
5482 -7255774 -11202254 -16697887 -19312960 -17295136 -13058471 -8985805 -5150147 -2264922
5474 -2264922 -3178614 -8816269 -15046665 -16551329 -12817720 -8170183 -6595410 -8188291
5466 -8188291 -9988082 -8915290 -4617473 -550069 -1148369 -6594098 -11668424 -11543156 -7402706
5457 -7402706 -3901099 -2067950 1657786 8632519 13849987 11538243 3401905 -2238193
5449 -2238193 -298176 4607463 3563764 -5985615 -17393770 -22494533 -19547829 -12728171
5441 -12728171 -6654086 -3956647 -6022758 -11969520 -17064475 -16280671 -10737535 -7269235
$$ packed form
5499A0942308j0073004m479083K18223L9665k240329j164414M071147P841882
5491E156395M936182k388558p028274n886780k408271l39757M82644Q40494o19849
5482g255774l946480n495633k615073K017824M236665M072666L835658K885225
5474b264922r13692n637655o230396j504664L733609M647537J574773j592881
5466h188291j799791J072792M297817M067404n98300n445729n074326J25268M140450
5457g402706L501607J833149L725736O974733N217468k311744q136338n640098
5449b238193J940017M905639j043699r549379j1408155n100763K946704O819658
5441a2728171O074085K697439k066111n946762n094955P83804N543136L468300
$$ plain form
5433 -7269235 -9736884 -13826410 -13055799 -7282375 -1770349 411763 960450 1805087 2113373
5424 2113373 783549 -1147637 -2025294 -1489095 88252 2083960 2665066 -359105 -6162269
5415 -6162269 -10265318 -9254955 -4959268 -2089590 -2668565 -4726095 -5864869 -5841056 -5308750
5406 -5308750 -3847784 -325939 5347333 11345304 14627227 12781234 6049711 -2149625
5398 -2149625 -7285104 -6968288 -2594382 1975649 3616465 2638528 2506433 5941281 10853645
5389 10853645 11485599 5006856 -3892653 -7068295 -1785274 6280441 9648356 7008680
5381 7008680 3160834 2201804 3211530 3113124 1584136 1077564 2637958 4064899 3028485
5372 3028485 177001 -2432749 -4581246 -7099528 -8470206 -5537889 1386538 7192267
$$ packed form
5433g269235k467649m089526P70611N773424N512026K182112N48687Q44637L08286
5424B113373j329824j931186q77657N36199J577347J995708N81106l024171n803164
5415f162269m103049J010363M295687K869678n78975k057530j138774K3813N32306
5406e308750J460966L521845N673272N997971L281923j845993o731523q199336
5398b149625n135479L16816M373906M570031J640816r77937j32095L434848M912364
5389A0853645O31954o478743q899509l175642N283021Q065715L367915k639676
5381G008680l847846r59030J009726r8406j528988n06572J560394J426941j036414
5372C028485k851484k609750k148497k518282j370678K932317O924427N805729
$$ plain form
5364 7192267 8004134 6314617 7198566 10996417 13325618 11737049 8385015 5514451 2248270
5355 2248270 -2263789 -5778491 -5853209 -3674127 -2061974 -1058447 1490591 5703459 9075881
5346 9075881 10175493 10220438 10403206 9945378 7782319 4372483 651611 -3513488 -8561229
5337 -8561229 -13604713 -16605263 -16112837 -12588713 -8194076 -5056690 -3329900 -1600157
5329 -1600157 14575 -1482276 -7971575 -15571604 -17370362 -11845402 -5541635 -5215258
5321 -5215258 -9609149 -11850638 -8474802 -2617454 1418026 3136185 4144524 4251298
5313 4251298 1752487 -3244350 -7914574 -9581080 -8468590 -6968827 -6648800 -6984241 -7306512
5304 -7306512 -8611203 -11687291 -14136796 -12195353 -6387811 -2239111 -3087032 -5182956
$$ packed form
5364G192267Q11867j689517Q83949L797851K329201j588569l352034k870564l266181
5355B248270m512059l514702p4718K179082J612153J003527K549038M212868L372422
5346I075881J099612M4945J82768m57828k163059l409836l720872m165099n047741
5337h561229n043484l000550M92426L524124M394637L137386J726790J729743
5329a600157J614732j496851o489299p600029j798758N524960O303767L26377
5321e215258m393891k241489L375836N857348M035480J718159J008339J06774
5313D251298k498811m996837m670224j666506J112490J499763L20027l35441l22271
5304g306512j304691l076088k449505J941443N807542M148700q47921k095924
$$ plain form
5296 -5182956 -3722818 -1239245 -4138803 -11353215 -13435756 -5547568 4799252 7627484
5288 7627484 3378483 -92310 33263 -295524 -2413910 -1874036 2931697 6341894 3949708
5279 3949708 65902 1045291 4894524 4270790 -1445405 -4032804 1967248 10897197 12798361
5270 12798361 5807061 -1984397 -2445982 3689214 8675555 7048214 1651576 187703
5262 187703 6561764 16695302 22930126 21270007 13599412 4318702 -3179292 -7041060
5254 -7041060 -6261793 -976761 6614132 12215663 11371175 2961246 -8768121 -17029489
5246 -17029489 -18277401 -14294686 -8421200 -2050661 4034594 7925836 8997593 9672010
5238 9672010 11254896 10006562 1784318 -10615874 -19761625 -22839118 -23278971 -23044635
$$ packed form
5296e182956J460138K483573k899558p214412k082541P888188J0346820K828232
5288G627484m249001l470793J25573l28787k118386N39874M805733L410197k392186
5279C949708l883806R79389L849233o23734n716195k587399O000052Q929949J901164
5270A2798361o991300p791458m61585O135196M986341j627341n396638j463873
5262A87703O374061J0133538O234824j660119p670595r280710p497994l861768
5254g041060P79267N285032P590893N601531q44488q409929j1729367q261368
5246a7029489j247912L982715N873486O370539O085255L891242J071757O74417
5238I672010J582886j248334q222244j2400192r145751l077493m39853K34336
$$ plain form
5230 -23044635 -19750863 -13325710 -8872002 -8943948 -8674379 -3840160 924829 -1479434 -9051539
5221 -9051539 -12742629 -9184601 -4636291 -5562182 -11043144 -16184658 -18353002 -17771128 -15270444
5212 -15270444 -11595556 -7012590 -985596 5501284 7780020 1732195 -9061641 -14850725
5204 -14850725 -10638237 -2119740 1769086 -868601 -5027932 -6597869 -6250005 -6616229
5196 -6616229 -8921248 -12479896 -15336290 -15220645 -11400164 -5894298 -2258924 -3283663
5188 -3283663 -9587261 -18804779 -25667204 -25292610 -18472669 -12271824 -12956774 -18836751 -22299259
5179 -22299259 -18872973 -12041491 -8289534 -9275777 -10860297 -9295820 -5818793 -3681744
5171 -3681744 -2677755 -89828 3087838 1524215 -6195523 -12690288 -10175960 -1722250
$$ packed form
5230b3044635L293772O425153M453708p1946K69569M834219M764989k404263p572105
5221i051539l691090L558028M548310r25891n480962n141514k168344N81874K500684
5212a5270444L674888M582966O026994O486880K278736o047825j0793836n789084
5204a4850725M212488Q518497L888826k637687m159331j569937L47864l66224
5196f616229k305019l558648k856394J15645L820481N505866L635374j024739
5188c283663o303598r217518o862425L74594O819941O200845o84950n879977l462508
5179b2299259L426286O831482L751957r86243j584520J564477L477027K137049
5171c681744J003989K587927L177666j563623p719738o494765K514328Q453710
$$ plain form
5163 -1722250 1802343 -4079319 -12364924 -15154161 -13403699 -12796478 -14688769 -15779269
5155 -15779269 -13866096 -9521714 -3896268 1209871 2519026 -1647277 -8180578 -12151244
5147 -12151244 -12134117 -9869265 -6092258 -384164 5439386 7562529 4358356 -2070920
5139 -2070920 -8570259 -13062774 -14578201 -13688940 -12646701 -12805384 -12348359 -8781752 -2906516
5130 -2906516 2166700 5042928 6325370 6009818 4119738 3301388 6817152 13606417 18629139
5121 18629139 18388187 13263612 5066035 -3760048 -8990330 -7766756 -3654362 -3583229 -8432704
5112 -8432704 -11755517 -9669168 -6313426 -6281043 -7228229 -4833223 -538504 1519051 2076924
5103 2076924 4825093 8652588 8341421 2994268 -1834192 -1302495 3831279 10121288 14957571
$$ packed form
5163a722250L524593n881662q285605k789237J750462O07221j892291j090500
5155a5779269J913173M344382N625446N106139J309155m166303o533301l970666
5147a2151244J7127K264852L777007N708094N823550K123143l204173o429276
5139b070920o499339m492515j515427Q89261J042239j58683M57025L566607N875236
5130b906516N073216K876228J282442l15552j890080q18350L515764O789265N022722
5121A8629139k40952n124575q197577q826083n230282J223574M112394P1133m849475
5112h432704l322813K086349L355742L2383r47186K395006M294719K057555N57873
5103B076924K748169L827495l11167n347153m828460N31697N133774O290009M836283
$$ plain form
5094 14957571 16368153 13640945 9751135 9596592 14081529 18777945 19578276 16646103
5086 16646103 11902087 6332529 1293110 -1307717 -2045394 -3458184 -4669486 -1359025
5078 -1359025 5823879 8392975 1170934 -8145234 -8014435 787697 6261788 1945588
5070 1945588 -5927829 -9444853 -8656800 -6592239 -2457272 4227576 8471676 5837884
5062 5837884 225516 -939453 2901626 5841076 4441329 279846 -4874787 -10068035
5054 -10068035 -12390481 -10024849 -7711455 -11843677 -19527341 -20430219 -11625189 -2736267
5046 -2736267 -2786957 -9380691 -15572735 -20025522 -23702712 -22940089 -14571124 -4170567 -274838
5037 -274838 -2125252 -1507142 3827199 6834393 2239864 -6401594 -12663841 -14143158 -11372272
$$ packed form
5094A4957571J410582k727208l889810j54543M484937M696416Q00331k932173
5086A6646103m744016n569558n039419k600827p37677j412790j211302L310461
5078a359025P182904K569096p222041r316168J30799Q802132N474091m316200
5070A945588p873417l517024P88053K064561M134967O684848M244100k633792
5062E837884n612368j164969L841079K939450j399747m161483n154633n193248
5054a0068035k322446K365632K313394m132222p683664r02878Q805030Q888922
5046b736267n0690o593734o192044m452787l677190P62623Q368965J0400557L895729
5037b74838j850414O18110N334341L007194m594529q641458o262247j479317K770886
$$ plain form
5028 -11372272 -5651069 -602515 -799235 -5764995 -9330838 -7429939 -2605476 1287898
5020 1287898 4063983 5879357 3912024 -2995251 -9961481 -11370744 -8261306 -5821903
5012 -5821903 -5509534 -4638143 -2718607 -3063308 -7714662 -14759273 -21136618 -24697038 -23413006
5003 -23413006 -16658947 -8317034 -4650868 -7041370 -9995291 -8668970 -5312262 -4951749
4995 -4951749 -7114684 -6515859 -1520510 2920213 2442203 -443910 -267211 3539947 6256567
4986 6256567 4416766 -682078 -5931587 -9566862 -10688863 -8699874 -4655781 -938319
4978 -938319 1569817 3730545 4777142 1999522 -4286949 -8796368 -7269319 -1750352
4970 -1750352 3252731 7050625 11177490 14102640 12920805 9215658 7578260 7982321
$$ packed form
5028a1372272N721203N048554j96720m965760l565843J900899M824463L893374
5020A287898K776085J815374j967333o907275o966230j409263L109438K439403
5012e821903L12369Q71391J919536l44701m651354p044611o377345l560420J284032
5003b3413006O754059Q341913L666166k390502k953921J326321L356708L60513
4995d951749k162935N98825M995349M440723m78010k886113J76699L807158K716620
4986F256567j839801n098844n249509l635275j122001J988989M044093L717462
4978i38319K508136K160728J046597k777620o286471m509419J527049N518967
4970a750352N003083L797894M126865K925150j181835l705147j637398M04061
$$ plain form
4962 7982321 4967700 -4107228 -14524917 -20131723 -20417680 -19377185 -19775847 -20840090
4954 -20840090 -20399227 -17829593 -15165731 -15046907 -16834468 -16247765 -10656126 -2839878 3092498
4945 3092498 7136110 11024921 13050725 10540881 5665429 2554238 -241384 -7258015
4937 -7258015 -16274325 -19088852 -13816265 -8476296 -9283480 -12818393 -13885468 -13996498 -16555262
4928 -16555262 -19588250 -19678709 -18820824 -20912481 -24263843 -23602566 -18155132 -13092988 -13721788
4919 -13721788 -21138754 -32138185 -41169310 -44379564 -43365090 -42473737 -41856073 -37429766
4911 -37429766 -28646979 -20788365 -17634528 -17617260 -19364493 -24397157 -31259330 -33984188
4903 -33984188 -30452086 -25769292 -23695682 -22140608 -21124251 -26299290 -38608077 -48942017
$$ packed form
4962G982321l014621r074928j0417689n606806k85957J040495l98662j064243
4954b0840090M40863K569634K663862J18824j787561N86703N591639P816248N932376
4945C092498M043612L888811K025804k509844m875452l111191k795622p016631
4937g258015r016310k814527N272587N339969q07184l534913j067075j11030k558764
4928a6555262l032988r0459Q57885k091657l351362O61277N447434N062144o28800
4919a3721788p416966j0999431r031125l210254J014474Q91353O17664M426307
4911c7429766Q782787P858614L153837J7268j747233n032664o862173k724858
4903c3984188L532102M682794K073610J555074J016357n175039j2308787j0333940
$$ plain form
4895 -48942017 -50061955 -46283654 -45064866 -47375032 -52524827 -62311302 -72976804 -74497310
4887 -74497310 -66629313 -63124326 -70154912 -75414515 -70971714 -69478452 -80969820 -92604948
4879 -92604948 -93323625 -98311909 -120679485 -141044652 -144505316 -165722475 -238005670 -303700424
4871 -303700424 -249303964 -55966251 147469500 225233648 182159529 122978551 106648665
4864 106648665 106249954 91494729 76802088 78127723 79869204 67269377 52972828 50357080
4856 50357080 50172092 42396387 35972021 38715980 39546416 28752718 17284271 18162973
4848 18162973 24637872 23981839 18967645 18403712 18445534 11100920 2094369 2936448 11580317
4839 11580317 16652433 16073053 17006291 20990245 22750174 21632218 22106412 24149540 23482618
$$ packed form
4895d8942017j119938L778301J218788k310166n149795r786475j0665502j520506
4887g4497310P867997L504987p030586n259603M442801J493262j1491368j1635128
4879i2604948p18677m988284k2367576k0365167l460664k1217159p2283195o5694754
4871c03700424N4396460J93337713K03435751P7764148m3074119n9180978j6329886
4864A06648665l98711j4755225j4692641J325635J741481j2599827j4296549k615748
4856E0357080j84988p775705o424366K743959Q30436j0793698j1468447Q78702
4848A8162973O474899o56033n014194n63933M1822p344614r006551Q42079Q643869
4839A1580317N072116n79380R33238L983954J759929j117956M74194K043128o66922
$$ plain form
4830 23482618 20154201 17911141 16881790 15279682 15684408 20675154 24873051 20992788
4822 20992788 12083507 8162998 11784492 16443837 18606783 21266183 24890373 24783241
4814 24783241 19906977 15845815 15919770 16527600 14296804 11166319 9057478 5732989 8279
4805 8279 -4114131 -3060507 265657 338719 -3575622 -7629631 -9495043 -11027882 -15091509
4796 -15091509 -21439377 -25920992 -23917521 -15424634 -5971932 -845384 532395 2111544
4788 2111544 4557389 4833176 1854499 -1845423 -4704104 -8073012 -11986640 -12858446 -8042868
4779 -8042868 -263398 5000932 5292689 2958295 2490725 6894979 14914705 20964477 19688530
4770 19688530 11708639 3324493 -204541 734525 2789948 4369704 5997637 7903950
$$ packed form
4830B3482618l328417k243060j029351j602108M04726M990746M197897l880263
4822B0992788q909281l920509L621494M659345K162946K659400L624190j07132
4814B4783241m876264m061162P3955O07830k230796l130485k108841l324489n724710
4805H279m122410J053624L326164P3062l914341m054009j865412j532839m063627
4796a5091509o347868m481615K003471Q492887R452702N126548J377779J579149
4788B111544K445845K75787k978677l699922k858681l368908l913628q71806M815578
4779h042868P779470N264330K91757k334394m67570M404254Q019726O049772j275947
4770A9688530p979891q384146l529034R39066K055423J579756J627933J906313
$$ plain form
4762 7903950 9474772 10290088 10106449 8378526 5059452 1430922 -938330 -1918058 -2939061
4753 -2939061 -5589881 -10243699 -15562604 -19164192 -19264395 -15896699 -10543094 -5176197
4745 -5176197 -1842939 -1634865 -2725036 -922271 5523138 12541971 14339964 10494210
4737 10494210 6049120 4509905 4154736 2322685 -80141 -640818 455481 1134660 941464
4728 941464 1431795 3772234 7801655 12699789 16782210 17530005 14135352 9695571 8432268
4719 8432268 10359864 11026335 7575491 2927273 1885701 4375148 5399205 1948886
4711 1948886 -2935132 -4772595 -4015977 -4469333 -6129573 -4010208 4124072 12462905 13147800
4702 13147800 5793761 -2675740 -6864139 -7580529 -7514017 -6536304 -3311795 1473590 6050474
$$ packed form
4762G903950J570822Q15316j83639j727923l319074l628530k369252r79728j021003
4753b939061k650820m653818n318905l601588j00203L367696N353605N366897
4745e176197L333258K08074j090171J802765O445409P018833J797993l845754
4737A0494210m445090j539215l55169j832051k402826n60677J096299O79179j93196
4728I41464M90331K340439M029421M898134M082421P47795l394653m439781j263303
4719H432268J927596O66471l450844m648218j041572K489447J024057l450319
4711A948886m884018j837463P56618m53356j660240K119365Q134280Q338833O84895
4702A3147800p354039q469501m188399p16390O6512R77713L224509M785385M576884
$$ plain form
4693 6050474 9843575 12612155 13063984 10848518 8637303 9382326 12080389 13095935 11673581
4684 11673581 11165595 13870061 17366511 17958595 15953720 14909129 16186980 16876847 13787177
4675 13787177 7569767 1711696 -1205013 -954839 1240548 3113244 1847787 -3057049
4667 -3057049 -7441418 -5966732 1191808 8022354 10423856 10996934 13557638 16250637
4659 16250637 14567312 9186346 5365079 4833612 3780522 -126910 -4102040 -5720586
4651 -5720586 -6821347 -8521994 -7149181 -188033 7180752 7668280 2530048 478047
4643 478047 5857458 13690737 17846387 18688574 19610509 20172230 16941458 9263957 535591
4634 535591 -5658536 -8077219 -7035590 -3604712 156587 1946565 888482 -1970436
$$ packed form
4693F050474L793101K768580M51829k215466k211215P45023K698063J015546j422354
4684A1673581n07986K704466L496450N92084k004875j044591J277851O89867l089670
4675A3787177o217410n858071k916709K50174K195387J872696j265457m904836
4667c057049m384369J474686P158540O830546K401502N73078K560704K692999
4659A6250637j683325n380966l821267n31467j053090l907432l975130j618546
4651e720586j100761j700647J372813O961148P368785M87528n138232k052001
4643D78047N379411P833279M155650Q42187R21935N61721l230772p677501q728366
4634E35591o194127k418683J041629L430878L761299J789978j058083k858918
$$ plain form
4626 -1970436 -4469349 -4189923 300751 7477150 12596827 11266166 3977635 -3576327
4618 -3576327 -5231815 391629 8763306 13254717 10760857 4069271 -1696879 -4691919
4610 -4691919 -6967350 -9623852 -10313412 -7405680 -3931758 -3942405 -6453488 -7173001 -5882552
4601 -5882552 -7323657 -13356733 -18710557 -17592109 -11374493 -6077231 -4360229 -4048964
4593 -4048964 -3353890 -3003528 -2953505 -1278563 2014688 3382412 317341 -4644259 -6966142
4584 -6966142 -5841080 -4470870 -5258014 -7054259 -7485049 -6324176 -5666132 -7254494 -10134089
4575 -10134089 -11142542 -8082007 -2287553 2832800 5872754 8559724 12150814 14631482
4567 14631482 13448566 9716458 6988441 6203110 4884292 2048368 795480 3864365
$$ packed form
4626a970436k498913K79426M490674P176399N119677j330661p288531p553962
4618c576327j655488N623444Q371677M491411k493860o691586n766150k995040
4610d691919k275431k656502o89560K907732L473922j0647k511083p19513J290449
4601e882552j441105o033076n353824J118448O217616N297262J717002L11265
4593d048964O95074L50362N0023J674942L293251J367724l065071m961600k321883
4584f966142J125062J370210p87144j796245m30790J160873O58044j588362k879595
4575a0134089j008453L060535N794454N120353L039954K686970L591090K480668
4567A4631482j182916l732108k728017p85331j318818k835924j252888L068885
$$ plain form
4559 3864365 8772591 10398830 7575310 3987704 2310938 737251 -2887006 -6127224
4551 -6127224 -4607563 1055599 4760101 2876365 -272449 1864544 8164463 9988366
4543 9988366 2541110 -7678984 -10277170 -3824150 3271069 4766793 4268947 8060421
4535 8060421 14449910 15814755 10155631 4634300 5712035 10451062 11310879 6677543
4527 6677543 2032823 1587627 3324316 3262671 1025384 -862770 -961998 -33571 675703
4518 675703 562963 -288436 -1110677 -1144800 -938564 -1767180 -3021758 -1871925 2963014
4509 2963014 8575302 10990512 9912579 8215224 7498164 6716489 5064988 3439956 2206273
4500 2206273 -189411 -4860977 -10075179 -12650422 -11131643 -6596496 -906480 4705750
$$ packed form
4559C864365M908226J626239k823520l587606j676766j573687l624257l240218
4551f127224J519661N663162L704502j883736l148814K136993O299919J823903
4543I988366p447256j0220094k598186O453020P095219J495724m97846L791474
4535H060421O389489J364845n659124n521331J077735M739027Q59817m633336
4527F677543m644720m45196J736689o1645k237287j888154r9228R28427P09274
4518F75703j12740q51399q22241l4123K06236q28616j254578J149833M834939
4509B963014N612288K415210j077933j697355p17060p81675j651501j625032j233683
4500B206273k395684m671566n214202k575243J518779M535147N690016N612230
$$ plain form
4492 4705750 9314302 11519901 9974870 5268308 890525 850856 5377414 9803686 8825858
4483 8825858 1452323 -8788838 -17268112 -20769375 -18414418 -12558970 -7881074 -6968279
4475 -6968279 -7230851 -4651098 132291 2728705 1617875 -205587 -845376 -2215677 -5001347
4466 -5001347 -5128956 969244 10135889 15437230 14070123 9177904 5003142 3496439
4458 3496439 4816983 7502183 7994864 3308695 -4845685 -10909052 -11427727 -8482223 -6482458
4449 -6482458 -7158884 -8679138 -8605778 -6660582 -4757810 -4622666 -5508902 -4893825 -1618766
4440 -1618766 2894937 7181264 11511617 15256111 14368380 5181006 -9104454 -19109549
4432 -19109549 -18319229 -9795974 -2318269 -937586 -3011237 -3083172 342248 4040079 5121598
$$ packed form
4492D705750M608552K205599j545031m706562m377783l9669M526558M426272r77828
4483H825858p373535j0241161q479274l501263K354957N855448M677896R12795
4475f968279k62572K579753M783389K596414j110830j823462o39789j370301k785670
4466e001347j27609O098200R166645N301341j367107m892219m174762j506703
4458C496439J320544K685200M92681m686169q154380o063367n18675K945504J999765
4449f482458o76426j520254P3360J945196J902772J35144q86236O15077L275059
4440a618766M513703M286327M330353L744494q87731r187374j4285460j0005095
4432a9109549P90320Q523255P477705J380683k073651p1935L425420L697831J081519
$$ plain form
4423 5121598 4630289 4945258 5396185 3400631 -251709 -836235 4060321 10816085 14655590
4414 14655590 15355674 14748438 11325349 2620148 -7885920 -12246627 -8153251 -2770532
4406 -2770532 -3555752 -8787992 -10841680 -6536330 -119513 3283997 3356129 3141007 4885422
4397 4885422 8642553 12936208 15102796 12369948 4839849 -2802958 -4607782 899565
4389 899565 9538754 16345579 19543039 18551416 11152547 -3332658 -19082928 -26897521
4381 -26897521 -23597861 -14569980 -5547323 3692157 14585819 23327025 24452428 18666070
4373 18666070 11821321 7169855 3775886 2146881 5497621 13786687 21379129 23419547
4365 23419547 21220612 18607579 15536058 8595966 -3058710 -14819006 -20181798 -16839085
$$ packed form
4423E121598m91309L14969M50927j995554l652340n84526M896556O755764L839505
4414A4655590P00084o07236l423089q705201j0506068m360707M093376N382719
4406b770532p85220n232240k053688M305350O416817L403510P2132k15122J744415
4397D885422L757131M293655K166588k732848p530099p642807j804824N507347
4389H99565Q639189O806825L197460r91623p398869j4485205j5750270p814593
4381b6897521L299660R027881R022657R239480J0893662Q741206J125403n786358
4373A8666070o844749m651466l393969j629005L350740Q289066P592442K040418
4365B3419547k198935k613033l071521o940092j1654676j1760296n362792L342713
$$ plain form
4357 -16839085 -9404928 -5547153 -8377352 -13379736 -14223967 -10313592 -6270290 -5286596
4349 -5286596 -6378885 -7614817 -8281012 -7739061 -5756460 -4249866 -5095809 -6127748 -3471702
4340 -3471702 1957674 5287733 5714846 7719795 12216175 13029809 6446791 -1284854 -1654808
4331 -1654808 4749081 10287641 10733709 7890813 4105461 508282 -349686 3574515 8945315
4322 8945315 9548919 4567168 -278136 -837647 553178 -380641 -4322803 -9084358 -12559435
4313 -12559435 -13226368 -10526524 -6501060 -4765881 -6404644 -8908832 -10152081 -10899311
4305 -10899311 -12072470 -12215401 -9812666 -6274335 -4460841 -5353247 -7798775 -10506470
4297 -10506470 -12863707 -14703657 -16469703 -18724824 -20644607 -20305700 -17485313 -14562208
$$ packed form
4357a6839085P434157L857775k830199n002384q44231L910375M043302R83694
4349e286596j092289j235932o66195N41951J982601J506594q45943j031939K656046
4340c471702N429376L330059M27113K004949M496380Q13634o583018p731645l69954
4331a654808O403889N538560M46068k842896l785352l597179q57968L924201N370800
4322H945315O03604m981751m845304n59511J390825r33819l942162m761555l475077
4313a2559435o66933K699844M025464J735179j638763k504188j243249p47230
4305a0899311j173159j42931K402735L538331J813494q92406k445528k707695
4297a0506470k357237j839950j766046k255121j919783L38907K820387K923105
$$ plain form
4289 -14562208 -13153888 -11522982 -7462151 -2400991 182035 -125504 -292430 1040884
4281 1040884 1276635 -1771472 -5933775 -7611492 -6834521 -6396716 -6941452 -6383842 -4310288
4272 -4310288 -3279893 -4307930 -4232933 -113727 5835195 8461676 5617193 -506827 -6754499
4263 -6754499 -11027287 -11907212 -9474469 -6583869 -6713562 -10128438 -13899502 -15332066 -13462047
4254 -13462047 -8147458 -435889 6826192 11623658 15261960 19272621 21429133 19256168
4246 19256168 16065637 17315225 20947653 18475866 7625484 -3100935 -5889107 -3093830
4238 -3093830 -768384 861146 4043476 5722763 1146448 -7040666 -10784381 -7319213
4230 -7319213 -1958320 -166115 -1733776 -2942861 -543379 6062481 13141907 14364398
$$ packed form
4289a4562208J408320J630906M060831N061160K583026l07539j66926J333314
4281A040884K35751l048107m162303j677717P76971M37805n44736N57610K073554
4272d310288J030395j028037P4997M119206N948922K626481k844483o124020o247672
4263f754499m272788q79925K432743K890600j29693l414876l771064j432564J870019
4254a3462047N314589P711569P262081M797466L638302M010661K156512k172965
4246A9256168l190531J249588L632428k471787j0850382j0726419k788172K795277
4238c093830K325446J629530L182330J679287m576315q187114l743715L465168
4230g319213N360893J792205j567661j209085K399482O605860P079426J222491
$$ plain form
4222 14364398 7911912 -16789 -3080051 -3598490 -7678397 -13838421 -14315442 -7615791
4214 -7615791 -1696604 -2595422 -6901656 -8615520 -7438456 -6448024 -6518437 -7136896 -8755472
4205 -8755472 -10430862 -8847424 -3875747 -1629830 -6841173 -14470854 -14704679 -6008826
4197 -6008826 2006725 16228 -10745626 -21618802 -26598859 -25961050 -21623229 -13523283
4189 -13523283 -2086812 8919640 15158657 16153278 14018950 8701434 -1521250 -14367598
4181 -14367598 -22821246 -22380053 -15933633 -9229821 -4572871 -1469825 -161356 -974155
4173 -974155 -2517170 -3745022 -5684832 -8456275 -9554360 -8259054 -8249420 -11693373 -14208623
4164 -14208623 -10906555 -4696999 -2802443 -6737164 -11348328 -12760126 -12104678 -11898816
$$ packed form
4222A4364398o452486p928701l063262n18439m079907o160024m77021O699651
4214g615791N919187q98818m306234j713864J177064R90432p0413o18459j618576
4205h755472j675390J583438M971677K245917n211343p629681k33825Q695853
4197f008826Q015551j990497j0761854j0873176m980057O37809M337821Q099946
4189a3523283J1436471J1006452O239017R94621k134328n317516j0222684j2846348
4181a4367598q453648M41193O446420O703812M656950L103046J308469q12799
4173i74155j543015j227852j939810k771443j098085J295306R634l443953k515250
4164a4208623L302068O209556J894556l934721m611164j411798O55448K05862
$$ plain form
4156 -11898816 -12954379 -14361132 -13814696 -10039225 -7054434 -11631661 -23186023 -31933880
4148 -31933880 -31668378 -27547046 -25411513 -21922587 -13841087 -8104056 -11189992 -16623312
4140 -16623312 -16228995 -15757961 -24190584 -35856824 -40966102 -44965192 -55775075 -61736266
4132 -61736266 -51054563 -44086745 -65310535 -82421878 -24835264 114618710 241770315
4125 241770315 262573362 191225302 116476496 86217840 75651211 56468667 39845756
4118 39845756 41012151 47318578 42654709 33383008 30651401 29696547 23771268 19679028
4110 19679028 23593291 27310916 22980782 17383359 18285975 19905830 15083817 9480811
4102 9480811 10198610 11553310 6069934 -209402 2308060 9477795 10196562 4316228 371207
$$ packed form
4156a1898816j055563j406753N46436L775471K984791m577227j1554362q747857
4148c1933880K65502M121332K135533L488926Q081500N737031l085936n433320
4140a6623312L94317M71034q432623j1666240n109278l999090j0809883n961191
4132f1736266J0681703O967818k1223790j7111343N7586614J39453974J27151605
4125B41770315K0803047p1348060p4748806l0258656j0566629j9182544j6622911
4118C9845756J166395O306427m663869r271701k731607r54854n925279m092240
4110A9679028L914263L717625m330134n597423R02616J619855m822013n603006
4102I480811P17799J354700n483376o279336K517462P169735P18767n880334l945021
$$ plain form
4093 371207 237859 -1010961 -3234482 -1298736 4593034 8723745 8779986 6817051 3538883
4084 3538883 -763113 -2522510 7416 1062950 -5127467 -14048983 -16379321 -11183736
4076 -11183736 -5238989 -1429033 3306754 9508323 13217006 12647337 9902772 6240171
4068 6240171 1887721 -317474 2246413 6201559 5878285 2472916 2923478 9440674 16297799
4059 16297799 17755724 14073559 9343150 7979751 13057728 23275896 31652924 31568828
4051 31568828 23880310 14780326 8577804 6471537 8986224 13590807 12993166 3359427
4043 3359427 -7681588 -9302901 -2620632 1045924 -3204061 -8403151 -8328988 -5995526
4035 -5995526 -5924364 -6326009 -4051676 -729708 1443221 4746691 11184256 16585508 14860941
$$ packed form
4093C71207j33348j248820k223521J935746N891770M130711N6241j962935l278168
4084C538883m301996j759397K529926J055534o190417q921516k330338N195585
4076a1183736N944747L809956M735787O201569L708683n69669k744565l662601
4068F240171m352450k205195K563887L955146l23274l405369M50562O517196O857125
4059A6297799J457925l682165m730409j363399N077977J0218168Q377028q4096
4051C1568828p688518r099984o202522k106267K514687M604583n97641r633739
4043C359427j1041015j621313O682269L666556m249985n199090P4163K333462
4035e995526P1162m01645K274333L321968K172929L303470O437565N401252j724567
$$ plain form
4026 14860941 5786869 -5566341 -14867936 -20270847 -20446407 -15136828 -7009587 -114611
4018 -114611 3250822 3081927 774561 -1025055 142115 3490196 5238622 3526789 1090521
4009 1090521 1189488 2671788 1404120 -4012801 -9524200 -8865847 126404 11835628 16871251
4000 16871251 11729765 3012685 -751021 446452 198627 -3423035 -5596126 -3823703
3992 -3823703 -2225132 -4085239 -6380590 -5571546 -3292875 -1612745 2236819 10461754
3984 10461754 18073038 18541480 13718187 11132187 12475121 11785707 5413422 -2873312
3976 -2873312 -8351656 -11086045 -12745680 -12669093 -10214241 -7050213 -3937354 1125615 7895702
3967 7895702 10406954 3401399 -9410221 -18271150 -18138509 -12580950 -7491563 -5487844
$$ packed form
4026A4860941r074072j1353210r301595n402911j75560N309579Q127241O894976
4018a14611L365433j68895k307366j799616J167170L348081J748426j711833k436268
4009A090521R8967J482300j267668n416921n511399O58353Q992251J1709224N035623
4000A6871251n141486q717080l763706J197473k47825l621662k173091J772423
3992c823703J598571j860107k295351Q09044K278671J680130L849564Q224935
3984A0461754P611284M68442m823293k586000J342934o89414o372285q286734
3976b873312n478344k734389j659635P6587K454852L164028L112859N062969O770087
3967G895702K511252p005555j2811620q860929J32641N557559N089387K003719
$$ plain form
3959 -5487844 -6884878 -11151805 -15323775 -15208136 -11127048 -9146246 -13474707 -20768246
3951 -20768246 -25593210 -28243727 -31991193 -35084971 -32410103 -25042980 -21161727 -25160357
3943 -25160357 -31472249 -32374438 -27324475 -20939229 -15739993 -11401305 -8510506 -8389346
3935 -8389346 -10213831 -11728991 -12022789 -11239109 -9090612 -6055412 -4240171 -4653777 -5674650
3926 -5674650 -6403115 -8441251 -11308853 -9856707 -1013681 9844283 14871403 14072796
3918 14072796 13769688 16280514 17736112 15841154 13090325 11396715 9727242 8430933
3910 8430933 9764330 12005966 9153862 -65932 -7902602 -6427936 2777531 11446597
3902 11446597 14323137 12668132 10415275 10130626 11426009 11097650 6206133 -1440310
$$ packed form
3959e487844j397034m266927m171970J15639M081088J980802m328461p293539
3951b0768246m824964k650517l747466l093778K674868P367123L881253l998630
3943b5160357o311892r02189N049963O385246N199236M338688K890799J21160
3935h389346j824485j515160k93798P83680K148497L035200J815241m13606j020873
3926e674650p28465k038136k867602J452146Q843026J0857964N027120p98607
3918A4072796l03108K510826J455598j894958k750829j693610j669473j296309
3910H430933J333397K241636k852104r219794p836670J474666R205467Q669066
3902A1446597K876540j655005k252857k84649J295383l28359m891517p646443
$$ plain form
3894 -1440310 -5755938 -2854390 4863894 12329857 17138451 19755444 20827011 20291532
3886 20291532 17697904 12406995 5217255 -124568 -211849 2475944 1083787 -6857287
3878 -6857287 -15721785 -18964071 -16578035 -12841510 -9927922 -7155004 -4331984 -2425535
3870 -2425535 -1861912 -2309523 -3220739 -3692642 -3731852 -6166201 -14005678 -24601684 -30231438
3861 -30231438 -26773906 -18417108 -11503232 -7546662 -5186798 -4762057 -6558168 -7702775
3853 -7702775 -5635015 -2701343 -2999205 -6236799 -8666634 -8625215 -7329110 -5549499 -3301363
3844 -3301363 -1755475 -1879626 -2005692 171344 4097268 7405500 8985362 8733505 6707794
3835 6707794 5334699 9197977 18478986 25578551 23398304 14832278 8682317 7974965
$$ packed form
3894a440310m315628K901548P718284P465963M808594K616993J071567n35479
3886B0291532k593628n290909p189740n341823q7281K687793j392157p941074
3878f857287q864498l242286K386036L736525K913588K772918K823020J906449
3870b425535N63623m47611r11216m71903l9210k434349p839477j0596006n629754
3861c0231438L457532Q356798O913876L956570K359864M24741j796111j144607
3853g702775K067760K933672k97862l237594k429835M1419J296105J779611K248136
3844c301363J545888j24151j26066K177036L925924L308232J579862k51857k025711
3835F707794j373095L863278R281009P099565k180247q566026o149961p07352
$$ plain form
3827 7974965 8217092 6016561 2956345 865807 -650279 -1202454 292466 1533056 -1692205
3818 -1692205 -8422611 -11974956 -8421963 -1219702 4357634 6831122 6389534 1826076
3810 1826076 -6775543 -15215012 -18542574 -16094284 -11394361 -8306636 -8136007 -8909646 -7138895
3801 -7138895 -2056799 2416110 2622980 1110433 3416361 9211728 11972642 8694929
3793 8694929 4437208 4329491 5706996 2285233 -6647456 -15096375 -17199990 -12785135
3785 -12785135 -7124450 -6404047 -11952517 -18456707 -19957561 -17229173 -15537434 -15364990
3777 -15364990 -11166255 -1150132 7966630 10071574 8306564 9197299 12045726 10542205
3769 10542205 2942531 -5665374 -10976538 -13971265 -17018607 -19707642 -20130655 -17936285
$$ packed form
3827G974965K42127k200531l060216k090538j516086n52175J494920J240590l225261
3818a692205o730406l552345L552993P202261N577336K473488m41588m563458
3810A826076q601619q439469l327562K448290M699923L087725J70629p73639J770751
3801g138895N082096M472909K06870j512547K305928N795367K760914l277713
3793H694929m257721j07717J377505l421763q932689q448919k103615M414855
3785a2785135N660685P20403n548470o504190j500854K728388J691739J72444
3777a5364990M198735J0016123R116762K104944j765010Q90735K848427j503521
3769A0542205p599674q607905n311164k994727l047342k689035m23013K194370
$$ plain form
3761 -17936285 -15030980 -14103735 -15791250 -16431533 -10857152 407675 9230084 8471667
3753 8471667 539729 -6348240 -8453092 -8419099 -8412984 -7334402 -5292003 -5055494 -6959006
3744 -6959006 -7033084 -2951820 1944580 3715032 3915209 7054899 13809511 20270860 23162368
3735 23162368 22795377 20994176 18568622 15242978 10508662 4350823 -1811021 -5442209
3727 -5442209 -5820885 -6192379 -10562871 -17878132 -22051961 -19438669 -13924618 -11683107 -12402897
3718 -12402897 -9992738 -2345133 4380887 4043842 -586149 -1608826 3383235 9491298
3710 9491298 12573820 13485759 13287390 9939825 2904604 -3311956 -4303087 -1676073 -32062
3701 -32062 -461748 -1189818 -2714173 -7349366 -14106855 -18499725 -17912871 -13774083 -8376605
$$ packed form
3761a7936285K905305R27245j687515o40283N574381J1264827Q822409p58417
3753H471667p931938o887969k104852L3993O115J078582K042399K36509j903512
3744f959006p4078M081264M896400J770452K00177L139690O754612O461349K891508
3735B3162368l66991j801201k425554l325644m734316o157839o161844l631188
3727e442209l78676l71494m370492p315261m173829K613292N514051K241511p19790
3718a2402897K410159P647605O726020l37045m629991j022677M992061O108063
3710I491298L082522R11939j98369l347565p035221o216560r91131K627014J644011
3701c2062m29686p28070j524355m635193o757489m392870N86854M138788N397478
$$ plain form
3692 -8376605 -3122081 89034 -60969 -983424 1901802 8408783 12744722 11533808 8691662
3683 8691662 9190848 11610563 11320756 8636630 8392581 11841624 14244812 11934568 7501818
3674 7501818 5312884 4899112 2316491 -3320178 -8290858 -9358942 -7275157 -4150801
3666 -4150801 -257508 4066070 5350561 -103981 -9871350 -15696953 -12433270 -4244100
3658 -4244100 955472 1366130 1670019 4280528 5457554 2248220 -1094803 1930640 10567879
3649 10567879 16923975 15691296 9703555 4631149 1856697 -775078 -3717631 -4827667
3641 -4827667 -2982415 478893 4082064 7516857 10259358 11358243 11471038 12822936
3633 12822936 15797862 17735890 17061289 16592344 19670772 23795789 21626032 9340560
$$ packed form
3692h376605N254524L211115j50003r22455K885226O506981M335939j210914k842146
3683H691662M99186K419715k89807k684126k44049L449043K403188k310244m432750
3674G501818k188934m13772k582621n636669m970680j068084K083785L124356
3666d150801L893293M323578J284491n454542r767369n825603L263683Q189170
3658d244100N199572M10658L03889K610509J177026l209334l343023L025443Q637239
3649A0567879O356096j232679n987741n072406k774452k631775k942553j110036
3641d827667J845252L461308L603171L434793K742501J098885J12795J351898
3633A2822936K974926J938028o74601m68945L078428M125017k169757j2285472
$$ plain form
3625 9340560 -8280821 -22428870 -28390234 -27940818 -25207783 -22339721 -19224207 -15603342
3617 -15603342 -12078415 -9267306 -7181278 -6109971 -7236514 -10959650 -14992548 -16162879
3609 -16162879 -14473954 -13104542 -13472907 -13091999 -10234188 -7634435 -8148208 -9354995 -7257736
3600 -7257736 -3681478 -3946406 -7144525 -5469915 4295179 14480710 15805730 8681792
3592 8681792 746545 -3507919 -5506995 -7191440 -8426784 -9452222 -11180974 -12429407
3584 -12429407 -10504954 -5468664 -968891 202262 -596290 237757 4582417 10616335
3576 10616335 13952367 11623252 6096258 3743440 7495336 12850287 13549753 9025466
3568 9025466 2968528 -3011651 -9378115 -13898385 -13098462 -8793641 -7037256 -9086482
$$ packed form
3625I340560j7621381j4148049n961364M49416K733035K868062L115514L620865
3617a5603342L524927K811109K086028J071307j126543l723136m032898j170331
3609a6162879J688925J369412l68365L80908K857811K599753n13773j206787K097259
3600g257736L576258k64928l198119J674610R765094J0185531J325020p123938
3592H681792p935247m254464j999076j684445j235344j025438j728752j248433
3584a2429407J924453N036290M499773J171153p98552Q34047M344660O033918
3576A0616335L336032k329115n526994k352818L751896N354951O99466m524287
3568I025466o056938n980179o366464m520270P99923M304821J756385k049226
$$ plain form
3560 -9086482 -9603390 -6501713 -5953485 -12399118 -19009557 -15687408 -4152158 2960982
3552 2960982 -1509647 -10866373 -14867619 -12250938 -8662551 -6626044 -3677945 1017164
3544 1017164 4274934 4299522 3880242 5717426 7821991 6781285 3597230 2654169 5454009
3535 5454009 8511978 7599231 1691319 -6962232 -13882871 -13901714 -5553300 5314938 10120016
3526 10120016 6976263 1754492 -1396536 -5161035 -11551501 -15127778 -9917429 399870
3518 399870 6171508 4030088 -1143834 -5506903 -10070821 -14473118 -14370378 -8133553 -652803
3509 -652803 2929402 3100064 2695097 1811045 -727552 -4193948 -7414463 -10493215 -12422595
3500 -12422595 -10334427 -4259734 758751 1104470 133246 2964521 8252153 10181706
$$ packed form
3560i086482n16908L101677N48228o445633o610439L322149J1535250P113140
3552B960982m470629r356726m001246K616681L588387K036507K948099M695109
3544A017164L257770K4588m19280J837184K104565j040706l184055r43061K799840
3535E454009L057969r12747n907912q653551o920639j8843Q348414J0868238M805078
3526A0120016l143753n221771l151028l764499o390466l576277N210349J0317299
3518C99870N771638k141420n173922m363069m563918m402297J02740O236825P480750
3509f52803L582205J70662m04967q84052k538597l466396l220515l078752j929380
3500a2422595K088168O074693N018485L45719r71224K831275N287632J929553
$$ plain form
3492 10181706 7237919 3686067 2401807 1180648 -2569483 -7394936 -10173585 -10517613
3484 -10517613 -10652582 -11925111 -13085514 -12208241 -9683398 -8321812 -9503156 -10053708 -5538490
3475 -5538490 2983006 8853633 8410053 6475139 9828855 17330601 20901343 16059733
3467 16059733 7729774 4669244 10428289 20452327 26440914 23292399 13259694 3631958
3459 3631958 -342190 239342 1007425 -216986 -2604816 -4977855 -6694856 -7081396 -6499439
3450 -6499439 -6913541 -8829692 -8942688 -4082938 3233105 6755461 4062253 -1020442 -3887318
3441 -3887318 -4105319 -4411579 -7445871 -13940754 -21547616 -25041871 -20556322 -10550293
3433 -10550293 -2138256 397576 -869883 -2125768 -3101370 -6098598 -11818154 -18147015
$$ packed form
3492A0181706k943787l551852j284260j221159l750131m825453k778649l44028
3484a0517613j34969j272529j160403Q77273K524843J361586j181344n50552M515218
3475e538490Q521496N870627m43580j934914L353716P501746L570742m841610
3467A6059733q329959l060530N759045J0024038N988587l148515j0032705r627736
3459C631958l974148N81532P68083j224411k387830k373039j717001l86540N81957
3450f499439m14102j916151j12996M859750P316043L522356k693208n082695k866876
3441c887318k18001l06260l034292o494883p606862l494255M485549J0006029
3433a0550293Q412037K535832j267459j255885r75602k997228n719556o328861
$$ plain form
3425 -18147015 -22245908 -22761516 -20606255 -17876892 -15244647 -10840286 -3151599 5673688
3417 5673688 11683861 13951495 14897245 15745186 14649611 10149163 3796290 -1875817 -5980424
3408 -5980424 -8975547 -11573532 -14437621 -17031505 -16786401 -12026973 -5750354 -3183929
3400 -3183929 -5044637 -6796579 -5444228 -2931798 -1170423 1789798 7540664 12933851
3392 12933851 13668794 9853572 4828014 826538 -1132984 221477 4146358 6280703
3384 6280703 3331013 -2274749 -6198479 -8732982 -13037041 -18399866 -20581323 -18459497
3376 -18459497 -15097989 -11982665 -7647309 -3086152 -2717472 -7174621 -10175864 -6743172
3368 -6743172 -935998 -488707 -5719278 -8946962 -4860515 3105350 8143336 8303787 6815046
$$ packed form
3425a8147015m098893n15608K155261K729363K632245M404361P688687Q825287
3417E673688O010173K267634R45750Q47941j095575m500448o352873n672107m104607
3408e980424k995123k597985k864089k593884K45104M759428O276619K566425
3400c183929j860708j751942J352351K512430J761375K960221N750866N393187
3392A2933851P34943l815222n025558m001476j959522J354461L924881K134345
3384F280703k949690n605762l923730k534503m304059n362825k181457K121826
3376a8459497L361508L115324M335356M561157L68680m457149l001243L432692
3368f743172N807174M47291n230571l227684M086447P965865N037986J60451j488741
$$ plain form
3359 6815046 6219571 5421602 2600810 -1528147 -4722016 -6055341 -6081453 -4876482 -1920768
3350 -1920768 2001346 4766428 5514114 5668757 6499105 7315295 7297296 7462710 9069542
3341 9069542 11243317 12014180 10888390 8785445 6340300 4016582 3116954 4882704 9048681
3332 9048681 14432944 19765538 22690339 20123365 12186643 4054764 739463 1253752
3324 1253752 1110928 -872058 -2317089 -2726037 -4265451 -7166157 -9400560 -11603581 -16930400
3315 -16930400 -24287673 -27094309 -21893965 -13818328 -9954504 -10929846 -12643159 -12828997
3307 -12828997 -11770075 -9480158 -6714508 -6449667 -9676463 -11563317 -6737300 2817900
3299 2817900 10150049 12957717 15568479 21038727 26461752 27603923 23932696 17224428
$$ packed form
3359F815046n95475p97969k820792m128957l193869j333325k6112J204971K955714
3350a920768L922114K765082P47686J54643Q30348Q16190j7999J65414J606832
3341I069542K173775P70863j125790k102945k445145k323718q99628J765750M165977
3332I048681N384263N332594K924801k566974p936722q131879l315301N14289
3324A253752j42824j982986j445031m08948j539414k900706k234403k203021n326819
3315a6930400p357273k806636N200344Q075637L863824r75342j713313j85838
3307a2828997J058922K289917K765650K64841l226796j886854M826017R555200
3299B817900P332149K807668K610762N470248N423025J142171l671227o708268
$$ plain form
3291 17224428 8944232 1365783 -1655298 2089800 10252046 17657773 20056365 16057612
3283 16057612 7403957 -2118249 -9847156 -16438188 -22952582 -26708535 -23891657 -16352330
3275 -16352330 -10979692 -10686293 -10741826 -6770078 -1640584 -51310 -81555 3985204 12036255
3266 12036255 17054070 13859066 4633749 -4465762 -8316366 -4618431 4421283 11060099
3258 11060099 7619140 -4109478 -12857666 -10679930 -2737632 -197268 -5540087 -10225112
3250 -10225112 -6925058 1225328 5878890 3989388 -682391 -4382291 -7089071 -9337764
3242 -9337764 -9564218 -6820187 -3633718 -3461955 -6328892 -9161979 -9810941 -8855291 -8065285
3233 -8065285 -8906971 -11726584 -14253642 -12001070 -3253713 6899731 11160456 8712634
$$ packed form
3291A7224428q280196p578449l021081L745098Q162246P405727K398592l998753
3283A6057612q653655r522206p728907o591032o514394l755953K816878P539327
3275a6352330N372638K93399n5533L971748N129494J589274l0245M066759Q051051
3266A2036255N017815l195004r225317r099511l850604L697935R039714O638816
3258A1060099l440959j1728618q748188K177736P942298K540364n342819m685025
3250a0225112L300054Q150386M653562j889502m671779l699900k706780k248693
3242i337764k26454K744031L186469J71763k866937k833087o48962R55650P90006
3233h065285q41686k819613k527058K252572Q747357J0153444M260725k447822
$$ plain form
3225 8712634 5447573 5285446 6234138 6396892 7978600 11873881 13843086 11302354 9296097
3216 9296097 13154447 18712196 17590702 10214973 4980470 4761503 3495214 -1837130
3208 -1837130 -4979642 -672844 6467107 9321603 8531347 8580279 8221153 2616328 -7205771
3199 -7205771 -14353058 -14922933 -10789671 -4083969 4873086 13705979 18155906 17877655 17168403
3190 17168403 17973619 16614959 9941518 988838 -4297140 -3175517 3361791 13073907
3182 13073907 22344640 26078966 21842005 13610585 8299633 8404136 10277068 9646281
3174 9646281 6438730 3438299 2252536 2324468 3108781 5301530 9293620 13471086 15196216
3165 15196216 13307161 8884016 3975864 802101 1652316 7141723 14032237 17554234
$$ packed form
3225H712634l265061j62127R48692J62754J581708L895281J969205k540732k006257
3216I296097L858350N557749j121494p375729n234503k18967j266289n332344
3208a837130l142512M306798P139951K854496p90256M8932l59126n604825r822099
3199g205771p147287n69875M133262O705702Q957055Q832893M449927k78251p09252
3190A7168403Q05216j358660o673441q952680n285978J121623O537308R712116
3182A3073907R270733L734326m236961q231420n310952J04503J872932o30787
3174I646281l207551l000431j185763P1932P84313K192749L992090M177466J725130
3165A5196216j889055m423145m908152l173763Q50215N489407O890514L521997
$$ plain form
3157 17554234 17466971 19010684 25209644 30909253 28567888 18438346 8100882 2095348
3149 2095348 -2599638 -9171229 -14126582 -11606369 -1838390 8462912 13192755 11777228
3141 11777228 7751241 4724971 3690869 2906869 393001 -3090603 -4405626 -1843270
3133 -1843270 2628047 5603716 5535327 3180010 188250 -1953180 -2904091 -4132645 -7296008
3124 -7296008 -11581873 -14450874 -15405447 -16575544 -18626636 -18828159 -14883930 -8263125 -1896854
3115 -1896854 2869256 4819525 1363796 -7799435 -17252485 -20141260 -15638498 -9198202
3107 -9198202 -5767541 -5487363 -5668775 -4094076 -371526 3390862 3302007 -2423630 -10395810
3098 -10395810 -15378465 -16369617 -16287311 -15697390 -11004144 -682041 10068119 14023414
$$ packed form
3157A7554234q7263J543713O198960N699609k341365j0129542j0337464o005534
3149B095348m694986o571591m955353K520213R767979J0301302M729843j415527
3141A1777228m025987l026270j034102p84000k513868l483604j315023K562356
3133a843270M471317K975669o8389k355317k991760k141430r50911j228554l163363
3124g296008m285865k869001r54573j170097k051092k01523L944229O620805O366271
3115a896854M766110J950269l455729r163231r453050k888775M502762O440296
3107i198202L430661K80178j81412J574699L722550L762388q8855n725637p972180
3098a0395810m982655r91152Q2306N89921M693246J0322103J0750160L955295
$$ plain form
3090 14023414 9902944 3073261 -940474 -1106358 993217 4823046 10360489 14903108
3082 14903108 13785037 6077175 -2704065 -6689775 -7027141 -8770892 -10918453 -6025051
3074 -6025051 7617634 19942583 21059022 14632453 11892362 15023123 15327025 7905393
3066 7905393 -808202 -3088099 -170629 1844663 763846 -1836809 -5347938 -9841812
3058 -9841812 -13848839 -16483663 -19199083 -21840125 -20210591 -12195219 -3600242 -2441351
3050 -2441351 -8759726 -15202286 -16758441 -14588863 -10555936 -4078722 3783865 8184552
3042 8184552 5719632 -879240 -5833433 -6278537 -3346701 759134 4529864 6989258
3034 6989258 7709915 6923489 4835813 1155464 -4322214 -11100394 -17979645 -23127374 -24637724
$$ packed form
3090A4023414m120470o829683m013735j65884K099575L829829N537443M542619
3082A4903108j118071p707862q781240l985710l37366j743751k147561M893402
3074f025051J3642685J2324949J116439o426569k740091L130761L03902p421632
3066G905393q713595k279897K917470K015292j080817k600655l511129m493874
3058i841812m007027k634824k715420k641042J629534Q015372Q594977J158891
3050b441351o318375o442560j556155K169578M032927O477214P862587M400687
3042H184552k464920o598872m954193m45104K931836M105835L770730K459394
3034F989258P20657p86426k087676l680349n477678o778180o879251n147729j510350
$$ plain form
3025 -24637724 -22243840 -18218597 -15157587 -12916749 -9093420 -2384375 5947471 13446409
3017 13446409 17323468 14636623 5040194 -5771015 -8919115 -1450401 9175238 12420293
3009 12420293 5685570 -4239817 -9891837 -10318643 -9071834 -7816791 -4333964 3491777
3001 3491777 13426881 19663160 17926577 9620552 715662 -3549936 -2959135 -1697656
2993 -1697656 -3854789 -9365047 -13937172 -13120830 -7007742 -746160 507208 -2709496
2985 -2709496 -4538821 -471730 7277042 12095768 10174020 4089676 -863027 -2512605
2977 -2512605 -2869240 -3995258 -4651444 -2173403 3178484 7666754 8482282 7164923 7137694
2968 7137694 8762869 9010793 6073047 1906070 -1001002 -3365550 -7425204 -12565994
$$ packed form
3025b4637724K393884M025243L061010K240838L823329O709045Q331846P498938
3017A3446409L877059k686845r596429j0811209l148100P468714J0625639L245055
3009A2420293o734723r925387n652020m26806J246809J255043L482827P825741
3001C491777R935104O236279j736583q306025q904890m265598N90801J261479
2993a697656k157133n510258m572125Q16342O113088O261582J253368l216704
2985b709496j829325M067091P748772M818726j921748o084344m952703j649578
2977b512605l56635j126018o56186K478041N351887M488270Q15528j317359k7229
2968G137694J625175K47924k937746m166977k907072k364548m059654n140790
$$ plain form
2960 -12565994 -15253398 -13456615 -8967820 -4817599 -2404594 -1820025 -2510796 -2093630 2818272
2951 2818272 11669649 17734344 14752598 5141347 -2553906 -4359033 -4097359 -4865437 -3424541
2942 -3424541 2896226 8968210 8043576 2293474 -102175 2566284 3720582 181632
2934 181632 -2350514 707396 4141807 281892 -9316220 -16185067 -16784074 -15487374 -16047822
2925 -16047822 -16056196 -11521232 -2815498 6014594 11349741 11979504 9078729 5598507 4281429
2916 4281429 5139484 5512790 2900786 -2745265 -8965101 -12154474 -10109888 -4746345 -1109710
2907 -1109710 -1646136 -2623423 1007581 7948662 11208970 6939802 -450110 -3485762 28715
2898 28715 5414651 6879926 3598576 -19763 176866 3076909 4160292 1918822 -629981
$$ packed form
2960a2565994k687404J796783M488795M150221K413005N84569o90771M17166M911902
2951B818272Q851377O064695k981746r611251p695253j805127K61674p68078J440896
2942c424541O320767O071984r24634n750102k395649K668459J154298l538950
2934A81632k532146L057910L434411l859915r598112o868847n99007J296700n60448
2925a6047822q374M534964Q705734Q830092N335147O29763k900775l480222j317078
2916D281429Q58055L73306k612004n646051o219836l189373K044586N363543L636635
2907a109710n36426r77287L631004O941081L260308m269168p389912l035652L514477
2898B8715N385936J465275l281350l618339J96629K900043J083383k241470k548803
$$ plain form
2889 -629981 -1727532 -3943920 -8365507 -9900402 -3922439 4838477 6567956 -960759
2881 -960759 -10052768 -13580877 -11681548 -7318874 -1993882 1893704 965033 -3164697 -3272333
2872 -3272333 3919221 12182043 14194735 11366816 10278384 12584263 13874988 10828463
2864 10828463 4819228 -722058 -3236934 -2508213 -1595574 -4239222 -9267807 -10911661
2856 -10911661 -7314790 -4367335 -7080001 -11803925 -12536671 -10599917 -10953274 -12290340
2848 -12290340 -9381007 -3764309 -2895582 -7751420 -9781317 -3014343 7541197 12975608
2840 12975608 10843575 5465199 2141817 3667379 8923116 12865487 11177485 6038169
2832 6038169 3534681 4910321 5391469 2613157 213028 842322 1582983 -364728 -2815740
$$ packed form
2889f29981j097551k216388m421587j534895N977963Q760916J729479p528715
2881i60759r092009l528109J899329M362674N324992L887586r28671m129730j07636
2872c272333P191554Q262822K012692k827919j088432K305879J290725l046525
2864A0828463o009235n541286k514876P28721R12639k643648n028585j643854
2856a0911661L596871K947455k712666m723924p32746J936754l53357j337066
2848a2290340K909333N616698Q68727m855838k029897O766974J0555540N434411
2840A2975608k132033n378376l323382J525562N255737L942371j688002n139316
2832F038169k503488J375640M81148k778312k400129O29294P40661j947711k451012
$$ plain form
2823 -2815740 -3289227 -3812958 -6974464 -11396748 -15047260 -18748561 -22298567 -21676307 -15071297
2814 -15071297 -7588829 -4585011 -4072352 -1467457 1796577 1078810 -2938884 -5839784
2806 -5839784 -7817533 -12870420 -20194220 -23762750 -21184550 -16491476 -13148023 -10437479
2798 -10437479 -8047198 -8090229 -10441624 -11433295 -9491674 -7306407 -6388927 -4517587 -1053152
2789 -1053152 352632 -2239223 -4838766 -3297273 292814 1097198 -1348439 -3632983
2781 -3632983 -4069512 -3895798 -4031321 -3841863 -2493563 535640 5181711 9541081 10852680
2772 10852680 9389518 8848902 10780328 11562508 7785810 1760355 -1870085 -2378629 -1753002
2763 -1753002 297027 5090087 10240090 11688037 10156696 10287061 12994846 14036954
$$ packed form
2823b815740m73487n23731l161506m422284l650512l701301l550006O22260O605010
2814a5071297P482468L003818N12659K604895L264034p17767m017694k900900
2806e839784j977749n052887p323800l568530K578200M693074L343453K710544
2798a0437479K390281m3031k351395r91671J941621K185267R17480J871340L464435
2789a053152J405784k591855k599543J541493L590087Q04384k445637k284544
2781c632983m36529J73714j35523J89458J348300L029203M646071M359370J311599
2772A0852680j463162n40616J931426P82180l776698o025455l630440n08544O25627
2763a753002K050029M793060N150003J447947j531341J30365K707785J042108
$$ plain form
2755 14036954 11443609 9172274 10960425 14837511 16519550 14601353 9551037 1257406
2747 1257406 -8672559 -15193535 -14896569 -11095855 -9625872 -10853346 -10402766 -7157089 -5254954
2738 -5254954 -7019523 -8760835 -6383021 -1701690 369181 -1015143 -1979751 -72299
2730 -72299 2106227 471649 -4874362 -8703265 -5437414 4955145 15880399 19906917
2722 19906917 16026743 9894068 6439335 4661713 1616375 -1052548 1365098 9151967
2714 9151967 16334625 17345467 12366976 5035514 -1804978 -6313268 -6919698 -4188243
2706 -4188243 -1222948 251069 1973397 4781648 5072000 -322287 -7838770 -10801578
2698 -10801578 -8499159 -6379878 -6977898 -6237094 -671583 6886021 11777442 13777438
$$ packed form
2755A4036954k593345k271335J788151L877086J682039j918197n050316q293631
2747A257406r929965o520976K96966L800714J469983j227474M50580L245677J902135
2738e254954j764569j741312K377814M681331K070871j384324r64608J907452
2730g2299K178526j634578n346011l828903L265851J0392559J0925254M026518
2722A9906917l880174o132675l454733j777622l045338k668923K417646P786869
2714I151967P182658J010842m978491p331462o840492m508290o06430K731455
2706d188243K965295J474017J722328K808251K90352n394287p516483k962808
2698a0801578K302419K119281n98020P40804N565511P557604M891421J999996
$$ plain form
2690 13777438 15171368 15618666 13211676 9005973 6348929 6119805 5996957 4458794 2627100
2681 2627100 1770743 1407012 574743 -800857 -2438757 -4088433 -4675188 -2349009 3378343
2672 3378343 9810365 12472877 9266157 3192526 -342234 129599 -30491 -5405425 -13719118
2663 -13719118 -18757345 -19343190 -20236075 -22897156 -21287187 -10833107 3165804 11666239
2655 11666239 13232163 13008668 12529170 8181201 163532 -4611719 -1603242 4805913
2647 4805913 7305547 4120078 -1712331 -7537504 -11635290 -11840712 -8199683 -4948542
2639 -4948542 -5386815 -6311731 -2412686 4530559 6439074 148084 -7294517 -7652397 -2195063
2630 -2195063 794595 -2692538 -8229461 -10089447 -8206912 -6318232 -6603864 -8987647
$$ packed form
2690A3777438J393930M47298k406990m205703k657044k29124j22848j538163j831694
2681B627100q56357l63731q32269j375600j637900j649676n86755K326179N727352
2672C378343O432022K662512l206720o073631l534760M71833j60090n374934q313693
2663a3719118n038227n85845q92885k661081J609969J0454080J3998911Q500435
2655A1666239J565924k23495m79498m347969q017669m775251L008477O409155
2647D805913K499634l185469n832409n825173m097786k05422L641029L251141
2639d948542m38273r24916L899045O943245J908515o290990p442601l57880N457334
2630b195063K989658l487133n536923j859986J882535J888680k85632k383783
$$ plain form
2622 -8987647 -13223637 -17871525 -18580126 -12049679 -2084027 2835983 -192128 -4530826
2614 -4530826 -2787733 3926743 8710795 7705264 2280086 -4972212 -11678740 -14781924
2606 -14781924 -13129055 -10070164 -8831938 -6501627 1775454 13300696 19265230 16543757
2598 16543757 11305051 9000991 7772544 5097665 3971125 7108249 10516436 9060768
2590 9060768 4435542 1420810 -392739 -4391817 -8867437 -8502185 -3427517 -240367
2582 -240367 -3317296 -10283386 -16570612 -19663301 -18478651 -13570121 -8965351 -9231221 -13296519
2573 -13296519 -14969015 -10704130 -3444960 1755471 2080965 -3400528 -13661995 -23844665
2565 -23844665 -27840925 -24754709 -19303324 -14646448 -9285883 -2911225 -189923 -4945592
$$ packed form
2622h987647m235990m647888p08601O530447R965652M920010l028111m338698
2614d530826J743093O714476M784052j005531n425178p252298o706528l103184
2606a4781924J652869L058891J238226K330311Q277081J1525242N964534k721473
2598A6543757n238706k304060j228447k674879j126540L137124L408187j455668
2590I060768m625226l014732j813549l999078m475620L65252N074668L187150
2582b40367l076929o966090o287226l092689J184650M908530M604770k65870m065298
2573a3296519j672496M264885P259170N200431L25494n481493j0261467j0182670
2565b3844665l996260L086216N451385M656876N360565O374658K721302m755669
$$ plain form
2557 -4945592 -14036275 -20801015 -22189504 -19508927 -14876530 -10447749 -8944076 -11151727
2549 -11151727 -13956457 -13665651 -10228949 -6122604 -2871374 -1018105 -1459464 -3867782
2541 -3867782 -5375648 -3746094 -660569 562804 -954011 -4090561 -8106362 -11733694
2533 -11733694 -12214897 -8998638 -6645477 -9847029 -16549294 -20175192 -18089404 -13691330
2525 -13691330 -10348214 -7663059 -4452654 -1547571 -318237 -1060648 -3384735 -5787050
2517 -5787050 -5275107 -737351 3823606 3668806 795874 1725663 6828938 8063304 674215
2508 674215 -8334582 -8749205 -730202 6037855 5213145 -41910 -3939168 -5614604 -7436129
2499 -7436129 -9373043 -8611099 -4058884 1275425 3293953 1422647 -819069 -127505 2782771
$$ packed form
2557d945592r090683o764740j388489K680577M632397M428781J503673k207651
2549a1151727k804730K90806L436702M106345L251230J853269m41359k408318
2541c867782j507866J629554L085525J223373j516815l136550m015801l627332
2533a1733694m81203L216259K353161l201552o702265l625898K085788M398074
2525a3691330L343116K685155L210405K905083J229334p42411k324087k402315
2517e787050N11943M537756M560957j54800k872932R29789N103275J234366p389089
2508F74215r008797m14623Q019003O768057q24710n255055l897258j675436j821525
2499g436129j936914P61944M552215N334309K018528j871306k241716O91564K910276
$$ plain form
2490 2782771 4910203 5457926 6011212 6379215 3943062 -1162186 -3776144 -25846 6456038
2481 6456038 8743685 5783188 2923638 3711564 6089571 7640304 9357649 11347302
2473 11347302 9270629 -194991 -12770253 -20570437 -22038472 -23020960 -27282603 -30619276
2465 -30619276 -26823614 -16262351 -5480064 -65589 -504447 -3620715 -5376047 -3244199
2457 -3244199 1344036 3393204 -229874 -6304559 -9012047 -7450496 -5566794 -4806629
2449 -4806629 -2059193 3357348 6223961 3087794 -973224 920445 6597033 7614785
2441 7614785 2435362 -482734 5003172 13593443 16124933 11988465 8390645 9105439
2433 9105439 9824772 5550266 -2112637 -7976590 -11001721 -15001774 -21478363 -25472940
$$ packed form
2490B782771K127432N47723N53286L68003k436153n105248k613958L750298O481884
2481F456038K287647k960497k859550P87926K378007J550733J717345J989653
2473A1347302k076673r465620j2575262p800184j468035r82488m261643l336673
2465c0619276L795662J0561263J0782287N414475m38858l116268j755332K131848
2457c244199M588235K049168l623078o074685k707488J561551J883702P60165
2449d806629K747436N416541K866613l136167m061018J893669N676588J017752
2441G614785n179423k918096N485906Q590271K531490m136468l597820P14794
2433I105439P19333m274506p662903n863953l025131m000053o476589l994577
$$ plain form
2425 -25472940 -21476239 -11805032 -5020354 -5526064 -8943064 -9915353 -10009051 -13273720 -17395067
2416 -17395067 -16107211 -9606287 -5362313 -7223204 -10485042 -10551422 -9897337 -11876241 -13381789
2407 -13381789 -9987206 -4415714 -2846122 -4982382 -4920506 -1130817 1481197 143252
2399 143252 -1789749 -1404972 -910827 -2549057 -3581342 -557119 4380072 5689704 1628920
2390 1628920 -4167202 -7819927 -9153348 -10220028 -11797010 -12343440 -10052142 -5264300
2382 -5264300 -163687 3854054 6942085 8157830 4586963 -4070323 -11893137 -11990456 -5181930
2373 -5181930 686383 649683 -2203006 -2488150 777990 5109007 8172570 7950088 2845754
$$ packed form
2425b5472940L996701R671207O784678n05710l417000r72289r3698l264669m121347
2416a7395067J287856O500924M243974j860891l261838o6380O54085j978904j505548
2407a3381789L394583N571492J569592k136260O1876L789689K612014j337945
2399A43252j933001L84777M94145j638230j032285L024223M937191J309632m060784
2390A628920n796122l652725j333421j066680j576982n46430K291298M787842
2382e264300N100613M017741L088031J215745l570867q657286p822814r7319O808526
2373e181930N868313l6700k852689k85144L266140M331017L063563k22482n104334
$$ [...]
##END NTUPLES=NMR SPECTRUM
##END=
