##TITLE=31Pdec_LR-780-R3-B2-3
 
 64 sc
 13.2.2024
##JCAMPDX= 6.0         $$ Bruker NMR JCAMP-DX V2.0
##DATA TYPE= NMR SPECTRUM
##DATA CLASS= NTUPLES
##ORIGIN= UXNMR, Bruker Analytische Messtechnik GmbH
##OWNER= root
$$ XWIN-NMR		Version 3.5
$$ Tue Feb 13 16:02:37 2024 Russian Standard Time (UT+4h)  she@DPX200
##.OBSERVE FREQUENCY= 81.013821
##.OBSERVE NUCLEUS= ^31P
##.ACQUISITION MODE= SIMULTANEOUS
##.ACQUISITION SCHEME= undefined
##.AVERAGES= 64
##.DIGITISER RES= 16
##SPECTROMETER/DATA SYSTEM= spect
##.PULSE SEQUENCE= zgpg30
##.SOLVENT NAME= CDCl3
##.SHIFT REFERENCE= (INTERNAL, CDCl3, 0, 248.564)
##AUDIT TRAIL= $$ (NUMBER, WHEN, WHO, WHERE, WHAT)
$$ ##TITLE= Audit trail, XWIN-NMR		Version 3.5
$$ ##JCAMPDX= 5.01
$$ ##ORIGIN= Bruker BioSpin GmbH
$$ ##OWNER= she
$$ F:/spectra/data/she/nmr/P31/1/pdata/1/auditp.txt
$$ ##AUDIT TRAIL=  $$ (NUMBER, WHEN, WHO, WHERE, WHAT)
(   1,<2024-02-13 16:01:27.25 +0400>,<she>,<DPX200>,
      <continue with go, POWCHK disabled, PULCHK disabled
       configuration hash MD5:
       00 E9 B6 7A A2 85 ED C7 34 08 36 98 17 FE 4E 26
       data hash MD5: 32K
       1D 0D 06 3C 44 73 F3 BC BC 18 B6 35 9A 49 71 4C>)
(   2,<2024-02-13 16:01:29.89 +0400>,<she>,<DPX200>,
      <Start of raw data processing
       efp BC_mod = 2 LB = 10 FT_mod = 6 PKNL = 1 PHC0 = -12911.51 PHC1 = 111.6835 SI = 64K 
       data hash MD5: 64K
       C2 F9 9C BC B1 DD 90 44 74 73 8B E6 31 37 7C 43>)
(   3,<2024-02-13 16:01:55.15 +0400>,<she>,<DPX200>,
      <pk PHC0 = -57.08955 PHC1 = 137.8 
       data hash MD5: 64K
       D3 21 0F 6D 93 75 F9 8C 70 27 4F 27 1D 44 63 F1>)
(   4,<2024-02-13 16:02:00.12 +0400>,<she>,<DPX200>,
      <abs ABSG = 5 
       data hash MD5: 64K
       38 29 2E 92 62 7E 06 34 9F 8D 57 6D EF FB 56 9A>)
$$ ##END=
$$ 
$$ hash MD5
$$ DF D9 21 A9 2F DE 3E 41 73 FF 52 25 67 79 F1 7C
##$RELAX= 
##$RELAX= 
##$RELAX= 
##$RELAX= 
##$RELAX= 
##$RELAX= 
##$RELAX= 
##$RELAX= 
##$RELAX= 
$$ Bruker specific parameters
$$ --------------------------
##$DU= <F:/spectra>
##$EXPNO= 1
##$NAME= <P31>
##$PROCNO= 1
##$TYPE= <nmr>
##$USER= <she>
##$AMP= (0..31)
100 100 100 100 100 100 100 100 100 100 100 100 100 100 100 100 100 100 
100 100 100 100 100 100 100 100 100 100 100 100 100 100 
##$AQSEQ= 0
##$AQ_mod= 1
##$AUNM= <au_zg>
##$AUTOPOS= <>
##$BF1= 81.014009
##$BF2= 200.13
##$BF3= 200.13
##$BF4= 200.13
##$BF5= 200.13
##$BF6= 200.13
##$BF7= 200.13
##$BF8= 200.13
##$BYTORDA= 1
##$CFDGTYP= 0
##$CFRGTYP= 5
##$CHEMSTR= <none>
##$CNST= (0..31)
1 1 145 1 1 1 1 1 1 1 1 1 1 1 1 1 1 1 1 1 1 1 1 1 1 1 1 1 1 1 1 1 
##$CPDPRG= <waltz16>
##$CPDPRG1= <>
##$CPDPRG2= <waltz16>
##$CPDPRG3= <>
##$CPDPRG4= <mlev>
##$CPDPRG5= <mlev>
##$CPDPRG6= <mlev>
##$CPDPRG7= <mlev>
##$CPDPRG8= <mlev>
##$CPDPRGB= <>
##$CPDPRGT= <>
##$D= (0..31)
0 1 0 0 0 0 0 0 0 0 0 0.03 2e-05 3e-06 0 0 0 0 0 0 0 0 0 0 0 0 0 0 0 0 
0 0 
##$DATE= 1707825577
##$DBL= (0..7)
120 120 120 11 120 120 24 19 
##$DBP= (0..7)
150 150 150 150 150 150 150 150 
##$DBP07= 0
##$DBPNAM0= <>
##$DBPNAM1= <>
$$ [...]
##$SUBNAM3= <"">
##$SUBNAM4= <"">
##$SUBNAM5= <"">
##$SUBNAM6= <"">
##$SUBNAM7= <"">
##$SUBNAM8= <"">
##$SUBNAM9= <"">
##$SW= 501.771253377433
##$SWIBOX= (0..15)
0 1 3 0 0 0 0 0 0 0 0 0 0 0 0 0 
##$SW_h= 40650.406504065
##$TD= 32768
##$TD0= 1
##$TE= 0
##$TE2= 300
##$TE3= 300
##$TEG= 300
##$TL= (0..7)
0 120 53 12 22 120 120 120 
##$TP= (0..7)
150 150 150 150 150 150 150 150 
##$TP07= 0
##$TPNAME0= <>
##$TPNAME1= <>
##$TPNAME2= <>
##$TPNAME3= <>
##$TPNAME4= <>
##$TPNAME5= <>
##$TPNAME6= <>
##$TPNAME7= <>
##$TPOAL= (0..7)
0.5 0.5 0.5 0.5 0.5 0.5 0.5 0.5 
##$TPOFFS= (0..7)
0 0 0 0 0 0 0 0 
##$TUNHIN= 0
##$TUNHOUT= 0
##$TUNXOUT= 0
##$USERA1= <user>
##$USERA2= <user>
##$USERA3= <user>
##$USERA4= <user>
##$USERA5= <user>
##$V9= 5
##$VALIST= <valist>
##$VCLIST= <CCCCCCCCCCCCCCC>
##$VD= 0
##$VDLIST= <DDDDDDDDDDDDDDD>
##$VPLIST= <PPPPPPPPPPPPPPP>
##$VTLIST= <TTTTTTTTTTTTTTT>
##$WBST= 1024
##$WBSW= 4
##$XGAIN= (0..3)
0 0 0 0 
##$XL= 0
##$YL= 0
##$YMAX_a= 6866
##$YMIN_a= -2372
##$ZGOPTNS= <>
##$ZL1= 120
##$ZL2= 120
##$ZL3= 120
##$ZL4= 120
##$ABSF1= 248.5645
##$ABSF2= -253.2056
##$ABSG= 5
##$ABSL= 3
##$ALPHA= 0
##$AQORDER= 0
##$ASSFAC= 0
##$ASSFACI= 0
##$ASSFACX= 0
##$ASSWID= 0
##$AUNMP= <proc_1d>
##$AZFE= 0.1
##$AZFW= 0.5
##$BCFW= 0
##$BC_mod= 2
##$BYTORDP= 0
##$COROFFS= 0
##$CY= -3
##$DATMOD= 1
##$DC= 0
##$DFILT= <>
##$DTYPP= 0
##$F1P= 0
##$F2P= 0
##$FCOR= 1
##$FTSIZE= 65536
##$FT_mod= 6
##$GAMMA= 0
##$GB= 0
##$INTBC= 1
##$INTSCL= 6.047779e-11
##$ISEN= 30
##$LB= 10
##$LEV0= 0
##$LPBIN= 0
##$MAXI= 10000
##$MC2= 0
##$MEAN= 0
##$ME_mod= 0
##$MI= 50
##$NCOEF= 0
##$NC_proc= -10
##$NLEV= 6
##$NOISF1= 182.463
##$NOISF2= 159.3651
##$NSP= 0
##$NTH_PI= 0
##$NZP= 0
##$OFFSET= 248.5645
##$PC= 4
##$PHC0= -12968.6
##$PHC1= 249.4835
##$PH_mod= 1
##$PKNL= yes
##$PPARMOD= 0
##$PSCAL= 0
##$PSIGN= 0
##$REVERSE= no
##$SF= 81.0140089999694
##$SI= 65536
##$SIGF1= 159.3651
##$SIGF2= -187.1042
##$SINO= 113.3802
##$SIOLD= 16384
##$SREGLST= <1H.CDCl3>
##$SSB= 0
##$STSI= 65536
##$STSR= 0
##$SW_p= 40650.406504065
##$SYMM= 0
##$S_DEV= 0
##$TDeff= 32768
##$TDoff= 0
##$TI= <>
##$TILT= no
##$TM1= 0
##$TM2= 0
##$TOPLEV= 0
##$USERP1= <user>
##$USERP2= <user>
##$USERP3= <user>
##$USERP4= <user>
##$USERP5= <user>
##$WDW= 1
##$XDIM= 65536
##$YMAX_p= 531156089
##$YMIN_p= -204797089
$$ End of Bruker specific parameters
$$ ---------------------------------
##NTUPLES= NMR SPECTRUM
##VAR_NAME=  FREQUENCY,     SPECTRUM/REAL,   SPECTRUM/IMAG
##SYMBOL=    X,             R,               I
##VAR_TYPE=  INDEPENDENT,   DEPENDENT,       DEPENDENT
##VAR_FORM=  AFFN,          ASDF,            ASDF
##VAR_DIM=   65536,         65536,           65536
##UNITS=     HZ,            ARBITRARY UNITS, ARBITRARY UNITS
##FACTOR=    0.620285442955139, 1,           1
##FIRST=     20137.2065510682, 0,            0
##LAST=      -20513.1999529968, 0,           0
##MIN=       -20513.1999529968, -204797089,  0
##MAX=       20137.2065510682, 531156089,    0
$$ Real data points
##PAGE= N=1
##DATA TABLE= (X++(R..R)), XYDATA
$$ [...]
$$ plain form
13057 -580111 494190 1655026 2815583 3857964 4657426 5109063 5149261 4764460 3984317
13048 3984317 2864032 1464933 -159994 -1973873 -3957450 -6104772 -8413888 -10874673
13040 -10874673 -13456493 -16098416 -18705796 -21157721 -23327301 -25110276 -26451193 -27355143
13032 -27355143 -27878960 -28105853 -28116234 -27969118 -27701594 -27342572 -26929114 -26514255 -26162955
13023 -26162955 -25940710 -25901930 -26081796 -26490701 -27108374 -27877308 -28700205 -29448915 -29987934
13014 -29987934 -30204585 -30030227 -29442004 -28449779 -27082918 -25386762 -23425740 -21283676 -19056394
13005 -19056394 -16839436 -14717132 -12757374 -11011677 -9515612 -8284857 -7308323 -6545635
12997 -6545635 -5933128 -5393837 -4845055 -4205038 -3405508 -2409409 -1223429 102790 1486705
$$ packed form
13057e80111J074301J160836J160557J042381P99462M51637M0198l84801p80143
13048C984317j120285j399099j624927j813879j983577k147322k309116k460785
13040a0874673k581820k641923k607380k451925k169580j782975j340917r03950
13032b7355143n23817k26893j0381J47116K67524L59022M13458M14859L51300
13023b6162955K22245L8780j79866m08905o17673p68934q22897p48710n39019
13014b9987934k16651J74358N88223R92225J366861J696156J961022K142064K227282
13005a9056394K216958K122304J959758J745697J496065J230755R76534P62688
12997f545635O12507N39291N48782O40017P99530R96099J185980J326219J383915
$$ plain form
12988 1486705 2822802 3991139 4871972 5370315 5441874 5105142 4430920 3514600 2446882
12979 2446882 1298037 120999 -1032783 -2096703 -2982505 -3589432 -3826078 -3633449 -2996227
12970 -2996227 -1939059 -517635 1184309 3053485 4952831 6740905 8296478 9533913
12962 9533913 10403853 10886425 10988196 10747905 10245737 9603927 8968486 8474000 8207499
12953 8207499 8190550 8387044 8728414 9141275 9566580 9966976 10324583 10634633 10900512 11131873
12943 11131873 11342497 11544757 11743135 11933021 12107944 12271937 12450576 12695068 13075218
12934 13075218 13659705 14488476 15549577 16773661 18050688 19261919 20314300 21164897
12926 21164897 21826409 22350595 22796290 23198423 23555296 23840086 24026982 24114521 24132847 24132159
$$ packed form
12988A486705J336097J168337Q80833M98343P1559l36732o74222r16320j067718
12979B446882j148845j177038j153782j063920q85802o06927k36646J92629O37222
12970b996227J057168J421424J701944J869176J899346J788074J555573J237435
12962I533913Q69940M82572J01771k40291n02168o41810o35441m94486k66501
12953H207499j6949J96494L41370M12861M25305M00396L57607L10050K65879K31361
12943A1131873K10624K02260J98378J89886J74923J63993J78639K44492L80150
12934A3075218N84487Q28771J061101J224084J277027J211231J052381Q50597
12926B1164897O61512N24186M45695M02133L56873K84790J86896Q7539J8326o88
$$ plain form
12916 24132159 24158856 24230303 24319286 24355806 24246648 23904274 23271455 22331517 21103516 19629083
12906 19629083 17957944 16135916 14198574 12174797 10100823 8036786 6072083 4310737
12898 4310737 2840483 1700314 863554 246056 -264253 -772078 -1350715 -2035574 -2828434
12889 -2828434 -3702524 -4605919 -5467629 -6209011 -6757142 -7055150 -7067433 -6779447 -6191030 -5304459
12879 -5304459 -4114540 -2610242 -789166 1325932 3681433 6199630 8788447 11346394
12871 11346394 13766906 15951463 17831447 19385267 20636000 21628525 22401061 22969675
12863 22969675 23333323 23491171 23456378 23256675 22925220 22492374 21984474 21426897 20846148
12854 20846148 20269977 19727659 19250965 18874502 18634943 18568832 18706512 19060331 19611585
$$ packed form
12916B4132159K6697P1447Q8983L6520j09158l42374o32819r39938j228001j474433
12906A9629083j671139j822028j937342k023777k073974k064037j964703j761346
12898D310737j470254j140169q36760o17498n10309n07825n78637o84859p92860
12889b828434q74090r03395q61710p41382n48131k98008j2283K87986N88417Q86571
12879e304459J189919J504298J821076K115098K355501K518197K588817K557947
12871A1346394K420512K184557J879984J553820J250733R92525P72536N68614
12863B2969675L63648J57848l4793j99703l31455m32846n07900n57577n80749
12854B0846148n76171n42318m76694l76463k39559o6111J37680L53819N51254
$$ plain form
12845 19611585 20305474 21058943 21776941 22369301 22764815 22922133 22834555 22524876 22032598
12836 22032598 21402921 20685200 19938971 19238734 18670006 18315558 18236174 18453309 18941517
12827 18941517 19635725 20451450 21308415 22145408 22920089 23598208 24143829 24519231 24693235
12818 24693235 24649301 24385940 23908782 23219192 22306372 21149367 19731718 18063656 16199163
12809 16199163 14235703 12294367 10489815 8903863 7572538 6488348 5611906 4883431
12801 4883431 4227617 3554146 2764065 1771411 538046 -894657 -2399697 -3795993 -4907659
12792 -4907659 -5621952 -5917247 -5852289 -5530495 -5060944 -4530568 -3992792 -3473107 -2987838 -2565276
12782 -2565276 -2255158 -2120050 -2215345 -2571122 -3184423 -4022016 -5029140 -6140034 -7287735
$$ packed form
12845A9611585O93889P53469P17998N92360L95514J57318q7578l09679m92278
12836B2032598o29677p17721p46229p00237n68728l54448p9384K17135M88208
12827A8941517O94208Q15725Q56965Q36993P74681O78119N45621L75402J74004
12818B4693235m3934k63361m77158o89590r12820j157005j417649j668062j864493
12809A6199163j963460j941336j804552j585952j331325j084190q76442p28475
12801D883431o55814o73471p90081r92654j233365j432703j505040j396296j111666
12792d907659p14293k95295O4958L21794M69551N30376N37776N19685M85269M22562
12782b565276L10118J35108r5295l55777o13301q37593j007124j110894j147701
$$ plain form
12773 -7287735 -8412646 -9471315 -10446503 -11355698 -12250981 -13204180 -14278340 -15494948 -16810396
12764 -16810396 -18112911 -19243338 -20032547 -20340332 -20081243 -19231906 -17824716 -15936491 -13677125
12755 -13677125 -11178735 -8584865 -6041261 -3690705 -1671949 -117486 858615 1187096
12747 1187096 875385 25329 -1179050 -2511462 -3752443 -4728392 -5332221 -5525979 -5327886
12738 -5327886 -4787992 -3962103 -2896078 -1626562 -193950 1342152 2893699 4346295
12730 4346295 5573828 6461660 6929497 6945295 6527956 5743119 4696022 3519922 2356196
12721 2356196 1328338 520390 -29268 -318061 -363355 -192221 159031 638924 1174929
12712 1174929 1674485 2037980 2182486 2066115 1699944 1141737 475827 -212445 -860617
$$ packed form
12773g287735j124911j058669r75188r09195q95283r53199j074160j216608j315448
12764a6810396j302515j130427p89209l07785K59089Q49337J407190J888225K259366
12755a3677125K498390K593870K543604K350556K018756J554463R76101L28481
12747A187096l11711q50056j204379j332412j240981r75949o03829j93758J98093
12738e327886N39894Q25889J066025J269516J432612J536102J551547J452596
12730D346295J227533Q87832M67837J5798m17339p84837j047097j176100j163726
12721B356196j027858q07948n49658k88793m5294J71134L51252M79893N36005
12712A174929M99556L63495J44506j16371l66171n58207o65910o88272o48172
$$ plain form
12703 -860617 -1444319 -1976599 -2489783 -3009043 -3532282 -4025102 -4428860 -4674257 -4694649 -4437649
12693 -4437649 -3875901 -3017103 -1910450 -644803 663810 1892200 2930978 3701051 4162521
12684 4162521 4313751 4180631 3801623 3217634 2470759 1606384 669998 -303080 -1298055
12675 -1298055 -2322262 -3394580 -4526523 -5704717 -6885679 -8007462 -9010297 -9850792
12667 -9850792 -10500692 -10937181 -11139933 -11100846 -10835288 -10377915 -9759181 -8977594 -7989231 -6723956
12657 -6723956 -5118967 -3150537 -849724 1699795 4374906 7029264 9508134 11660821
12649 11660821 13352183 14475806 14970061 14833153 14128353 12971819 11503991 9854592
12641 9854592 8113788 6317847 4452600 2474390 343786 -1939219 -4313767 -6661145
$$ packed form
12703h60617n83702n32280n13184n19260n23239m92820m03758k45397k0392K57000
12693d437649N61748Q58798J106653J265647J308613J228390J038778P70073M61470
12684D162521J51230j33120l79008n83989p46875q64375r36386r73078r94975
12675a298055j024207j072318j131943j178194j180962j121783j002835q40495
12667i850792o49900m36489k02752L9087K65558M57373O18734P81587R88363J265275
12657f723956J604989J968430K300813K549519K675111K654358K478870K152687
12649A1660821J691362J123623M94255j36908p04800j156534j467828j649399
12641I854592j740804j795941j865247j978210k130604k283005k374548k347378
$$ plain form
12633 -6661145 -8830560 -10674316 -12076336 -12965106 -13312485 -13125844 -12440430 -11315349 -9833735
12624 -9833735 -8105726 -6270134 -4488513 -2926923 -1726839 -973467 -673295 -751302 -1071848
12615 -1071848 -1476682 -1823501 -2007450 -1959284 -1630071 -979686 20816 1376666 3058023
12606 3058023 4997836 7099142 9248195 11330929 13250464 14940494 16368485 17528287
12598 17528287 18428939 19086328 19517832 19737343 19753173 19574720 19226278 18755048 18220802
12589 18220802 17669566 17108998 16503987 15797555 14946106 13950150 12865119 11787697 10824368
12580 10824368 10055093 9505704 9140041 8876559 8623425 8315608 7935600 7509408 7084034
12571 7084034 6701670 6384841 6137977 5960016 5856691 5843989 5942993 6172093 6541438 7050719
$$ packed form
12633f661145k169415j843756j402020q88770l47379J86641O85414J125081J481614
12624i833735J728009J835592J781621J561590J200084P53372L00172p8007l20546
12615a071848m04834l46819j83949M8166L29213O50385J000502J355850J681357
12606C058023J939813K101306K149053K082734J919535J690030J427991J159802
12598A7528287R00652O57389M31504K19511J5830j78453l48442m71230n34246
12589A8220802n51236n60568o05011p06432q51449r95956j085031j077422r63329
12580A0824368p69275n49389l65663k63482k53134l07817l80008m26192m25374
12571G084034l82364l16829k46864j77961j03325j2702R9004K29100L69345N09281
$$ plain form
12561 7050719 7689913 8442185 9285891 10191350 11111776 11974143 12678309 13108973 13158567 12753445
12551 12753445 11872636 10550788 8865462 6918169 4820043 2686090 634244 -1216478
12543 -1216478 -2752101 -3874879 -4518174 -4660822 -4334978 -3622719 -2640631 -1515719 -359563
12534 -359563 750154 1772815 2691119 3488031 4128100 4555371 4710716 4559297 4111435
12525 4111435 3422839 2571735 1623795 603218 -514179 -1781594 -3245833 -4914795 -6742677
12516 -6742677 -8634990 -10465529 -12097298 -13404416 -14292967 -14714836 -14667757 -14181851 -13302345
12507 -13302345 -12079883 -10571385 -8844001 -6972889 -5031748 -3083865 -1181383 627660
12499 627660 2291565 3752915 4954597 5853728 6441019 6757671 6897174 6983377 7129552
$$ packed form
12561G050719O39194P52272Q43706R05459R20426Q62367P04166M30664M9594m05122
12551A2753445q80809j321848j685326j947293k098126k133953k051846j850722
12543a216478j535623j122778o43295j42648L25844P12259R82088J124912J156156
12534c59563J109717J022661R18304P96912O40069M27271J55345j51419m47862
12525D111435o88596q51104r47940j020577j117397j267415j464239j668962j827882
12516f742677j892313j830539j631769j307118q88551m21869M7079M85906Q79506
12507a3302345J222462J508498J727384J871112J941141J947883J902482J809043
12499F27660J663905J461350J201682Q99131N87291L16652J39503Q6203J46175
$$ plain form
12490 7129552 7396139 7767494 8158424 8446071 8510714 8267769 7683325 6777310 5620150
12481 5620150 4321470 3005835 1779440 702856 -216344 -1010725 -1730597 -2422562 -3114055
12472 -3114055 -3806689 -4480556 -5106977 -5661248 -6127261 -6493724 -6748859 -6879878 -6877095 -6737158
12462 -6737158 -6460776 -6046075 -5484231 -4763555 -3881436 -2856318 -1731200 -566823 569116
12453 569116 1608037 2478855 3104999 3410669 3341083 2888915 2111606 1128709 100098
12444 100098 -805928 -1444693 -1719476 -1592156 -1078261 -231209 875283 2160688 3547665
12435 3547665 4971836 6391187 7790033 9172020 10542148 11885981 13158112 14286665
12427 14286665 15189819 15794043 16046622 15921634 15421107 14572546 13424775 12045486 10521152
$$ packed form
12490G129552K66587L71355L90930K87647O4643k42945n84444r06015j157160
12481E620150j298680j315635j226395j076584r19200p94381p19872o91965o91493
12472c114055o92634o73867o26421n54271m66013l66463k55135j31019K783J39937
12462f737158K76382M14701N61844P20676Q82119J025118J125118J164377J135939
12453E69116J038921Q70818O26144L05670o9586m52168p77309r82897j028611
12444A00098r06026o38765k74783J27320N13895Q47052J106492J285405J386977
12435C547665J424171J419351J398846J381987J370128J343833J272131J128553
12427A4286665R03154O04224K52579j24988n00527q48561j147771j379289j524334
$$ plain form
12418 10521152 8954722 7455747 6123576 5030437 4211904 3668347 3376630 3306909 3436485
12409 3436485 3754422 4257477 4943436 5805858 6827743 7970013 9157355 10272097 11167097
12400 11167097 11699572 11775362 11385625 10618922 9640291 8642242 7786142 7159114 6764650
12391 6764650 6546589 6428538 6346941 6265558 6171086 6056351 5900704 5658777 5265329 4653958
12381 4653958 3778408 2626149 1222624 -369685 -2055455 -3716474 -5228744 -6482395
12373 -6482395 -7397065 -7928546 -8068658 -7843101 -7309542 -6554239 -5684191 -4813691 -4046701
12364 -4046701 -3458600 -3083105 -2910573 -2899588 -2996046 -3149706 -3321589 -3482891 -3611086 -3689012
12354 -3689012 -3709411 -3682242 -3638335 -3624587 -3692562 -3886756 -4236234 -4749097 -5409973 -6184094
$$ packed form
12418A0521152j566430j498975j332171j093139q18533n43557k91717o9721J29576
12409C436485L17937N03055O85959Q62422J021885J142270J187342J114742Q95000
12400A1167097N32475P5790l89737p66703r78631r98049q56100o27028l94464
12391F764650k18061j18051q1597q1383r4472j14735j55647k41927l93448o11371
12381D653958q75550j152259j403525j592309j685770j661019j512270j253651
12373f482395r14670n31481j40112K25557N33559P55303Q70048Q70500P66990
12364d046701N88101L75495J72532J0985r6458j53660j71883j61302j28195p7926
12354c689012k0399K7169M3907J3748o7975j94194l49478n12863o60876p74121
$$ plain form
12344 -6184094 -7028614 -7904161 -8777563 -9615197 -10375498 -11008599 -11463066 -11694547 -11672762 -11386264
12334 -11386264 -10844011 -10071515 -9101877 -7968093 -6705334 -5365189 -4031975 -2826077
12326 -2826077 -1886668 -1339456 -1262768 -1664606 -2478916 -3583461 -4832972 -6093336 -7263527
12317 -7263527 -8281853 -9121530 -9780968 -10272007 -10610510 -10813697 -10902477 -10901479 -10833993 -10718221
12307 -10718221 -10570872 -10413272 -10269135 -10151934 -10053319 -9945943 -9802187 -9616611 -9416014
12298 -9416014 -9248481 -9156090 -9146688 -9181599 -9186821 -9081283 -8806506 -8342833 -7707154 -6938425
12288 -6938425 -6082453 -5183894 -4286286 -3436580 -2689900 -2109651 -1758320 -1679398 -1879162 -2319632
12278 -2319632 -2926078 -3602006 -4242737 -4746016 -5024503 -5023368 -4738883 -4228528 -3604613 -3011174
$$ packed form
12344f184094q44520q75547q73402q37634p60301o33101m54467k31481K1785K86498
12334a1386264N42253P72496R69638J133784J262759J340145J333214J205898
12326b826077R39409N47212P6688m01838q14310j104545j249511j260364j170191
12317g263527j018326q39677o59438m91039l38503k03187q8780R98O7486J15772
12307a0718221J47349J57600J44137J17201R8615J07376J43756J85576K00597
12298i416014J67533R2391R402l4911n222J05538K74777M63673O35679P68729
12288f938425Q55972Q98559Q97608Q49706P46680N80249L51331P8922j99764m40470
12278b319632o06446o75928o40731n03279k78487J135K84485N10355O23915N93439
$$ plain form
12268 -3011174 -2592141 -2460844 -2676431 -3228367 -4031537 -4937451 -5763694 -6334248 -6516490
12259 -6516490 -6242665 -5511426 -4372992 -2906997 -1203694 644996 2547057 4413241
12251 4413241 6167354 7761175 9184990 10466447 11657985 12819945 14007446 15264150
12243 15264150 16620280 18091023 19674677 21351981 23086723 24826816 26507517 28060564
12235 28060564 29428928 30579525 31504475 32209178 32695634 32952575 32957708 32687381 32124125
12226 32124125 31257107 30080220 28596721 26832236 24846381 22730364 20587478 18505645
12218 18505645 16535249 14680938 12909890 11174328 9441390 7718271 6059357 4549302
12210 4549302 3269484 2266133 1537495 1043915 729169 536474 411264 295380 122983
$$ packed form
12268c011174M19033J31297k15587n51936q03170r05914q26243n70554j82242
12259f516490K73825P31239J138434J465995J703303J848690J902061J866184
12251D413241J754113J593821J423815J281457J191538J161960J187501J256704
12243A5264150J356130J470743J583654J677304J734742J740093J680701J553047
12235B8060564J368364J150597R24950P04703M86456K56941N133k70327n63256
12226C2124125q67018j176887j483499j764485j985855k116017k142886k081833
12218A8505645j970396j854311j771048j735562j732938j723119j658914j510055
12210D549302j279818j003351p28638m93580l14746j92695j25210j15884j72397
$$ plain form
12201 122983 -174313 -651654 -1328724 -2170227 -3080335 -3918412 -4533492 -4805177 -4675341 -4159966
12191 -4159966 -3340003 -2338089 -1290040 -317129 497363 1123038 1583429 1941888 2278389
12182 2278389 2667231 3162326 3790334 4549153 5410776 6329190 7251908 8130185 8922412
12173 8922412 9590337 10094331 10394795 10460228 10275415 9843733 9184016 8326173 7306447
12164 7306447 6159610 4908339 3556776 2096193 522547 -1144559 -2854094 -4531482
12156 -4531482 -6095506 -7473056 -8605341 -9447449 -9966767 -10143506 -9973262 -9470854 -8674829
12147 -8674829 -7650565 -6488226 -5293218 -4170961 -3211172 -2476908 -2000362 -1783342 -1799165
12138 -1799165 -1995643 -2302704 -2646612 -2965879 -3220330 -3390654 -3474593 -3486217 -3455912 -3422949
$$ packed form
12201A22983k97296m77341o77070q41503r10108q38077o15080k71685J29836N15375
12191d159966Q19963J001914J048049R72911Q14492O25675M60391L58459L36501
12182B278389L88842M95095O28008P58819Q61623R18414R22718Q78277P92227
12173H922412O67925N03994L00464O5433j84813m31682o59717q57843j019726
12164G306447j146837j251271j351563j460583j573646j667106j709535j677388
12156d531482j564024j377550j132285q42108n19318j76739J70244N02408P96025
12147h674829J024264J162339J195008J122257R59789P34264M76546K17020j5823
12138a799165j96478l07061l43908l19267k54451j70324q3939j1624L0305L2963
$$ plain form
12128 -3422949 -3418760 -3450821 -3500959 -3542302 -3564398 -3588151 -3658535 -3818989 -4084867 -4433096 -4812413
12117 -4812413 -5164958 -5446188 -5635580 -5737636 -5776061 -5784144 -5793901 -5826855 -5890167 -5980720 -6094710
12106 -6094710 -6234423 -6404588 -6600010 -6794638 -6939532 -6967279 -6796712 -6338992 -5512557 -4268899
12096 -4268899 -2618456 -640823 1528159 3726485 5799958 7628269 9137424 10298631
12088 10298631 11116997 11614667 11813702 11724845 11347123 10678621 9732372 8548086 7192937
12079 7192937 5750906 4306454 2930740 1675450 572540 -365395 -1145740 -1792304 -2332400
12070 -2332400 -2777728 -3109924 -3279157 -3215332 -2845701 -2113987 -998773 470989 2206453
12061 2206453 4058363 5828693 7297371 8262322 8581658 8200921 7154409 5544170 3510891
$$ packed form
12128c422949M189l2061n0138m1343k2096k3753p0384j60454k65878l48229l79317
12117d812413l52545k81230j89392j02056l8425q083r757l2954o3312r0553j13990
12106f094710j39713j70165j95422j94628j44894k7747J70567M57720Q26435J243658
12096d268899J650443J977633K168982K198326K073473J828311J509155J161207
12088A0298631Q18366M97670J99035q8857l77722o68502r46249j184286j355149
12079G192937j442031j444452j375714j255290j102910r37935p80345o46564n40096
12070b332400m45328l32196j69233O3825L69631P31714J115214J469762J735464
12061B206453J851910J770330J468678R64951L19336l80737j046512j610239k033279
$$ plain form
12052 3510891 1209615 -1205373 -3589626 -5816449 -7785995 -9433208 -10729163 -11672152
12044 -11672152 -12271528 -12533290 -12455759 -12037072 -11289141 -10249494 -8983438 -7573617 -6101192
12035 -6101192 -4628527 -3192240 -1808206 -483291 773021 1942171 2998285 3917971
12027 3917971 4692139 5331261 5861296 6316689 6737388 7167630 7648393 8202587 8823101
12018 8823101 9473396 10098636 10637284 11027771 11213645 11151746 10821765 10231660 9415643 8425509
12008 8425509 7318494 6146389 4951894 3775754 2671189 1715454 1008814 658564 754465
11999 754465 1345929 2429073 3945396 5787851 7809262 9833200 11672660 13159856
11991 13159856 14180859 14700868 14767946 14493385 14017055 13469645 12942174 12470018 12034923
$$ packed form
12052C510891k301276k414988k384253k226823j969546j647213j295955r42989
12044a1672152n99376k61762P7531M18687P47931J039647J266056J409821J472425
12035f101192J472665J436287J384034J324915J256312J169150J056114R19686
12027C917971P74168O39122N30035M55393M20699M30242M80763N54194O20514
12018H823101O50295O25240N38648L90487J85874o1899l29981n90105q16017r90134
12008H425509j107015j172105j194495j176140j104565r55735p06640l50250R5901
11999G54465N91464J083144J516323J842455K021411K023938J839460J487196
11991A3159856J021003N20009O7078k74561m76330n47410n27471m72156m35095
$$ plain form
11982 12034923 11583507 11054742 10405082 9620956 8715328 7714471 6646482 5539594 4428693
11973 4428693 3361344 2395602 1588607 981118 585326 381611 325768 363189 443682 532325
11963 532325 615569 703679 828831 1036037 1365073 1826841 2384021 2948187 3399493 3622173
11953 3622173 3539450 3132578 2439202 1536044 514204 -545688 -1592424 -2612370 -3625000
11944 -3625000 -4667493 -5772391 -6943841 -8140016 -9270114 -10210008 -10832020 -11036668 -10773760
11935 -10773760 -10047634 -8911018 -7455849 -5804282 -4095743 -2465677 -1020143 182057
11927 182057 1130246 1845956 2358834 2685187 2818394 2736289 2422565 1890091 1191666 412290
11917 412290 -350592 -1007567 -1492376 -1772297 -1854422 -1783990 -1630497 -1464483 -1336255 -1268024
$$ packed form
11982A2034923m51416n28765o49660p84126r05628j000857j067989j106888j110901
11973D428693j067349r65742q06995o07489l95792k03715n5843L7421Q0493Q8643
11963E32325Q3244Q8110J25152K07206L29036M61768N57180N64166M51306K22680
11953C622173q2723m06872o93376r03158j021840j059892j046736j019946j012630
11944c625000j042493j104898j171450j196175j130098r39894o22012k04648K62908
11935a0773760P26126J136616J455169J651567J708539J630066J445534J202200
11927A82057R48189P15710N12878L26353J33207q2105l13724n32474o98425p79376
11917D12290p62882o56975m84809k79921q2125P0432J53493J66014J28228O8231
$$ plain form
11907 -1268024 -1261356 -1310893 -1413226 -1567558 -1773895 -2034856 -2359483 -2761580 -3249488 -3813844
11897 -3813844 -4422697 -5025529 -5559802 -5955833 -6143930 -6069083 -5710286 -5094063 -4293506 -3411556
11887 -3411556 -2553249 -1795463 -1165384 -637055 -146209 386110 1031622 1838430 2819716
11878 2819716 3949117 5166600 6395036 7561199 8611619 9516382 10260408 10829200 11199671
11869 11199671 11342859 11236239 10877086 10289513 9523696 8649759 7748885 6902708 6181394
11860 6181394 5632292 5272703 5089116 5040799 5063171 5071034 4968132 4667644 4116951 3312419
11850 3312419 2294852 1128705 -123455 -1418503 -2732824 -4043848 -5305033 -6434079
11842 -6434079 -7326629 -7888921 -8069956 -7876116 -7362765 -6608280 -5682824 -4626595 -3447209
$$ packed form
11907a268024O668m9537j02333j54332k06337k60961l24627m02097m87908n64356
11897c813844o08853o02832n34273l96031j88097P4847L58797O16223Q00557Q81950
11887c411556Q58307P57786O30079N28329M90846N32319O45512Q06808R81286
11878B819716J129401J217483J228436J166163J050420R04763P44026N68792L70471
11869A1199671J43188j06620l59153n87573p65817q73937r00874q46177p21314
11860F181394n49102l59589j83587m8317K2372P863j02902l00488n50693q04532
11850C312419j017567j166147j252160j295048j314321j311024j261185j129046
11842f434079q92550n62292j81035J93840N13351P54485R25456J056229J179386
$$ plain form
11833 -3447209 -2133602 -673341 938929 2702516 4610731 6640086 8731432 10779027
11825 10779027 12642424 14179071 15278809 15882576 15984061 15624821 14888943 13893624 12771509
11816 12771509 11647899 10619104 9735472 8992169 8334103 7679573 6955690 6127706 5206682
11807 5206682 4235198 3265258 2343738 1509219 792075 208836 -247688 -611544 -931804
11798 -931804 -1250272 -1583530 -1922241 -2248489 -2559127 -2878909 -3254969 -3738267 -4365902 -5153695
11788 -5153695 -6096583 -7168267 -8316560 -9459614 -10491189 -11297931 -11783228 -11886493 -11588666
11779 -11588666 -10904492 -9872161 -8550768 -7024978 -5406207 -3821407 -2391197 -1207186
11771 -1207186 -317524 276025 611590 755583 789404 795327 841682 969972 1188541 1474498
$$ packed form
11833c447209J313607J460261J612270J763587J908215K029355K091346K047595
11825A0779027J863397J536647J099738O03767J01485l59240p35878r95319j122115
11816A2771509j123610j028795q83632p43303o58066o54530p23883q27984r21024
11807E206682r71484r69940r21520q34519p17144n83239m56524l63856l20260
11798i31804l18468l33258l38711l26248l10638l19782l76060m83298o27635p87793
11788e153695r42888j071684j148293j143054j031575q06742m85297j03265K97827
11779a1588666O84174J032331J321393J525790J618771J584800J430210J184011
11771a207186Q89662N93549L35565J43993L3821N923M6355J28290K18569K85957
$$ plain form
11761 1474498 1780447 2041874 2185502 2141526 1858669 1315646 523743 -477580 -1625605
11752 -1625605 -2836970 -4013037 -5054733 -5885423 -6469977 -6817933 -6970293 -6981123 -6904915
11743 -6904915 -6791063 -6680732 -6604571 -6584274 -6638998 -6792352 -7074688 -7519597 -8156284 -8999565
11733 -8999565 -10040484 -11243107 -12551369 -13902251 -15236049 -16498363 -17637199 -18601639
11725 -18601639 -19344043 -19823762 -20012051 -19899712 -19504782 -18871892 -18057263 -17104295 -16024135
11716 -16024135 -14793581 -13371489 -11723753 -9843478 -7758237 -5525561 -3224040 -945848
11708 -945848 1209788 3145839 4779431 6051467 6929440 7404661 7488747 7212262 6623872
11699 6623872 5786363 4768156 3634019 2442330 1254083 149766 -759488 -1340744 -1470725
$$ packed form
11761A474498L05949K61427J43628m3976k82857n43023p91903j001323j148025
11752a625605j211365j176067j041696q30690n84554l47956j52360j0830P6208
11743f904915J13852J10331P6161K0297n4724j53354k82336m44909o36687q43281
11733h999565j040919j202623j308262j350882j333798j262314j138836r64440
11725a8601639p42404m79719j88289J12339L94930O32890Q14629R52968J080160
11716a6024135J230554J422092J647736J880275K085241K232676K301521K278192
11708i45848K155636J936051J633592J272036Q77973M75221Q4086k76485n88390
11699F623872q37509j018207j134137j191689j188247j104317r09254n81256j29981
$$ plain form
11690 -1470725 -1075738 -157477 1210331 2910435 4816120 6811725 8795036 10671027
11682 10671027 12348295 13742154 14782111 15419785 15633466 15426998 14825569 13875558 12651682
11673 12651682 11263449 9847340 8539857 7442059 6593985 5971917 5509087 5128663 4772391
11664 4772391 4411948 4041148 3657449 3244201 2762367 2156961 1378505 410981 -709384
11655 -709384 -1896097 -3032673 -3997918 -4684717 -5009829 -4918327 -4386837 -3428190 -2097659
11646 -2097659 -496492 1234696 2936796 4462469 5704054 6608228 7173247 7431963 7429012
11637 7429012 7202845 6780822 6187983 5461702 4661824 3870542 3182682 2689890 2462114
11628 2462114 2530856 2880619 3453844 4168559 4941166 5704360 6413336 7039922 7560697 7948279
$$ packed form
11690a470725L94987R18261J367808J700104J905685J995605J983311J875991
11682A0671027J677268J393859J039957O37674K13681k06468o01429r50011j223876
11673A2651682j388233j416109j307483j097798q48074o22068m62830l80424l56272
11664D772391l60443l70800l83699m13248m81834o05406p78456r67524j120365
11655g09384j186713j136576r65245o86799l25112R1502N31490R58647J330531
11646b097659J601167J731188J702100J525673J241585R04174N65019K58716k951
11637G429012k26167m22023n92839p26281p99878p91282o87860m92792k27776
11628B462114O8742L49763N73225P14715P72607P63194P08976O26586N20775L87582
$$ plain form
11618 7948279 8171760 8204375 8030596 7646149 7051005 6239833 5193952 3877180 2238743
11609 2238743 227065 -2186043 -4979689 -8070019 -11315689 -14537940 -17543626 -20144158
11601 -20144158 -22172922 -23506052 -24084214 -23926175 -23126906 -21840769 -20255096 -18559279
11593 -18559279 -16914073 -15427732 -14146238 -13061251 -12133086 -11320476 -10605808 -10005578 -9561800
11584 -9561800 -9319292 -9300889 -9493060 -9847803 -10296845 -10767286 -11189538 -11498184 -11634955 -11560686
11574 -11560686 -11271534 -10806692 -10239323 -9654081 -9121779 -8680639 -8329012 -8031183 -7734406
11565 -7734406 -7390809 -6975252 -6493027 -5977220 -5479154 -5054704 -4748141 -4576880 -4523309 -4539001
11555 -4539001 -4561166 -4534930 -4432225 -4259646 -4052903 -3862652 -3741575 -3740135 -3908749 -4296590
$$ packed form
11618G948279K23481L2615j73779l84447n95144q11172j045881j316772j638437
11609B238743k011678k413108k793646l090330l245670l222251l005686k600532
11601b0144158k028764j333130n78162J58039P99269J286137J585673J695817
11593a8559279J645206J486341J281494J084987R28165Q12610P14668O00230M43778
11584i561800K42508J8403j92171l54743m49042m70441m22252l08646j36771P4269
11574a1560686K89152M64842N67369N85242N32302M41140L51627K97829K96777
11565g734406L43597M15557M82225N15807M98066M24450L06563J71261N3571j5692
11555d539001k2165K6236J02705J72579K06743J90251J21077J440j68614l87841
$$ plain form
11545 -4296590 -4940504 -5848386 -6988082 -8289038 -9655690 -10986783 -12194269 -13216202
11537 -13216202 -14020222 -14598938 -14962560 -15133056 -15139293 -15010314 -14766549 -14412257 -13932744 -13297257
11527 -13297257 -12466278 -11401006 -10072578 -8469310 -6602657 -4515104 -2291767 -70843
11519 -70843 1959576 3589961 4641803 5025055 4773585 4041057 3059284 2076950 1300753
11510 1300753 855551 770934 992601 1410852 1896448 2334542 2647489 2798837 2778260 2579408
11500 2579408 2188180 1590079 789151 -176600 -1232458 -2276700 -3199876 -3911127 -4365198
11491 -4365198 -4578178 -4622596 -4603967 -4630747 -4789434 -5130363 -5665228 -6375281 -7225527 -8176627
11481 -8176627 -9188192 -10215237 -11206052 -12107849 -12878510 -13496532 -13962149 -14288953 -14491559
$$ packed form
11545d296590o43914r07882j139696j300956j366652j331093j207486j021933
11537a3216202q04020n78716l63622j70496o237J28979K43765L54292M79513O35487
11527a3297257Q30979J065272J328428J603268J866653K087553K223337K220924
11519g0843K030419J630385J051842L83252k51470p32528r81773r82334p76197
11510A300753m45202q4617K21667M18251M85596M38094L12947J51348k0577j98852
11500B579408l91228n98101q00928r65751j055858j044242r23176p11251m54071
11491d365198k12980m4418J8629k6780j58687l40929n34865p10053q50246r51100
11481h176627j011565j027045r90815r01797p70661o18022m65617l26804k02606
$$ plain form
11472 -14491559 -14577077 -14545691 -14400498 -14160935 -13870106 -13587721 -13368805 -13239085 -13181983 -13145357
11462 -13145357 -13064121 -12887082 -12596316 -12212447 -11785461 -11376558 -11039731 -10810427 -10703198
11453 -10703198 -10714832 -10827121 -11005880 -11198404 -11335969 -11345932 -11169782 -10777293 -10169783 -9374301
11443 -9374301 -8435503 -7409830 -6362277 -5364309 -4491036 -3815091 -3395445 -3262701 -3405704
11434 -3405704 -3765008 -4237765 -4695804 -5013219 -5093915 -4889687 -4406428 -3702070 -2878325 -2063902
11424 -2063902 -1387916 -949391 -793727 -904753 -1213995 -1622154 -2024862 -2335650 -2502042
11415 -2502042 -2512085 -2388413 -2169442 -1884598 -1536544 -1100561 -540676 166999 1015436 1960817
11405 1960817 2932101 3849920 4642230 5247667 5610887 5683952 5441670 4902094 4134538 3246404
$$ packed form
11472a4491559q5518L1386J45193K39563K90829K82385K18916J29720N7102L6626
11462a3145357Q1236J77039K90766L83869M26986M08903L36827K29304J07229
11453a0703198j1634j12289j78759j92524j37565r963J76150L92489O07510P95482
11443i374301R38798J025673J047553R97968Q73273O75945M19646J32744j43003
11434c405704l59304m72757m58039l17415q0696K04228M83259P04358Q23745Q14423
11424b063902O75986M38525J55664j11026l09242m08159m02708l10788j66392
11415b502042j0043J23672K18971K84844L48054M35983N59885P07675Q48437R45381
11405A960817R71284R17819P92310O05437L63220P3065k42282n39576p67556q88134
$$ plain form
11395 3246404 2356690 1571215 968093 591653 449981 514835 725953 1001138 1251921 1403548
11385 1403548 1415610 1295257 1094277 888509 748636 715469 787718 922716 1047993 1081899
11375 1081899 959747 657835 206678 -310800 -774286 -1049371 -1013400 -577664 299910 1612947
11365 1612947 3310484 5299640 7446964 9586311 11539882 13148331 14297252 14930122
11357 14930122 15048231 14704532 13995483 13048655 12002622 10980962 10069199 9305140 8686792
11348 8686792 8191635 7794553 7475149 7215045 6992756 6782311 6556022 6289391 5968047
11339 5968047 5596756 5205659 4845099 4565772 4393514 4315558 4288510 4262523 4205185 4110611
11329 4110611 3991042 3859954 3719981 3563513 3383096 3181255 2971658 2772648 2600534
$$ packed form
11395C246404q89714p85475o03122l76440j41672O4854K11118K75185K50783J51627
11385A403548J2062j20353k00980k05768j39873l3167P2249J34998J25277L3906
11375A081899j22152l01912m51157n17478m63486k75085L5971M35736Q77574J313037
11365A612947J697537J989156K147324K139347J953571J608449J148921O32870
11357A4930122J18109l43699p09049r46828j046033j021660r11763p64059o18348
11348H686792m95157l97082l19404k60104k22289k10445k26289k66631l21344
11339E968047l71291l91097l60560k79327j72258p7956k7048k5987n7338r4574
11329D110611j19569j31088j39973j56468j80417k01841k09597j99010j72114
$$ plain form
11320 2600534 2468264 2389107 2381058 2467816 2674443 3019007 3504032 4111187 4800038 5511221
11310 5511221 6176958 6741118 7182804 7528851 7843481 8197832 8635339 9150226 9686945
11301 9686945 10157964 10471754 10562520 10414628 10075080 9647281 9263178 9041363 9049492 9289277
11291 9289277 9708760 10230647 10779864 11299624 11754145 12121501 12382555 12513304 12486606 12283245
11281 12283245 11905249 11382433 10768268 10128479 9529030 9027586 8667712 8472511 8435915
11272 8435915 8514564 8627801 8672983 8555616 8222212 7677792 6976654 6191632 5381615 4578266
11262 4578266 3798472 3068893 2438906 1967613 1693242 1609658 1669877 1814503 2004219 2235729
11252 2235729 2536836 2951290 3524995 4295587 5281065 6467466 7803042 9206300 10586282
$$ packed form
11320B600534j32270p9157q049Q6758K06627L44564M85025O07155O88851P11183
11310E511221O65737N64160M41686L46047L14630L54351M37507N14887N36719
11301I686945M71019L13790R0766j47892l39548m27799l84103k21815Q129K39785
11291I289277M19483N21887N49217N19760M54521L67356K61054J30749k6698k03361
11281A2283245l77996n22816o14165o39789n99449n01444l59874j95201l6596
11272H435915P8649J13237M5182j17367l33404n44420p01138p85022q10017q03349
11262D578266p79794p29579o29987m71293k74371q3584O0219J44626J89716K31510
11252B235729L01107M14454N73705P70592R85478J186401J335576J403258J379982
$$ plain form
11243 10586282 11865582 12996608 13966519 14790463 15496385 16108718 16639232 17087470 17445460
11234 17445460 17700201 17833118 17820527 17638388 17271037 16720601 16011732 15186636 14291147
11225 14291147 13360903 12418073 11479464 10565897 9702491 8909840 8195032 7551110 6966527
11216 6966527 6439250 5986975 5646071 5457501 5446341 5606634 5900671 6272841 6670497 7062841
11206 7062841 7452254 7875405 8392041 9060532 9904682 10884816 11890556 12765658 13356914
11197 13356914 13561927 13350327 12752371 11830991 10657546 9297794 7802465 6200414 4502699
11188 4502699 2724228 914754 -820914 -2328928 -3437994 -4002615 -3941600 -3261474 -2061960
11179 -2061960 -524339 1116868 2617463 3774182 4465705 4667045 4432755 3861070 3059090
$$ packed form
11243A0586282J279300J131026R69911Q23944P05922O12333N30514M48238L57990
11234A7445460K54741J32917j2591j82139l67351n50436p08869q25096q95489
11225A4291147r30244r42830r38609r13567q63406p92651p14808o43922n84583
11216F966527n27277m52275l40904j88570j1160J60293K94037L72170L97656L92344
11206G062841L89413M23151N16636O68491Q44150R80134J005740Q75102N91256
11197A3356914K05013k11600n97956r21380j173445j359752j495329j602051j697715
11188D502699j778471j809474j735668j508014j109066n64621O1015O80126J199514
11179b061960J537621J641207J500595J156719O91523K01340k34290n71685q01980
$$ plain form
11170 3059090 2122690 1131002 146024 -790579 -1663315 -2485627 -3294789 -4138360 -5055157
11161 -5055157 -6057258 -7122622 -8204932 -9256121 -10246745 -11171945 -12043437 -12876590 -13679499
11152 -13679499 -14445970 -15154167 -15773293 -16276223 -16650565 -16901989 -17050182 -17121598 -17141500 -17125989
11142 -17125989 -17075772 -16974698 -16794781 -16506412 -16089885 -15542738 -14877837 -14110862 -13242603
11133 -13242603 -12247004 -11075178 -9676988 -8030032 -6159916 -4140786 -2077068 -76660
11125 -76660 1772532 3414482 4823059 5991226 6921880 7628331 8141900 8515472 8814184
11116 8814184 9095363 9388326 9684785 9944551 10113934 10149172 10035999 9799012 9497936 9211035
11106 9211035 9010412 8939349 9002016 9167749 9382689 9581076 9695972 9673175 9486768 9147695
$$ packed form
11170C059090r36400r91688r84978r36603q72736q22312q09162q43571r16797
11161e055157j002101j065364j082310j051189r90624r25200q71492q33153q02909
11152a3679499p66471p08197o19126n02930l74342k51424j48193p1416j9902J5511
11142a7125989N0217J01074J79917K88369M16527N47147O64901P66975Q68259
11133a3242603R95599J171826J398190J646956J870116K019130K063718K000408
11125g6660J849192J641950J408577J168167R30654P06451N13569L73572K98712
11116H814184K81179K92963K96459K59766J69383L5238j13173k36987l01076k86901
11106I211035k00623p1063O2667J65733K14940J98387J14896k2797j86407l39073
$$ plain form
11096 9147695 8698166 8194597 7690030 7225696 6832077 6531648 6336352 6240569 6215917 6211649
11086 6211649 6158944 5976932 5582809 4909899 3932557 2689461 1293298 -83241 -1246928
11077 -1246928 -2037124 -2370057 -2254344 -1775326 -1062970 -261092 494346 1089764 1445362
11068 1445362 1525805 1350732 1001519 614836 353904 361429 715406 1412591 2387418 3549908
11058 3549908 4816103 6116243 7386644 8561835 9577147 10378469 10929350 11211114 11220443
11049 11220443 10970569 10495468 9849866 9099480 8304663 7507426 6730376 5987407 5297101
11040 5297101 4687951 4191081 3826061 3590738 3462831 3412598 3418695 3477526 3600486 3801249
11030 3801249 4082015 4427318 4806259 5176752 5486816 5675748 5681495 5455061 4974848 4252323
$$ packed form
11096I147695m49529n03569n04567m64334l93619l00429j95296r5783k4652m268
11086F211649n2705j82012l94123o72910r77342j243096j396163j376539j163687
11077a246928p90196l32933J15713M79018P12356Q01878P55438N95418L55598
11068A445362Q0443j75073l49213l86683k60932P525L53977O97185R74827J162490
11058C549908J266195J300140J270401J175191J015312Q01322N50881K81764R329
11049A1220443k49874m75101o45602p50386p94817p97237p77050p42969o90306
11040E297101o09150m96870l65020k35323j27907n0233O097N8831J22960K00763
11030C801249K80766L45303L78941L70493L10064J88932N747k26434m80213p22525
$$ plain form
11020 4252323 3326056 2248136 1070515 -162930 -1418032 -2669660 -3902630 -5113840
11012 -5113840 -6312372 -7514849 -8735593 -9973788 -11203830 -12377215 -13439021 -14350581
11004 -14350581 -15104110 -15721978 -16245169 -16719334 -17182761 -17657432 -18145206 -18629965 -19082119
10995 -19082119 -19460463 -19711214 -19768547 -19559371 -19010685 -18057594 -16652996 -14780348 -12466584
10986 -12466584 -9787747 -6860640 -3820594 -794034 2121018 4857439 7366052 9598528
10978 9598528 11498534 13005772 14068188 14654345 14761878 14422670 13705592 12714567 11578764
10969 11578764 10434156 9398746 8545770 7882088 7342002 6803708 6125294 5187039 3926116
10960 3926116 2356131 568605 -1285658 -3033634 -4524335 -5662177 -6416131 -6806157
$$ packed form
11020D252323r26267j077920j177621j233445j255102j251628j232970j211210
11012e113840j198532j202477j220744j238195j230042j173385j061806r11560
11004a4350581p53529o17868n23191m74165m63427m74671m87774m84759m52154
10995a9082119l78344k50751n7333K09176N48686R53091J404598J872648K313764
10986a2466584K678837K927107L040046L026560K915052K736421K508613K232476
10978I598528J900006J507238J062416N86157J07533l39208p17078r91025j135803
10969A1578764j144608j035410q52976o63682n40086n38294o78414r38255j260923
10960C926116j569985j787526j854263j747976j490701j137842p53954l90026
$$ plain form
10952 -6806157 -6880949 -6701763 -6336902 -5860316 -5345359 -4851815 -4412607 -4028154 -3671130 -3298989
10942 -3298989 -2869714 -2356457 -1757008 -1094915 -411629 247897 851213 1389701 1880298
10933 1880298 2357909 2864642 3442293 4128069 4947612 5902216 6956496 8037772 9051658
10924 9051658 9905481 10525630 10862609 10889449 10602035 10022068 9196002 8185647 7054616
10915 7054616 5859215 4648765 3473605 2394475 1486056 829811 496183 521691 889984
10906 889984 1526205 2310778 3110631 3815824 4365548 4755048 5027340 5258423 5539380 5954150
10896 5954150 6555723 7350271 8297378 9324490 10345607 11275223 12035600 12560336 12796860
10887 12796860 12708637 12277993 11511340 10446244 9154999 7737758 6303674 4946957 3728452
$$ packed form
10952f806157p4792J79186L64861M76586N14957M93544M39208L84453L57024L72141
10942c298989M29275N13257N99449O62093O83286O59526O03316N38488M90597
10933A880298M77611N06733N77651O85776Q19543R54604J054280J081276J013886
10924I051658Q53823O20149L36979K6840k87414n79967q26066j010355j131031
10915G054616j195401j210450j175160j079130r08419o56245l33628K5508L68293
10906H89984O36221P84573P99853P05193N49724L89500K72292K31083K80957M14770
10896E954150O01573P94548R47107J027112J021117R29616P60377N24736K36524
10887A2796860q8223m30644p66653j065096j291245j417241j434084j356717j218505
$$ plain form
10878 3728452 2669783 1760512 973971 285423 -314323 -815749 -1199757 -1453923 -1584545
10869 -1584545 -1614041 -1563348 -1431755 -1189973 -792239 -198709 605969 1606094 2759392
10860 2759392 4007511 5287753 6542615 7724613 8795698 9723828 10482450 11058512 11468362
10851 11468362 11770848 12062510 12448518 13000227 13721494 14541805 15339616 15984984 16383196
10842 16383196 16501164 16365791 16037396 15575500 15017896 14381964 13678278 12918065 12105908
10833 12105908 11226735 10243176 9109948 7797713 6313422 4708848 3076376 1535869
10825 1535869 218081 -751218 -1265162 -1247836 -662972 482956 2142947 4234855 6650248
10816 6650248 9268936 11976474 14674806 17278136 19698810 21839247 23603618 24927832
$$ packed form
10878C728452j058669r09271p86541o88548n99746n01426l84008k54166j30622
10869a584545k9496N0693J31593K41782L97734N93530Q04678J000125J153298
10860B759392J248119J280242J254862J181998J071085R28130P58622N76062M09850
10851A1468362L02486K91662L86008N51709P21267Q20311P97811O45368L98212
10842A6383196J17968j35373l28395m61896n57604o35932p03686p60213q12157
10833A2105908q79173r83559j133228j312235j484291j604574j632472j540507
10825A535869j317788r69299n13944J7326N84864J145928J659991K091908K415393
10816F650248K618688K707538K698332K603330K420674K140437J764371J324214
$$ plain form
10808 24927832 25810051 26319311 26572226 26689599 26758281 26817056 26866347 26888669 26867702 26800744
10798 26800744 26702668 26600123 26517281 26458735 26398326 26281714 26043849 25632564 25024487 24226411
10788 24226411 23267455 22191071 21048123 19885718 18730629 17575212 16376248 15071006
10780 15071006 13605931 11966351 10193671 8382028 6656623 5143022 3936583 3078739
10772 3078739 2546730 2261620 2111924 1981795 1772081 1409956 850804 78722 -890891
10763 -890891 -2008912 -3196477 -4359157 -5407564 -6275388 -6928164 -7362167 -7596116 -7658813
10754 -7658813 -7576682 -7366308 -7035514 -6592383 -6057019 -5468384 -4879681 -4342436 -3887843 -3516385
10744 -3516385 -3200277 -2895213 -2555863 -2151768 -1680644 -1174294 -692912 -307814 -77537
$$ packed form
10808B4927832Q82219N09260K52915J17373O8682N8775M9291K2322k0967o6958
10798B6800744r8076j02545q2842n8546o0409j16612k37865m11285o08077p98076
10788B4226411r58956j076384j142948j162405j155089j155417j198964j305242
10780A5071006j465075j639580j772680j811643j725405j513601j206439q57844
10772C078739n32009k85110j49696j30129k09714l62125n59152p72082r69613
10763h90891j118021j187565j162680j048407q67824o52776m34003k33949o2697
10754g658813Q2131K10374L30794M43131N35364N88635N88703N37245M54593L71458
10744c516385L16108L05064L39350M04095M71124N06350M81382L85098K30277
$$ plain form
10735 -77537 -25647 -129028 -321268 -507682 -582610 -441215 14658 870508 2186101 3973991
10725 3973991 6178480 8670767 11270107 13783364 16042059 17920827 19338585 20255375
10717 20255375 20674406 20647062 20271088 19674185 18984587 18299222 17661947 17058587 16428394
10708 16428394 15687735 14759043 13594749 12187064 10563211 8774000 6882352 4951675
10700 4951675 3033359 1158861 -656931 -2402585 -4056382 -5579245 -6914610 -7993218
10692 -7993218 -8743235 -9106709 -9059198 -8625010 -7880266 -6940007 -5931599 -4962450 -4093608
10683 -4093608 -3329198 -2624320 -1905311 -1092875 -122891 1034838 2361149 3782751 5185655
10674 5185655 6444169 7452806 8149055 8523480 8618632 8517374 8321377 8125572 7997854
$$ packed form
10735g7537N1890j03381j92240j86414p4928J41395M55873Q55850J315593J787890
10725C973991K204489K492287K599340K513257K258695J878768J417758R16790
10717B0255375M19031k7344l75974n96903o89598o85365o37275o03360o30193
10708A6428394p40659r28692j164294j407685j623853j789211j891648j930677
10700D951675j918316j874498j815792j745654j653797j522863j335365j078608
10692g993218p50017l63474M7511M34188P44744R40259J008408R69149Q68842
10683d093608P64410P04878P19009Q12436R69984J157729J326311J421602J402904
10674E185655J258514J008637O96249L74425R5152j01258j95997j95805j27718
$$ plain form
10665 7997854 7970165 8040306 8180830 8353072 8525908 8696198 8903416 9229571 9780046 10649109
10655 10649109 11881214 13442879 15218426 17034247 18702629 20065789 21023081 21537021
10647 21537021 21624441 21339481 20751335 19920176 18878892 17629178 16155317 14450539 12543031
10638 12543031 10505639 8440823 6448508 4596853 2912143 1387994 1326 -1276676
10630 -1276676 -2477198 -3633550 -4779343 -5944025 -7147025 -8391211 -9656283 -10895720
10622 -10895720 -12042613 -13024373 -13777370 -14252055 -14410207 -14225176 -13691507 -12837744 -11731215
10613 -11731215 -10470108 -9166476 -7926229 -6830940 -5925406 -5214791 -4673383 -4262967 -3953338
10604 -3953338 -3734919 -3617612 -3618752 -3747903 -3993549 -4313537 -4632924 -4854258 -4879596 -4634796
$$ packed form
10665G997854k7689P0141J40524J72242J72836J70290K07218L26155N50475Q69063
10655A0649109J232105J561665J775547J815821J668382J363160R57292N13940
10647B1537021Q7420k84960n88146q31159j041284j249714j473861j704778j907508
10638A2543031k037392k064816j992315j851655j684710j524149j386668j278002
10630a276676j200522j156352j145793j164682j203000j244186j265072j239437
10622a0895720j146893r81760p52997m74685j58152J85031N33669Q53763J106529
10613a1731215J261107J303632J240247J095289R05534P10615N41408M10416L09629
10604c953338K18419J17307j140j29151k45646l19988l19387k21334k5338K44800
$$ plain form
10594 -4634796 -4084952 -3235608 -2121151 -786165 731797 2410954 4245024 6238583
10586 6238583 8399909 10728402 13197597 15743682 18269478 20661848 22810147 24616554
10578 24616554 26000666 26906667 27315573 27254137 26788246 25998651 24952606 23690206 22232328
10569 22232328 20600113 18829865 16974106 15090233 13225059 11404749 9634133 7900871
10561 7900871 6177973 4425540 2598436 661481 -1394572 -3542308 -5712189 -7792978
10553 -7792978 -9643750 -11120653 -12110829 -12559208 -12477388 -11931658 -11015473 -9820185 -8420354
10544 -8420354 -6879485 -5265576 -3660067 -2152463 -824349 268728 1109833 1724414
10536 1724414 2178230 2573765 3041838 3719586 4715389 6077166 7782572 9754331 11889312
$$ packed form
10594d634796N49844Q49344J114457J334986J517962J679157J834070J993559
10586F238583K161326K328493K469195K546085K525796K392370K148299J806407
10578B4616554J384112R06001M08906o1436m65891p89595j046045j262400j457878
10569B2232328j632215j770248j855759j883873j865174j820310j770616j733262
10561G900871j722898j752433j827104j936955k056053k147736k169881k080789
10553g792978j850772j476903r90176m48379Q1820N45730R16185J195288J399831
10544h420354J540869J613909J605509J507604J328114J093077Q41105O14581
10536A724414M53816L95535M68073O77748R95803J361777J705406J971759K134981
$$ plain form
10527 11889312 14087600 16272771 18400017 20454054 22441009 24375343 26262166 28083583
10519 28083583 29803344 31392225 32857734 34259671 35708401 37353187 39364793 41912639
10511 41912639 45139203 49136644 53931791 59489406 65740844 72627904 80137899 88318407
10503 88318407 97282363 107213242 118362592 131033879 145565636 162327316 181719966
10496 181719966 204166273 230085410 259843710 293652043 331382521 372305310 414778800
10489 414778800 455994524 492008289 518338504 531156089 528591257 511406779 482616476
10482 482616476 446329850 406534095 366354886 327867517 292236637 259966280 231146449
10475 231146449 205641339 183200385 163516659 146270027 131163270 117937962 106369729
$$ packed form
10527A1889312K198288K185171K127246K054037J986955J934334J886823J821417
10519B8083583J719761J588881J465509J401937J448730J644786K011606K547846
10511D1912639L226564L997441M795147N557615O251438O887060P509995Q180508
10503H8318407Q963956R930879J1149350J2671287J4531757J6761680J9392650
10496A81719966K2446307K5919137K9758300L3808333L7730478M0922789M2473490
10489D14778800M1215724L6013765K6330215J2817585k564832j7184478k8790303
10482D82616476l6286626l9795755m0179209l8487369l5630880l2270357k8819831
10475B31146449k5505110k2440954j9683726j7246632j5106757j3225308j1568233
$$ plain form
10468 106369729 96258049 87420430 79692258 72934438 67046720 61973124 57687094 54161664
10460 54161664 51341768 49131369 47399570 46003865 44818861 43751723 42736324 41718940
10452 41718940 40653218 39506755 38269386 36956341 35605362 34267032 32989703 31807244
10444 31807244 30737560 29790292 28976038 28312083 27821614 27521591 27399490 27391512 27379142 27209545
10434 27209545 26731366 25833287 24473998 22693323 20599739 18341547 16076512 13949478
10426 13949478 12076774 10532525 9336196 8446140 7766419 7171776 6547216 5827974 5021546
10417 5021546 4199972 3464041 2895971 2526968 2340654 2309146 2432098 2746334 3299028 4105420
10407 4105420 5119144 6230116 7288230 8140969 8670312 8818593 8600398 8100921 7459152
$$ packed form
10468A06369729j0111680q837619p728172o757820n887718n073596m286030l525430
10460E4161664k819896k210399j731799j395705j185004j067138j015399j017384
10452D1718940j065722j146463j237369j313045j350979j338330j277329j182459
10444C1807244j069684r47268q14254o63955m90469l00023j22101p978j2370j69597
10434B7209545m78179q98079j359289j780675k093584k258192k265035k127034
10426A3949478j872704j544249j196329q90056o79721n94643o24560p19242q06428
10417E021546q21574p35931n68070l69003j86314l1508J22952L14236N52694Q06392
10407D105420J013724J110972J058114Q52739N29343J48281k18195m99477o41769
$$ plain form
10398 7459152 6835127 6369173 6149292 6199542 6490056 6959588 7540041 8176465 8840396 9536665
10388 9536665 10302260 11193304 12259472 13515303 14924849 16409859 17875858 19239688
10380 19239688 20444311 21456677 22253277 22802166 23051671 22933955 22384989 21372523 19917289
10371 19917289 18096223 16027980 13850869 11702829 9705445 7949404 6482565 5307484
10363 5307484 4393258 3697083 3183230 2829932 2625333 2561515 2633013 2837824 3175588 3642823
10353 3642823 4230758 4928893 5730411 6633145 7634827 8727026 9892782 11109439 12354304
10344 12354304 13608738 14856786 16078112 17238759 18284358 19139006 19712233 19915727
10336 19915727 19687064 19010564 17922680 16496271 14810967 12926282 10873472 8670550
$$ packed form
10398G459152o24025m65954k19881N0250K90514M69532N80453O36424O63931O96269
10388I536665P65595Q91044J066168J255831J409546J485010J465999J363830
10380A9239688J204623J012366P96600N48889K49505j17716n48966j012466j455234
10371A9917289j821066k068243k177111k148040j997384j756041j466839j175081
10363E307484r14226o96175n13853l53298k04599o3818P1498K04811L37764M67235
10353C642823N87935O98135Q01518R02734J001682J092199J165756J216657J244865
10344A2354304J254434J248048J221326J160647J045599Q54648N73227K03494
10336A9915727k28663o76500j087884j426409j685304j884685k052810k202922
$$ plain form
10328 8670550 6349025 3971621 1626698 -596793 -2634937 -4457503 -6057420 -7433303
10320 -7433303 -8579092 -9484990 -10143808 -10555003 -10724016 -10659180 -10368751 -9859712 -9140233
10311 -9140233 -8226464 -7149177 -5952193 -4678511 -3349984 -1952853 -439613 1250144
10303 1250144 3157068 5273233 7534382 9839116 12082351 14180019 16070300 17696639
10295 17696639 18992349 19884738 20321042 20300632 19891109 19215667 18417925 17623195 16913096
10286 16913096 16318611 15826601 15392184 14952502 14441336 13804706 13013807 12068438 10987910
10277 10987910 9796111 8512093 7151185 5731288 4276539 2816346 1382935 10309
10269 10309 -1264795 -2400934 -3351874 -4072723 -4532898 -4729343 -4691082 -4473009 -4144568 -3777991
$$ packed form
10328H670550k321525k377404k344923k223491k038144j822566j599917j375883
10320g433303j145789r05898o58818m11195j69013O4836K90429N09039P19479
10311i140233R13769J077287J196984J273682J328527J397131J513240J689757
10303A250144J906924K116165K261149K304734K243235K097668J890281J626339
10295A7696639J295710Q92389M36304k0410m09523o75442p97742p94730p10099
10286A6913096n94485m92010m34417m39682n11166o36630p90899r45369j080528
10277A0987910j191799j284018j360908j419897j454749j460193j433411j372626
10269A0309j275104j136139r50940p20849m60175j96445L8261K18073L28441L66577
$$ plain form
10259 -3777991 -3434519 -3146765 -2903639 -2649707 -2303840 -1788063 -1051119 -78217 1110479
10250 1110479 2467041 3928031 5433637 6948707 8472548 10027036 11627325 13252930
10242 13252930 14836788 16277215 17464081 18305484 18745418 18770789 18411071 17732641 16826314
10233 16826314 15788377 14703086 13638223 12656041 11827638 11235572 10961471 11068184 11587344
10224 11587344 12516907 13828972 15485715 17455491 19717208 22248161 25005130 27914515
10216 27914515 30877717 33784802 36526969 39004975 41135309 42854433 44119305 44904640
10208 44904640 45201115 45018606 44393211 43390683 42099399 40614100 39019793 37384045
10200 37384045 35757282 34175679 32664365 31242944 29933024 28763086 27767034 26977984
$$ packed form
10259c777991L43472K87754K43126K53932L45867N15777P36944R72902J188696
10250A110479J356562J460990J505606J515070J523841J554488J600289J625605
10242A3252930J583858J440427J186866Q41403M39934K5371l59718o78430r06327
10233A6826314j037937j085291j064863r82182q28403n92066k74101J06713N19160
10224A1587344R29563J312065J656743J969776K261717K530953K756969K909385
10216B7914515K963202K907085K742167K478006K130334J719124J264872P85335
10208D4904640K96475j82509o25395j002528j291284j485299j594307j635748
10200C7384045j626763j581603j511314j421421j309920j169938r96052p89050
$$ plain form
10192 26977984 26421006 26107092 26030253 26170356 26501657 27001975 27657075 28460048 29408700
10183 29408700 30500967 31725077 33044333 34383399 35625605 36626494 37241326 37358289
10175 37358289 36926309 35967399 34568909 32858743 30972991 29027210 27098943 25223037
10167 25223037 23396720 21591219 19768296 17899059 15978478 14027875 12084240 10185830
10159 10185830 8367498 6670238 5154307 3898572 2979024 2438262 2266877 2408045 2778177
10150 2778177 3287068 3848074 4382446 4827612 5151948 5366940 5524249 5694672 5939461
10141 5939461 6288324 6730048 7212529 7649703 7938663 7988599 7752352 7244573 6537252 5737429
10131 5737429 4960054 4306342 3850390 3630983 3644604 3840289 4123359 4375900 4492650 4418044
$$ packed form
10192B6977984n56978l13914p6839J40103L31301N00318O55100Q02973R48652
10183B9408700J092267J224110J319256J339066J242206J000889O14832J16963
10175C7358289m31980r58910j398490j710166j885752j945781j928267j875906
10167B5223037j826317j805501j822923j869237j920581j950603j943635j898410
10159A0185830j818332j697260j515931j255735r19548n40762j71385J41168L70132
10150B778177N08891N61006N34372M45166L24336K14992J57309J70423K44789
10141E939461L48863M41724M82481M37174K88960M9936k36247n07779p07321p99823
10131E737429p77375o53712m55952k19407J3621J95685K83070K52541J16750p4606
$$ plain form
10121 4418044 4166029 3813968 3477122 3278230 3323431 3687495 4406690 5478348 6867549
10112 6867549 8518116 10360401 12309925 14260895 16087217 17659736 18873970 19672353
10104 19672353 20049393 20041307 19709517 19125373 18359149 17476398 16544829 15648546 14897169 14416482
10094 14416482 14319590 14673139 15478289 16676322 18173192 19867310 21666481 23489836 25261601
10085 25261601 26907276 28357506 29555961 30463675 31056736 31321041 31249887 30846144 30126143
10076 30126143 29121810 27879750 26457297 24915544 23310040 21682332 20056819 18445224
10068 18445224 16856734 15308953 13835010 12484235 11316006 10388506 9745758 9407054
10060 9407054 9362572 9577288 10001573 10582228 11265948 11992515 12684608 13246622 13580002 13610310
$$ packed form
10121D418044k52015l52061l36846j98892M5201L64064P19195J071658J389201
10112F867549J650567J842285J949524J950970J826322J572519J214234P98383
10104A9672353L77040q086l31790n84144p66224q82751r31569q96283p51377m80687
10094A4416482r6892L53549Q05150J198033J496870J694118J799171J823355J771765
10085B5261601J645675J450230J198455R07714N93061K64305p1154m03743p20001
10076C0126143j004333j242060j422453j541753j605504j627708j625513j611595
10068A8445224j588490j547781j473943j350775j168229r27500o42748l38704
10060I407054m4482K14716M24285N80655O83720P26567O92093N62014L33380L0308
$$ plain form
10050 13610310 13311155 12710003 11871364 10867377 9754175 8567645 7337103 6102432
10042 6102432 4920859 3862081 3001618 2420500 2207462 2451819 3221334 4534384 6344176
10033 6344176 8545884 11002040 13571847 16132186 18586265 20862535 22909703 24694142
10025 24694142 26202556 27445870 28456330 29274657 29934543 30456335 30853894 31145614 31356276
10016 31356276 31506316 31598909 31618162 31540604 31349600 31041802 30624861 30113647 29530369 28907389
10006 28907389 28288532 27725989 27271861 26964607 26813339 26786614 26813640 26802096 26668774 26371344
9996 26371344 25927225 25411674 24937756 24627655 24583681 24863357 25461732 26305728 27265195 28181234
9986 28181234 28905928 29341491 29464346 29323863 29016359 28646501 28293559 27995733 27754630
$$ packed form
10050A3610310k99155o01152q38639j003987j113202j186530j230542j234671
10042F102432j181573j058778q60463n81118k13038K44357P69515J313050J809792
10033F344176K201708K456156K569807K560339K454079K276270K047168J784439
10025B4694142J508414J243314J010460Q18327O59886N21792L97559K91720K10662
10016C1356276J50040R2593J9253p7558j91004l07798m16941n11214n83278o22980
10006B8907389o18857n62543m54128l07254j51268k6725K7026j1544j33322k97430
9996B6371344m44119n15551m73918l10101m3974K79676N98375Q43996R59467R16039
9986B8181234P24694M35563J22855j40483l07504l69858l52942k97826k41103
$$ plain form
9977 27754630 27550435 27354072 27129316 26829325 26397735 25780284 24944827 23902564 22720886
9968 22720886 21518145 20436169 19598721 19074793 18864531 18912572 19138959 19471080 19863846
9959 19863846 20305254 20811613 21415144 22142185 22984552 23879105 24713583 25360254 25717917
9950 25717917 25740117 25442724 24896874 24212483 23513191 22906477 22458323 22181989 22044553 21988143
9940 21988143 21957145 21919056 21869090 21818015 21773232 21726098 21652200 21521008 21305472 20985096 20544350
9929 20544350 19972782 19269288 18447498 17539443 16598436 15701355 14945895 14437666 14268234
9920 14268234 14492033 15112316 16083076 17325700 18748803 20256486 21740834 23070583 24092381
9911 24092381 24648826 24601019 23837255 22256940 19733530 16072609 10983254 4073659 -5123960
$$ packed form
9977B7754630k04195j96363k24756k99991m31590o17451q35457j042263j181678
9968B2720886j202741j081976q37448n23928k10262M8041K26387L32121L92766
9959A9863846M41408N06359O03531P27041Q42367Q94553Q34478O46671L57663
9950B5717917K2200k97393n45850o84391o99292o06714m48154k76334j37436n6410
9940B1988143l0998l8089m9966n1075m4783m7134p3898j31192k15536l20376m40746
9929B0544350n71568p03494q21790r08055r41007q97081p55460n08229j69432
9920A4268234K23799O20283R70760J242624J423103J507683J484348J329749J021798
9911B4092381N56445m7807p63764j580315k523410l660921n089355o909595r197619
$$ plain form
9902 -5123960 -17094056 -32240935 -50760250 -72491354 -96769228 -122323296 -147317636
9895 -147317636 -169624288 -187305366 -199111717 -204748957 -204797089 -200383718 -192815890 -183316530
9887 -183316530 -172893450 -162303344 -152069335 -142521905 -133840180 -126082586 -119210263 -113110794
9879 -113110794 -107625500 -102580652 -97820712 -93235572 -88770201 -84412974 -80172255 -76056654
9871 -76056654 -72070204 -68224349 -64557201 -61141562 -58067092 -55401808 -53157224 -51279699
9863 -51279699 -49670345 -48218155 -46830275 -45452996 -44083746 -42773149 -41613275 -40710759
9855 -40710759 -40152012 -39974830 -40158799 -40637307 -41324336 -42144263 -43051663 -44031907 -45083894
9846 -45083894 -46197888 -47341914 -48459019 -49469262 -50274436 -50770489 -50869333 -50521604 -49729074
$$ packed form
9902e123960j1970096j5146879j8519315k1731104k4277874k5554068k4994340
9895a47317636k2306652j7681078j1806351n637240m8132M413371P567828R499360
9887a83316530J0423080J0590106J0234009R547430Q681725P757594O872323O099469
9879a13110794N485294N044848M759940M585140M465371M357227M240719M115601
9871g6056654L986450L845855L667148L415639L074470K665284K244584J877525
9863e1279699J609354J452190J387880J377279J369250J310597J159874R02516
9855d0710759N58747J77182j83969m78508o87029q19927r07400r80244j051987
9846d5083894j113994j144026j117105j010243q05174m96053r8844L47729P92530
$$ plain form
9837 -49729074 -48542485 -47047724 -45345085 -43527205 -41663770 -39800133 -37969812 -36212012
9829 -36212012 -34582005 -33146314 -31964061 -31064912 -30436290 -30025065 -29749632 -29515947 -29234740
9820 -29234740 -28837606 -28285782 -27566224 -26679039 -25627841 -24419654 -23069091 -21598112 -20031633
9811 -20031633 -18397985 -16739390 -15125170 -13654205 -12440537 -11588810 -11171829 -11217946 -11709150
9802 -11709150 -12588269 -13773706 -15178027 -16723311 -18346866 -19997001 -21624276 -23173816
9794 -23173816 -24580243 -25764346 -26632896 -27086426 -27038114 -26439189 -25299003 -23689023 -21729397
9785 -21729397 -19565674 -17344770 -15194575 -13208060 -11433599 -9875127 -8504467 -7282649
9777 -7282649 -6181086 -5192506 -4328242 -3607898 -3050883 -2672857 -2481662 -2466837 -2584928 -2750756
$$ packed form
9837d9729074J186589J494761J702639J817880J863435J863637J830321J757800
9829c6212012J630007J435691J182253Q99149O28622M11225K75433K33685K81207
9820b9234740L97134N51824P19558Q87185J051198J208187J350563J470979J566479
9811b0031633J633648J658595J614220J470965J213668Q51727M16981m6117m91204
9802a1709150q79119j185437j404321j545284j623555j650135j627275j549540
9794b3173816j406427j184103q68550m53530M8312N98925J140186J609980J959626
9785b1729397K163723K220904K150195J986515J774461J558472J370660J221818
9777g282649J101563R88580Q64264P20344N57015L78026J91195J4825j18091j65828
$$ plain form
9767 -2750756 -2845139 -2743022 -2356553 -1677654 -798527 106554 836453 1231860 1224605 846019
9757 846019 196202 -604966 -1460904 -2321361 -3183599 -4076701 -5036500 -6081223 -7198568
9748 -7198568 -8348483 -9474567 -10512230 -11389981 -12031646 -12367491 -12350820 -11968836 -11241602
9739 -11241602 -10213680 -8945945 -7509098 -5975411 -4407625 -2849108 -1320219 177949
9731 177949 1655216 3122741 4584206 6028716 7426930 8732753 9891409 10850284 11565195
9722 11565195 11996944 12101541 11824964 11111910 9927430 8279052 6224832 3862201 1306231
9713 1306231 -1327503 -3926740 -6378023 -8566705 -10389263 -11773926 -12698795 -13199131 -13361525
9704 -13361525 -13306686 -13164680 -13049116 -13037574 -13162111 -13408694 -13723367 -14025690 -14229763 -14267873
$$ packed form
9767b750756r4383J02117L86469O78899Q79127R05081P29899L95407p255l78586
9757H46019o49817q01168q55938q60457q62238q93102r59799j044723j117345
9748g198568j149915j126084j037663q77751o41665l35845J6671L81984P27234
9739a1241602J027922J267735J436847J533687J567786J558517J528889J498168
9731A77949J477267J467525J461465J444510J398214J305823J158656R58875P14911
9722A1565195M31749J04597k76577p13054j184480j648378k054220k362631k555970
9713A306231k633734k599237k451283k188682j822558j384663r24869n00336j62394
9704a3361525N4839J42006J15564J1542j24537k46583l14673l02323k04073l8110
$$ plain form
9694 -14267873 -14107674 -13756763 -13255447 -12661662 -12031087 -11396435 -10753379 -10060224 -9251397
9685 -9251397 -8258462 -7033011 -5568946 -3919088 -2196014 -550719 863516 1923958
9677 1923958 2553731 2719419 2420564 1680450 541152 -938970 -2687934 -4623111 -6652782
9668 -6652782 -8676088 -10585451 -12276890 -13668447 -14719060 -15437475 -15875343 -16106057 -16196586
9659 -16196586 -16182405 -16055427 -15770360 -15266237 -14491966 -13423370 -12065810 -10446497 -8606032
9650 -8606032 -6595579 -4478369 -2330074 -235329 1717825 3443751 4866275 5928155
9642 5928155 6600188 6884749 6811893 6432342 5814136 5044927 4233741 3502400 2963612 2695289
9632 2695289 2726744 3044683 3612244 4386741 5327238 6393961 7547446 8752500 9984592
$$ packed form
9694a4267873J60199L50911N01316N93785O30575O34652O43056O93155Q08827
9685i251397R92935J225451J464065J649858J723074J645295J414235J060442
9677A923958O29773J65688k98855p40114j139298j480122j748964j935177k029671
9668f652782k023306j909363j691439j391557j050613p18415m37868k30714r0529
9659a6196586J4181J26978K85067N04123P74271J068596J357560J619313J840465
9650h606032K010453K117210K148295K094745J953154J725926J422524J061880
9642E928155O72033K84561p2856l79551o18206p69209q11186p31341n38788k68323
9632B695289L1455L17939N67561P74497R40497J066723J153485J205054J232092
$$ plain form
9623 9984592 11231316 12484148 13724152 14911656 15987261 16883408 17540493 17921954 18023948
9614 18023948 17875503 17527836 17037615 16451587 15796230 15072099 14254409 13304193 12190161
9605 12190161 10912697 9517963 8095645 6761940 5634388 4806772 4331455 4212363 4406514
9596 4406514 4830516 5371369 5902672 6304234 6479322 6364713 5933337 5191870 4175197
9587 4175197 2939281 1555167 106733 -1308716 -2581601 -3597098 -4247842 -4448489 -4148751
9578 -4148751 -3343476 -2078494 -449465 1407935 3334240 5163971 6742468 7942990
9570 7942990 8684759 8947904 8778373 8278771 7587208 6850899 6202171 5742096 5532442 5593248
9560 5593248 5904310 6412339 7045507 7731095 8407255 9023689 9535006 9894050 10048016 9936238
$$ packed form
9623I984592J246724J252832J240004J187504J075605Q96147O57085L81461J01994
9614A8023948j48445l47667m90221n86028o55357p24131q17690r50216j114032
9605A2190161j277464j394734j422318j333705j127552q27616m75317j19092J94151
9596D406514M24002N40853N31303M01562J75088j14609m31376p41467j016673
9587D175197j235916j384114j448434j415449j272885j015497o50744k00647K99738
9578d148751Q05275J264982J629029J857400J926305J829731J578497J200522
9570G942990P41769K63145j69531m99602o91563p36309o48728m60075k09654O0806
9560E593248L11062N08029O33168O85588O76160O16434N11317L59044J53966j11778
$$ plain form
9550 9936238 9491836 8653496 7388844 5718831 3726809 1544139 -680545 -2812737 -4751881
9541 -4751881 -6437121 -7843658 -8975658 -9858923 -10533401 -11044279 -11431398 -11718926 -11908766
9532 -11908766 -11980368 -11896769 -11614395 -11093731 -10308681 -9252562 -7939281 -6401068 -4687154
9523 -4687154 -2866141 -1028421 719342 2271820 3550000 4523553 5221605 5726890 6152293
9514 6152293 6605080 7151669 7798370 8496248 9165437 9725362 10117784 10316544 10325356 10168725
9504 10168725 9880510 9492955 9028606 8497918 7903575 7248697 6543440 5805503 5053725
9495 5053725 4297922 3530856 2727653 1852995 871345 -243927 -1501660 -2882745 -4333174
9486 -4333174 -5768211 -7089019 -8203575 -9043256 -9574475 -9808708 -9808805 -9683331 -9563781 -9570166
$$ packed form
9550I936238m44402q38340j264652j670013j992022k182670k224684k132192j939144
9541d751881j685240j406537j132000q83265o74478n10878l87119k87528j89840
9532a1908766p1602Q3599K82374N20664P85050J056119J313281J538213J713914
9523d687154J821013J837720J747763J552478J278180R73553O98052N05285M25403
9514F152293M52787N46589O46701O97878O69189N59925L92422J98760Q812j56631
9504A0168725k88215l87555m64349n30688n94343o54878p05257p37937p51778
9495E053725p55803p67066q03203q74658r81650j115272j257733j381085j450429
9486d333174j435037j320808j114556q39681n31219k34233r7J25474J19550o385
$$ plain form
9476 -9570166 -9779203 -10208665 -10822123 -11547249 -12296356 -12982413 -13530914 -13889822 -14036773 -13980814
9466 -13980814 -13757513 -13417675 -13010213 -12562545 -12067362 -11486202 -10772792 -9906483 -8917202
9457 -8917202 -7885172 -6912228 -6080125 -5421479 -4920465 -4538962 -4247966 -4045534 -3955371 -4011364
9447 -4011364 -4237785 -4634883 -5176012 -5815470 -6500151 -7178510 -7805920 -8349250 -8792236 -9139368
9437 -9139368 -9413528 -9643778 -9845059 -9999475 -10052430 -9930169 -9571431 -8956340 -8118720 -7140008
9427 -7140008 -6132456 -5219463 -4515604 -4107052 -4037241 -4305437 -4879760 -5715339 -6764872
9418 -6764872 -7977923 -9296489 -10655409 -11987847 -13229942 -14321947 -15210053 -15854318 -16241678
9409 -16241678 -16396203 -16378877 -16275636 -16178170 -16162702 -16271152 -16501259 -16813931 -17159518 -17511102
$$ packed form
9476i570166k09037m29462o13458p25126p49107o86057n48501l58908j46951N5959
9466a3980814K23301L39838M07462M47668M95183N81160P13410Q66309R89281
9457h917202J032030R72944Q32103O58646N01014L81503K90996K02432R0163n5993
9447d011364k26421l97098n41129o39458o84681o78359o27410n43330m42986l47132
9437i139368k74160k30250k01281j54416n2955J22261L58738O15091Q37620R78712
9427g140008J007552R12993P03859M08552O9811k68196n74323q35579j049533
9418f764872j213051j318566j358920j332438j242095j092005q88106o44265l87360
9409a6241678j54525J7326J03241R7466J5468j08450k30107l12672l45587l51584
$$ plain form
9399 -17511102 -17884504 -18331254 -18907371 -19634680 -20474394 -21325514 -22048331 -22502604 -22586059 -22261518
9389 -22261518 -21565050 -20591820 -19464303 -18297835 -17180700 -16174305 -15324220 -14669764 -14247750
9380 -14247750 -14092219 -14231028 -14678422 -15424819 -16427369 -17604836 -18841017 -20001496 -20963003
9371 -20963003 -21643894 -22019937 -22118545 -21997768 -21721477 -21339091 -20874220 -20323563 -19662846 -18853591
9361 -18853591 -17848488 -16599961 -15076048 -13279075 -11256509 -9097485 -6917201 -4835910
9353 -4835910 -2958453 -1358910 -73914 894380 1568695 1985690 2188344 2223330 2141249
9344 2141249 1994909 1831979 1683496 1554370 1421252 1238610 950431 504156 -137243 -989738
9334 -989738 -2051058 -3307812 -4740315 -6322412 -8018760 -9782331 -11552809 -13257443
$$ packed form
9399a7511102l73402m46750n76117p27309q39714q51120p22817m54273q3455L24541
9389b2261518O96468R73230J127517J166468J117135J006395Q50085O54456M22014
9380a4247750J55531j38809m47394p46397j002550j177467j236181j160479r61507
9371b0963003o80891l76043r8608J20777K76291L82386M64871N50657O60717Q09255
9361a8853591J005103J248527J523913J796973K022566K159024K180284K081291
9353d835910J877457J599543J284996R68294O74315M16995K02654L4986q2081
9344B141249j46340j62930j48483j29126j33118j82642k88179m46275o41399q52495
9334i89738j061320j256754j432503j582097j696348j763571j770478j704634
$$ plain form
9326 -13257443 -14818404 -16168297 -17268658 -18122112 -18771642 -19286036 -19735400 -20165208 -20580607
9317 -20580607 -20948824 -21215992 -21326139 -21233378 -20908585 -20345667 -19566817 -18620616 -17570303
9308 -17570303 -16477623 -15391614 -14347334 -13372051 -12492689 -11740244 -11150822 -10763607 -10614426
9299 -10614426 -10725121 -11094486 -11698268 -12498139 -13450408 -14507086 -15613286 -16711044 -17752258
9290 -17752258 -18712374 -19594970 -20424845 -21233053 -22037817 -22825977 -23543097 -24100595 -24400459
9281 -24400459 -24367013 -23970961 -23236642 -22233074 -21055403 -19804367 -18570328 -17426437 -16430231
9272 -16430231 -15625341 -15032874 -14631770 -14343060 -14037786 -13573735 -12843679 -11808284 -10498814
9263 -10498814 -8995770 -7401225 -5818397 -4340338 -3042039 -1971220 -1138945 -516052
$$ packed form
9326a3257443j560961j349893j100361q53454o49530n14394m49364m29808m15399
9317b0580607l68217k67168j10147R2761L24793N62918P78850R46201J050313
9308a7570303J092680J086009J044280R75283Q79362P52445N89422L87215J49181
9299a0614426j10695l69365o03782p99871r52269j056678j106200j097758j041214
9290a7752258r60116q82596q29875q08208q04764p88160p17120n57498k99864
9281b4400459L3446L96052P34319J003568J177671J251036J234039J143891R96206
9272a6430231Q04890N92467M01104K88710L05274M64051P30056J035395J309470
9263a0498814J503044J594545J582828J478059J298299J070819Q32275O22893
$$ plain form
9255 -516052 -41252 358787 744293 1142528 1540688 1893213 2141215 2239824 2185288 2028518
9245 2028518 1863999 1796815 1906184 2225910 2747879 3438784 4256632 5160609 6114050 7081431
9235 7081431 8021219 8880327 9597358 10116160 10402190 10451098 10284647 9937810 9445004 8830796
9225 8830796 8105579 7264707 6291304 5164449 3871337 2416465 820329 -891653 -2699156
9216 -2699156 -4584735 -6519907 -8451394 -10298835 -11964736 -13349474 -14366023 -14955228
9208 -14955228 -15103664 -14860210 -14340643 -13709899 -13142408 -12776089 -12682510 -12865691 -13282250 -13864004
9198 -13864004 -14530498 -15193934 -15766397 -16174309 -16376114 -16375000 -16219545 -15989292 -15768265 -15616242
9188 -15616242 -15550501 -15546144 -15552687 -15515532 -15390117 -15144103 -14752082 -14190505 -13437322 -12476787
$$ packed form
9255e16052M74800M00039L85506L98235L98160L52525K48002R8609n4536j56770
9245B028518j64519o7184J09369L19726N21969O90905Q17848R03977R53441R67381
9235G081431R39788Q59108P17031N18802K86030M8908j66451l46837m92806o14208
9225H830796p25217q40872r73403j126855j293112j454872j596136j711982j807503
9216b699156j885579j935172j931487j847441j665901j384738j016549n89205
9208a4955228j48436K43454N19567O30744N67491L66319R3579j83181m16559n81754
9198a3864004o66494o63436n72463m07912k01805J114J55455K30253K21027J52023
9188a5616242O5741M357o543L7155J25415K46014L92021N61577P53183R60535
$$ plain form
9178 -12476787 -11308469 -9957634 -8480321 -6955125 -5460319 -4045595 -2713695 -1423868
9170 -1423868 -119216 1232590 2606081 3912429 5025628 5822840 6214293 6152183 5627373
9161 5627373 4667144 3336372 1734401 -17847 -1796502 -3490585 -5011433 -6299226
9153 -6299226 -7331296 -8130301 -8764211 -9331812 -9936331 -10657726 -11535088 -12565247 -13715884
9144 -13715884 -14944212 -16209447 -17472746 -18689141 -19802235 -20747770 -21463233 -21898275 -22025025
9135 -22025025 -21849019 -21416459 -20809708 -20127500 -19456240 -18844391 -18290055 -17745446 -17135091
9126 -17135091 -16379559 -15415851 -14210597 -12768110 -11135414 -9400981 -7682178 -6103197
9118 -6103197 -4773554 -3776267 -3165448 -2966236 -3172344 -3742279 -4597309 -5623199 -6678046
$$ packed form
9178a2476787J168318J350835J477313J525196J494806J414724J331900J289827
9170a423868J304652J351806J373491J306348J113199P97212L91453o2110n24810
9161E627373r60229j330772j601971j752248j778655j694083j520848j287793
9153f299226j032070p99005o33910n67601o04519p21395q77362j030159j150637
9144a3715884j228328j265235j263299j216395j113094r45535p15463m35042j26750
9135b2025025J76006M32560O06751O82208O71260O11849N54336N44609O10355
9126a7135091P55532R63708J205254J442487J632696J734433J718803J578981
9118f103197J329643R97287O10819J99212k06108n69935q55030j025890j054847
$$ plain form
9109 -6678046 -7608966 -8276866 -8582725 -8486878 -8016400 -7259220 -6344365 -5409707 -4565009 -3864490
9099 -3864490 -3301892 -2830940 -2401166 -1990978 -1620890 -1340102 -1194470 -1195007 -1305931 -1459281
9089 -1459281 -1586631 -1647870 -1639612 -1580060 -1482770 -1337527 -1108710 -747910 -209100 542928
9079 542928 1530651 2760627 4212914 5827342 7500750 9107160 10537607 11739728 12734410
9070 12734410 13600584 14437797 15325180 16291667 17304085 18274541 19085158 19621920 19803060
9061 19803060 19589809 18980044 17997103 16685291 15112316 13370588 11571233 9831870 8262702
9052 8262702 6953005 5956614 5275935 4850005 4557286 4240040 3744168 2957307 1830563
9043 1830563 382245 -1309540 -3121362 -4907377 -6529536 -7886527 -8930982 -9670893
$$ packed form
9109f678046r30920o67900l05859R5847M70478P57180R14855R34658Q44698P00519
9099c864490N62598M70952M29774M10188L70088K80788J45632n37j10924j53350
9089a459281j27350o1239Q258N9552R7290J45243K28817L60800N38810P52028
9079E42928R87723J229976J452287J614428J673408J606410J430447J202121R94682
9070A2734410Q66174Q37213Q87383R66487J012418R70456Q10617N36762J81140
9061A9803060k13251o09765r82941j311812j572975j741728j799355j739363j569168
9052H262702j309697r96391o80679m25930k92719l17246m95872p86861j126744
9043A830563j448318j691785j811822j786015j622159j356991j044455p39911
$$ plain form
9035 -9670893 -10158649 -10473564 -10702261 -10920088 -11177515 -11495645 -11871598 -12288753 -12724177 -13150153
9025 -13150153 -13533678 -13838575 -14030155 -14080404 -13974964 -13722744 -13361307 -12947778 -12536237 -12157787
9015 -12157787 -11818173 -11509566 -11219668 -10928246 -10598683 -10179109 -9618392 -8888280 -7997442
9006 -7997442 -6988619 -5920173 -4840339 -3764338 -2663607 -1474309 -125444 1425100
8998 1425100 3165948 5030993 6916591 8703999 10281412 11568105 12537659 13226190 13713626
8989 13713626 14083963 14385788 14613567 14717078 14631968 14314927 13764921 13020771 12141187 11183253
8979 11183253 10189927 9184655 8167214 7112625 5981038 4740253 3389842 1971381
8971 1971381 558656 -764437 -1924656 -2870474 -3573991 -4028196 -4242096 -4233990 -4024266
$$ packed form
9035i670893m87756l14915k28697k17827k57427l18130l75953m17155m35424m25976
9025a3150153l83525l04897j91580n0249J05440K52220L61437M13529M11541L78450
9015a2157787L39614L08607K89898K91422L29563M19574N60717P30112Q90838
9006g997442J008823J068446J079834J076001J100731J189298J348865J550544
8998A425100J740848J865045J885598J787408J577413J286693R69554O88531M87436
8989A3713626L70337L01825K27779J03511q5110l17041n50006p44150q79584r57934
8979A1183253r93326j005272j017441j054589j131587j240785j350411j418461
8971A971381j412725j323093j160219r45818p03517m54205k13900Q106K09724
$$ plain form
8962 -4024266 -3631329 -3073181 -2373230 -1566290 -701579 158491 944526 1591985 2056554 2326005
8952 2326005 2419095 2367648 2190354 1876619 1394481 718586 -142432 -1138446 -2191520 -3216421
8942 -3216421 -4134872 -4883121 -5419499 -5733428 -5849212 -5818647 -5705416 -5571168 -5470353 -5451140
8932 -5451140 -5553529 -5799311 -6178295 -6641247 -7107193 -7484888 -7701247 -7725487 -7577211 -7312795
8922 -7312795 -6997014 -6677369 -6376481 -6104517 -5879956 -5742941 -5750690 -5955096 -6374295 -6975994
8912 -6975994 -7683761 -8401532 -9040434 -9535228 -9848962 -9970646 -9909087 -9683971 -9317095 -8828295
8902 -8828295 -8237625 -7570278 -6858863 -6139944 -5445609 -4793574 -4180442 -3582299 -2964393 -2297408
8892 -2297408 -1573671 -816199 -77793 567810 1040358 1273826 1243086 987546 615513 278675
$$ packed form
8962d024266L92937N58148O99951Q06940Q64711Q60070P86035O47459M64569K69451
8952B326005R3090n1447j77294l13735m82138o75895q61018r96014j053074j024901
8942c216421r18451p48249n36378l13929j15784L0565J13231J34248J00815J9213
8932e451140j02389k45782l78984m62952m65946l77695k16359k4240J48276K64416
8922g312795L15781L19645L00888K71964K24561J37015p749k04406m19199o01699
8912f975994p07767p17771o38902m94794l13734j21684O1559K25116L66876M88800
8902h828295N90670O67347P11415P18919O94335O52035O13132N98143O17906O66985
8892b297408P23737P57472P38406O45603M72548K33468l0740k55540l72033l36838
$$ plain form
8882 278675 123897 245495 660961 1317575 2119582 2958681 3735944 4372733 4813483 5023180
8872 5023180 4981793 4678974 4112810 3293819 2251139 1036042 -279746 -1608749 -2850975
8863 -2850975 -3895005 -4623691 -4933590 -4768243 -4150974 -3197296 -2096447 -1067587 -306665
8854 -306665 58769 -6297 -447160 -1146331 -1965064 -2787530 -3555265 -4279631 -5025416 -5872593
8844 -5872593 -6876875 -8049140 -9358233 -10746315 -12144161 -13482544 -14702784 -15767762
8836 -15767762 -16669235 -17426043 -18073166 -18647992 -19180299 -19686610 -20166041 -20598699 -20952382
8827 -20952382 -21199234 -21333458 -21377465 -21372667 -21363203 -21383640 -21455425 -21589757 -21792364 -22066851 -22415092
8816 -22415092 -22834674 -23313398 -23820587 -24296662 -24646941 -24747805 -24468086 -23698626 -22377713
$$ packed form
8882B78675j54778J21598M15466O56614Q02007Q39099P77263O36789M40750K09697
8872E023180m1387l02819n66164q18991j042680j215097j315788j329003j242226
8863b850975j044030p28686l09899J65347O17269R53678J100849J028860P60922
8854c06665L65434o5066m40863o99171q18733q22466p67735p24366p45785q47177
8844e872593j004282j172265j309093j388082j397846j338383j220240j064978
8836a5767762r01473p56808o47123n74826n32307n06311m79431m32658l53683
8827b0952382k46852j34224m4007M798R464k0437p1785j34332k02607k74487l48241
8816b2415092m19582m78724n07189m76075l50279j00864K79719P69460J320913
$$ plain form
8807 -22377713 -20504364 -18140025 -15403094 -12457106 -9489105 -6677686 -4159726 -2010739
8799 -2010739 -247546 1152106 2226886 3015982 3550855 3852077 3931744 3802862 3492044
8790 3492044 3046605 2528897 1998735 1492433 1009220 512322 -54695 -742798 -1574685 -2534966
8780 -2534966 -3577655 -4645634 -5689423 -6673490 -7568519 -8340550 -8951415 -9374687 -9615514
8771 -9615514 -9716676 -9744204 -9764160 -9829586 -9985392 -10280375 -10768313 -11491147 -12455247 -13618968
8761 -13618968 -14899714 -16192154 -17382122 -18349660 -18970033 -19127171 -18743298 -17811212 -16408495
8752 -16408495 -14683052 -12817051 -10986446 -9329789 -7930955 -6814987 -5955493 -5290201
8744 -5290201 -4737970 -4211434 -3626120 -2911410 -2024241 -958992 251622 1540240 2805261
$$ packed form
8807b2377713J873349K364339K736931K945988K968001K811419K517960K148987
8799b010739J763193J399652J074780P89096N34873L01222P9667j28882l10818
8790C492044m45439n17708n30162n06302m83213m96898n67017o88103q31887r60281
8780b534966j042689j067979j043789r84067q95029p72031o10865m23272k40827
8771i615514j01162k7528j9956o5426j55806k94983m87938p22834r64100j163721
8761a3618968j280746j292440j189968r67538o20373j57138L83873R32086J402717
8752a6408495J725443J866001J830605J656657J398834J115968Q59494O65292
8744e290201N52231N26536N85314P14710Q87169J065249J210614J288618J265021
$$ plain form
8735 2805261 3910579 4698916 5027695 4815330 4070791 2887178 1403983 -239210 -1935297
8726 -1935297 -3619357 -5259207 -6836461 -8329125 -9704584 -10924898 -11956453 -12772274
8718 -12772274 -13342910 -13623764 -13550518 -13047435 -12045469 -10505287 -8439982 -5928896 -3112036
8709 -3112036 -162516 2751619 5497574 7988180 10174711 12033394 13555515 14743795
8701 14743795 15612829 16192091 16531331 16704842 16806020 16926137 17122703 17392871 17666449
8692 17666449 17824097 17736766 17313956 16541232 15489106 14291584 13111637 12112905 11440918
8683 11440918 11204131 11451059 12154063 13212943 14478869 15786291 16979386 17928031 18536473
8674 18536473 18749891 18560178 18007171 17170500 16151842 15053504 13960938 12932849 11997569
$$ packed form
8735B805261J105318P88337L28779k12365p44539j183613j483195j643193j696087
8726a935297j684060j639850j577254j492664j375459j220314j031555q15821
8718a2772274n70636k80854P3246N03083J001966J540182K065305K511086K816860
8709c112036K949520K914135K745955K490606K186531J858683J522121J188280
8701A4743795Q69034N79262L39240J73511J01178J20117J96566K70168K73578
8692A7666449J57648q7331m22810p72724j052126j197522j179947r98732o71987
8683A1440918k36787K46928P03004J058880J265926J307422J193095R48645O08442
8674A8536473K13418j89713n53007q36671j018658j098338j092566j028089r35280
$$ plain form
8665 11997569 11153637 10375659 9627686 8881642 8131968 7398430 6718154 6134935 5690625
8656 5690625 5416243 5320770 5382592 5549836 5748118 5889360 5880920 5641056 5122188 4331362
8646 4331362 3333439 2232409 1140309 149076 -684315 -1339166 -1825866 -2180951 -2462515
8637 -2462515 -2740941 -3082857 -3534341 -4113433 -4816520 -5632815 -6555237 -7579572 -8693578
8628 -8693578 -9864546 -11032476 -12110376 -12991320 -13564106 -13737539 -13464680 -12753453 -11658688
8619 -11658688 -10266475 -8686101 -7051738 -5519785 -4247464 -3355271 -2893614 -2834677 -3093796
8610 -3093796 -3565622 -4155317 -4794496 -5442896 -6080178 -6691498 -7252904 -7726368 -8070218 -8258566
8600 -8258566 -8294664 -8207999 -8038941 -7824269 -7593556 -7374486 -7196189 -7081912 -7033761 -7022232
$$ packed form
8665A1997569q43932p77978p47973p46044p49674p33538o80276n83219m44310
8656E690625k74382r5473O1822J67244J98282J41242q440k39864n18868p90826
8646D331362r97923j101030j092100r91233q33391o54851m86700l55085k81564
8637b462515k78426l41916m51484n79092p03087q16295r22422j024335j114006
8628h693578j170968j167930j077900q80944n72786j73433K72859P11227J094765
8619a1658688J392213J580374J634363J531953J272321Q92193M61657N8937k59119
8610c093796m71826n89695o39179o48400o37282o11320n61406m73464l43850j88348
8600h258566l6098Q6665J69058K14672K30713K19070J78297J14277M8151J1529
$$ plain form
8590 -7022232 -6991766 -6881359 -6647293 -6274626 -5774586 -5176099 -4520683 -3861583 -3260217 -2774813
8580 -2774813 -2445228 -2284184 -2281838 -2421009 -2692919 -3102728 -3659747 -4356401 -5148216 -5949491
8570 -5949491 -6652043 -7160780 -7428088 -7467648 -7339767 -7118204 -6860084 -6595862 -6338817 -6098828
8560 -6098828 -5885980 -5702964 -5536102 -5354422 -5117809 -4788969 -4343385 -3774795 -3096426 -2338953
8550 -2338953 -1545748 -766411 -51238 550377 987882 1209427 1170619 852846 281454 -471015
8540 -471015 -1304194 -2124020 -2872271 -3535127 -4129921 -4683889 -5220605 -5758741 -6315591 -6905358
8530 -6905358 -7531138 -8179561 -8826947 -9454928 -10063226 -10668905 -11292718 -11942211 -12600865 -13227315
8520 -13227315 -13764669 -14157050 -14366656 -14383006 -14220576 -13908921 -13483371 -12981562 -12445421 -11924441
$$ packed form
8590g022232L0466J10407K34066L72667N00040N98487O55416O59100O01366M85404
8580b774813L29585J61044K346j39171k71910m09809n57019o96654p91815q01275
8570e949491p02552n08737k67308l9560J27881K21563K58120K64222K57045K39989
8560f098828K12848J83016J66862J81680K36613L28840M45584N68590O78369P57473
8550b338953P93205P79337P15173O01615M37505K21545l8808l17773n71392p52469
8540d71015q33179q19826p48251o62856n94794n53968n36716n38136n56850n89767
8530f905358o25780o48423o47386o27981o08298o05679o23813o49493o58654o26450
8520a3227315n37354l92381k09606j6350J62430L11655M25550N01809N36141N20980
$$ plain form
8510 -11924441 -11475687 -11158507 -11025283 -11110978 -11423163 -11934003 -12578029 -13260310 -13874600 -14324043
8500 -14324043 -14536419 -14472602 -14131815 -13554035 -12814228 -12004830 -11212373 -10500893 -9910525 -9468460
8490 -9468460 -9202117 -9145655 -9336302 -9801022 -10538197 -11504607 -12619373 -13787351 -14929957
8481 -14929957 -16005897 -17012919 -17974096 -18916837 -19851969 -20760657 -21597186 -22308266 -22856772
8472 -22856772 -23232670 -23443536 -23493508 -23367568 -23031605 -22445638 -21580554 -20432018 -19031001
8463 -19031001 -17449329 -15794035 -14186735 -12735743 -11515553 -10561382 -9874230 -9429396 -9187653
8454 -9187653 -9110276 -9172762 -9367852 -9694738 -10141944 -10675297 -11236886 -11752374 -12139632 -12314765
8444 -12314765 -12198815 -11731275 -10889761 -9705023 -8258866 -6663087 -5030836 -3457004 -2017560
$$ packed form
8510a1924441M48754L17180J33224q5695l12185n10840o44026o82281o14290m49443
8500a4324043k12376O3817L40787N77780P39807Q09398P92457P11480N90368M42065
8490i468460K66343N6462j90647m64720p37175r66410j114766j167978j142606
8481a4929957j075940j007022r61177r42741r35132r08688q36529p11080n48506
8472b2856772l75898k10866m9972J25940L35963N85967Q65084J148536J401017
8463a9031001J581672J655294J607300J450992J220190R54171O87152M44834K41743
8454i187653P7377o2486j95090l26886m47206n33353n61589n15488l87258j75133
8444a2314765J15950M67540Q41514J184738J446157J595779J632251J573832J439444
$$ plain form
8435 -2017560 -784299 160288 723488 821106 403078 -528293 -1914251 -3649848 -5607543
8426 -5607543 -7669504 -9756299 -11837567 -13920076 -16021646 -18144240 -20256944 -22295305
8418 -22295305 -24177112 -25824798 -27179155 -28197317 -28843214 -29084773 -28903631 -28311317 -27361804
8409 -27361804 -26153111 -24814633 -23481295 -22262089 -21215219 -20340087 -19588233 -18887169 -18167758
8400 -18167758 -17386604 -16537160 -15646353 -14758252 -13911126 -13115763 -12340843 -11510126 -10517726
8391 -10517726 -9264967 -7709098 -5899202 -3975822 -2132567 -561466 591451 1247330
8383 1247330 1393938 1070567 346306 -699354 -1985985 -3431073 -4945553 -6434999 -7809452
8374 -7809452 -8996652 -9949715 -10644489 -11070700 -11226347 -11120645 -10780807 -10252794 -9591152
$$ packed form
8435b017560J233261R44587N63200R7618m18028r31371j385958j735597j957695
8426e607543k061961k086795k081268k082509k101570k122594k112704k038361
8418b2295305j881807j647686j354357j018162o45897k41559J81142N92314R49513
8409b7361804J208693J338478J333338J219206J046870Q75132P51854P01064P19411
8400a8167758P81154Q49444Q90807Q88101Q47126P95363P74920Q30717R92400
8391a0517726J252759J555869J809896J923380J843255J571101J152917O55879
8383A247330J46608l23371p24261j045660j286631j445088j514480j489446j374453
8374g809452j187200r53063o94774m26211j55647J05702L39838N28013O61642
$$ plain form
8365 -9591152 -8842722 -8033879 -7168007 -6233423 -5216766 -4114965 -2940140 -1715793 -467710
8356 -467710 783641 2023453 3235353 4392178 5452359 6366402 7091898 7610496 7938154
8347 7938154 8122101 8223716 8293589 8349081 8363993 8275580 8008261 7505961 6758719 5809682
8337 5809682 4739100 3636275 2576631 1614283 787614 127705 -339058 -596456 -648435
8328 -648435 -526755 -289066 -4421 268422 497907 682158 838243 988056 1149308 1332766
8318 1332766 1543060 1781229 2047123 2338083 2642861 2936284 3181126 3335526 3357622 3203928
8308 3203928 2827946 2186874 1256047 44163 -1397224 -2974064 -4562694 -6033298 -7274388
8299 -7274388 -8207038 -8786320 -8997166 -8851756 -8388135 -7666294 -6761799 -5760905 -4758833
$$ packed form
8365i591152P48430Q08843Q65872R34584J016657J101801J174825J224347J248083
8356d67710J251351J239812J211900J156825J060181R14043P25496N18598L27658
8347G938154J83947J01615O9873N5492J4912q8413k67319n02300p47242r49037
8337E809682j070582j102825j059644r62348q26669o59909m66763k57398n1979
8328f48435J21680K37689K84645K72843K29485J84251J56085J49813J61252J83458
8318A332766K10294K38169K65894K90960L04778K93423K44842J54400K2096j53694
8308C203928l75982o41072r30827j211884j441387j576840j588630j470604j241090
8299g274388r32650n79282k10846J45410M63621P21841R04495J000894J002072
$$ plain form
8290 -4758833 -3857067 -3153120 -2720440 -2584890 -2710996 -3008859 -3360750 -3653823 -3803185 -3758606
8280 -3758606 -3499337 -3025676 -2353393 -1512676 -549720 472997 1481068 2396651 3147309
8271 3147309 3672090 3925519 3881655 3537844 2915217 2054003 1004984 -179580 -1452421
8262 -1452421 -2773130 -4105458 -5412632 -6654859 -7791261 -8784515 -9604009 -10224707 -10622804
8253 -10622804 -10773508 -10657419 -10277044 -9675292 -8941526 -8196455 -7561984 -7132905 -6964293
8244 -6964293 -7076050 -7465686 -8118710 -9010710 -10102066 -11331756 -12617961 -13868587 -14997544
8235 -14997544 -15938602 -16650740 -17114314 -17321656 -17267475 -16944562 -16349061 -15495000 -14430285
8226 -14430285 -13241202 -12036932 -10919384 -9955653 -9168751 -8548248 -8069653 -7709531 -7449759
$$ packed form
8290d758833R01766P03947M32680J35550j26106k97863l51891k93073j49362M4579
8280c758606K59269M73661O72283Q40717R62956J022717J008071R15583P50658
8271C147309N24781K53429m3864l43811o22627q61214j049019j184564j272841
8262a452421j320709j332328j307174j242227j136402r93254q19494o20698l98097
8253a0622804j50704J16089L80375O01752P33766P45071O34471M29079J68612
8244f964293j11757l89636o53024q92000j091356j229690j286205j250626j128957
8235a4997544r41058p12138m63574k07342N4181L22913N95501Q54061J064715
8226a4430285J189083J204270J117548R63731P86902O20503M78595L60122K59772
$$ plain form
8217 -7449759 -7270957 -7139975 -6999872 -6771041 -6365624 -5708518 -4754640 -3495858 -1957359
8208 -1957359 -188158 1747003 3768878 5780198 7667519 9316828 10639130 11591463
8200 11591463 12180725 12449658 12454524 12245566 11857256 11310317 10622715 9822624 8954480 8072262
8190 8072262 7221521 6419495 5645605 4849154 3970354 2962584 1804514 499021 -935405
8181 -935405 -2471354 -4070330 -5672211 -7185985 -8496514 -9495122 -10123507 -10404740 -10438155
8172 -10438155 -10358249 -10282101 -10274973 -10347354 -10474942 -10622837 -10759465 -10857154 -10886006 -10811015 -10597990
8161 -10597990 -10225581 -9695359 -9033435 -8282858 -7490964 -6697913 -5931936 -5212561 -4556624
8152 -4556624 -3979211 -3487371 -3073377 -2715430 -2385050 -2052464 -1684662 -1241665 -681689 21875
$$ packed form
8217g449759J78802J30982J40103K28831M05417O57106R53878J258782J538499
8208a957359J769201J935161K021875K011320J887321J649309J322302R52333
8200A1591463N89262K68933M866k08958l88310n46939o87602q00091q68144q82218
8190H072262q50741q02026p73890p96451q78800j007770j158070j305493j434426
8181i35405j535949j598976j601881j513774j310529r98608o28385k81233l3415
8172a0438155P9906P6148P128p2381j27588j47895j36628r7689k8852P4991K13025
8161a0597990L72409N30222O61924P50577P91894P93051P65977P19375O55937
8152d556624N77413M91840M13994L57947L30380L32586L67802M42997N59976P03564
$$ plain form
8142 21875 861899 1792727 2745624 3655837 4484492 5223712 5885937 6486774 7029909 7497246
8132 7497246 7844962 8008223 7918300 7530682 6852866 5955070 4953592 3971956 3097709 2354000
8122 2354000 1696944 1039447 292522 -592962 -1603352 -2668072 -3687540 -4565299 -5229301
8113 -5229301 -5638543 -5779944 -5661922 -5308604 -4755825 -4048162 -3235677 -2369846 -1499370 -667681
8103 -667681 85901 721573 1196152 1470204 1528137 1401657 1179647 993914 984841 1260525
8093 1260525 1863560 2756839 3835571 4963223 6015821 6914176 7633303 8193230 8640961
8084 8640961 9029225 9394949 9743711 10048225 10262657 10345310 10278677 10079024 9792425 9477843
8074 9477843 9183114 8925424 8688702 8441653 8165936 7874740 7606419 7395193 7239185 7089920
$$ packed form
8142B1875Q40024R30828R52897R10213Q28655P39220O62225O00837N43135M67337
8132G497246L47716J63261q9923l87618o77816q97796j001478r81636q74247p43709
8122B354000o57056o57497p46925q85484j010390j064720j019468q77759o64002
8113e229301m09242j41401J18022L53318N52779P07663Q12485Q65831Q70476Q31689
8103f67681P53582O35672M74579K74052N7933j26480k22010j85733r073K75684
8093A260525O03035Q93279J078732J127652J052598Q98355P19127N59927M47731
8084H640961L88264L65724L48762L04514K14432Q2653o6633j99653k86599l14582
8074I477843k94729k57690k36722k47049k75717k91196k68321k11226j56008j49265
$$ plain form
8064 7089920 6872675 6525516 6033906 5443341 4845685 4345923 4023073 3902640 3954787 4118704
8054 4118704 4337389 4581277 4848944 5148760 5474818 5790683 6029591 6111939 5971831 5578433
8044 5578433 4941460 4101516 3115518 2046810 961911 -69795 -977299 -1692439 -2159814
8035 -2159814 -2352527 -2288440 -2036292 -1703015 -1402998 -1220180 -1178299 -1232622 -1288558 -1240375
8025 -1240375 -1011911 -579560 31191 768683 1581366 2433208 3303217 4174758 5027451 5842684
8015 5842684 6621716 7401616 8251735 9246280 10426410 11773276 13206154 14604369 15838918
8006 15838918 16797291 17393394 17567061 17284355 16545301 15394689 13925324 12267482 10567719
7997 10567719 8964839 7568710 6444802 5608627 5034484 4676211 4488056 4432825 4475320
$$ packed form
8064G089920k17245l47159m91610n90565n97656m99762l22850j20433N2147J63917
8054D118704K18685K43888K67667K99816L26058L15865K38908Q2348j40108l93398
8044E578433o36973q39944r85998j068708j084899j031706r07504p15140m67375
8035b159814j92713O4087K52148L33277L00017J82818M1881n4323n5936M8183
8025a240375K28464M32351O10751P37492Q12683Q51842Q70009Q71541Q52693Q15233
8015E842684P79032P79900Q50119R94545J180130J346866J432878J398215J234549
8006A5838918R58373N96103J73667k82706p39054j150612j469365j657842j699763
7997A0567719j602880j396129j123908q36175n74143l58273j88155n5231M2495
$$ plain form
7988 4475320 4571084 4662204 4684310 4581422 4322916 3916677 3412841 2894729 2458932 2191600
7978 2191600 2150002 2355780 2799494 3448144 4245449 5103688 5899119 6485527 6726758 6531612
7968 6531612 5871053 4771406 3294150 1517818 -470909 -2580918 -4721947 -6812235
7960 -6812235 -8782744 -10573957 -12129720 -13397686 -14339790 -14944001 -15224007 -15203817 -14899825
7951 -14899825 -14316233 -13456049 -12334117 -10979056 -9426615 -7717637 -5906680 -4071655
7943 -4071655 -2310369 -720967 622851 1687056 2474717 3008748 3312929 3406407 3316514
7934 3316514 3097658 2836223 2631746 2564252 2668357 2929627 3303832 3746006 4230714 4751019
7924 4751019 5298887 5844008 6329367 6688642 6873901 6875475 6723127 6471123 6178961 5898408
$$ packed form
7988D475320R5764R1120K2106j02888k58506m06239n03836n18112m35797k67332
7978B191600m1598K05778M43714O48650P97305Q58239P95431N86408K41231j95146
7968F531612o60559j099647j477256j776332j988727k110009k141029k090288
7960f812235j970509j791213j555763j267966r42104o04211k80006K0190L03992
7951a4899825N83592Q60184J121932J355061J552441J708978J810957J835025
7943d071655J761286J589402J343818J064205P87661N34031L04181R3478q9893
7934C316514k18856k61435k04477o7494J04105K61270L74205M42174M84708N20305
7924D751019N47868N45121M85359L59275J85259J574j52348k52004k92162k80553
$$ plain form
7914 5898408 5670031 5526162 5496630 5614878 5921567 6461329 7270532 8360014 9701576
7905 9701576 11226372 12837033 14427421 15899457 17170200 18171890 18853926 19191041 19191426
7896 19191426 18895128 18361440 17653578 16828659 15932997 14998791 14042178 13066125 12068122
7887 12068122 11046930 10003753 8939960 7856545 6755792 5641042 4512988 3367142
7879 3367142 2197413 1004327 -198523 -1384565 -2520954 -3579184 -4545219 -5423746 -6233385
7870 -6233385 -6996214 -7729481 -8444290 -9148935 -9851902 -10561955 -11285280 -12020252 -12752425 -13454286
$$ packed form
7914E898408k28377j43869k9532J18248L06689N39762Q09203J089482J341562
7905I701576J524796J610661J590388J472036J270743J001690O82036L37115L85
7896A9191426k96298n33688p07862q24919q95662r34206r56613r76053r98003
7887A2068122j021192j043177j063793j083415j100753j114750j128054j145846
7879C367142j169729j193086j202850j186042j136389j058230r66035q78527q09639
7870f233385p62829p33267p14809p04645p02967p10053p23325p34972p32173p01861
$$ [...]
##END NTUPLES=NMR SPECTRUM
##END=
