##TITLE=31Pdec_LR-780-R3-B1H
 
 64 sc
 13.2.2024
##JCAMPDX= 6.0         $$ Bruker NMR JCAMP-DX V2.0
##DATA TYPE= NMR SPECTRUM
##DATA CLASS= NTUPLES
##ORIGIN= UXNMR, Bruker Analytische Messtechnik GmbH
##OWNER= root
$$ XWIN-NMR		Version 3.5
$$ Tue Feb 13 16:07:04 2024 Russian Standard Time (UT+4h)  she@DPX200
##.OBSERVE FREQUENCY= 81.013821
##.OBSERVE NUCLEUS= ^31P
##.ACQUISITION MODE= SIMULTANEOUS
##.ACQUISITION SCHEME= undefined
##.AVERAGES= 24
##.DIGITISER RES= 16
##SPECTROMETER/DATA SYSTEM= spect
##.PULSE SEQUENCE= zgpg30
##.SOLVENT NAME= CDCl3
##.SHIFT REFERENCE= (INTERNAL, CDCl3, 0, 248.564)
##AUDIT TRAIL= $$ (NUMBER, WHEN, WHO, WHERE, WHAT)
$$ ##TITLE= Audit trail, XWIN-NMR		Version 3.5
$$ ##JCAMPDX= 5.01
$$ ##ORIGIN= Bruker BioSpin GmbH
$$ ##OWNER= she
$$ F:/spectra/data/she/nmr/P31/1/pdata/1/auditp.txt
$$ ##AUDIT TRAIL=  $$ (NUMBER, WHEN, WHO, WHERE, WHAT)
(   1,<2024-02-13 16:06:05.48 +0400>,<she>,<DPX200>,
      <created by zg, POWCHK disabled, PULCHK disabled
       configuration hash MD5:
       00 E9 B6 7A A2 85 ED C7 34 08 36 98 17 FE 4E 26
       data hash MD5: 32K
       60 C0 AB 63 D3 6A 12 62 CC BF CA 1F 60 19 92 21>)
(   2,<2024-02-13 16:06:09.53 +0400>,<she>,<DPX200>,
      <Start of raw data processing
       efp BC_mod = 2 LB = 10 FT_mod = 6 PKNL = 1 PHC0 = -12968.6 PHC1 = 249.4835 SI = 64K 
       data hash MD5: 64K
       E7 BF 90 6E C3 5F 00 C3 E9 B5 1B FA B8 6D C2 7F>)
(   3,<2024-02-13 16:06:26.34 +0400>,<she>,<DPX200>,
      <pk PHC0 = -53.30947 PHC1 = 139 
       data hash MD5: 64K
       DF EE F5 19 4A 83 BB 9B CB BA 4C 74 36 97 43 91>)
(   4,<2024-02-13 16:06:33.75 +0400>,<she>,<DPX200>,
      <abs ABSG = 5 
       data hash MD5: 64K
       76 AE 8C 4C 5A D1 68 1B 62 FA 32 6E 76 BD EC A2>)
$$ ##END=
$$ 
$$ hash MD5
$$ 92 D8 37 C6 62 3A 4E 61 4D DB 45 A1 8A F4 C1 AF
##$RELAX= 
##$RELAX= 
##$RELAX= 
##$RELAX= 
##$RELAX= 
##$RELAX= 
##$RELAX= 
##$RELAX= 
##$RELAX= 
$$ Bruker specific parameters
$$ --------------------------
##$DU= <F:/spectra>
##$EXPNO= 1
##$NAME= <P31>
##$PROCNO= 1
##$TYPE= <nmr>
##$USER= <she>
##$AMP= (0..31)
100 100 100 100 100 100 100 100 100 100 100 100 100 100 100 100 100 100 
100 100 100 100 100 100 100 100 100 100 100 100 100 100 
##$AQSEQ= 0
##$AQ_mod= 1
##$AUNM= <au_zg>
##$AUTOPOS= <>
##$BF1= 81.014009
##$BF2= 200.13
##$BF3= 200.13
##$BF4= 200.13
##$BF5= 200.13
##$BF6= 200.13
##$BF7= 200.13
##$BF8= 200.13
##$BYTORDA= 1
##$CFDGTYP= 0
##$CFRGTYP= 5
##$CHEMSTR= <none>
##$CNST= (0..31)
1 1 145 1 1 1 1 1 1 1 1 1 1 1 1 1 1 1 1 1 1 1 1 1 1 1 1 1 1 1 1 1 
##$CPDPRG= <waltz16>
##$CPDPRG1= <>
##$CPDPRG2= <waltz16>
##$CPDPRG3= <>
##$CPDPRG4= <mlev>
##$CPDPRG5= <mlev>
##$CPDPRG6= <mlev>
##$CPDPRG7= <mlev>
##$CPDPRG8= <mlev>
##$CPDPRGB= <>
##$CPDPRGT= <>
##$D= (0..31)
0 1 0 0 0 0 0 0 0 0 0 0.03 2e-05 3e-06 0 0 0 0 0 0 0 0 0 0 0 0 0 0 0 0 
0 0 
##$DATE= 1707825964
##$DBL= (0..7)
120 120 120 11 120 120 24 19 
##$DBP= (0..7)
150 150 150 150 150 150 150 150 
##$DBP07= 0
##$DBPNAM0= <>
##$DBPNAM1= <>
$$ [...]
##$SUBNAM3= <"">
##$SUBNAM4= <"">
##$SUBNAM5= <"">
##$SUBNAM6= <"">
##$SUBNAM7= <"">
##$SUBNAM8= <"">
##$SUBNAM9= <"">
##$SW= 501.771253377433
##$SWIBOX= (0..15)
0 1 3 0 0 0 0 0 0 0 0 0 0 0 0 0 
##$SW_h= 40650.406504065
##$TD= 32768
##$TD0= 1
##$TE= 0
##$TE2= 300
##$TE3= 300
##$TEG= 300
##$TL= (0..7)
0 120 53 12 22 120 120 120 
##$TP= (0..7)
150 150 150 150 150 150 150 150 
##$TP07= 0
##$TPNAME0= <>
##$TPNAME1= <>
##$TPNAME2= <>
##$TPNAME3= <>
##$TPNAME4= <>
##$TPNAME5= <>
##$TPNAME6= <>
##$TPNAME7= <>
##$TPOAL= (0..7)
0.5 0.5 0.5 0.5 0.5 0.5 0.5 0.5 
##$TPOFFS= (0..7)
0 0 0 0 0 0 0 0 
##$TUNHIN= 0
##$TUNHOUT= 0
##$TUNXOUT= 0
##$USERA1= <user>
##$USERA2= <user>
##$USERA3= <user>
##$USERA4= <user>
##$USERA5= <user>
##$V9= 5
##$VALIST= <valist>
##$VCLIST= <CCCCCCCCCCCCCCC>
##$VD= 0
##$VDLIST= <DDDDDDDDDDDDDDD>
##$VPLIST= <PPPPPPPPPPPPPPP>
##$VTLIST= <TTTTTTTTTTTTTTT>
##$WBST= 1024
##$WBSW= 4
##$XGAIN= (0..3)
0 0 0 0 
##$XL= 0
##$YL= 0
##$YMAX_a= 3195
##$YMIN_a= -2213
##$ZGOPTNS= <>
##$ZL1= 120
##$ZL2= 120
##$ZL3= 120
##$ZL4= 120
##$ABSF1= 248.5645
##$ABSF2= -253.2056
##$ABSG= 5
##$ABSL= 3
##$ALPHA= 0
##$AQORDER= 0
##$ASSFAC= 0
##$ASSFACI= 0
##$ASSFACX= 0
##$ASSWID= 0
##$AUNMP= <proc_1d>
##$AZFE= 0.1
##$AZFW= 0.5
##$BCFW= 0
##$BC_mod= 2
##$BYTORDP= 0
##$COROFFS= 0
##$CY= -3
##$DATMOD= 1
##$DC= 0
##$DFILT= <>
##$DTYPP= 0
##$F1P= 0
##$F2P= 0
##$FCOR= 1
##$FTSIZE= 65536
##$FT_mod= 6
##$GAMMA= 0
##$GB= 0
##$INTBC= 1
##$INTSCL= 6.047779e-11
##$ISEN= 30
##$LB= 10
##$LEV0= 0
##$LPBIN= 0
##$MAXI= 10000
##$MC2= 0
##$MEAN= 0
##$ME_mod= 0
##$MI= 50
##$NCOEF= 0
##$NC_proc= -10
##$NLEV= 6
##$NOISF1= 182.463
##$NOISF2= 159.3651
##$NSP= 0
##$NTH_PI= 0
##$NZP= 0
##$OFFSET= 248.5645
##$PC= 4
##$PHC0= -13021.91
##$PHC1= 388.4835
##$PH_mod= 1
##$PKNL= yes
##$PPARMOD= 0
##$PSCAL= 0
##$PSIGN= 0
##$REVERSE= no
##$SF= 81.0140089999694
##$SI= 65536
##$SIGF1= 159.3651
##$SIGF2= -187.1042
##$SINO= 113.3802
##$SIOLD= 16384
##$SREGLST= <1H.CDCl3>
##$SSB= 0
##$STSI= 65536
##$STSR= 0
##$SW_p= 40650.406504065
##$SYMM= 0
##$S_DEV= 0
##$TDeff= 32768
##$TDoff= 0
##$TI= <>
##$TILT= no
##$TM1= 0
##$TM2= 0
##$TOPLEV= 0
##$USERP1= <user>
##$USERP2= <user>
##$USERP3= <user>
##$USERP4= <user>
##$USERP5= <user>
##$WDW= 1
##$XDIM= 65536
##$YMAX_p= 309994457
##$YMIN_p= -329050885
$$ End of Bruker specific parameters
$$ ---------------------------------
##NTUPLES= NMR SPECTRUM
##VAR_NAME=  FREQUENCY,     SPECTRUM/REAL,   SPECTRUM/IMAG
##SYMBOL=    X,             R,               I
##VAR_TYPE=  INDEPENDENT,   DEPENDENT,       DEPENDENT
##VAR_FORM=  AFFN,          ASDF,            ASDF
##VAR_DIM=   65536,         65536,           65536
##UNITS=     HZ,            ARBITRARY UNITS, ARBITRARY UNITS
##FACTOR=    0.620285442955139, 1,           1
##FIRST=     20137.2065510682, 0,            0
##LAST=      -20513.1999529968, 0,           0
##MIN=       -20513.1999529968, -329050885,  0
##MAX=       20137.2065510682, 309994457,    0
$$ Real data points
##PAGE= N=1
##DATA TABLE= (X++(R..R)), XYDATA
$$ [...]
$$ plain form
13180 -2950734 -2092446 -1311093 -583211 120871 821067 1515566 2177736 2762456 3218128
13171 3218128 3500152 3583934 3475941 3219257 2889946 2584444 2401813 2424537 2700079 3226750
13161 3226750 3949842 4772329 5577986 6258842 6737228 6974893 6966506 6721963 6249067 5548727
13151 5548727 4625977 3507542 2251455 941370 -329333 -1472187 -2410167 -3078956 -3430488
13142 -3430488 -3442020 -3125763 -2530466 -1730719 -808152 166108 1140901 2086603 2993363 3867699
13132 3867699 4724076 5568854 6382182 7109444 7669637 7977006 7965243 7605591 6915412 5955957
13122 5955957 4818625 3602363 2390196 1234625 156781 -843502 -1774497 -2643011
13114 -2643011 -3450305 -4191281 -4854953 -5427248 -5897847 -6268920 -6559612 -6801417 -7025838
$$ packed form
13180b950734Q58288P81353P27882P04082P00196O94499O62170N84720M55672
13171C218128K82024Q3782j07993k56684l29311l05502j82631K2724K75542N26671
13161C226750P23092Q22487Q05657O80856M78386K37665q387k44543m72896p00340
13151E548727r22750j118435j256087j310085j270703j142854r37980o68789l51532
13142c430488j1532L16257N95297P99747R22567R74260R74793R45702R06760Q74336
13132C867699Q56377Q44778Q13328P27262N60193L07369j1763l59652o90179r59455
13122E955957j137332j216262j212167j155571j077844j000283r30995q68514
13114b643011q07294p40976o63672n72295m70599l71073k90692k41805k24421
$$ plain form
13105 -7025838 -7251100 -7474586 -7673881 -7814942 -7863389 -7793915 -7594077 -7261929 -6800548 -6213783
13095 -6213783 -5505819 -4683730 -3759692 -2750268 -1673694 -548855 601710 1747086 2846406
13086 2846406 3852773 4720622 5412773 5905179 6188909 6269331 6163363 5896956 5503939
13077 5503939 5023850 4495306 3946077 3386206 2809371 2201129 1548439 846382 100779
13068 100779 -674266 -1464247 -2263650 -3079337 -3923747 -4802465 -5705821 -6611013 -7493548 -8340883
13058 -8340883 -9159187 -9966627 -10774196 -11564976 -12286545 -12863509 -13223124 -13318620 -13138456 -12700422
13048 -12700422 -12038300 -11190745 -10198501 -9109799 -7987896 -6911840 -5964370 -5209424 -4671055
13039 -4671055 -4327483 -4124777 -4001345 -3908891 -3821984 -3738139 -3673177 -3653484 -3705608 -3847051
$$ packed form
13105g025838k25262k23486j99295j41061m8447O9474J99838L32148M61381N86765
13095f213783P07964Q22089R24038J009424J076574J124839J150565J145376J099320
13086B846406J006367Q67849O92151M92406K83730Q0422j05968k66407l93017
13077E503939m80089n28544n49229n59871n76835o08242o52690p02057p45603
13068A00779p75045p89981p99403q15687q44410q78718r03356r05192q82535q47335
13058h340883q18304q07440q07569p90780p21569n76964l59615r5496J80164M38034
13048a2700422O62122Q47555R92244J088702J121903J076056R47470P54946N38369
13039d671055L43572K02706J23432R2454Q6907Q3845O4962J9693n2124j41443
$$ plain form
13029 -3847051 -4083603 -4413675 -4833940 -5339979 -5920702 -6549816 -7179271 -7739824 -8153183
13020 -8153183 -8355427 -8322526 -8082663 -7705190 -7270541 -6837717 -6425662 -6014123 -5559603 -5019143
13010 -5019143 -4375044 -3652019 -2917660 -2263389 -1774570 -1505224 -1468288 -1641589 -1981634 -2436437
13000 -2436437 -2952965 -3480166 -3971580 -4390178 -4714113 -4939630 -5078650 -5151741 -5179085 -5172490
12990 -5172490 -5131027 -5041462 -4882561 -4631872 -4274817 -3815707 -3286740 -2748478 -2278588 -1952860
12980 -1952860 -1826590 -1922244 -2225057 -2686031 -3231040 -3773751 -4229757 -4530361 -4635374 -4542813
12970 -4542813 -4291309 -3951755 -3609170 -3340654 -3197330 -3195808 -3319902 -3529366 -3771640 -3994051
12960 -3994051 -4154733 -4229694 -4213057 -4110040 -3926353 -3659714 -3297225 -2818796 -2204520 -1443832
$$ packed form
13029c847051k36552l30072m20265n06039n80723o29114o29455n60553m13359
13020h153183k02244L2901K39863L77473M34649M32824M12055M11539M54520N40460
13010e019143O44099P23025P34359O54271M88819K69346L6936j73301l40045m54803
13000b436437n16528n27201m91414m18598l23935k25517j39020p3091k7344O595
12990e172490M1463Q9565J58901K50689L57055M59110N28967N38262M69890L25728
12980a952860J26270r5654l02813m60974n45009n42711m56006l00604j05013R2561
12970d542813K51504L39554L42585K68516J43324J522j24094k09464k42274k22411
12960c994051j60682p4961J6637J03017J83687K66639L62489M78429O14276P60688
$$ plain form
12950 -1443832 -544579 460761 1515076 2544674 3473950 4242521 4819534 5209823 5447667
12941 5447667 5578463 5636010 5627680 5535994 5334669 5009106 4570644 4059079 3533696 3057053
12931 3057053 2677950 2419809 2277308 2219910 2199116 2157699 2040590 1805944 1432763 922137
12921 922137 293444 -419741 -1171408 -1905352 -2562454 -3092514 -3464333 -3668414 -3712952 -3618323
12911 -3618323 -3414417 -3141311 -2850314 -2600437 -2446424 -2420683 -2518911 -2699593 -2898439 -3049052
12901 -3049052 -3100084 -3024954 -2824171 -2520188 -2145499 -1728445 -1283556 -810565 -300979 252348
12891 252348 847824 1473577 2112097 2747061 3366954 3963455 4527601 5048376 5515358 5922674
12881 5922674 6269988 6558631 6785205 6937434 6995523 6938301 6750414 6427146 5976147 5417843
$$ packed form
12950a443832Q99253J005340J054315J029598R29276P68571N77013L90289K37844
12941E447667J30796N7547q330r1686k01325l25563m38462n11565n25383m76643
12931C057053l79103k58141j42501n7398k0794m1417j17109k34646l73181n10626
12921I22137o28693p13185p51667p33944o57102n30060l71819k04081m4538R4629
12911c618323K03906K73106K90997K49877J54013K5741r8228j80682j98846j50613
12901c049052n1032P5130K00783L03983L74689M17054M44889M72991N09586N53327
12891B52348N95476O25753O38520O34964O19893N96501N64146N20775M66982M07316
12881E922674L47314K88643K26574J52229N8089n7222j87887l23268m50999n58304
$$ plain form
12871 5417843 4786460 4130805 3510522 2983652 2587496 2322558 2150566 2009491 1837647
12862 1837647 1594628 1270694 883069 462715 37554 -380764 -800673 -1243675 -1731218
12853 -1731218 -2273966 -2869993 -3511448 -4192825 -4913505 -5673206 -6465250 -7273490 -8074414
12844 -8074414 -8841700 -9549807 -10175438 -10697558 -11096890 -11355061 -11453579 -11373984 -11101546 -10633333
12834 -10633333 -9987305 -9206239 -8352716 -7497441 -6706739 -6033005 -5507937 -5137754 -4902168
12825 -4902168 -4759900 -4660830 -4561123 -4436022 -4285941 -4133516 -4012399 -3952310 -3967239 -4052239
12815 -4052239 -4189422 -4359048 -4549766 -4763145 -5010298 -5301885 -5636806 -5996859 -6351721
12806 -6351721 -6671061 -6935131 -7137392 -7280898 -7375310 -7437476 -7490965 -7558556 -7649153 -7748354
$$ packed form
12871E417843o31383o55655o20283n26870l96156k64938j71992j41075j71844
12862A837647k43019l23934l87625m20354m25161m18318m19909m43002m87543
12853a731218n42748n96027o41455o81377p20680p59701p92044q08240q00924
12844h074414p67286p08107o25631n22120l99332k58171r8518P9595K72438M68213
12834a0633333O46028P81066Q53523Q55275P90702O73734N25068L70183K35586
12825d902168J42268R9070R9707J25101J50081J52425J21117O0089j4929q5000
12815d052239j37183j69626j90718k13379k47153k91587l34921l60053l54862
12806f351721l19340k64070k02261j43506r4412o2166n3489o7591r0597r9201
$$ plain form
12796 -7748354 -7821260 -7827962 -7743687 -7572579 -7346794 -7109874 -6892788 -6696670 -6492050 -6232444
12786 -6232444 -5870837 -5369243 -4700304 -3846140 -2798857 -1563226 -159813 1373535 2983538
12777 2983538 4606880 6177337 7632187 8917539 9994132 10843998 11475359 11922291 12238008
12768 12238008 12483613 12715469 12973919 13275094 13606307 13925255 14164243 14241733 14081619
12759 14081619 13635485 12898672 11912122 10748515 9489194 8202544 6932760 5701025
12751 5701025 4514019 3372426 2276191 1228363 239453 -669747 -1471039 -2137991 -2657081
12742 -2657081 -3035112 -3299692 -3492398 -3656497 -3823399 -4003954 -4188944 -4358083 -4491938
12733 -4491938 -4580213 -4622600 -4622902 -4581261 -4490691 -4340463 -4122579 -3834285 -3473401 -3030672 -2486889
$$ packed form
12796g748354p2906o702Q4275J71108K25785K36920K17086J96118K04620K59606
12786f232444L61607N01594O68939Q54164J047283J235631J403413J533348J610003
12777B983538J623342J570457J454850J285352J076593Q49866O31361M46932L15717
12768A2238008K45605K31856K58450L01175L31213L18948K38988P7490j60114
12759A4081619m46134p36813r86550j163607j259321j286650j269784j231735
12751E701025j187006j141593j096235j047828r88910r09200q01292o66952n19090
12742b657081l78031k64580j92706j64099j66902j80555j84990j69139j33855
12733d491938q8275m2387l02M1641R0570J50228K17884K88294L60884M42729N43783
$$ plain form
12722 -2486889 -1818712 -1010242 -63539 996868 2126213 3266504 4356535 5343335 6192083
12713 6192083 6889783 7439653 7848610 8114797 8222394 8147099 7870547 7396974 6762701 6031453
12703 6031453 5277020 4563022 3930423 3396572 2962414 2622564 2374419 2223733 2185048 2277455
12693 2277455 2518359 2917799 3473979 4169737 4970127 5821952 6656287 7395009 7961313
12684 7961313 8291738 8345185 8105542 7578568 6786743 5765792 4564016 3242617 1873262
12675 1873262 529944 -723499 -1844187 -2813532 -3633167 -4318764 -4896307 -5399946 -5867553
12666 -5867553 -6332032 -6810225 -7293593 -7745148 -8106512 -8315630 -8329614 -8142347 -7788358 -7332628
12656 -7332628 -6853414 -6425714 -6107811 -5930063 -5887345 -5940514 -6030707 -6102164 -6121771 -6084532
$$ packed form
12722b486889O68177Q08470R46703J060407J129345J140291J090031R86800Q48748
12713F192083O97700N49870M08957K66187J07597p5295k76552m73573o34273p31248
12703F031453p54433p13998o32599n33851m34158l39850k48145j50686l8685R2407
12693B277455K40904L99440N56180O95758Q00390Q51825Q34335P38722N66304
12684G961313L30425N3447k39643n26974p91825j020951j201776j321399j369355
12675A873262j343318j253443j120688r69345q19635o85597n77543n03639m67607
12666e867553m64479m78193m83368m51555l61364k09118j3984J87267L53989M55730
12656g332628M79214M27700L17903J77748M2718n3169r0193p1457j9607L7239
$$ plain form
12646 -6084532 -6003301 -5890572 -5743011 -5535849 -5229083 -4783162 -4178347 -3429119 -2585710 -1720774
12636 -1720774 -907196 -197239 389256 866007 1273684 1669185 2113399 2659413 3342615
12627 3342615 4173227 5130867 6161883 7182365 8089599 8780714 9172791 9218703 8917126
12618 8917126 8317766 7520419 6662742 5893597 5337209 5061141 5060784 5265185 5559902 5817850
12608 5817850 5929359 5824618 5483917 4933740 4230787 3440822 2621576 1816204 1056626
12599 1056626 369487 -222711 -706631 -1084434 -1376471 -1620027 -1866264 -2174507 -2600200
12590 -2600200 -3176581 -3898075 -4715784 -5548137 -6300138 -6882251 -7224780 -7288251 -7070304 -6608044
12580 -6608044 -5974680 -5269846 -4603244 -4073569 -3749057 -3657781 -3790644 -4112079 -4571039 -5108937
$$ packed form
12646f084532Q1231J12729J47561K07162L06766M45921O04815P49228Q43409Q64936
12636a720774Q13578P09957N86495M76751M07677L95501M44214N46014O83202
12627C342615Q30612R57640J031016J020482R07234O91115L92077M5912l01577
12618H917126n99360p97347q57677p69145n56388k76068l57K04401K94717K57948
12608E817850J11509j04741l40701n50177p02953p89965q19246q05372p59578
12599A056626o87139n92198m83920l77803k92037k43556k46237l08243m25693
12590b600200n76381p21494q17709q32353p52001n82113l42529o3471K17947M62260
12580f608044O33364P04834O66602N29675L24512R1276j32863l21435m58960n37898
$$ plain form
12570 -5108937 -5665269 -6181102 -6599537 -6864859 -6925748 -6746054 -6319131 -5676328 -4882886 -4022993
12560 -4022993 -3182293 -2435982 -1845017 -1456858 -1304856 -1402743 -1736241 -2258632 -2896872 -3568601
12550 -3568601 -4202300 -4750253 -5189560 -5515122 -5732381 -5854469 -5903116 -5909784 -5913610 -5954468
12540 -5954468 -6062733 -6250841 -6511969 -6826026 -7167501 -7509713 -7825408 -8087799 -8274589
12531 -8274589 -8373338 -8384974 -8323827 -8214337 -8085014 -7960183 -7851058 -7749394 -7627959 -7449995
12521 -7449995 -7184058 -6814744 -6340788 -5762227 -5069570 -4247773 -3294386 -2236784 -1132985
12512 -1132985 -54269 938484 1811160 2560206 3205799 3777776 4298019 4766321 5158600
12503 5158600 5440425 5587805 5601435 5505931 5336672 5123966 4883115 4612929 4300121 3925534
$$ packed form
12570e108937n56332n15833m18435k65322o0889J79694M26923O42803P93442Q59893
12560d022993Q40700P46311N90965L88159J52002r7887l33498n22391o38240o71729
12550c568601o33699n47953m39307l25562k17259j22088m8647o668l826m0858
12540e954468j08265j88108k61128l14057l41475l42212l15695k62391j86790
12531h274589r8749j1636O1147J09490J29323J24831J09125J01664J21435J77964
12521g449995K65937L69314M73956N78561O92657Q21797R53387J057602J103799
12512a132985J078716R92753Q72676P49046O45593N71977N20243M68302L92279
12503E158600K81825J47380J3630r5504j69259k12706k40851k70186l12808l74587
$$ plain form
12493 3925534 3469786 2917847 2262690 1508035 670389 -219538 -1117855 -1974516 -2747236
12484 -2747236 -3416587 -3992647 -4508356 -5004107 -5513213 -6054337 -6630349 -7230027 -7830819
12475 -7830819 -8403512 -8919178 -9356075 -9702495 -9954290 -10110400 -10170868 -10137739 -10014838 -9804034
12465 -9804034 -9501632 -9100494 -8598342 -8005804 -7347296 -6653934 -5953827 -5266136 -4601550
12456 -4601550 -3967271 -3372494 -2831301 -2362032 -1983512 -1709256 -1541765 -1469976 -1472008 -1522802
12446 -1522802 -1604082 -1713528 -1869656 -2108936 -2474111 -2997880 -3689305 -4528089 -5466570 -6436701
12436 -6436701 -7359969 -8158583 -8765259 -9129510 -9222024 -9040978 -8620362 -8033556 -7383535 -6778840
12426 -6778840 -6305774 -6011436 -5904582 -5968960 -6177897 -6503070 -6917519 -7395367 -7909214 -8426044
$$ packed form
12493C925534m55748n51939o55157p54655q37646q89927q98317q56661p72720
12484b747236o69351n76060n15709m95751n09106n41124n76012n99678o00792
12475g830819n72693n15666m36897l46420k51795j56110o0468L3129J22901K10804
12465i804034L02402M01138N02152N92538O58508O93362P00107O87691O64586
12456d601550O34279N94777N41193M69269L78520K74256J67491P1789k032n0794
12446a522802q1280j09446j56128k39280l65175n23769o91425q38784r38481r70131
12436f436701r23268p98614o06676l64251r2514J81046M20616N86806O50021O04695
12426f778840M73066K94338J06854o4378k08937l25173m14449m77848n13847n16830
$$ plain form
12416 -8426044 -8904721 -9298345 -9560712 -9652412 -9543125 -9211191 -8644536 -7845514 -6837985
12407 -6837985 -5671602 -4418642 -3163141 -1987211 -960535 -134896 459214 817236 965522
12398 965522 962082 889257 839004 895703 1122623 1555557 2202929 3048677 4055094 5166457
12388 5166457 6316992 7444750 8507481 9491839 10408263 11271078 12072890 12767704 13273971
12379 13273971 13497948 13366456 12853335 11988695 10849797 9540941 8172416 6845481 5644445
12370 5644445 4632602 3848984 3306671 2995688 2891048 2961622 3174192 3491505 3868719
12361 3868719 4253635 4592133 4835979 4949492 4913736 4728281 4409982 3987814 3495291 2965414
12351 2965414 2432296 1937096 1529779 1260218 1161203 1233144 1439223 1713097 1975517 2153514
$$ packed form
12416h426044m78677l93624k62367r1700J09287L31934N66655P99022J007529
12407f837985J166383J252960J255501J175930J026676Q25639N94110L58022J48286
12398I65522l440p2825n0253N6699K26920M32934O47372Q45748J006417J111363
12388E166457J150535J127758J062731R84358R16424Q62815Q01812O94814N06267
12379A3273971K23977j31492n13121q64640j138898j308856j368525j326935j201036
12370E644445j011843p83618n42313l10983j04640P0574K12570L17313L77214
12361C868719L84916L38498K43846J13513l5756j85455l18299m22168m92523n29877
12351B965414n33118m95200m07317k69561r9015P1941K06079K73874K62420J77997
$$ plain form
12341 2153514 2195697 2079660 1812072 1424931 970176 512478 120797 -138771 -208577 -47170
12331 -47170 358754 984435 1769223 2632808 3495453 4290372 4966282 5487317 5835748 6015091
12321 6015091 6048170 5969657 5818046 5631598 5447888 5303452 5231043 5254563 5383373 5608190
12311 5608190 5900869 6218942 6512977 6733132 6832934 6771353 6515120 6042150 5346036 4441880
12301 4441880 3372314 2209537 1048362 -10730 -883424 -1520442 -1917636 -2115457 -2188708
12292 -2188708 -2228641 -2320794 -2524440 -2860831 -3314423 -3843779 -4393361 -4900252 -5298545 -5528238
12282 -5528238 -5549533 -5354434 -4967148 -4433561 -3807676 -3141437 -2478088 -1847469 -1265297 -739811
12272 -739811 -282599 86698 349056 502320 570227 595278 621565 681103 790600 955315
$$ packed form
12341B153514M2183j16037k67588l87141m54755m57698l91681k59568o9806J61407
12331d7170M05924O25681P84788Q63585Q62645P94919O75910N21035L48431J79343
12321F015091L3079p8513j51611j86448j83710j44436p2409K3520J28810K24817
12311E608190K92679L18073K94035K20155R9802o1581k56233m72970o96114r04156
12301D441880j069566j162777j161175j059092q72694o37018l97194j97821p3251
12292b188708l9933r2153k03646l36391m53592n29356n49582n06891l98293k29693
12282e528238k1295J95099L87286N33587O25885O66239O63349O30619N82172N25486
12272g39811M57212L69297K62358J53264O7907K5051K6287N9538J09497J64715
$$ plain form
12262 955315 1173902 1442237 1756317 2112232 2500989 2900341 3270186 3556702 3704926 3675020
12252 3675020 3456522 3075735 2592999 2089706 1649374 1340174 1204841 1258741 1492936 1879137
12242 1879137 2375735 2934689 3507793 4050665 4524697 4898302 5148041 5259819 5231344 5076714
12232 5076714 4830719 4548035 4295013 4136796 4124492 4285295 4616872 5087764 5644651 6224031
12222 6224031 6763156 7206579 7508626 7634693 7563686 7291116 6829920 6206280 5451361 4593650
12212 4593650 3656181 2658469 1619739 560937 -493951 -1516350 -2471941 -3321329 -4022749
12203 -4022749 -4535874 -4826208 -4870760 -4665828 -4235676 -3637562 -2957163 -2291996 -1727982 -1319466
12193 -1319466 -1081068 -992125 -1008284 -1074320 -1136124 -1152534 -1106385 -1010509 -903280 -833070 -838856
$$ packed form
12262I55315K18587K68335L14080L55915L88757L99352L69845K86516J48224k9906
12252C675020k18498l80787m82736n03293m40332l09200j35333N3900K34195L86201
12242A879137M96598N58954N73104N42872M74032L73605K49739J11778k8475j54630
12232E076714k45995k82684k53022j58217j2304J60803L31577M70892N56887N79380
12222F224031N39125M43423L02047J26067p1007k72570m61196o23640p54919q57711
12212D593650r37469r97712j038730j058802j054888j022399r55591q49388p01420
12203d022749n13125k90334m4552K04932M30152N98114O80399O65167N64014M08516
12193a319466K38398Q8943j6159o6036o1804j6410M6149R5876J07229P0210n786
$$ plain form
12182 -838856 -937970 -1126847 -1390541 -1710649 -2064946 -2422036 -2741014 -2982980 -3130395 -3201338
12172 -3201338 -3247348 -3334627 -3519090 -3827836 -4252992 -4756107 -5277594 -5746612 -6089583 -6238290
12162 -6238290 -6139525 -5766119 -5125173 -4257601 -3226775 -2101112 -939794 211682 1316929
12153 1316929 2342356 3256666 4037475 4679072 5193353 5601187 5919133 6149588 6279128
12144 6279128 6284037 6139149 5826509 5341563 4695294 3912267 3026822 2079918 1116423 180358
12134 180358 -692426 -1480055 -2173744 -2769869 -3260789 -3631567 -3865112 -3952486 -3902455 -3745681
12124 -3745681 -3531692 -3319409 -3163817 -3102787 -3148438 -3286037 -3480343 -3685911 -3856661 -3951802
12114 -3951802 -3939015 -3798075 -3526570 -3145033 -2696325 -2236573 -1820283 -1485196 -1241221 -1065972
$$ packed form
12182h38856r9114j88877k63694l20108l54297l57090l18978k41966j47415p0943
12172c201338m6010q7279j84463l08746m25156n03115n21487m69018l42971j48707
12162f238290R8765L73406O40946Q67572J030826J125663J161318J151476J105247
12153A316929J025427R14310P80809O41597N14281M07834L17946K30455J29540
12144F279128M909j44888l12640m84946o46269p83027q85445r46904r63495r36065
12134A80358q72784p87629o93689n96125m90920l70778k33545q7374N0031J56774
12124c745681K13989K12283J55592O1030m5651j37599j94306k05568j70750r5141
12114c951802J2787J40940K71505L81537M48708M59752M16290L35087K43975J75249
$$ plain form
12104 -1065972 -909415 -709083 -411857 8097 545219 1173187 1861043 2583305 3319473
12095 3319473 4047531 4740522 5372305 5930509 6427606 6900785 7398651 7961408 8603974
12086 8603974 9307802 10022302 10674866 11188190 11501876 11592314 11483818 11246191 10978305 10781911
12076 10781911 10733795 10866245 11163157 11572115 12025483 12461048 12836180 13134589 13367037
12067 13367037 13566736 13779427 14049558 14406582 14856666 15383264 15955239 16536869 17093797
12058 17093797 17593199 18001437 18283942 18409656 18358756 18130065 17744045 17239187 16663421
12049 16663421 16065205 15488067 14968296 14532230 14190281 13928673 13704123 13448536 13087054
12040 13087054 12563786 11861551 11004036 10041211 9030515 8025732 7074794 6219111 5488643
$$ packed form
12104a065972J56557K00332K97226M19954N37122O27968O87856P22262P36168
12095C319473P28058O92991O31783N58204M97097M73179M97866N62757O42566
12086H603974P03828P14500O52564N13324L13686R0438j08496k37627k67886j96394
12076A0781911m8116J32450K96912M08958M53368M35565L75132K98409K32448
12067A3367037J99699K12691K70131L57024M50084N26598N71975N81630N56928
12058A7093797M99402M08238K82505J25714n0900k28691l86020n04858n75766
12049A6663421n98216n77138n19771m36066l41949k61608k24550k55587l61482
12040A3087054n23268p02235q57515r62825j010696j004783r50938q55683p30468
$$ plain form
12031 5488643 4894663 4426299 4054134 3738528 3438226 3117331 2751683 2335120 1882980
12022 1882980 1429282 1017394 687972 468672 368074 374754 461322 591125 723878 819445
12012 819445 844156 783342 654906 511275 421886 443253 594043 848954 1152221 1441576
12002 1441576 1671619 1828499 1931311 2019531 2131430 2283505 2460996 2623418 2720457 2708757
11992 2708757 2562138 2274021 1855902 1335954 758294 179973 -337426 -741290 -1001537
11983 -1001537 -1116912 -1109705 -1012172 -853937 -658069 -445621 -241959 -78772 9423 -7648
11973 -7648 -147846 -410844 -779328 -1228407 -1736722 -2289095 -2867437 -3438485 -3951361 -4350014
11963 -4350014 -4593578 -4672599 -4612971 -4466658 -4293608 -4141983 -4034749 -3967903 -3919446 -3862389
$$ packed form
12031E488643n93980m68364l72165l15606l00302l20895l65648m16563m52140
12022A882980m53698m11888l29422k19300j00598O680Q6568J29803J32753R5567
12012H19445K4711o0814j28436j43631q9389K1367J50790K54911L03267K89355
12002A441576K30043J56880J02812Q8220J11899J52075J77491J62422R7039j1700
11992B708757j46619k88117m18119n19948n77660n78321n17399m03864k60247
11983a001537j15375P207R7533J58235J95868K12448K03662J63187Q8195j7071
11973g648j40198k62998l68484m49079n08315n52373n78342n71048n12876l98653
11963d350014k43564p9021N9628J46313J73050J51625J07234O6846M8457N7057
$$ plain form
11953 -3862389 -3774714 -3643823 -3467406 -3253041 -3017186 -2783611 -2581640 -2443719 -2400636 -2473845
11943 -2473845 -2667835 -2967457 -3343194 -3762858 -4204085 -4660399 -5136149 -5632316 -6131970
11934 -6131970 -6594804 -6963390 -7176218 -7180771 -6943172 -6453703 -5727589 -4801040 -3724813 -2558566
11924 -2558566 -1367023 -216065 832522 1726156 2424074 2897377 3128086 3107787 2835231
11915 2835231 2314280 1556256 588786 -533703 -1727239 -2888854 -3916985 -4732821 -5294767
11906 -5294767 -5601975 -5685561 -5589568 -5349309 -4978510 -4473023 -3828678 -3061649 -2218565 -1371100
11896 -1371100 -599885 22350 441610 627508 575686 308772 -126467 -667357 -1246738 -1803362
11886 -1803362 -2288178 -2666006 -2914472 -3023609 -2998327 -2861815 -2654604 -2425978 -2220613 -2067065
$$ packed form
11953c862389Q7675J30891J76417K14365K35855K33575K01971J37921M3083p3209
11943b473845j93990k99622l75737m19664m41227m56314m75750m96167m99654
11934f131970m62834l68586k12828m553K37599M89469P26114R26549J076227J166247
11924b558566J191543J150958J048587Q93634O97918M73303K30709k0299k72556
11915B835231n20951p58024r67470j122489j193536j161615j028131q15836n61946
11906e294767l07208q3586R5993K40259L70799N05487O44345P67029Q43084Q47465
11896a371100P71215O22235M19260J85898n1822k66914m35239n40890n79381n56624
11886a803362m84816l77828k48466j09137K5282J36512K07211K28626K05365J53548
$$ plain form
11876 -2067065 -1973270 -1930071 -1920872 -1933390 -1967990 -2037866 -2161443 -2353047 -2618901 -2960139 -3377926
11865 -3377926 -3874058 -4445418 -5077656 -5745332 -6420299 -7082442 -7724492 -8347610 -8951305
11856 -8951305 -9524340 -10041799 -10469561 -10773493 -10928355 -10922589 -10759214 -10455829 -10045116 -9573421
11846 -9573421 -9094122 -8656094 -8291814 -8010572 -7799747 -7633472 -7484892 -7336491 -7183995
11837 -7183995 -7033035 -6891590 -6761955 -6634458 -6484556 -6276111 -5972706 -5553812 -5027126
11828 -5027126 -4429619 -3817167 -3249299 -2775944 -2429652 -2224131 -2158551 -2224529 -2410588 -2700967
11818 -2700967 -3071282 -3487172 -3909719 -4305617 -4655939 -4957741 -5217159 -5438653 -5618309
11809 -5618309 -5746626 -5819386 -5849384 -5870989 -5933171 -6082423 -6342982 -6705117 -7129105 -7563159
$$ packed form
11876b067065R3795M3199R199j2518l4600o9876j23577j91604k65854l41238m17787
11865c377926m96132n71360o32238o67676o74967o62143o42050o23118o03695
11856h951305n73035n17459m27762l03932j54862N766J63375L03385M10713M71695
11846i573421M79299M38028L64280K81242K10825J66275J48580J48401J52496
11837g183995J50960J41445J29635J27497J49902K08445L03405M18894N26686
11828e027126N97507O12452N67868M73355L46292K05521O5580o5978j86059k90379
11818b700967l70315m15890m22547l95898l50322l01802k59418k21494j79656
11809e618309j28317p2760k9998k1605o2182j49252k60559l62135m23988m34054
$$ plain form
11799 -7563159 -7964427 -8310810 -8598294 -8827839 -8991682 -9068634 -9032303 -8867821 -8586482 -8228449
11789 -8228449 -7851260 -7510689 -7244311 -7064775 -6963258 -6918474 -6905977 -6904572 -6899065 -6879896 -6841145
11778 -6841145 -6779200 -6693815 -6590791 -6482763 -6384590 -6304067 -6234124 -6154241 -6042844 -5892916
11768 -5892916 -5718753 -5548433 -5408226 -5310467 -5250865 -5212553 -5171103 -5097981 -4963099 -4737471
11758 -4737471 -4396283 -3922783 -3313265 -2581982 -1763592 -911119 -89284 635025 1203042
11749 1203042 1574057 1734737 1705747 1540665 1313010 1094177 932359 842370 808687 796812
11739 796812 766906 686111 537674 325156 70785 -191544 -426756 -609490 -731708 -804538
11729 -804538 -855048 -919991 -1037108 -1233593 -1514345 -1856270 -2213033 -2528266 -2751027 -2848777
$$ packed form
11799g563159m01268l46383k87484k29545j63843p6952L6331J64482K81339L58033
11789h228449L77189L40571K66378J79536J01517M4784J2497J405N507J9169L8751
11778f841145O1945Q5385J03024J08028R8173Q0523O9943P9883J11397J49928
11768e892916J74163J70320J40207R7759N9602L8312M1450P3122J34882K25628
11758d737471L41188M73500O09518P31283Q18390Q52473Q21835P24309N68017
11749A203042L71015J60680k8990j65082k27655k18833j61818q9989l3683j1875
11739G96812k9906q0795j48437k12518k54371k62329k35212j82734j22218p2830
11729h04538n0510o4943j17117j96485k80752l41925l56763l15233k22761r7750
$$ plain form
11719 -2848777 -2815731 -2674341 -2468089 -2248263 -2062234 -1948600 -1936905 -2045623 -2276968 -2613706
11709 -2613706 -3022656 -3462819 -3892493 -4273169 -4572481 -4767963 -4849683 -4819435 -4687486 -4469866
11699 -4469866 -4187238 -3863841 -3525062 -3194121 -2889027 -2620211 -2389305 -2190418 -2015468
11690 -2015468 -1863079 -1747242 -1699921 -1763701 -1976446 -2355792 -2891368 -3546596 -4265682 -4980754
11680 -4980754 -5618156 -6106047 -6385112 -6421741 -6220418 -5829653 -5336101 -4846282 -4462036 -4258308
11670 -4258308 -4268435 -4478712 -4834147 -5257051 -5674241 -6040963 -6349495 -6619624 -6878840 -7143663
11660 -7143663 -7409929 -7654531 -7846934 -7965833 -8013834 -8022220 -8040849 -8115404 -8262486 -8455935
11650 -8455935 -8631773 -8708505 -8612648 -8299854 -7766132 -7047173 -6207105 -5321866 -4464087 -3693473
$$ packed form
11719b848777L3046J41390K06252K19826J86029J13634J1695j08718k31345l36738
11709b613706m08950m40163m29674l80676k99312j95482q1720L0248J31949K17620
11699d469866K82628L23397L38779L30941L05094K68816K30906J98887J74950
11690b015468J52389J15837M7321o3780k12745l79346n35576o55228p19086p15072
11680d980754o37402m87891k79065l6629K01323L90765M93552M89819L84246K03728
11670d258308j0127k10277l55435m22904m17190l66722l08532k70129k59216k64823
11660g143663k66266k44602j92403j18899m8001q386j8629p4555j47082j93449
11650h455935j75838p6732R5857L12794N33722P18959Q40068Q85239Q57779P70614
$$ plain form
11640 -3693473 -3051729 -2559164 -2212001 -1982068 -1821719 -1676247 -1502961 -1290597 -1068928
11631 -1068928 -901446 -862956 -1011832 -1368412 -1907466 -2567007 -3269086 -3942397 -4535943 -5019575
11621 -5019575 -5376078 -5593282 -5661559 -5577034 -5347876 -5000106 -4578893 -4142331 -3748583 -3442142
11611 -3442142 -3246058 -3162539 -3178264 -3269146 -3403444 -3546534 -3669753 -3760227 -3824855 -3884331
11601 -3884331 -3959996 -4061333 -4181377 -4302192 -4406598 -4488826 -4557807 -4631346 -4724860 -4841102
11591 -4841102 -4966075 -5072486 -5127889 -5102676 -4974478 -4729377 -4363298 -3886113 -3327321 -2739187
11581 -2739187 -2194110 -1775455 -1563066 -1615874 -1956351 -2564101 -3383886 -4345611 -5386298
11572 -5386298 -6463703 -7557783 -8662292 -9770828 -10862394 -11893171 -12799841 -13512703
$$ packed form
11640c693473O41744M92565L47163K29933J60349J45472J73286K12364K21669
11631a068928J67482L8490j48876l56580n39054o59541p02079o73311n93546m83632
11621e019575l56503k17204o8277Q4525K29158L47770M21213M36562L93748L06441
11611c442142J96084Q3519j5725r0882j34298j43090j23219r0474o4628n9476
11601c884331p5665j01337j20044j20815j04406q2228o8981p3539r3514j16242
11591d841102j24973j06411n5403K5213J28198K45101L66079M77185N58792N88134
11581b739187N45077M18655K12389n2808l40477o07750q19785r61725j040687
11572e386298j077405j094080j104509j108536j091566j030777r06670p12862
$$ plain form
11564 -13512703 -13970073 -14127139 -13960446 -13472571 -12696177 -11691349 -10534117 -9302632 -8069170
11555 -8069170 -6898362 -5845234 -4949264 -4228568 -3680779 -3291141 -3041189 -2911194 -2876020
11546 -2876020 -2899976 -2936527 -2934344 -2846763 -2640053 -2297113 -1816299 -1208127 -492853 300765
11536 300765 1138263 1985606 2816208 3613336 4364592 5051090 5638779 6079357 6323105 6338271
11526 6338271 6126740 5727335 5205257 4633379 4073684 3565144 3120799 2733523 2387237
11517 2387237 2069013 1777865 1527282 1340152 1237806 1229267 1308350 1460882 1675490 1948166
11507 1948166 2277292 2655091 3063608 3477417 3869263 4214750 4495608 4702153 4833888
11498 4833888 4896808 4898852 4847708 4753716 4635609 4523338 4453647 4459535 4559510 4752436 5019245
$$ packed form
11564a3512703m57370j57066J66693M87875P76394J004828J157232J231485J233462
11555h069170J170808J053128Q95970P20696N47789L89638K49952J29995L5174
11546b876020k3956l6551K183Q7581K06710L42940M80814O08172P15274P93618
11536C00765Q37498Q47343Q30602P97128P51256O86498N87689M40578K43748J5166
11526F338271k11531l99405n22078n71878n59695n08540m44345l87276l46286
11517B387237l18224k91148k50583j87130j02346q539P9083J52532K14608K72676
11507A948166L29126L77799M08517M13809L91846L45487K80858K06545J31735
11498D833888O2920K044n1144r3992j18107j12271o9691N888R9975J92926K66809
$$ plain form
11487 5019245 5328560 5643536 5930254 6167906 6356580 6515338 6668119 6824805 6969956
11478 6969956 7066552 7071369 6951329 6691425 6292084 5761665 5112135 4361548 3539509 2688179
11468 2688179 1854516 1076467 370644 -271035 -873118 -1461104 -2047955 -2630323 -3194396
11459 -3194396 -3724208 -4206274 -4631176 -4996691 -5312963 -5604348 -5902814 -6235084 -6611560
11450 -6611560 -7024011 -7452399 -7875619 -8279670 -8659053 -9011408 -9329718 -9598435 -9797319
11441 -9797319 -9910771 -9935948 -9883832 -9772960 -9621004 -9440875 -9244144 -9048176 -8879827 -8771494
11431 -8771494 -8751910 -8837824 -9030486 -9317298 -9677980 -10094208 -10558686 -11077222 -11661147 -12315216
11421 -12315216 -13029477 -13779193 -14530643 -15248821 -15904513 -16479169 -16965900 -17365497 -17678170
$$ packed form
11487E019245L09315L14976K86718K37652J88674J58758J52781J56686J45151
11478F969956R6596M817j20040k59904l99341n30419o49530p50587q22039q51330
11468B688179q33663p78049p05823o41679o02083n87986n86851n82368n64073
11459c194396n29812m82066m24902l65515l16272k91385k98466l32270l76476
11450f611560m12451m28388m23220m04051l79383l52355l18310k68717j98884
11441i797319j13452k5177N2116J10872J51956J80129J96731J95968J68349J08333
11431h771494J9584q5914j92662k86812l60682m16228m64478n18536n83925o54069
11421a2315216p14261p49716p51450p18178o55692n74656m86731l99597l12673
$$ plain form
11412 -17678170 -17893743 -17985238 -17911133 -17627949 -17108284 -16355393 -15407356 -14328553 -13190979
11403 -13190979 -12052411 -10941889 -9860373 -8795010 -7736880 -6692347 -5684919 -4749443
11395 -4749443 -3921327 -3224242 -2661656 -2216469 -1857772 -1549560 -1256877 -948575 -598533
11386 -598533 -187682 291625 829467 1393251 1927685 2362455 2627276 2669849 2469173 2038135
11376 2038135 1416398 660998 -159402 -968528 -1690525 -2262970 -2648609 -2838958 -2848853 -2706355
11366 -2706355 -2443564 -2091901 -1682340 -1247949 -824441 -446435 -141241 76113 204618
11357 204618 256370 253591 223103 188990 167358 167203 196243 265209 385300 560710 782795
11346 782795 1029803 1270638 1469715 1592326 1610829 1510072 1289408 960384 541936 56002
$$ packed form
11412a7678170k15573r1495P4105K83184N19665P52891R48037J078803J137574
11403a3190979J138568J110522J081516J065363J058130J044533J007428R35476
11395d749443Q28116O97085N62586M45187L58697L08212K92683L08302L50042
11386e98533M10851M79307N37842N63784N34434M34770K64821M2573k00676m31038
11376B038135o21737p55400q20400q09126p21997n72445l85639j90349r895J42498
11366b706355K62791L51663M09561M34391M23508L78006L05194K17354J28505
11357B04618N1752k779l0488l4113k1632j55K9040O8966J20091J75410K22085
11346G82795K47008K40835J99077J22611J8503j00757k20664l29024m18448m85934
$$ plain form
11336 56002 -473661 -1019092 -1545559 -2014170 -2391085 -2658166 -2818084 -2891924 -2912934 -2920574
11326 -2920574 -2956289 -3061020 -3273997 -3631241 -4161640 -4880308 -5781390 -6832792 -7974850
11317 -7974850 -9125686 -10195569 -11107809 -11817284 -12317229 -12631919 -12800661 -12860897 -12836149
11308 -12836149 -12732148 -12542693 -12262926 -11902781 -11491798 -11071261 -10677750 -10327233 -10007652
11299 -10007652 -9682568 -9303249 -8823985 -8214771 -7466889 -6589833 -5602064 -4520764 -3356083
11290 -3356083 -2113091 -800544 559068 1925554 3247215 4474054 5569419 6512600
11282 6512600 7291354 7890569 8285597 8445100 8341251 7960673 7310651 6419905 5336408
11273 5336408 4124464 2861176 1630842 515492 -418250 -1131428 -1616770 -1890800 -1978862
$$ packed form
11336E6002n29663n45431n26467m68611l76915k67081j59918p3840k1010p640
11326b920574l5715j04731k12977l57244n30399p18668r01082j051402j142058
11317g974850j150836j069883r12240p09475m99945l14690j68742o0236K4748
11308a2836149J04001J89455K79767L60145M10983M20537L93511L50517L19581
11299a0007652L25084L79319M79264O09214P47882Q77056R87769J081300J164681
11290c356083J242992J312547J359612J366486J321661J226839J095365R43181
11282F512600P78754N99215L95028J59503j03849l80578o50022q90746j083497
11273E336408j211944j263288j230334j115350r33742p13178m85342k74030q8062
$$ plain form
11264 -1978862 -1902944 -1678440 -1318322 -839454 -267529 360088 993570 1572644 2032811 2316373
11254 2316373 2385652 2231894 1873813 1346878 691858 -49712 -834214 -1616155 -2353993 -3017567
11244 -3017567 -3590393 -4065310 -4438089 -4704022 -4857855 -4894084 -4805852 -4583992 -4219058 -3707500
11234 -3707500 -3060005 -2307244 -1497600 -685142 86761 796438 1443811 2042557 2611640
11225 2611640 3168747 3723499 4270981 4791683 5262158 5671264 6030192 6367928 6714000
11216 6714000 7079113 7445799 7774958 8023339 8159320 8166925 8038858 7768251 7347894 6778127
11206 6778127 6078049 5292917 4492109 3755820 3154572 2730288 2486909 2392756 2391753 2419504
11196 2419504 2420551 2362017 2238507 2067217 1878325 1707288 1590557 1560928 1639829 1829690
$$ packed form
11264a978862P5918K24504L60118M78868N71925O27617O33482N79074M60167K83562
11254B316373O9279j53758l58081n26935o55020p41570p84502p81941p37838o63574
11244c017567n72826m74917l72779k65933j53833l6229Q8232K21860L64934N11558
11234c707500O47495P52761Q09644Q12458P71903P09677O47373N98746N69083
11225B611640N57107N54752N47482N20702M70475M09106L58928L37736L46072
11216F714000L65113L66686L29159K48381J35981P605j28067k70607m20357n69767
11206F778127p00078p85132q00808p36289o01248m24284k43379r4153j003K7751
11196B419504J047n8534j23510j71290j88892j71037j16731k9629P8901J89861
$$ plain form
11186 1829690 2112808 2458961 2836711 3219822 3584629 3902859 4139376 4260259 4246340 4101206
11176 4101206 3847225 3513866 3128192 2713284 2292295 1891537 1537465 1246742 1013671
11167 1013671 802995 555455 207357 -282714 -911768 -1625888 -2334381 -2940153 -3372942
11158 -3372942 -3610069 -3677087 -3631760 -3540510 -3455086 -3394827 -3340371 -3243952 -3055163 -2750961 -2353469
11147 -2353469 -1924932 -1543237 -1273159 -1148693 -1171338 -1318886 -1557384 -1853029 -2182468 -2537682
11137 -2537682 -2921483 -3335467 -3768785 -4195933 -4584501 -4906504 -5145411 -5295561 -5356483 -5327040
11127 -5327040 -5202679 -4976758 -4646123 -4220419 -3731452 -3235690 -2804894 -2507561 -2390585
11118 -2390585 -2470060 -2733777 -3152020 -3691257 -4325796 -5043449 -5842964 -6724306 -7676580 -8670064
$$ packed form
11186A829690K83118L46153L77750L83111L64807L18230K36517J20883j3919j45134
11176D101206k53981l33359l85674m14908m20989m00758l54072k90723k33071
11167A013671k10676k47540l48098m90071o29054p14120p08493o05772m32789
11158c372942k37127o7018M5327R1250Q5424O0259N4456R6419J88789L04202L97492
11147b353469M28537L81695K70078J24466k2645j47548k38498k95645l29439l55214
11137b537682l83801m13984m33318m27148l88568l22003k38907j50150o0922K9443
11127e327040J24361K25921L30635M25704M88967M95762M30796K97333J16976
11118b390585p9475k63717m18243n39237o34539p17653p99515q81342r52274r93484
$$ plain form
11108 -8670064 -9656905 -10580520 -11389788 -12052669 -12564724 -12949315 -13248008 -13503248 -13740286
11099 -13740286 -13957732 -14132181 -14233595 -14240961 -14148361 -13959684 -13678584 -13302110 -12820952 -12223066
11089 -12223066 -11496232 -10628677 -9609950 -8434112 -7105019 -5641782 -4081566 -2477261
11081 -2477261 -889818 621295 2004522 3217330 4224992 5002216 5539985 5854627 5992953
11072 5992953 6028291 6046595 6126395 6319308 6637630 7053256 7508532 7935832 8279258 8510518
11062 8510518 8633703 8679240 8692220 8720475 8804683 8970524 9224194 9553813 9936850 10349116
11052 10349116 10769576 11178903 11554600 11867416 12082645 12167270 12100351 11880988 11528496 11074228
11042 11074228 10549976 9979060 9373369 8736298 8069573 7380376 6684348 6002061 5351469
$$ packed form
11108h670064r86841r23615q09268o62881n12055l84591k98693k55240k37038
11099a3740286k17446j74449j01414p366R2600J88677K81100L76474M81158N97886
11089a2223066P26834Q67555J018727J175838J329093J463237J560216J604305
11081b477261J587443J511113J383227J212808J007662P77224N37769L14642J38326
11072E992953L5338J8304P9800J92913L18322M15626M55276M27300L43426K31260
11062H510518J23185M5537J2980K8255Q4208J65841K53670L29619L83037M12266
11052A0349116M20460M09327L75697L12816K15229Q4625o6919k19363l52492m54268
11042A1074228n24252n70916o05691o37071o66725o89197o96028o82287o50592
$$ plain form
11033 5351469 4741975 4174149 3644286 3150008 2693906 2284960 1938974 1678563 1531646
11024 1531646 1526966 1686263 2014628 2492057 3070360 3678938 4239670 4685728 4976069 5099735
11014 5099735 5070578 4917997 4679324 4395795 4110488 3865579 3697588 3631056 3672182 3805040
11004 3805040 3994080 4195406 4373605 4514556 4625374 4722366 4817187 4910814 4996191 5063803
10994 5063803 5105262 5113986 5084064 5008871 4881586 4699256 4468674 4209250 3949021 3714994
10984 3714994 3523483 3376115 3263003 3169614 3082099 2988085 2873822 2720874 2505615 2203718
10974 2203718 1799351 1295106 716455 107036 -483110 -1010221 -1444745 -1771917 -1985526
10965 -1985526 -2078682 -2038034 -1846993 -1498175 -1008914 -430989 151812 638710 933927 967595
$$ packed form
11033E351469o09494n67826n29863m94278m56102m08946l45986k60411j46917
11024A531646m680J59297L28365M77429N78303O08578N60732M46058K90341J23666
11014E099735k9157j52581k38673k83529k85307k44909j67991o6532M1126J32858
11004C805040J89040K01326J78199J40951J10818R6992R4821R3627Q5377O7612
10994E063803M1459Q724k9922p5193j27285j82330k30582k59424k60229k34027
10984C714994j91511j47368j13112r3389q7515r4014j14263j52948k15259l01897
10974B203718m04367n04245n78651o09419n90146n27111m34524l27172k13609
10965a985526r3156M0648J91041L48818M89261N77925N82801M86898K95217L3668
$$ plain form
10955 967595 709936 176984 -572652 -1450928 -2361297 -3219571 -3965226 -4560576 -4983914 -5224709
10945 -5224709 -5283879 -5176569 -4932496 -4589634 -4180826 -3718993 -3190361 -2561018 -1793056 -861037
10935 -861037 237711 1479646 2816813 4183912 5510940 6738610 7830344 8775472
10927 8775472 9583505 10274361 10869658 11386472 11832186 12200542 12471783 12619432 12622137 12474835
10917 12474835 12192910 11806845 11350904 10853408 10334348 9809430 9294810 8808296 8367177
10908 8367177 7983791 7658149 7368816 7069134 6697119 6198660 5552157 4780870 3948284
10899 3948284 3141956 2453650 1960254 1707907 1702605 1910680 2269531 2705013 3149857 3557636
10889 3557636 3908246 4204021 4459962 4694044 4921703 5154127 5397604 5652401 5911554
$$ packed form
10955I67595k57659n32952p49636q78276r10369q58274p45655n95350m23338k40795
10945e224709n9170J07310K44073L42862M08808M61833N28632O29343P67962R32019
10935h61037J098748J241935J337167J367099J327028J227670J091734R45128
10927H775472Q08033O90856N95297N16814M45714L68356K71241J47649K705j47302
10917A2474835k81925l86065m55941m97496n19060n24918n14620m86514m41119
10908H367177l83386l25642k89333k99682l72015m98459o46503p71287q32586
10899C948284q06328o88306m93396k52347n302K08075L58851M35482M44844M07779
10889C557636L50610K95775K55941K34082K27659K32424K43477K54797K59153
$$ plain form
10880 5911554 6160325 6376701 6534044 6607545 6584375 6473881 6311797 6154158 6062097 6084743
10870 6084743 6248919 6559101 7003276 7557327 8184748 8834596 9442450 9936777 10250278
10861 10250278 10333540 10165996 9758213 9142842 8358507 7435923 6394549 5251447 4036004
10852 4036004 2799848 1613830 552517 -325467 -991878 -1453593 -1747952 -1930477 -2057794
10843 -2057794 -2170842 -2284356 -2385942 -2444458 -2425042 -2306085 -2090469 -1803786 -1479414 -1139663
10833 -1139663 -784925 -396381 51167 574552 1173347 1830289 2518142 3205543 3856573
10824 3856573 4426455 4860522 5099897 5090573 4790919 4176189 3240418 1994736 461395
10815 461395 -1333261 -3360842 -5584536 -7946400 -10354501 -12677885 -14756296 -16425720
$$ packed form
10880E911554K48771K16376J57343P3501k3170j10494j62084j57639r2061K2646
10870F084743J64176L10182M44175N54051O27421O49848O07854M94327L13501
10861A0250278Q3262j67544m07783o15371p84335r22584j041374j143102j215443
10852D036004j236156j186018j061313q77984o66411m61715k94359j82525j27317
10843b057794j13048j13514j01586n8516J9416J18957K15616K86683L24372L39751
10833a139663L54738L88544M47548N23385N98795O56942O87853O87401O51030
10824C856573N69882M34067K39375r324k99654o14730r35771j245682j533341
10815D61395j794656k027581k223694k361864k408101k323384k078411j669424
$$ plain form
10807 -16425720 -17551439 -18054917 -17925350 -17216537 -16035176 -14524597 -12844105 -11144482
10799 -11144482 -9544138 -8113988 -6878466 -5833056 -4968471 -4286381 -3797751 -3508241 -3403485
10790 -3403485 -3444251 -3572783 -3725527 -3846147 -3893958 -3845220 -3688143 -3415518 -3019765 -2493409
10780 -2493409 -1834733 -1055196 -184143 731192 1628958 2437676 3084664 3509999 3682943
10771 3682943 3611951 3340470 2928937 2431942 1882429 1290687 656964 -11527 -689568 -1332527
10761 -1332527 -1881175 -2269032 -2432715 -2326031 -1933509 -1276456 -409292 589810 1630071
10752 1630071 2621725 3493044 4205532 4757690 5173233 5480777 5697839 5827212 5864045 5806189
10742 5806189 5660958 5445408 5181128 4887501 4578208 4263226 3954183 3668698 3430829
$$ packed form
10807a6425720j125719n03478J29567P08813J181361J510579J680492J699623
10799a1144482J600344J430150J235522J045410Q64585O82090M88630K89510J04756
10790c403485m0766j28532j52744j20620m7811M8738J57077K72625L95753N26356
10780b493409O58676P79537Q71053R15335Q97766Q08718O46988M25335J72944
10771C682943p0992k71481m11533m96995n49513n91742o33723o68491o78041o42959
10761a332527n48648l87857j63683J06684L92522O57053Q67164R99102J040261
10752A630071R91654Q71319P12488N52158M15543L07544K17062J29373L6833n7856
10742E806189j45231k15550k64280k93627l09293l14982l09043k85485k37869
$$ plain form
10733 3430829 3267814 3205095 3261738 3447866 3764533 4204624 4752491 5382138 6057440 6738530
10723 6738530 7393242 8005394 8571195 9084683 9524851 9857695 10053517 10106210 10040819 9906806
10713 9906806 9764182 9670123 9669185 9787390 10030120 10383776 10820750 11306774 11807930 12293240
10703 12293240 12731122 13084092 13309595 13370843 13253399 12977837 12599849 12195532 11838067
10694 11838067 11577465 11432744 11396869 11447198 11553895 11683812 11801156 11867268 11841573 11685267
10684 11685267 11367697 10873622 10208999 9402720 8501783 7559603 6621810 5716620 4853502
10675 4853502 4028014 3228318 2441387 1659491 887152 146708 -520485 -1059310 -1411973
10666 -1411973 -1531335 -1392123 -997518 -380390 401396 1275378 2167417 3011944 3756249
$$ packed form
10733C430829j63015o2719N6643J86128L16667M40091N47867O29647O75302O81090
10723F738530O54712O12152N65801N13488M40168L32844J95822N2693o5391j34013
10713I906806j42624r4059r38J18205K42730L53656M36974M86024N01156M85310
10703A2293240M37882L52970K25503O1248j17444k75562l77988m04317l57465
10694A1838067k60602j44721l5875N0329J06697J29917J17344O6112k5695j56306
10684A1685267l17570m94075o64623q06279r00937r42180r37793r05190q63118
10675D853502q25488p99696p86931p81896p72339p40444o67193n38825l52663
10666a411973j19362J39212L94605O17128P81786Q73982Q92039Q44527P44305
$$ plain form
10657 3756249 4359230 4786673 5005511 4981331 4684374 4104795 3269618 2249563 1148687
10648 1148687 80170 -860277 -1611413 -2149058 -2478672 -2625630 -2626889 -2522613 -2346911 -2121008
10638 -2121008 -1853299 -1546522 -1207083 -849421 -490656 -137612 223924 626609 1103884
10629 1103884 1668256 2300145 2953631 3574053 4117036 4559967 4902144 5156074 5337191
10620 5337191 5459085 5536430 5592051 5661628 5790456 6021037 6376951 6852337 7413182 8008686
10610 8008686 8585831 9101780 9532383 9876145 10152169 10391461 10624125 10867337 11118325
10601 11118325 11353284 11530686 11597672 11499828 11194012 10660840 9912187 8991589 7968016
10592 7968016 6923519 5935479 5057506 4306166 3658955 3064001 2458429 1790210 1035851
$$ packed form
10657C756249O02981M27443K18838k4180k96957n79579q35177j020055j100876
10648A148687j068517r40447p51136n37645l29614j46958j259J04276J75702K25903
10638b121008K67709L06777L39439L57662L58765L53044L61536M02685M77275
10629A103884N64372O31889O53486O20422N42983M42931L42177K53930J81117
10620E337191J21894P7345N5621O9577J28828K30581L55914M75386N60845N95504
10610H008686N77145N15949M30603L43762K76024K39292K32664K43212K50988
10601A1118325K34959J77402O6986r7844l05816n33172p48653r20598j023573
10592G968016j044497r88040q77973p51340o47211n94954o05572o68219p54359
$$ plain form
10583 1035851 206427 -659323 -1508486 -2286619 -2946951 -3456382 -3797454 -3966074 -3968294 -3820626
10573 -3820626 -3554089 -3217629 -2876173 -2600990 -2453048 -2464580 -2628040 -2899888 -3218235 -3525154
10563 -3525154 -3782719 -3976480 -4106905 -4175321 -4173651 -4084474 -3891112 -3591338 -3206138 -2777076
10553 -2777076 -2352050 -1967084 -1635475 -1350771 -1101032 -886464 -731984 -687706 -814456 -1160314
10543 -1160314 -1741898 -2540805 -3513265 -4602585 -5746707 -6881099 -7941531 -8870853 -9629940
10534 -9629940 -10207600 -10621836 -10910052 -11114475 -11271523 -11408396 -11544786 -11697140 -11883679
10525 -11883679 -12127644 -12456905 -12900815 -13486499 -14235642 -15162364 -16273248 -17569184 -19047233
10516 -19047233 -20702804 -22534529 -24550680 -26771228 -29222604 -31929696 -34911020 -38177980
$$ packed form
10583A035851q29424q65750q49163p78133o60332n09431l41072j68620k220J47668
10573c820626K66537L36460L41456K75183J47942j1532j63460k71848l18347l06919
10563c525154k57565j93761j30425o8416J670Q9177J93362K99774L85200M29062
10553b777076M25026L84966L31609K84704K49739K14568J54480M4278j26750l45858
10543a160314n81584p98907r72460j089320j144122j134392j060432r29322p59087
10534i629940n77660m14236k88216k04423j57048j36873j36390j52354j86539
10525a1883679k43965l29261m43910n85684p49143r26722j110884j295936j478049
10516a9047233j655571j831725k016151k220548k451376k707092k981324l266960
$$ plain form
10508 -38177980 -41737461 -45599086 -49786259 -54345394 -59349567 -64899364 -71123402 -78175957
10500 -78175957 -86230687 -95475777 -106114057 -118364824 -132463758 -148657519 -167177076
10493 -167177076 -188162315 -211523975 -236756738 -262738256 -287586886 -308725360 -323315429
10486 -323315429 -329050885 -324979599 -311873269 -291903023 -267837772 -242243070 -217026599
10479 -217026599 -193360167 -171815633 -152558383 -135518917 -120512156 -107302153 -95634796
10472 -95634796 -85264949 -75983863 -67636663 -60123344 -53385290 -47383126 -42076157 -37416079
10464 -37416079 -33357094 -29868343 -26933054 -24533502 -22633186 -21167736 -20050514 -19191956
10456 -19191956 -18522561 -18004905 -17628384 -17392975 -17291393 -17294343 -17343356 -17357603 -17253727 -16966438
$$ packed form
10508c8177980l559481l861625m187173m559135n004173n549797o224038p052555
10500g8175957q054730r245090j0638280j2250767j4098934j6193761j8519557
10493a67177076k0985239k3361660k5232763k5981518k4848630k1138474j4590069
10486c23315429n735456M071286J3106330J9970246K4065251K5594702K5216471
10479b17026599K3666432K1544534J9257250J7039466J5006761J3210003J1667357
10472i5634796J0369847R281086Q347200P513319O738054O002164N306969M660078
10464c7416079M058985L488751K935289K399552J900316J465450J117222Q58558
10456a9191956O69395N17656L76521K35409J01582k950m9013j4247J03876K87289
$$ plain form
10446 -16966438 -16458425 -15720615 -14770084 -13647223 -12409047 -11118986 -9836898 -8610920
10438 -8610920 -7471452 -6430027 -5485332 -4633222 -3874846 -3220126 -2686633 -2293737 -2053578
10429 -2053578 -1964101 -2008106 -2156091 -2368974 -2601928 -2812600 -2971312 -3066327 -3101368 -3089191
10419 -3089191 -3045809 -2986708 -2925387 -2875176 -2853944 -2888521 -3014358 -3267098 -3666718 -4201376
10409 -4201376 -4822027 -5453951 -6020059 -6464125 -6764816 -6937576 -7024543 -7075203 -7125151 -7183071
10399 -7183071 -7231724 -7240306 -7180232 -7036806 -6813115 -6526659 -6201647 -5859607 -5510269 -5145844
10389 -5145844 -4742965 -4273273 -3717263 -3073594 -2360652 -1613239 -878393 -211689 327242
10380 327242 681672 807397 682532 313111 -268517 -1011703 -1858607 -2754461 -3653042 -4514925
$$ packed form
10446a6966438N08013P37810R50531J122861J238176J290061J282088J225978
10438h610920J139468J041425R44695Q52110P58376O54720N33493L92896K40159
10429b053578Q9477m4005j47985k12883k32954k10672j58712r5015l5041J2177
10419c089191M3382N9101O1321N0211K1232l4577j25837k52740l99620n34658
10409d201376o20651o31924n66108m44066l00691j72760q6967n0660m9948n7920
10399g183071m8653q582O0074J43426K23691K86456L25012L42040L49338L64425
10389e145844M02879M69692N56010O43669P12942P47413P34846O66704N38931
10380C27242L54430J25725j24865l69421n81628p43186q46904q95854q98581q61883
$$ plain form
10370 -4514925 -5301326 -5971390 -6488226 -6829595 -6993554 -6994315 -6852647 -6588451 -6219353 -5764305
10360 -5764305 -5248529 -4705439 -4172508 -3681429 -3246756 -2859107 -2488184 -2097041 -1662137
10351 -1662137 -1187977 -707030 -266123 90072 328585 429780 386535 205009 -94262 -478453
10341 -478453 -908709 -1348204 -1768604 -2153409 -2498088 -2806667 -3084435 -3329298 -3527634 -3659456
10331 -3659456 -3711195 -3688328 -3619909 -3552689 -3538772 -3623048 -3834021 -4177371 -4630582 -5140609
10321 -5140609 -5629879 -6013373 -6222701 -6228871 -6056709 -5786447 -5539160 -5445967 -5608811 -6068703
10311 -6068703 -6796925 -7713725 -8723816 -9749394 -10745160 -11692978 -12585608 -13411107 -14144197
10302 -14144197 -14745608 -15168551 -15369569 -15318412 -15002397 -14426491 -13614472 -12613399 -11496612
$$ packed form
10370d514925p86401o70064n16836l41369j63959p61J41668K64196L69098M55048
10360e764305N15776N43090N32931M91079M34673L87649L70923L91143M34904
10351a662137M74160M80947M40907L56195K38513J01195m3245j81526k99271l84191
10341d78453m30256m39495m20400l84805l44679l08579k77768k44863j98336j31822
10331c659456n1739K2867O8419O7220J3917q4276k10973l43350m53211n10027
10321e140609m89270l83494k09328o170J72162K70262K47287R3193j62844m59892
10311f068703p28222r16800j010091j025578r95766r47818q92630q25499p33090
10302a4144197o01411m22943k01018N1157L16015N75906Q12019J001073J116787
$$ plain form
10293 -11496612 -10358409 -9299110 -8406620 -7742707 -7337459 -7189090 -7265149 -7506236 -7836998
10284 -7836998 -8184608 -8496109 -8744345 -8920801 -9023209 -9046418 -8979510 -8808172 -8520521 -8113565
10274 -8113565 -7596423 -6988767 -6317426 -5614999 -4920152 -4275484 -3720660 -3284005 -2978551
10265 -2978551 -2805779 -2764087 -2855354 -3084814 -3454719 -3956178 -4563641 -5234449 -5913396 -6540281
10255 -6540281 -7057380 -7415194 -7577869 -7530548 -7287964 -6899567 -6445903 -6024335 -5727639 -5622986
10245 -5622986 -5739320 -6066911 -6567382 -7189342 -7884435 -8618158 -9369871 -10121341 -10841951
10236 -10841951 -11482845 -11985796 -12301048 -12402651 -12293375 -11999082 -11558398 -11014666 -10413060
10227 -10413060 -9799462 -9215675 -8690379 -8231859 -7828547 -7456891 -7090087 -6701884 -6265539
$$ packed form
10293a1496612J138203J059299Q92490O63913M05248J48369p6059k41087l30762
10284g836998l47610l11501k48236j76456j02408k3209O6908J71338K87651M06956
10274h113565N17142O07656O71341P02427O94847O44668N54824M36655L05454
10265b978551J72772M1692r1267k29460l69905n01459o07463o70808o78947o26885
10255f540281n17099l57814j62675M7321K42584L88397M53664M21568K96696J04653
10245e622986j16334l27591n00471o21960o95093p33723p51713p51470p20610
10236a0841951o40894n02951l15252j01603J09276K94293M40684N43732O01606
10227a0413060O13598N83787N25296M58520M03312L71656L66804L88203M36345
$$ plain form
10218 -6265539 -5753461 -5142829 -4425969 -3617286 -2748978 -1856794 -965934 -86954 776080
10209 776080 1610494 2382018 3033454 3499999 3736353 3741150 3564673 3295975 3036323 2870307
10199 2870307 2845179 2965332 3201888 3509441 3839947 4149889 4404156 4581144 4679183 4720449
10189 4720449 4747621 4810431 4944437 5151435 5393866 5608946 5735602 5739034 5619913 5405682
10179 5405682 5132225 4829047 4516996 4217653 3965063 3809574 3809822 4016234 4453381 5108471
10169 5108471 5930382 6839074 7740953 8544599 9173366 9573920 9720679 9615997 9286627
10160 9286627 8777940 8147040 7454665 6755557 6088489 5468839 4886909 4313905 3715228
10151 3715228 3067386 2371599 1656954 970798 361146 -140110 -526178 -814436 -1037506
$$ packed form
10218f265539N12078O10632P16860Q08683Q68308Q92184Q90860Q78980Q63034
10209G76080Q34414P71524O51436M66545K36354M797j76477k68698k59652j66016
10199B870307k5128J20153K36556L07553L30506L09942K54267J76988R8039M1266
10189D720449K7172O2810J34006K06998K42431K15080J26656L432j19121k14231
10179E405682k73457l03178l12051k99343k52590j55489K48K06412M37147O55090
10169E108471Q21911R08692R01879Q03646O28767M00554J46759j04682l29370
10160I286627n08687o30900o92375o99108o67068o19650n81930n73004n98677
10151C715228o47842o95787p14645o86156o09652n01256l86068k88258k23070
$$ plain form
10142 -1037506 -1230089 -1415815 -1597819 -1755396 -1847855 -1825688 -1646743 -1291154 -767227 -104879
10132 -104879 658600 1491225 2370897 3281685 4205984 5117375 5977943 6741674 7362518 7803231
10122 7803231 8041294 8071082 7903849 7567074 7103066 6565817 6015462 5510638 5099887 4814592
10112 4814592 4666386 4650178 4750106 4943817 5202817 5491134 5766520 5986585 6119401 6155646
10102 6155646 6117144 6055519 6038120 6125885 6353687 6722007 7201386 7744229 8296780 8806529
10092 8806529 9224692 9507098 9617504 9534557 9259461 8819614 8265063 7658351 7061953 6528211
10082 6528211 6093623 5775254 5566965 5437201 5332172 5184764 4925459 4492586 3842382
10073 3842382 2957611 1849211 547383 -912031 -2494423 -4161110 -5858325 -7511940
$$ packed form
10142a037506j92583j85726j82004j57577r2459K2167J78945L55589N23927O62348
10132a04879P63479Q32625Q79672R10788R24299R11391Q60568P63731O20844M40713
10122G803231K38063K9788j67233l36775m64008n37249n50355n04824m10751k85295
10112D814592j48206j6208R9928J93711K59000K88317K75386K20065J32816L6245
10102F155646l8502o1625j7399Q7765K27802L68320M79379N42843N52551N09749
10092H806529M18163K82406J10406q2947k75096m39847n54551o06712n96398n33742
10082F528211m34588l18369k08289j29764j05029j47408k59305m32873o50204
10073C842382q84771j108400j301828j459414j582392j666687j697215j653615
$$ plain form
10065 -7511940 -9033679 -10334955 -11340037 -11993582 -12264314 -12149589 -11681540 -10929227 -9990171
10056 -9990171 -8970476 -7959727 -7010385 -6131401 -5301818 -4500180 -3733269 -3044634 -2495789
10047 -2495789 -2132262 -1956150 -1920324 -1944420 -1941501 -1842139 -1608243 -1236216 -752721 -205574
10037 -205574 348764 858076 1283289 1601359 1803864 1893887 1882004 1782412 1612055 1394742
10027 1394742 1167228 980731 893560 956844 1199629 1619314 2179921 2817746 3453512 4010673
10017 4010673 4436665 4718096 4879143 4961102 4995097 4985868 4915602 4761506 4513079 4179550
10007 4179550 3787729 3376314 2991195 2680897 2488172 2436570 2517217 2684722 2867613 2990333
9997 2990333 2996814 2864802 2605339 2249737 1832653 1381543 918684 473994 98961 -130150
$$ packed form
10065g511940j521739j301276j005082o53545k70732J14725M68049P52313R39056
10056i990171J019695J010749R49342Q78984Q29583Q01638P66911O88635N48845
10047b495789L63527J76112L5826k4096K919R9362K33896L72027M83495N47147
10037b05574N54338N09312M25213L18070K02505R0023j1883r9592j70357k17313
10027A394742k27514j86497q7171O3284K42785M19685N60607O37825O35766N57161
10017D010673M25992K81431J61047Q1959L3995r229p0266j54096k48427l33529
10007D179550l91821m11415l85119l10298j92725n1602Q0647J67505J82891J22720
9997B990333O481j32012k59463l55602m17084m51110m62859m44690l75033k29111
$$ plain form
9987 -130150 -125364 189183 854916 1867622 3179249 4709537 6363924 8053056 9706243
9978 9706243 11271724 12704867 13955193 14964222 15676966 16059404 16111439 15869539 15398824
9969 15398824 14777376 14076946 13346072 12601722 11832371 11010199 10107220 9110180 8030168
9960 8030168 6904212 5788693 4747727 3840493 3109626 2572308 2217814 2015085 1927539
9951 1927539 1925777 1990515 2106739 2256051 2412682 2544787 2621455 2624907 2563857 2480368 2444230
9940 2444230 2535384 2821725 3341897 4099589 5069000 6205603 7456367 8767245 10088013
9931 10088013 11373547 12581146 13667214 14589017 15313581 15829152 16151792 16322913 16398913
9922 16398913 16438144 16490968 16596409 16785283 17087291 17538481 18184701 19077459 20262815 21768812
$$ packed form
9987a30150M786L14547O65733J012706J311627J530288J654387J689132J653187
9978I706243J565481J433143J250326J009029P12744L82438N2035k41900m70715
9969A5398824o21448p00430p30874p44350p69351q22172r02979r97040j080012
9960H030168j125956j115519j040966r07234p30867n37318l54494k02729q7546
9951A927539j762O4738J16224J49312J56631J32105P6668L452o1050q3489l6138
9940B444230R1154K86341N20172P57692R69411J136603J250764J310878J320768
9931A0088013J285534J207599J086068R21803P24564N15571L22640J71121P6000
9922A6398913L9231N2824J05441J88874L02008M51190O46220Q92758J185356J505997
$$ plain form
9912 21768812 23597206 25721175 28088392 30629856 33273764 35959039 38641252 41288203
9904 41288203 43867245 46327251 48578813 50478680 51823846 52358084 51798934 49901225
9896 49901225 46558582 41900334 36311803 30340411 24530805 19281412 14786758 11062625
9888 11062625 8011072 5487340 3350205 1489204 -169789 -1670488 -3032090 -4251936
9880 -4251936 -5308377 -6166145 -6783833 -7123822 -7164792 -6912893 -6405606 -5706175 -4891711 -4039531
9870 -4039531 -3215468 -2467336 -1824437 -1300068 -892521 -583568 -337738 -106604 159618 494406
9860 494406 897548 1328278 1715852 1983869 2075691 1969240 1677856 1241790 717877 173230
9850 173230 -316225 -667543 -799774 -651649 -200690 527517 1466723 2531072 3638448
$$ packed form
9912B1768812J828394K123969K367217K541464K643908K685275K682213K646951
9904D1288203K579042K460006K251562J899867J345166N34238n59150j897709
9896D9901225l342643m658248n588531n971392n809606n249393m494654l724133
9888A1062625l051553k523732k137135j861001j658993j500699j361602j219846
9880d251936j056441q57768o17688l39989m0970K51899N07287O99431Q14464Q52180
9870d039531Q24063P48132O42899N24369M07547L08953K45830K31134K66222L34788
9860D94406M03142M30730L87574K68017R1822j06451k91384m36066n23913n44647
9850A73230m89455l51318j32231J48125M50959P28207R39206J064349J107376
$$ plain form
9841 3638448 4724238 5741933 6657413 7446848 8101391 8633133 9074810 9470976 9864568
9832 9864568 10284878 10740945 11221027 11696718 12130296 12484638 12734038 12872287 12914207 12889529
9822 12889529 12831225 12762229 12685435 12581798 12418282 12161325 11787989 11289511 10668046 9931124
9812 9931124 9087558 8146116 7116306 6009655 4840011 3622627 2372975 1106532 -159793
9803 -159793 -1404696 -2599711 -3709389 -4695309 -5520633 -6150837 -6550989 -6685450 -6524866
9794 -6524866 -6058363 -5303753 -4309952 -3151029 -1914956 -690957 441508 1420256 2204209
9785 2204209 2774304 3131932 3294404 3287156 3134432 2852725 2451018 1937922 1330903 661607
9775 661607 -25548 -680550 -1258073 -1727636 -2079543 -2323547 -2481293 -2577510 -2633997 -2666458
$$ packed form
9841C638448J085790J017695R15480P89435O54543N31742M41677L96166L93592
9832I864568M20310M56067M80082M75691M33578L54342K49400J38249M1920k4678
9822A2889529n8304o8996p6794j03637j63516k56957l73336m98478o21465p36922
9812I931124q43566r41442j029810j106651j169644j217384j249652j266443j266325
9803a59793j244903j195015j109678r85920q25324o30204m00152j34461J60584
9794f524866M66503P54610R93801J158923J236073J223999J132465R78748P83953
9785B204209N70095L57628J62472p248j52724k81707m01707n13096o07019o69296
9775F61607o87155o55002n77523m69563l51907k44004j57746r6217n6487l2461
$$ plain form
9765 -2666458 -2682483 -2681003 -2655013 -2597200 -2504978 -2381404 -2231580 -2057246 -1853073 -1606739 -1302639
9754 -1302639 -927479 -475612 47946 628419 1246135 1882346 2521238 3145727 3730321 4238008
9744 4238008 4626031 4859125 4923528 4834628 4635139 4385641 4151414 3988597 3931200 3981129
9734 3981129 4105234 4243480 4328638 4311534 4181028 3968785 3736657 3553634 3472806 3515047
9724 3515047 3661777 3858487 4030438 4106791 4043058 3832084 3502178 3107884 2718239 2402917
9714 2402917 2216659 2186592 2308853 2556098 2890071 3270783 3658471 4011969 4290572 4462739
9704 4462739 4518458 4478344 4393540 4333987 4367031 4533370 4830790 5213878 5609943 5943209
9694 5943209 6156680 6223749 6146856 5946240 5646427 5268662 4832389 4361921 3891234 3462122
$$ packed form
9765b666458j6025J480K5990N7813R2222J23574J49824J74334K04173K46334L04100
9754a302639L75160M51867N23558N80473O17716O36211O38892O24489N84594N07687
9744D238008L88023K33094O4403q8900j99489k49498k34227j62817n7397M9929
9734C981129J24105J38246Q5158j7104j30506k12243k32128j83023q0828M2241
9724C515047J46730J96710J71951P6353o3733k10974l29906l94294l89645l15322
9714B402917j86258l0067J22261K47245L33973L80712L87688L53498K78603J72167
9704D462739N5719m0114q4804n9553L3044J66339K97420L83088L96065L33266
9694E943209K13471O7069p6893k00616k99813l77765m36273m70468m70687m29112
$$ plain form
9684 3462122 3115736 2881464 2768787 2766547 2849976 2990984 3165463 3354489 3541732 3712094
9674 3712094 3854172 3964354 4048313 4118891 4193744 4296030 4456436 4711280 5094078 5623889
9664 5623889 6296087 7078864 7915648 8733294 9455430 10017497 10377013 10514297 10425926 10119389
9654 10119389 9616284 8962703 8236532 7540486 6978166 6622051 6488335 6530543 6654877 6750923
9644 6750923 6725745 6528928 6160745 5663205 5100457 4537558 4024118 3584905 3216866 2892072
9634 2892072 2566445 2192546 1732382 1166204 495975 -255485 -1048791 -1835935 -2571214 -3222544
9624 -3222544 -3779896 -4258989 -4699911 -5160658 -5705938 -6392848 -7256249 -8297281 -9478530
9615 -9478530 -10728918 -11958798 -13081129 -14030846 -14775322 -15313386 -15665538 -15860581 -15923832
$$ packed form
9684C462122l46386k34272j12677k240Q3429J41008J74479J89026J87243J70362
9674C712094J42078J10182Q3959P0578P4853J02286J60406K54844L82798N29811
9664E623889O72198P82777Q36784Q17646P22136N62067L59516J37284q8371l06537
9654A0119389n03105o53581p26171o96046n62320l56115j33716M2208J24334R6046
9644F750923k5178j96817l68183m97540n62748n62899n13440m39213l68039l24794
9634B892072l25627l73899m60164n66178o70229p51460p93306p87144p35279o51330
9624c222544n57352m79093m40922m60747n45280o86910q63401j041032j181249
9615i478530j250388j229880j122331r49717p44476n38064l52152j95043o3251
$$ plain form
9606 -15923832 -15869872 -15699760 -15401213 -14951972 -14328848 -13523073 -12556183 -11486499 -10400045
9597 -10400045 -9389089 -8528045 -7856215 -7372176 -7039452 -6799149 -6583697 -6328328 -5981145
9588 -5981145 -5513270 -4926211 -4250825 -3536630 -2837758 -2202951 -1670668 -1264959 -989926 -826029
9578 -826029 -732971 -660216 -561956 -411274 -207699 25753 254535 445895 575863 629065
9568 629065 597356 482313 299966 82309 -127047 -280720 -335437 -258677 -34319 333332
9558 333332 819281 1383663 1984014 2589940 3191854 3796419 4410251 5023777 5607831 6124576
9548 6124576 6542738 6846551 7036621 7127765 7147247 7131968 7121960 7150642 7234998 7369148 7524026
9537 7524026 7655407 7720230 7696156 7594487 7457835 7342678 7297086 7346758 7495452 7735602
$$ packed form
9606a5923832N3960J70112K98547M49241O23124Q05775R66890J069684J086454
9597a0400045J010956Q61044O71830M84039L32724K40303K15452K55369L47183
9588e981145M67875N87059O75386P14195O98872O34807N32283M05709K75033J63897
9578h26029R3058P2755R8260J50682K03575K33452K28782J91360J29968N3202
9568F29065l1709j15043j82347k17657k09356j53673n4717P6760K24358L67651
9558C33332M85949N64382O00351O05926O01914O04565O13832O13526N84054N16745
9548F124576M18162L03813J90070R1144J9482j5279j0008K8682Q4356J34150J54878
9537G524026J31381O4823k4074j01669j36652j15157m5592M9672J48694K40150
$$ plain form
9527 7735602 8059669 8465017 8951038 9512582 10135538 10798126 11476426 12149294 12799443 13411828
9517 13411828 13972367 14468201 14888440 15224713 15472278 15632510 15716172 15745814 15755203 15784205
9507 15784205 15869170 16031604 16269698 16556355 16843947 17072517 17177520 17096330 16776939 16192100
9497 16192100 15355412 14328634 13210704 12110127 11114151 10270257 9586570 9046087 8623609
9488 8623609 8296712 8048971 7868695 7746529 7672774 7634453 7613522 7587894 7534841 7434490
9478 7434490 7272071 7039369 6735974 6369853 5956179 5513841 5060161 4606050 4155227 3709880
9468 3709880 3280872 2896522 2603815 2459326 2512051 2784846 3263222 3897331 4615682 5343356
9458 5343356 6017921 6600059 7077342 7458585 7758074 7975830 8085741 8040990 7795262 7326374
$$ packed form
9527G735602L24067M05348M86021N61544O22956O62588O78300O72868O50149O12385
9517A3411828N60539M95834M20239L36273K47565J60232Q3662K9642R389K9002
9507A5784205Q4965J62434K38094K86657K87592K28570J05003q1190l19391n84839
9497A6192100q36688j026778j117930j100577r95976q43894o83687n40483m22478
9488H623609l26897k47741j80276j22166p3755l8321k0931k5628n3053j00351
9478G434490j62419k32702l03395l66121m13674m42338m53680m54111m50823m45347
9468C709880m29008l84350k92707j44489N2725K72795M78376O34109P18351P27674
9458E343356O74565N82138M77283L81243K99489K17756J09911m4751k45728m68888
$$ plain form
9448 7326374 6645824 5787444 4784534 3653928 2399352 1030692 -415599 -1868986 -3235136
9439 -3235136 -4419075 -5349967 -5995365 -6358999 -6466701 -6352641 -6055603 -5624882 -5126662
9430 -5126662 -4641879 -4253978 -4032448 -4019753 -4225243 -4624877 -5164243 -5764359 -6331931 -6775059
9420 -6775059 -7021665 -7033729 -6809905 -6375145 -5765097 -5017083 -4173087 -3289080 -2439705 -1712039
9410 -1712039 -1190536 -939766 -991014 -1336688 -1934322 -2718787 -3617941 -4565546 -5507646 -6402949
9400 -6402949 -7220593 -7938136 -8539747 -9013322 -9347184 -9529688 -9554427 -9429440 -9184947 -8874042
9390 -8874042 -8564008 -8320616 -8191340 -8194018 -8313930 -8508087 -8714491 -8866018 -8908032 -8814507
9380 -8814507 -8595115 -8289914 -7955068 -7645748 -7401169 -7236123 -7143352 -7106329 -7113400 -7161420
$$ packed form
9448G326374o80550q58380j002910j130606j254576j368660j446291j453387j366150
9439c235136j183939r30892o45398l63634j07702J14060K97038M30721M98220
9430e126662M84783L87901K21530J2695k05490l99634n39366o00116n67572m43128
9420f775059k46606j2064K23824M34760O10048P48014Q43996Q84007Q49375P27666
9410a712039N21503K50770n1248l45674n97634p84465q99154r47605r42100q95303
9400f402949q17644p17543o01611m73575l33862j82504k4739J24987K44493L10905
9390h874042L10034K43392J29276k678j19912j94157k06404j51527m2014R3525
9380h814507K19392L05201L34846L09320K44579J65046R2771L7023p071m8020
$$ plain form
9370 -7161420 -7246035 -7348455 -7431796 -7450686 -7366714 -7160106 -6833879 -6412340 -5935843 -5451432
9360 -5451432 -4999949 -4604247 -4265483 -3970619 -3706530 -3471236 -3275166 -3132593 -3049590 -3015812
9350 -3015812 -3004399 -2979839 -2909980 -2776258 -2577152 -2324032 -2032924 -1716955 -1381793 -1024000
9340 -1024000 -632276 -192133 306892 864934 1469795 2099518 2726753 3322223 3856991 4304833
9330 4304833 4645156 4864989 4957897 4920029 4747003 4436376 3996647 3457655 2874398 2319662
9320 2319662 1867697 1576325 1475118 1563486 1817322 2198885 2663711 3160961 3628887 3991833
9310 3991833 4165760 4074056 3667456 2938097 1921143 684996 -683956 -2096157 -3469771
9301 -3469771 -4736341 -5841829 -6745961 -7423668 -7869988 -8105431 -8176299 -8146423 -8081975 -8035589
$$ packed form
9370g161420q4615j02420q3341j8890Q3972K06608L26227M21539M76497M84411
9360e451432M51483L95702L38764K94864K64089K35294J96070J42573Q3003L3778
9350c015812J1413K4560O9859J33722J99106K53120K91108L15969L35162L57793
9340a024000L91724M40143M99025N58042O04861O29723O27235N95470N34768M47842
9330D304833L40323K19833R2908l7868j73026l10627m39729n38992n83257n54736
9320B319662m51965k91372j01207Q8368K53836L81563M64826M97250M67926L62946
9310C991833J73927r1704m06600p29359j016954j236147j368952j412201j373614
9301c469771j266570j105488r04132o77707m46320k35443p0868K9876O4448M6386
$$ plain form
9291 -8035589 -8036282 -8087674 -8172811 -8262584 -8325587 -8337203 -8284838 -8167102 -7988064 -7750407 -7451106
9280 -7451106 -7081400 -6630738 -6092382 -5466796 -4760387 -3981535 -3138646 -2242824 -1313159 -380572
9270 -380572 512262 1315340 1979188 2464259 2749530 2838763 2763823 2583166 2372439 2206844
9260 2206844 2141031 2195838 2358196 2593633 2864879 3147514 3435339 3734148 4050295 4382837
9250 4382837 4722828 5055895 5363098 5620107 5798762 5873172 5828212 5666310 5409320 5093685
9240 5093685 4759368 4437229 4142356 3877850 3645383 3453099 3314418 3239798 3229438 3273344
9230 3273344 3358913 3480692 3645634 3870383 4172308 4559693 5025471 5545290 6078595 6572689
9220 6572689 6971201 7226318 7310679 7223879 6991394 6657055 6271793 5881694 5518380 5194259
$$ packed form
9291h035589o93n1392q5137q9773o3003j1616N2365J17736J79038K37657K99301
9280g451106L69706M50662N38356O25586P06409P78852Q42889Q95822R29665R32587
9270c80572Q92834Q03078O63848M85071K85271Q9233p4940j80657k10727j65595
9260B206844o5813N4807J62358K35437K71246K82635K87825K98809L16147L32542
9250D382837L39991L33067L07203K57009J78655P4410m4960j61902k56990l15635
9240E093685l34317l22139k94873k64506k32467j92284j38681p4620j0360M3906
9230C273344Q5569J21779J64942K24749L01925L87385M65778N19819N33305M94094
9220F572689L98512K55117Q4361q6800k32485l34339l85262l90099l63314l24121
$$ plain form
9210 5194259 4903909 4631418 4361767 4092158 3837686 3627843 3495569 3464609 3540073 3703348
9200 3703348 3910957 4098717 4193319 4130265 3872523 3423057 2827228 2163965 1526184 994156
9190 994156 611376 375160 247600 179554 133090 92567 64843 74000 153591 336392 642721
9179 642721 1070753 1592400 2156880 2702137 3170801 3522916 3737443 3801862 3698873 3401478
9169 3401478 2880422 2118726 1124890 -60715 -1367941 -2706549 -3980052 -5098089 -5983049
9160 -5983049 -6572308 -6821904 -6715242 -6272810 -5554185 -4646893 -3645175 -2627772 -1644034
9151 -1644034 -712967 166634 1002105 1797068 2549598 3256016 3915401 4532223 5117392 5688304
9141 5688304 6267779 6881908 7556568 8310856 9146377 10036763 10926738 11746572 12436257 12965201
$$ packed form
9210E194259k90350k72491k69651k69609k54472k09843j32274l0960P5464J63275
9200C703348K07609J87760R4602o3054k57742m49466n95829o63263o37781n32028
9190I94156l82780k36216j27560o8046m6464m0523k7724R157P9591J82801L06329
9179F42721M28032N21647N64480N45257M68664L52115K14527O4419j02989k97395
9169C401478n21056p61696r93836j185605j307226j338608j273503j118037q84960
9160e983049n89259k49596J06662M42432P18625R07292J001718J017403R83738
9151a644034R31067Q79601Q35471P94963P52530P06418O59385O16822N85169N70912
9141E688304N79475O14129O74660P54288Q35521Q90386Q89975Q19834O89685N28944
$$ plain form
9131 12965201 13336203 13573914 13706812 13752472 13711378 13570028 13310597 12921587 12403112 11764426
9121 11764426 11018510 10181907 9282533 8368217 7504936 6761494 6189202 5808938 5610753
9112 5610753 5561479 5613463 5712163 5804603 5849318 5824033 5726367 5567558 5365152 5140745 4922297
9101 4922297 4744102 4638968 4625347 4697675 4825248 4957997 5035112 4995658 4792641 4408761
9091 4408761 3866591 3225536 2564290 1956492 1451217 1066320 794230 613374 498209 424871
9081 424871 373271 327230 273752 202342 105187 -21686 -176916 -352405 -532080 -691245 -797858
9070 -797858 -816923 -717539 -479816 -97713 424789 1082351 1875102 2806476 3870930 5039028
9060 5039028 6250947 7424456 8474403 9334636 9973401 10397006 10641230 10754541 10780782
$$ packed form
9131A2965201L71002K37711J32898M5660m1094j41350k59431l89010n18475o38686
9121A1764426p45916q36603q99374r14316q63281p43442n72292l80264j98185
9112E610753m9274N1984R8700R2440M4715k5285r7666j58809k02406k24407k18448
9101D922297j78195j05134j3621P2328J27573J32749P7115l9454k03017l83880
9091D408761n42170o41055o61246o07798n05275l84897k72090j80856j15165p3338
9081D24871n1600m6041n3478p1410r7155j26873j55230j75489j79675j59165j06613
9070g97858j9065R9384K37723L82103N22502O57562P92751R31374J064454J168098
9060E039028J211919J173509J049947Q60233O38765M23605K44224J13311K6241
$$ plain form
9051 10780782 10749062 10673790 10561025 10414368 10236399 10026733 9780356 9488965 9145788 8751927
9041 8751927 8320331 7873445 7433680 7010869 6593358 6147246 5623963 4973405 4159386 3174097
9031 3174097 2047813 849943 -320495 -1353563 -2151534 -2650613 -2835901 -2745206 -2458718
9022 -2458718 -2075617 -1685780 -1349837 -1097243 -940237 -890767 -967079 -1185922 -1547152 -2022532
9012 -2022532 -2557825 -3089137 -3565449 -3965366 -4300505 -4606750 -4929914 -5311365 -5776108 -6325319
9002 -6325319 -6935643 -7565570 -8165424 -8686475 -9087719 -9342035 -9442552 -9406172 -9269799 -9079205
8992 -9079205 -8877294 -8700308 -8583677 -8569752 -8706777 -9035608 -9571047 -10289433 -11130292 -12011841
8982 -12011841 -12853550 -13596871 -14216919 -14721297 -15136581 -15488101 -15783515 -16009884 -16145334
$$ packed form
9051A0780782l1720p5272j12765j46657j77969k09666k46377k91391l43177l93861
9041H751927m31596m46886m39765m22811m17511m46112n23283o50558q14019r85289
9031C174097j126284j197870j170438j033068p97971m99079j85288R0695K86488
9022b458718L83101L89837L35943K52594J57006M9470p6312k18843l61230m75380
9012b022532n35293n31312m76312l99917l35139l06245l23164l81451m64743n49211
9002f325319o10324o29927n99854n21051m01244k54316j00517L6380J36373J90594
8992i079205K01911J76986J16631J3925j37025l28831n35439p18386q40859q81549
8982a2011841q41709p43321o20048n04378m15284l51520k95414k26369j35450
$$ plain form
8973 -16145334 -16175200 -16100108 -15932390 -15687674 -15379614 -15018550 -14610143 -14152545 -13635626 -13046431
8963 -13046431 -12380833 -11655951 -10914958 -10218431 -9624272 -9166749 -8846545 -8636392 -8497770
8954 -8497770 -8400373 -8337270 -8330617 -8424728 -8667677 -9088321 -9678147 -10384574 -11117479 -11767321
8944 -11767321 -12230565 -12434985 -12355315 -12012288 -11455548 -10739194 -9902375 -8964212 -7934060
8935 -7934060 -6829492 -5690199 -4578635 -3566706 -2716509 -2066432 -1628952 -1397823 -1356901
8926 -1356901 -1484472 -1752553 -2124658 -2555852 -2996922 -3402114 -3737855 -3988610 -4157141 -4259441
8916 -4259441 -4317694 -4354914 -4392643 -4450233 -4543499 -4682059 -4867084 -5092221 -5348917 -5634241
8906 -5634241 -5956584 -6334389 -6786557 -7318982 -7915879 -8543271 -9164481 -9759164 -10334499 -10921903
$$ packed form
8973a6145334k9866P5092J67718K44716L08060L61064M08407M57598N16919N89195
8963a3046431O65598P24882P40993O96527N94159M57523L20204K10153J38622
8954h497770R7397O3103O653r4111k42949m20644n89826p06427p32905o49842
8944a1767321m63244k04420P9670L43027N56740P16354Q36819R38163J030152
8935g934060J104568J139293J111564J011929Q50197O50077M37480K31129M0922
8926a356901j27571k68081l72105m31194m41070m05192l35741k50755j68531j02300
8916d259441n8253l7220l7729n7590r3266j38560j85025k25137k56696k85324
8906e634241l22343l77805m52168n32425n96897o27392o21210n94683n75335n87404
$$ plain form
8896 -10921903 -11561045 -12279498 -13077824 -13926454 -14775246 -15571321 -16277819 -16885903 -17415080
8887 -17415080 -17901831 -18381864 -18874047 -19372443 -19848258 -20258607 -20556301 -20695719 -20634237 -20334106
8877 -20334106 -19770154 -18942407 -17884912 -16661988 -15351868 -14027096 -12742302 -11533027
8869 -11533027 -10421474 -9422149 -8543301 -7785274 -7140087 -6594356 -6132568 -5735955 -5377003
8860 -5377003 -5015936 -4605199 -4100938 -3473859 -2712551 -1818807 -800642 330150 1552983
8851 1552983 2829672 4099647 5285504 6308688 7108567 7656069 7956091 8038555 7943290
8842 7943290 7706083 7351081 6890301 6327938 5667027 4916557 4096259 3235983 2368986 1522627
8832 1522627 711583 -64086 -817696 -1574021 -2366217 -3228096 -4179906 -5212134 -6277001
$$ packed form
8896a0921903o39142p18453p98326q48630q48792p96075p06498o08084n29177
8887a7415080m86751m80033m92183m98396m75815m10349k97694j39418O1482L00131
8877b0334106N63952Q27747J057495J222924J310120J324772J284794J209275
8869a1533027J111553R99325Q78848P58027O45187N45731M61788L96613L58952
8860e377003L61067M10737N04261O27079P61308Q93744J018165J130792J222833
8851A552983J276689J269975J185857J023184P99879N47502L00022Q2464r5265
8842G943290k37207l55002m60780n62363o60911p50470q20298q60276q66997q46359
8832A522627q11044p75669p53610p56325p92196q61879r51810j032228j064867
$$ plain form
8823 -6277001 -7295306 -8177457 -8848961 -9268905 -9435061 -9376146 -9136574 -8760981 -8285211 -7737286
8813 -7737286 -7146479 -6553536 -6013702 -5588602 -5330501 -5267462 -5396601 -5686597 -6085868 -6532126
8803 -6532126 -6960833 -7311483 -7531765 -7580900 -7433495 -7083337 -6544775 -5850312 -5045190 -4180108
8793 -4180108 -3302309 -2446040 -1626104 -838755 -70246 691875 1451061 2200210 2923507 3596754
8783 3596754 4184319 4636172 4890744 4886154 4576493 3946356 3017893 1848325 519540 -876499
8773 -876499 -2252882 -3540544 -4695866 -5699950 -6549128 -7242187 -7772750 -8130397 -8305982
8764 -8305982 -8294821 -8097108 -7719199 -7176658 -6495379 -5707745 -4845372 -3932577 -2983658 -2004974
8754 -2004974 -1000581 22254 1051490 2072712 3071442 4032112 4934954 5754004 6457202
$$ packed form
8823f277001j018305q82151o71504m19944j66156N8915K39572L75593M75770N47925
8813g737286N90807N92943N39834M25100K58101O3039j29139k89996l99271m46258
8803f532126m28707l50650k20282m9135J47405L50158N38562O94463Q05122Q65082
8793d180108Q77799Q56269Q19936P87349P68509P62121P59186P49149P23297O73247
8783C596754N87565M51853K54572m590l09661o30137r28463j169568j328785j396039
8773h76499j376383j287662j155322j004084q49178o93059n30563l57647j75585
8764h305982J1161J97713L77909N42541O81279P87634Q62373R12795R48919R78684
8754b004974J004393J022835J029236J021222R98730R60670R02842Q19050P03198
$$ plain form
8745 6457202 7008361 7372182 7524081 7462554 7217230 6846021 6420658 6006838 5648637 5364547
8735 5364547 5154829 5012079 4925907 4880137 4849350 4802081 4710730 4561651 4359137 4121776
8725 4121776 3873636 3634072 3410169 3195178 2973757 2730732 2457930 2155188 1825647 1468727
8715 1468727 1075039 626205 100093 -521275 -1245948 -2072007 -2992681 -4002192 -5097649
8706 -5097649 -6275039 -7520393 -8799338 -10049995 -11184514 -12101550 -12706225 -12930329 -12747012
8697 -12747012 -12178654 -11298501 -10224809 -9104751 -8087972 -7295226 -6791948 -6576861 -6590932
8688 -6590932 -6743444 -6943074 -7119145 -7225406 -7231156 -7112566 -6853948 -6458549 -5959799 -5422992
8678 -5422992 -4933348 -4574751 -4408893 -4463155 -4728902 -5166100 -5710985 -6287950 -6827287 -7283995
$$ packed form
8745F457202N51159L63821J51899o1527k45324l71209m25363m13820l58201k84090
8735E364547k09718j42750q6172m5770l0787m7269r1351j49079k02514k37361
8725D121776k48140k39564k23903k14991k21421k43025k72802l02742l29541l56920
8715A468727l93688m48834n26112o21368p24673q26059r20674j009511j095457
8706e097649j177390j245354j278945j250657j134519r17036o04675k24104J83317
8697a2747012N68358Q80153J073692J120058J016779P92746N03278K15087j4071
8688f590932j52512j99630j76071j06261n750J18590K58618L95399M98750N36807
8678e422992M89644L58597J65858n4262k65747m37198n44885n76965n39337m56708
$$ plain form
8668 -7283995 -7647072 -7931949 -8159973 -8338206 -8451895 -8471980 -8369749 -8127807 -7741637 -7213867
8658 -7213867 -6547652 -5744542 -4808202 -3751685 -2604266 -1414186 -245722 828950 1741226
8649 1741226 2437941 2889533 3090998 3056205 2810780 2388453 1830536 1184718 501827 -166680
8639 -166680 -768776 -1252426 -1570849 -1692222 -1608481 -1337678 -918547 -400634 164768 729816
8629 729816 1253235 1705576 2077401 2384773 2665177 2963624 3316520 3741998 4239330 4793847
8619 4793847 5382282 5975974 6541756 7041268 7430173 7659968 7685604 7479101 7043784 6420377
8609 6420377 5679175 4900340 4151319 3471871 2872930 2348259 1891135 1506380 1212218 1033175
8599 1033175 989175 1085642 1307986 1623413 1990937 2375812 2760763 3147845 3550832 3983595
$$ packed form
8668g283995l63077k84877k28024j78233j13689k0085J02231K41942L86170N27770
8658g213867O66215Q03110R36340J056517J147419J190080J168464J074672R12276
8649A741226O96715M51592K01465l4793k45425m22327n57917o45818o82891o68507
8639a66680o02096m83650l18423j21373Q3741K70803M19131N17913N65402N65048
8629G29816N23419M52341L71825L07372K80404K98447L52896M25478M97332N54517
8619D793847N88435N93692N65782M99512L88905K29795K5636k06503m35317o23407
8609F420377p41202p78835p49021o79448n98941n24671m57124l84755k94162j79043
8599A033175m4000R6467K22344L15427L67524L84875L84951L87082M02987M32763
$$ plain form
8589 3983595 4450979 4945504 5448793 5934586 6371657 6727741 6975931 7102297 7110949 7023344
8579 7023344 6871486 6687757 6496172 6309984 6136954 5987693 5879813 5834699 5870477 5996865
8569 5996865 6213646 6509856 6860701 7223451 7537919 7737275 7768933 7616193 7307275 6904510
8559 6904510 6479080 6084958 5744017 5446427 5163325 4865118 4538076 4193529 3867515 3611818
8549 3611818 3478522 3501275 3679126 3970953 4305491 4603653 4802286 4867953 4796305 4601226
8539 4601226 4302339 3917385 3460718 2945224 2384782 1796475 1202923 634228 127857 -274878
8529 -274878 -535084 -622976 -522448 -232020 237454 865972 1625414 2477927 3375459 4265677
8519 4265677 5104515 5868163 6555841 7181516 7760801 8300314 8792007 9211968 9524641 9694071
$$ packed form
8589C983595M67384M94525N03289M85793M37071L56084K48190J26366Q652q7605
8579G023344j51858j83729j91585j86188j73030j49261j07880m5114L5778J26388
8569E996865K16781K96210L50845L62750L14468J99356L1658j52740l08918m02765
8559F904510m25430l94122l40941k97590k83102k98207l27042l44547l26014k55697
8549C611818j33296K2753J77851K91827L34538K98162J98633O5667p1648j95079
8539D601226k98887l84954m56667n15494n60442n88307n93552n68695n06371m02735
8529b74878k60206q7892J00528K90428M69474O28518P59442Q52513Q97532Q90218
8519D265677Q38838P63648O87678O25675N79285N39513M91693M19961L12673J69430
$$ plain form
8509 9694071 9699418 9546571 9268035 8910230 8515179 8106396 7686055 7244167 6774076 6285129
8499 6285129 5804977 5370156 5010549 4737090 4540172 4399493 4298797 4235756 4220774 4266225
8489 4266225 4373753 4527801 4698182 4847968 4940404 4942533 4828906 4588705 4232835 3792181
8479 3792181 3303387 2790354 2255161 1684472 1065141 398336 -292977 -962332 -1542589 -1954642
8469 -1954642 -2122736 -1993605 -1553813 -839641 64401 1039522 1956138 2700224 3194518 3409019
8459 3409019 3359356 3095481 2685388 2199015 1696389 1221917 804590 462239 207102 50072
8449 50072 2160 73456 271536 601677 1069479 1682956 2449067 3362797 4394185 5482942
8439 5482942 6546343 7497065 8262315 8797352 9091247 9165194 9064574 8847161 8570843 8283163
$$ packed form
8509I694071N347j52847k78536l57805l95051m08783m20341m41888m70091m88947
8499F285129m80152m34821l59607k73459j96918j40679j00696o3041j4982M5451
8489D266225J07528J54048J70381J49786R2436K129j13627k40201l55870m40654
8479C792181m88794n13033n35193n70689o19331o66805o91313o69355n80257m12053
8469a954642j68094J29131M39792P14172R04042R75121R16616P44086M94294K14501
8459C409019m9663k63875m10093m86373n02626m74472m17327l42351k55137j57030
8449E0072m7912P1296J98080L30141M67802O13477P66111R13730J031388J088757
8439E482942J063401R50722P65250N35037K93895P3947j00620k17413k76318k87680
$$ plain form
8429 8283163 8013377 7768200 7533606 7283484 6991733 6641894 6230320 5763029 5249024 4693589
8419 4693589 4095124 3447754 2748583 2005017 1237826 479072 -233147 -861884 -1380359 -1780921
8409 -1780921 -2078725 -2305984 -2499180 -2687794 -2891559 -3125256 -3403444 -3738550 -4132533 -4568231
8399 -4568231 -5007453 -5399290 -5696468 -5872545 -5931190 -5902857 -5831903 -5762567 -5730815 -5763301 -5880661
8388 -5880661 -6102444 -6451690 -6955671 -7638512 -8506000 -9530430 -10646267 -11761459 -12779661
8379 -12779661 -13623154 -14247695 -14645876 -14841018 -14876478 -14804527 -14676013 -14530793 -14390507 -14256649
8369 -14256649 -14114490 -13940034 -13706847 -13391635 -12977369 -12451778 -11801966 -11011950 -10070021
8360 -10070021 -8983471 -7788702 -6546687 -5325536 -4181359 -3147842 -2237670 -1452138
$$ packed form
8429H283163k69786k45177k34594k50122k91751l49839m11574m67291n14005n55435
8419D693589n98465o47370o99171p43566p67191p58754p12219o28737n18475m00562
8409a780921k97804k27259j93196j88614k03765k33697k78188l35106l93983m35698
8399d568231m39222l91837k97178j76077n8645K8333P0954O9336L1752l2486j17360
8388e880661k21783l49246n03981o82841q67488j024430j115837j115192j018202
8379a2779661q43493o24541l98181j95142l5460P1951J28514J45220J40286J33858
8369a4256649J42159J74456K33187L15212M14266N25591O49812P90016R41929
8360a0070021J086550J194769J242015J221151J144177J033517R10172P85532
$$ plain form
8352 -1452138 -792023 -262915 128161 382183 516682 567226 580338 601331 662059 772003
8342 772003 913951 1045440 1107965 1044387 820203 440606 -43592 -543716 -953224 -1175251
8332 -1175251 -1148835 -862917 -352330 319780 1082684 1874312 2650915 3389662 4083139 4727763
8322 4727763 5312771 5816018 6206768 6451106 6516932 6379157 6026215 5466827 4733937 3882934
8312 3882934 2983129 2104995 1308885 640472 132964 -189416 -312702 -240137 358 356026
8302 356026 761393 1160053 1525567 1869617 2233375 2668930 3221769 3920703 4775242 5777941
8292 5777941 6909130 8140353 9432640 10730275 11957057 13022954 13841608 14350250 14521589
8283 14521589 14363648 13911796 13220079 12355117 11390461 10398119 9437822 8548420 7745386
$$ packed form
8352a452138O60115N29108L91076K54022J34499N0544J3112K0993O0728J09944
8342G72003J41948J31489O2525o3578k24184l79597m84198n00124m09508k22027
8332a175251K6416K85918N10587O72110P62904P91628P76603P38747O93477O44624
8322D727763N85008N03247L90750K44338O5826j37775l52942n59388p32890q51003
8312C882934q99805q78134p96110o68413n07508l22380j23286P2565K40495L55668
8302C56026M05367L98660L65514L44050L63758M35555N52839O98934Q54539J002699
8292E777941J131189J231223J292287J297635J226782J065897Q18654N08642J71339
8283A4521589j57941m51852o91717q64962r64656r92342r60297q89402q03034
$$ plain form
8274 7745386 7024648 6369887 5759925 5173843 4593024 4001462 3387220 2746776 2090584 1445917
8264 1445917 854110 362234 11377 -175781 -205053 -114829 29526 152237 190313 112929
8254 112929 -74026 -340687 -653357 -987087 -1323173 -1637269 -1890574 -2032174 -2010800 -1788383
8244 -1788383 -1349187 -703352 113558 1044571 2019675 2967310 3824409 4540964 5079713 5415043
8234 5415043 5534002 5439068 5150787 4708512 4167596 3592060 3044426 2576747 2225856 2012623
8224 2012623 1943101 2009910 2192986 2459413 2763833 3053095 3277840 3408601 3448455 3433612
8214 3433612 3419061 3455386 3569257 3758184 4000236 4268528 4538030 4780730 4956403 5010197
8204 5010197 4882395 4526731 3928739 3116451 2158607 1148544 177098 -694503 -1447560
$$ packed form
8274G745386p20738o54761o09962n86082n80819n91562o14242o40444o56192o44667
8264A445917n91807m91876l50857j87158k9272R0224J44355J22711L8076p7384
8254A12929j86955k66661l12670l33730l36086l14096k53305j41600K1374K22417
8244a788383M39196O45835Q16910R31013R75104R47635Q57099P16555N38749L35330
8234E415043J18959r4934k88281m42275n40916n75536n47634m67679l50891k13233
8224B012623o9522O6809J83076K66427L04420K89262K24745J30761L9854j4843
8214C433612j4551L6325J13871J88927K42052K68292K69502K42700J75673N3794
8204E010197j27802l55664n97992q12288r57844j010063r71446q71601p53057
$$ plain form
8195 -1447560 -2097979 -2675422 -3205101 -3701709 -4173220 -4627274 -5075874 -5537310 -6033843 -6583973
8185 -6583973 -7191962 -7840859 -8494051 -9104978 -9629728 -10035793 -10303228 -10419858 -10376263 -10165485
8175 -10165485 -9788269 -9261026 -8622235 -7932399 -7263845 -6681598 -6223661 -5891564 -5656740
8166 -5656740 -5479142 -5328316 -5196566 -5098354 -5057292 -5088771 -5187907 -5328236 -5469765 -5570176
8156 -5570176 -5592128 -5503584 -5275317 -4884195 -4326086 -3631125 -2868194 -2132219 -1520251 -1107955
8146 -1107955 -934134 -994224 -1240913 -1590499 -1934469 -2155492 -2146111 -1827427 -1164552 -175509
8136 -175509 1069477 2459928 3865960 5160953 6238489 7021641 7468415 7576289 7382953
8127 7382953 6957798 6383676 5736216 5070640 4421087 3808792 3249922 2755989 2327830 1951095
$$ packed form
8195a447560o50419n77443n29679m96608m71511m54054m48600m61436m96533n50130
8185f583973o07989o48897o53192o10927n24750m06065k67435j16630M3595K10778
8175a0165485L77216N27243O38791O89836O68554N82247M57937L32097K34824
8166e656740J77598J50826J31750R8212M1062l1479r9136j40329j41529j00411
8156e570176k1952Q8544K28267L91122N58109O94961P62931P35975O11968M12296
8146a107955J73821o0090k46689l49586l43970k21023R381L18684O62875R89043
8136a75509J244986J390451J406032J294993J077536P83152M46774J07874j93336
8127G382953m25155n74122o47460o65576o49553o12295n58870m93933m28159l76735
$$ plain form
8117 1951095 1600802 1255525 914087 604828 380550 299575 401185 687389 1119797 1632301
8107 1632301 2152933 2625276 3021425 3342677 3609017 3842275 4050212 4219122 4319421 4321243
8097 4321243 4209581 3988815 3675909 3290896 2852955 2382496 1904546 1450254 1056168 760510
8087 760510 594927 572940 679804 868895 1067344 1190825 1164211 941125 514100 -88960
8077 -88960 -819507 -1627017 -2473746 -3339461 -4214484 -5086463 -5931960 -6721349 -7434542 -8075259
8067 -8075259 -8672422 -9267480 -9896244 -10575301 -11297780 -12037025 -12753819 -13403208 -13939157 -14317694
8057 -14317694 -14500223 -14457703 -14174612 -13650963 -12901739 -11954124 -10843208 -9607097 -8283005
8048 -8283005 -6905840 -5508745 -4123031 -2775538 -1484628 -258194 904337 2007206
$$ packed form
8117A951095l50293l45277l41438l09259k24278q0975J01610K86204M32408N12504
8107A632301N20632M72343L96149L21252K66340K33258K07937J68910J00299J822
8097D321243j11662k20766l12906l85013m37941m70459m77950m54292l94086k95658
8087G60510j65583k1987J06864J89091J98449J23481k6614k23086m27025o03060
8077h8960p30547q07510q46729q65715q75023q71979q45497p89389p13193o40717
8067h075259n97163n95058o28764o79057p22479p39245p16794o49389n35949l78537
8057a4317694j82529M2520K83091N23649P49224R47615J110916J236111J324092
8048h283005J377165J397095J385714J347493J290910J226434J162531J102869
$$ plain form
8040 2007206 3052973 4036988 4940637 5724524 6326953 6673599 6698861 6371989 5716931 4816362
8030 4816362 3796104 2794592 1929649 1276303 862005 675424 680634 831457 1083737 1402513
8020 1402513 1761067 2133595 2488737 2790397 3006000 3117095 3126443 3057604 2945820 2823117
8010 2823117 2704232 2580013 2420722 2187056 1844493 1376759 794723 137646 -535105 -1160827
8000 -1160827 -1692756 -2112500 -2428954 -2665681 -2846035 -2984436 -3085537 -3147620 -3165892 -3133054
7990 -3133054 -3037060 -2859121 -2576204 -2169168 -1632676 -981691 -252278 502813 1222532 1847613
7980 1847613 2329392 2636351 2760164 2720934 2565978 2357075 2150589 1982781 1868490 1809605
7970 1809605 1803276 1844113 1922984 2028948 2157362 2319363 2542862 2859294 3282118 3791373
$$ packed form
8040B007206J045767R84015R03649P83887O02429L46646K5262l26872o55058r00569
8030D816362j020258j001512q64943o53346m14298j86581N210J50823K52280L18776
8020A402513L58554L72528L55142L01660K15603J11095R348o8839j11784j22703
8010B823117j18885j24219j59291k33666l42563m67734n82036o57077o72751o25722
8000a160827n31929m19744l16454k36727j80354j38401j01101o2083j8272L2838
7990c133054R5994J77939K82917M07036N36492O50985P29413P55091P19719O25081
7980A847613M81779L06959J23813l9230j54956k08903k06486j67808j14291n8885
7970A809605o329M0837P8871J05964J28414J62001K23499L16432M22824N09255
$$ plain form
7960 3791373 4334544 4841961 5246964 5502348 5589842 5522300 5338593 5091610 4831308 4587113
7950 4587113 4356384 4105256 3783123 3344224 2765375 2051323 1226854 323116 -630636 -1602768
7940 -1602768 -2546382 -3390961 -4050145 -4444964 -4529925 -4307515 -3825031 -3157810 -2388404 -1590563
7930 -1590563 -822205 -125947 467729 939312 1282591 1508043 1642470 1721067 1772914 1807065
7920 1807065 1808765 1750196 1610161 1389619 1112004 807696 493161 158526 -228790 -706973
7910 -706973 -1298783 -1996977 -2762312 -3533737 -4244857 -4838921 -5277130 -5539584 -5621353 -5526968
7900 -5526968 -5265957 -4851087 -4299865 -3638520 -2906007 -2154557 -1444413 -834193 -371395 -86351
7890 -86351 11538 -62252 -264764 -529492 -779062 -941552 -962512 -809500 -472416 35629
$$ packed form
7960C791373N43171N07417M05003K55384Q7494o7542j83707k46983k60302k44195
7950D587113k30729k51128l22133m38899n78849p14052q24469r03738r53752r72132
7940a602768r43614q44579o59184l94819q4961K22410M82484O67221P69406P97841
7930a590563P68358O96258N93676M71583L43279K25452J34427P8597N1847L4151
7920A807065J700n8569j40035k20542k77615l04308l14535l34635l87316m78183
7910g06973n91810o98194p65335p71425p11120n94064m38209k62454q1769R4385
7900e526968K61011M14870N51222O61345P32513P51450P10144O10220M62798K85044
7890h6351R7889p3790k02512k64728k49570j62490k0960J53012L37084N08045
$$ plain form
7880 35629 676374 1387139 2088486 2699230 3154798 3423260 3514789 3481927 3408434 3386716 3489852
7869 3489852 3749606 4150012 4637421 5140132 5589006 5932471 6141708 6205413 6119384 5879916
7859 5879916 5486423 4949661 4296330 3564267 2791711 2009729 1243784 521406 -122446 -647960
7849 -647960 -1018791 -1209668 -1208948 -1016874 -643094 -106606 561467 1315589 2099824 2861136
7839 2861136 3567055 4216438 4834613 5454491 6094402 6744205 7364426 7895659 8272270 8435887
7829 8435887 8346574 7990270 7381067 6558503 5582464 4527912 3478438 2515680 1704859
7820 1704859 1081710 647115 371707 207911 104888 21712 -65758 -167528 -290703 -452884
7810 -452884 -688475 -1041973 -1550857 -2228731 -3060044 -4009606 -5039660 -6123353 -7248246
$$ packed form
7880C5629O40745P10765P01347O10744M55568K68462R1529l2862p3493k1718J03136
7869C489852K59754M00406M87409N02711M48874L43465K09237O3705q6029k39468
7859E879916l93493n36762o53331p32063p72556p81982p65945p22378o43852n25514
7849f47960l70831j90877P20J92074L73780N36488O68073P54122P84235P61312
7839B861136P05919O49383O18175O19878O39911O49803O20221N31233L76611J63617
7829H435887q9313l56304o09203q22564r76039j054552j049474r62758q10821
7820A704859o23149m34595k75408j63796j03023q3176q7470j01770j23175j62181
7810d52884k35591l53498n08884o77874q31313r49562j030054j083693j124893
$$ plain form
7801 -7248246 -8411276 -9610745 -10839965 -12084284 -13320953 -14520363 -15647896 -16666782
7793 -16666782 -17542882 -18251029 -18780515 -19136641 -19336781 -19402351 -19350242 -19187148 -18907876 -18496527
7783 -18496527 -17929477 -17180984 -16232787 -15086243 -13771719 -12348913 -10895633 -9488906 -8186639
7774 -8186639 -7017296 -5979841 -5051113 -4196792 -3383787 -2591735 -1818621 -1076046 -376348
7765 -376348 278753 899478 1499660 2086256 2652533 3175602 3617502 3931218 4072639 4015552
7755 4015552 3764224 3359458 2876275 2412167 2066193 1913496 1984672 2259585 2679111 3169060
7745 3169060 3664074 4120427 4515124 4837794 5083540 5248799 5326876 5302072 5147025 4828310
7735 4828310 4318677 3608316 2708598 1647762 463243 -803784 -2108745 -3400871 -4623147
$$ packed form
7801g248246j163030j199469j229220j244319j236669j199410j127533j018886
7793a6666782q76100p08147n29486l56126k00140o5570N2109J63094K79272M11349
7783a8496527N67050P48493R48197J146544J314524J422806J453280J406727J302267
7774h186639J169343J037455R28728Q54321Q13005P92052P73114P42575O99698
7765c76348O55101O20725O00182N86596N66277N23069M41900L13716J41421n7087
7755D015552k51328m04766m83183m64108l45974j52697P1176K74913M19526M89949
7745C169060M95014M56353L94697L22670K45746J65259P8077k4804j55047l18715
7735D828310n09633p10361q99718j060836j184519j267027j304961j292126j222276
$$ [...]
##END NTUPLES=NMR SPECTRUM
##END=
