##TITLE=31Pdec_LR-780-OM1
 CDCl3
  64 sc
 19.12.2023
##JCAMPDX= 6.0         $$ Bruker NMR JCAMP-DX V2.0
##DATA TYPE= NMR SPECTRUM
##DATA CLASS= NTUPLES
##ORIGIN= UXNMR, Bruker Analytische Messtechnik GmbH
##OWNER= root
$$ XWIN-NMR		Version 3.5
$$ Tue Dec 19 15:34:02 2023 Russian Standard Time (UT+4h)  she@DPX200
##.OBSERVE FREQUENCY= 81.013821
##.OBSERVE NUCLEUS= ^31P
##.ACQUISITION MODE= SIMULTANEOUS
##.ACQUISITION SCHEME= undefined
##.AVERAGES= 80
##.DIGITISER RES= 16
##SPECTROMETER/DATA SYSTEM= spect
##.PULSE SEQUENCE= zgpg30
##.SOLVENT NAME= D2O
##.SHIFT REFERENCE= (INTERNAL, D2O, 0, 248.564)
##AUDIT TRAIL= $$ (NUMBER, WHEN, WHO, WHERE, WHAT)
$$ ##TITLE= Audit trail, XWIN-NMR		Version 3.5
$$ ##JCAMPDX= 5.01
$$ ##ORIGIN= Bruker BioSpin GmbH
$$ ##OWNER= she
$$ F:/spectra/data/she/nmr/P31/1/pdata/1/auditp.txt
$$ ##AUDIT TRAIL=  $$ (NUMBER, WHEN, WHO, WHERE, WHAT)
(   1,<2023-12-19 15:31:33.10 +0400>,<she>,<DPX200>,
      <continue with go, POWCHK disabled, PULCHK disabled
       configuration hash MD5:
       00 E9 B6 7A A2 85 ED C7 34 08 36 98 17 FE 4E 26
       data hash MD5: 32K
       3B 53 2C 6E C2 45 67 1C 90 D2 FF 72 03 A5 F6 87>)
(   2,<2023-12-19 15:32:58.51 +0400>,<she>,<DPX200>,
      <Start of raw data processing
       efp BC_mod = 2 LB = 10 FT_mod = 6 PKNL = 1 PHC0 = -11771.42 PHC1 = 124.6937 SI = 64K 
       data hash MD5: 64K
       18 D9 C6 FA 56 EA 1A 48 14 E6 64 00 EC 78 6D 84>)
(   3,<2023-12-19 15:33:28.00 +0400>,<she>,<DPX200>,
      <pk PHC0 = -610.9626 PHC1 = 534.6004 
       data hash MD5: 64K
       9C 26 45 3D 1E 29 0F C4 FB 29 AA E4 C4 35 01 A3>)
(   4,<2023-12-19 15:33:31.90 +0400>,<she>,<DPX200>,
      <abs ABSG = 5 
       data hash MD5: 64K
       90 B7 34 11 8F F2 CF 50 A4 CF 00 3E FE C9 4E 96>)
$$ ##END=
$$ 
$$ hash MD5
$$ 73 3B 23 91 F2 2C 34 E8 83 EE D3 BA E9 CC 85 68
##$RELAX= 
##$RELAX= 
##$RELAX= 
##$RELAX= 
##$RELAX= 
##$RELAX= 
##$RELAX= 
##$RELAX= 
##$RELAX= 
$$ Bruker specific parameters
$$ --------------------------
##$DU= <F:/spectra>
##$EXPNO= 1
##$NAME= <P31>
##$PROCNO= 1
##$TYPE= <nmr>
##$USER= <she>
##$AMP= (0..31)
100 100 100 100 100 100 100 100 100 100 100 100 100 100 100 100 100 100 
100 100 100 100 100 100 100 100 100 100 100 100 100 100 
##$AQSEQ= 0
##$AQ_mod= 1
##$AUNM= <au_zg>
##$AUTOPOS= <>
##$BF1= 81.014009
##$BF2= 200.13
##$BF3= 200.13
##$BF4= 200.13
##$BF5= 200.13
##$BF6= 200.13
##$BF7= 200.13
##$BF8= 200.13
##$BYTORDA= 1
##$CFDGTYP= 0
##$CFRGTYP= 5
##$CHEMSTR= <none>
##$CNST= (0..31)
1 1 145 1 1 1 1 1 1 1 1 1 1 1 1 1 1 1 1 1 1 1 1 1 1 1 1 1 1 1 1 1 
##$CPDPRG= <waltz16>
##$CPDPRG1= <>
##$CPDPRG2= <waltz16>
##$CPDPRG3= <>
##$CPDPRG4= <mlev>
##$CPDPRG5= <mlev>
##$CPDPRG6= <mlev>
##$CPDPRG7= <mlev>
##$CPDPRG8= <mlev>
##$CPDPRGB= <>
##$CPDPRGT= <>
##$D= (0..31)
0 1 0 0 0 0 0 0 0 0 0 0.03 2e-05 3e-06 0 0 0 0 0 0 0 0 0 0 0 0 0 0 0 0 
0 0 
##$DATE= 1702985381
##$DBL= (0..7)
120 120 120 11 120 120 24 19 
##$DBP= (0..7)
150 150 150 150 150 150 150 150 
##$DBP07= 0
##$DBPNAM0= <>
##$DBPNAM1= <>
$$ [...]
##$SUBNAM3= <"">
##$SUBNAM4= <"">
##$SUBNAM5= <"">
##$SUBNAM6= <"">
##$SUBNAM7= <"">
##$SUBNAM8= <"">
##$SUBNAM9= <"">
##$SW= 501.771253377433
##$SWIBOX= (0..15)
0 1 3 0 0 0 0 0 0 0 0 0 0 0 0 0 
##$SW_h= 40650.406504065
##$TD= 32768
##$TD0= 1
##$TE= 0
##$TE2= 300
##$TE3= 300
##$TEG= 300
##$TL= (0..7)
0 120 53 12 22 120 120 120 
##$TP= (0..7)
150 150 150 150 150 150 150 150 
##$TP07= 0
##$TPNAME0= <>
##$TPNAME1= <>
##$TPNAME2= <>
##$TPNAME3= <>
##$TPNAME4= <>
##$TPNAME5= <>
##$TPNAME6= <>
##$TPNAME7= <>
##$TPOAL= (0..7)
0.5 0.5 0.5 0.5 0.5 0.5 0.5 0.5 
##$TPOFFS= (0..7)
0 0 0 0 0 0 0 0 
##$TUNHIN= 0
##$TUNHOUT= 0
##$TUNXOUT= 0
##$USERA1= <user>
##$USERA2= <user>
##$USERA3= <user>
##$USERA4= <user>
##$USERA5= <user>
##$V9= 5
##$VALIST= <valist>
##$VCLIST= <CCCCCCCCCCCCCCC>
##$VD= 0
##$VDLIST= <DDDDDDDDDDDDDDD>
##$VPLIST= <PPPPPPPPPPPPPPP>
##$VTLIST= <TTTTTTTTTTTTTTT>
##$WBST= 1024
##$WBSW= 4
##$XGAIN= (0..3)
0 0 0 0 
##$XL= 0
##$YL= 0
##$YMAX_a= 4698
##$YMIN_a= -4036
##$ZGOPTNS= <>
##$ZL1= 120
##$ZL2= 120
##$ZL3= 120
##$ZL4= 120
##$ABSF1= 248.5645
##$ABSF2= -253.2056
##$ABSG= 5
##$ABSL= 3
##$ALPHA= 0
##$AQORDER= 0
##$ASSFAC= 0
##$ASSFACI= 0
##$ASSFACX= 0
##$ASSWID= 0
##$AUNMP= <proc_1d>
##$AZFE= 0.1
##$AZFW= 0.5
##$BCFW= 0
##$BC_mod= 2
##$BYTORDP= 0
##$COROFFS= 0
##$CY= -3
##$DATMOD= 1
##$DC= 0
##$DFILT= <>
##$DTYPP= 0
##$F1P= 0
##$F2P= 0
##$FCOR= 1
##$FTSIZE= 65536
##$FT_mod= 6
##$GAMMA= 0
##$GB= 0
##$INTBC= 1
##$INTSCL= 6.047779e-11
##$ISEN= 30
##$LB= 10
##$LEV0= 0
##$LPBIN= 0
##$MAXI= 10000
##$MC2= 0
##$MEAN= 0
##$ME_mod= 0
##$MI= 50
##$NCOEF= 0
##$NC_proc= -10
##$NLEV= 6
##$NOISF1= 182.463
##$NOISF2= 159.3651
##$NSP= 0
##$NTH_PI= 0
##$NZP= 0
##$OFFSET= 248.5645
##$PC= 4
##$PHC0= -12382.38
##$PHC1= 659.2941
##$PH_mod= 1
##$PKNL= yes
##$PPARMOD= 0
##$PSCAL= 0
##$PSIGN= 0
##$REVERSE= no
##$SF= 81.0140089999694
##$SI= 65536
##$SIGF1= 159.3651
##$SIGF2= -187.1042
##$SINO= 113.3802
##$SIOLD= 16384
##$SREGLST= <1H.CDCl3>
##$SSB= 0
##$STSI= 65536
##$STSR= 0
##$SW_p= 40650.406504065
##$SYMM= 0
##$S_DEV= 0
##$TDeff= 32768
##$TDoff= 0
##$TI= <>
##$TILT= no
##$TM1= 0
##$TM2= 0
##$TOPLEV= 0
##$USERP1= <user>
##$USERP2= <user>
##$USERP3= <user>
##$USERP4= <user>
##$USERP5= <user>
##$WDW= 1
##$XDIM= 65536
##$YMAX_p= 337697487
##$YMIN_p= -46557875
$$ End of Bruker specific parameters
$$ ---------------------------------
##NTUPLES= NMR SPECTRUM
##VAR_NAME=  FREQUENCY,     SPECTRUM/REAL,   SPECTRUM/IMAG
##SYMBOL=    X,             R,               I
##VAR_TYPE=  INDEPENDENT,   DEPENDENT,       DEPENDENT
##VAR_FORM=  AFFN,          ASDF,            ASDF
##VAR_DIM=   65536,         65536,           65536
##UNITS=     HZ,            ARBITRARY UNITS, ARBITRARY UNITS
##FACTOR=    0.620285442955139, 1,           1
##FIRST=     20137.2065510682, 0,            0
##LAST=      -20513.1999529968, 0,           0
##MIN=       -20513.1999529968, -46557875,   0
##MAX=       20137.2065510682, 337697487,    0
$$ Real data points
##PAGE= N=1
##DATA TABLE= (X++(R..R)), XYDATA
$$ [...]
13053e202730K392752K345013K200237J952407J603690J174257P01014K29731
13045G396371j93358n31080p67120r13606j005583j083634j176527j294047j428995
13036i97579j561028j659228j686827j611838j421164j129835p77412m11661o9334
13027a1325906K33340M95480P18421Q96365J017469J072738J064395J007024R21124
13018c899550Q24425P27294O34168N48102M73893M17700L83891L71696L74677
13009H56296L84247L95148M08008M25788M46322M57738M41969L85430K89974J76708
12999D667628P9388K9655M0438R6353J59009J87245J60284Q6853o010r3440j65865
12988E241538k29021k96974l84148m95734o17507p13389p39319o69375n17574
$$ plain form
13053 -5202730 -2809978 -464965 1735272 3687679 5291369 6465626 7166640 7396371
13045 7396371 7203013 6671933 5904813 4991207 3985624 2901990 1725463 431416 -997579
13036 -997579 -2558607 -4217835 -5904662 -7516500 -8937664 -10067499 -10844911 -11256572 -11325906
13027 -11325906 -11092566 -10597086 -9878665 -8982300 -7964831 -6892093 -5827698 -4820674 -3899550
13018 -3899550 -3075125 -2347831 -1713663 -1165561 -691668 -273968 109923 481619 856296
13009 856296 1240543 1635691 2043699 2469487 2915809 3373547 3815516 4200946 4490920 4667628
12999 4667628 4747016 4776671 4817109 4913462 5072471 5259716 5420000 5506853 5500843 5407403 5241538
12988 5241538 5012517 4715543 4331395 3835661 3218154 2504765 1765446 1096071 578497
12979E78497l39014k06719j75659k53600l95687n26475n76809n14600l53849j40580
12969b904495P3219K52506L89037M97533O04828P39498R25297J177243J497590
12960C252256J870541K257762K600279K831797K901361K793392K530666K156521
12952B3194575J709240J208713O65156J00357m38382q83967j170865j258476j145444
12943B1980907q70351m99432j06545K44577N07541O51672O60645N35696K97828
12934B3402538j7001l66792p08922j000436j198895j268522j189958r67940o32123
12925A6051949k30223J82628N52620Q32514R87351J003018Q92087O88572M31960
12916B1392476J51540j38090m29715p13535r74752j201764j397590j581888j777691
$$ plain form
12979 578497 239483 32764 -142895 -396495 -792182 -1318657 -1895466 -2410066 -2763915 -2904495
12969 -2904495 -2831276 -2578770 -2189733 -1692200 -1087372 -347874 577423 1754666 3252256
12960 3252256 5122797 7380559 9980838 12812635 15713996 18507388 21038054 23194575
12952 23194575 24903815 26112528 26777684 26878041 26439659 25555692 24384827 23126351 21980907
12943 21980907 21110556 20611124 20504579 20749156 21256697 21908369 22569014 23104710 23402538
12934 23402538 23385537 23018745 22309823 21309387 20110492 18841970 17652012 16684072 16051949
12925 16051949 15821726 16004354 16556974 17389488 18376839 19379857 20271944 20960516 21392476
12916 21392476 21544016 21405926 20976211 20262676 19287924 18086160 16688570 15106682 13328991
12907A3328991j991517k202682k369395k445047k393741k200215j874612j451500
12899c599718r81179n15048r2055K66440N52233P62724Q98711R69051R94297J000900
12889B56356J008876J024707J045347J065192J075652J058955R87428Q33080N79697
12880H935290K27908k06809o96655j201891j673088k058558k314722k414787k354597
12871c757909k157042j872718j569499j307485j109003r43846p44154m43086j4066
12862a3918808N12577J062236J546348J891598K055432K027176J822014J474649
12854a526778J033332N51276P5150l63761p49153j070843j315930j468067j514004
12845f348778j449534j280034j018111o83405l04428Q1351M31045P01994Q58768
$$ plain form
12907 13328991 11337474 9134792 6765397 4320350 1926609 -273606 -2148218 -3599718
12899 -3599718 -4580897 -5095945 -5188000 -4921560 -4369327 -3606603 -2707892 -1738841 -744544 256356
12889 256356 1265232 2289939 3335286 4400478 5476130 6535085 7522513 8355593 8935290
12880 8935290 9163198 8956389 8259734 7057843 5384755 3326197 1011475 -1403312 -3757909
12871 -3757909 -5914951 -7787669 -9357168 -10664653 -11773656 -12717502 -13461656 -13904742 -13918808
12862 -13918808 -13406231 -12343995 -10797647 -8906049 -6850617 -4823441 -3001427 -1526778
12854 -1526778 -493446 57830 132980 -230781 -979934 -2050777 -3366707 -4834774 -6348778
12845 -6348778 -7798312 -9078346 -10096457 -10779862 -11084290 -11002939 -10571894 -9869900 -9011132
12836i011132Q82553P81604N95827L88307K23921J44807J56039K29556L23298
12827e285220M03465M56464M85124M94737M80810M28409L24693J75871J4612j10673
12817b131708j59585j20862j7580J04418J95621K19354J60569K6610j57304l54402
12807b234869n22546o21696o23929n22807l35498r4288J68102M30455O85801R34486
12797b736789J171622J375186J502284J499430J324882R71042M72098j07464o93691
12788D778600j219571j632655j899130k007994j971894j820738j591223j318619
12780h683224j031771p47624m65988j72074J48808M92269Q26104J098998J260109
12771g274393J277427J147167Q93171N57940J88688j75117n06271p86777j004113
$$ plain form
12836 -9011132 -8128579 -7346975 -6751148 -6362841 -6138920 -5994113 -5838074 -5608518 -5285220
12827 -5285220 -4881755 -4425291 -3940167 -3445430 -2964620 -2536211 -2211518 -2035647 -2021035 -2131708
12817 -2131708 -2291293 -2412155 -2429735 -2325317 -2129696 -1910342 -1749773 -1723163 -1880467 -2234869
12807 -2234869 -2757415 -3379111 -4003040 -4525847 -4861345 -4955633 -4787531 -4357076 -3671275 -2736789
12797 -2736789 -1565167 -189981 1312303 2811733 4136615 5107657 5579755 5472291 4778600
12788 4778600 3559029 1926374 27244 -1980750 -3952644 -5773382 -7364605 -8683224
12780 -8683224 -9714995 -10462619 -10928607 -11100681 -10951873 -10459604 -9633500 -8534502 -7274393
12771 -7274393 -5996966 -4849799 -3956628 -3398688 -3210000 -3385117 -3891388 -4678165 -5682278
12762e682278j152047j233293j258656j242360j197495j132790j049441r40220
12754a4888580p96018o18387m26525k49238j06771J753R5146J95355L12950M41511
12744a6038804N62062O53514P03609P15689P08824P11326P49092Q32276R46044
12735i456368J051517J098620J045748Q76734O06773K75099p0651l89208o52546
12726e614282q44650r57899r93026r63606r00075q45767q41162r01728j002878
12717a3865073j084720j077772r37544o70483l37896l3978J54206J85577Q0738
12708a7586945r4722k66628l83661m27534m04421l30836k24473j02661J4465J01841
12698a9705575J34265R7817q41j37000k81082m10942n14185n82584o06628n74507
$$ plain form
12762 -5682278 -6834325 -8067618 -9326274 -10568634 -11766129 -12898919 -13948360 -14888580
12754 -14888580 -15684598 -16302985 -16729510 -16978748 -17085519 -17083766 -16988620 -16793265 -16480315 -16038804
12744 -16038804 -15476742 -14823228 -14119619 -13403930 -12695106 -11983780 -11234688 -10402412 -9456368
12735 -9456368 -8404851 -7306231 -6260483 -5383749 -4776976 -4501877 -4572528 -4961736 -5614282
12726 -5614282 -6458932 -7416831 -8409857 -9373463 -10273538 -11119305 -11960467 -12862195 -13865073
12717 -13865073 -14949793 -16027565 -16965109 -17635592 -17973488 -18007466 -17853260 -17667683 -17586945
12708 -17586945 -17681667 -17948295 -18331956 -18759490 -19163911 -19494747 -19719220 -19821881 -19807416 -19705575
12698 -19705575 -19571310 -19473493 -19474334 -19611334 -19892416 -20303358 -20817543 -21400127 -22006755 -22581262
12688b2581262m74738l01493o1477K21963N12953P75896R90060J157118J296587
12679a8464393J430751J567422J691679J772085J775453J679270J477146J180628
12671e889959Q19599M38639Q8225j84531l42040l62099k46463k7295K36514M74498
12661d994912O25177O55491N73679M28388K89574K17500K35727L21619M18070
12652a229687M62784M24169L23531K24335J91445K50626L79417N30495O61705
12643B218820P50002P88764P80190P29466O41241N19767L74500K27186J12624
12634G142560P0265J31579L08796N86700R18940J233816J453382J520320J418833
12625A4785191J178510Q61453N41724K85881J38410J13132J91584L28439M61838
$$ plain form
12688 -22581262 -23056000 -23357493 -23418970 -23197007 -22684054 -21908158 -20918098 -19760980 -18464393
12679 -18464393 -17033642 -15466220 -13774541 -12002456 -10227003 -8547733 -7070587 -5889959
12671 -5889959 -5070360 -4631721 -4543496 -4728027 -5070067 -5432166 -5678629 -5705924 -5469410 -4994912
12661 -4994912 -4369735 -3714244 -3140565 -2712177 -2422603 -2205103 -1969376 -1647757 -1229687
12652 -1229687 -766903 -342734 -19203 205132 396577 647203 1026620 1557115 2218820
12643 2218820 2968822 3757586 4537776 5267242 5908483 6428250 6802750 7029936 7142560
12634 7142560 7212825 7344404 7653200 8239900 9158840 10392656 11846038 13366358 14785191
12625 14785191 15963701 16825154 17366878 17652759 17791169 17904301 18095885 18424324 18886162
12616A8886162N26628M70335K69898n8170m62875q78119j243279j511978j650105
12607A4348497j635777j468370j177931q20877m60126j43116J08170K93258M22917
12598I466645N08128N49521N30850M24672K12760r1294m37376p59709j008906
12589I395291j171307j263698j311061j324767j294759j199296j025623p87449
12581A7331n25756k91243j21471k8921m320k7144p4429j26520j71677k08449k43458
12570a806057k86168l44985m25700n29061o45822p53389q19371q12509p15654
12561g138716n34899l01734o7104J12066J90519J50213Q150j85933l62727m56407
12551h586572m30362k91173p9606J54794L74775N57859O86275P40274P01619N62231
$$ plain form
12616 18886162 19412790 19883125 20153023 20094853 19631978 18753859 17510580 15998602 14348497
12607 14348497 12712720 11244350 10066419 9245542 8785416 8642300 8750470 9043728 9466645
12598 9466645 9974773 10524294 11055144 11479816 11692576 11601282 11163906 10404197 9395291
12589 9395291 8223984 6960286 5649225 4324458 3029699 1830403 804780 17331
12581 17331 -508425 -799668 -921139 -950060 -954380 -981524 -1055953 -1182473 -1354150 -1562599 -1806057
12570 -1806057 -2092225 -2437210 -2862910 -3391971 -4037793 -4791182 -5610553 -6423062 -7138716
12561 -7138716 -7673615 -7975349 -8042453 -7930387 -7739868 -7589655 -7581505 -7767438 -8130165 -8586572
12551 -8586572 -9016934 -9308107 -9387713 -9232919 -8858144 -8300285 -7614010 -6873736 -6172117 -5609886
12541e609886L32025M3427k52047n00161o68108p59285q05688q43059q87091r26013
12531a0875886r33080q90591q08613p21896o64215o40511o21274n62918m34881
12522a7153865k33295K2042K98242N60162P79865R43190J050959J115306J154440
12513a1462954J187117J224998J263699J279544J238889J117371R16575O66827
12505b567934M15773K11549Q8585N8728J08433K03991L04705L77998M08049L94057
12495C934L40998K49484J11425q4330l37931o24619q91741j071457j104573r64531
12485d373341o69074k71636J64130N90295R82830J328717J607088J783007J818279
12476B960295J689232J399603R84139N03641L1721l65715o51707q28305r27071
$$ plain form
12541 -5609886 -5277861 -5234434 -5486481 -5986642 -6654750 -7414035 -8219723 -9062782 -9949873 -10875886
12531 -10875886 -11808966 -12699557 -13508170 -14230066 -14894281 -15534792 -16156066 -16718984 -17153865
12522 -17153865 -17387160 -17365118 -17066876 -16506714 -15726849 -14783659 -13732700 -12617394 -11462954
12513 -11462954 -10275837 -9050839 -7787140 -6507596 -5268707 -4151336 -3234761 -2567934
12505 -2567934 -2152161 -1940612 -1852027 -1793299 -1684866 -1480875 -1176170 -798172 -390123 3934
12495 3934 344932 594416 705841 621511 283580 -341039 -1232780 -2304237 -3408810 -4373341
12485 -4373341 -5042415 -5314051 -5149921 -4559626 -3576796 -2248079 -640991 1142016 2960295
12476 2960295 4649527 6049130 7033269 7536910 7568631 7202916 6551209 5722904 4795833
12467D795833r84229j016113j010509r37567p70799n03955j55090K41051O44279
12458C02901J016070J321253J528695J614644J567639J392474J113043P73939
12450A0630658M36482J65153Q575j4170Q4365K66019M76355O58101P69074P95394
12440A4276006P47464O39862M73870K40355o0341m02936p42265j033328j247934
12431A2890753j377886j430468j425877j396758j383010j419675j524002j688734
12423A244343j883554k063037k179282k196086k099176j898010j619367j296882
12415a3991051r60953o31494l15364r673K89916N80773Q51262J087272J281194
12406a1818118J433690J546254J613622J625436J575266J466869J312717J129152
$$ plain form
12467 4795833 3811604 2795491 1784982 847415 76616 -427339 -582429 -341378 302901
12458 302901 1318971 2640224 4168919 5783563 7351202 8743676 9856719 10630658
12450 10630658 11067140 11232293 11240868 11226698 11311063 11577082 12053437 12711538 13480612 14276006
12440 14276006 15023470 15663332 16137202 16377557 16317216 15914280 15172015 14138687 12890753
12431 12890753 11512867 10082399 8656522 7259764 5876754 4457079 2933077 1244343
12423 1244343 -639211 -2702248 -4881530 -7077616 -9176792 -11074802 -12694169 -13991051
12415 -13991051 -14952004 -15583498 -15898862 -15908535 -15618619 -15037846 -14186584 -13099312 -11818118
12406 -11818118 -10384428 -8838174 -7224552 -5599116 -4023850 -2556981 -1244264 -115112
12398a15112R32790P36997N47025L57756J58332n8908k92207n29833p52138r33061
12388E1641j042410j052793r51798p52280m90237k07701O6842L23840N62152P77984
12378b714760R65421J122374J248170J332507J349654J268255J071761P75589
12370F418971M29727J03831j38337k61335k66395j86037p2164J9154M7213N076
12360F099704p5917j41478j39497l9430J59730M28758P11936R38078J040361R79067
12350I961312P55810M10134j229m30670q55397j274350j692268k103776k485818
12341B283748k799312k998488l046362k931266k674871k324845j935982j552754
12333a7980132j203830r07104o74976n12765m12936l52486k96965k09914o5859
$$ plain form
12398 -115112 817678 1554675 2101700 2459456 2617788 2558880 2266673 1736840 984702 51641
12388 51641 -990769 -2043562 -2995360 -3747640 -4237877 -4445578 -4378736 -4054896 -3492744 -2714760
12378 -2714760 -1749339 -626965 621205 1953712 3303366 4571621 5643382 6418971
12370 6418971 6848698 6952529 6814192 6552857 6286462 6100425 6028261 6047415 6094628 6099704
12360 6099704 6023787 5882309 5742812 5703382 5863112 6291870 7003806 7941884 8982245 9961312
12350 9961312 10717122 11127256 11126027 10695357 9839960 8565610 6873342 4769566 2283748
12341 2283748 -515564 -3514052 -6560414 -9491680 -12166551 -14491396 -16427378 -17980132
12333 -17980132 -19183962 -20091066 -20766042 -21278807 -21691743 -22044229 -22341194 -22551108 -22616967
12324b2616967J36455L67913N77756P15623P55017P05879O12259N38166N46225
12315a7661674O74862R21351J237521J541382J743363J778949J631635J332121
12307f800490R37011N07755J04980k10210l87063m09359l11197j65230m8353p374
12297f789530m3157j17088j73380j66358q0477O5804K32559L78805M79625N33031
12287e680166N56545N78576O29974P37216R15140J158074J432443J677202J817078
12278C822082J787448J560922J160886O53046J20450l62468p44941j003484j139449
12269E854492j173614j138287j068294r92523r26150q65240p89644o77750n24688
12260b301698l47507j70685n157J58206L34102N21303O93362Q07964Q26358P30671
$$ plain form
12324 -22616967 -22480512 -22112599 -21534843 -20819220 -20064203 -19358324 -18746065 -18207899 -17661674
12315 -17661674 -16986812 -16065461 -14827940 -13286558 -11543195 -9764246 -8132611 -6800490
12307 -6800490 -5863479 -5355724 -5250744 -5460954 -5848017 -6257376 -6568573 -6733803 -6782156 -6789530
12297 -6789530 -6832687 -6949775 -7123155 -7289513 -7369990 -7304186 -7071627 -6692822 -6213197 -5680166
12287 -5680166 -5123621 -4545045 -3915071 -3177855 -2262715 -1104641 327802 2005004 3822082
12278 3822082 5609530 7170452 8331338 8984384 9104834 8742366 7997425 6993941 5854492
12269 5854492 4680878 3542591 2474297 1481774 555624 -309616 -1099260 -1777010 -2301698
12260 -2301698 -2649205 -2819890 -2825047 -2666841 -2332739 -1811436 -1118074 -310110 516248 1246919
12250A246919N32303K69953j979k30827l81282m41970m22281l44576k35579j16530
12240a25849P245J50939L42189O02321R29257J294227J654103J969574K216053
12231I040059K380892K451944K410242K236322J926400J503690J013341N04483
12223B3467373J3987m37832q42416j198181j509646j787261k044911k296185k550703
12214A0814225k809288l058474l269777l408396l447169l374814l193019k908289
12206a4655001k529164k072424j571986j080400o57172l47502j63227p8432m2981
12197b3198289m889P2241K04269L91661O26787Q96790J181154J449628J667116
12188a6713532J805621J854662J821489J721067J563801J348636J064808P01643
$$ plain form
12250 1246919 1779222 2049175 2047196 1816369 1435087 993117 570836 226260 -9319 -125849
12240 -125849 -118604 32335 374524 976845 1906102 3200329 4854432 6824006 9040059
12231 9040059 11420951 13872895 16283137 18519459 20445859 21949549 22962890 23467373
12223 23467373 23481360 23043528 22201112 21002931 19493285 17706024 15661113 13364928 10814225
12214 10814225 8004937 4946463 1676686 -1731710 -5178879 -8553693 -11746712 -14655001
12206 -14655001 -17184165 -19256589 -20828575 -21908975 -22566147 -22913649 -23076876 -23155308 -23198289
12197 -23198289 -23203178 -23130937 -22926668 -22535007 -21908220 -21011430 -19830276 -18380648 -16713532
12188 -16713532 -14907911 -13053249 -11231760 -9510693 -7946892 -6598256 -5533448 -4831805
12180d831805K62451k25771p14029j143020j456116j608699j576944j367912j022901
12171a3684746o04280j69966K45742O29760R71223J246199J421542J473733J404568
12162g066225J239968J015530P64005N14721L00130J57387J19000J98008L78358
12153b379118O17881Q63724J072520J223892J320191J375555J404695J418793
12145F918133J426986J436838J450356J457804J434592J345574J157694Q56973
12137A7484950M61260J9654m04172p57471j018133j195820j313971j387079j412112
12128A0477106j380856j300182j199526j117003j075832j070301j070065j036252
12120A227089r37907p62638n20740k42191L3952K73270M54492N68414O12297N88570
$$ plain form
12180 -4831805 -4569354 -4795125 -5509154 -6652174 -8108290 -9716989 -11293933 -12661845 -13684746
12171 -13684746 -14289026 -14458992 -14213250 -13583490 -12612267 -11366068 -9944526 -8470793 -7066225
12162 -7066225 -5826257 -4810727 -4046722 -3532001 -3231871 -3074484 -2955484 -2757476 -2379118
12153 -2379118 -1761237 -897513 175007 1398899 2719090 4094645 5499340 6918133
12145 6918133 8345119 9781957 11232313 12690117 14124709 15470283 16627977 17484950
12137 17484950 17946210 17965864 17561692 16804221 15786088 14590268 13276297 11889218 10477106
12128 10477106 9096250 7796068 6596542 5479539 4403707 3333406 2263341 1227089
12120 1227089 289182 -473456 -994196 -1236387 -1202435 -929165 -474673 93741 706038 1294608
12110A294608N09874M03053L03842K42617K30662K56596K94038L13346K90264
12101D138900K11129P7672q9494k54906l82360m51962m68885m59228m57108m89810
12091A373948n66451o75230p92056q95598r77029j037220j076453j088336j063316
12082f797741r97434q98723p86949o86510o15962n80629n73160n79904n85268
12073a3102280n70078n08804l73578j46096J69713N43203R24604J261687J516931
12064a0284698J675918J743935J736998J676437J588908J505039J451008J436968
12056B530513J452691J475368J482916J460608J395195J263792J031842O68089
12048A2761014J68343m31126j063263j657395k164370k564236k856488l045560
$$ plain form
12110 1294608 1804482 2207535 2511377 2753994 2984656 3241252 3535290 3848636 4138900
12101 4138900 4350029 4427701 4338207 4083301 3700941 3248979 2780094 2320866 1863758 1373948
12091 1373948 807497 132267 -659789 -1555387 -2532416 -3569636 -4646089 -5734425 -6797741
12082 -6797741 -7795175 -8693898 -9480847 -10167357 -10783319 -11363948 -11937108 -12517012 -13102280
12073 -13102280 -13672358 -14181162 -14554740 -14700836 -14531123 -13987920 -13063316 -11801629 -10284698
12064 -10284698 -8608780 -6864845 -5127847 -3451410 -1862502 -357463 1093545 2530513
12056 2530513 3983204 5458572 6941488 8402096 9797291 11061083 12092925 12761014
12048 12761014 12929357 12498231 11434968 9777573 7613203 5048967 2192479 -853081
12040h53081l133745l123260l019526k827988k546854k167565j690045j143487
12032b0505551n92825j20982K01881L41260L03092J26558j24992l72965n36944
12023b1281468n54398m00390r7044K93847O92431J026205J247581J338489J305455
12014a6429292J172600R77526P68851N99547N12377N22339O08530P23785Q16608
12005i727129Q50158Q08325O92502N18313L15127J22839j9250q9231r5941p8998
11995f703285r1582j73250l28964n28455p25669q83169r84840j032328j033754
11986a2485296r95268r18891q03203o44127m37293j84362R9228L81971O24119
11977a5363122P92508Q73724Q78315Q34766P76782P28911O96176O63680O08938
$$ plain form
12040 -853081 -3986826 -7110086 -10129612 -12957600 -15504454 -17672019 -19362064 -20505551
12032 -20505551 -21098376 -21219358 -21017477 -20676217 -20373125 -20246567 -20371559 -20744524 -21281468
12023 -21281468 -21835866 -22236256 -22333300 -22039453 -21347022 -20320817 -19073236 -17734747 -16429292
12014 -16429292 -15256692 -14279166 -13510315 -12910768 -12398391 -11876052 -11267522 -10543737 -9727129
12005 -9727129 -8876971 -8068646 -7376144 -6857831 -6542704 -6419865 -6439115 -6528346 -6624287 -6703285
11995 -6703285 -6794867 -6968117 -7297081 -7825536 -8551205 -9434374 -10419214 -11451542 -12485296
11986 -12485296 -13480564 -14399455 -15202658 -15846785 -16284078 -16468440 -16369212 -15987241 -15363122
11977 -15363122 -14570614 -13696890 -12818575 -11983809 -11207027 -10478116 -9781940 -9118260 -8509322
11968h509322N21170M14096L20896K73655K82364L28377L74388L81539L23316
11959e289521J92561K727k15229m20180n71705o41971o23784n30326l86052k14448
11949h697928l0956J55172L33735M88805O01599O59920O66793O40094O02431N70144
11939d010191N51168N51061N77251O35124P20000Q13196Q84639Q99239Q24403
11930B445890O38002L35298o7695n36393j025962j493928j910730k260720k533867
11921f410105k719123k809393k813769k761418k687380k607787k503403k326415
11913b7638793k029408j598540j068537n10416k698L95625O60453Q05185Q70517
11904c0116612R03347R36153R81842J044913J132523J251689J398189J552498
$$ plain form
11968 -8509322 -7988152 -7574056 -7253160 -6979505 -6697141 -6368764 -5994376 -5612837 -5289521
11959 -5289521 -5096960 -5094233 -5309462 -5729642 -6301347 -6943318 -7567102 -8097428 -8483480 -8697928
11949 -8697928 -8728884 -8573712 -8239977 -7751172 -7149573 -6489653 -5822860 -5182766 -4580335 -4010191
11939 -4010191 -3459023 -2907962 -2330711 -1695587 -975587 -162391 722248 1621487 2445890
11930 2445890 3083892 3419190 3351495 2815102 1789140 295212 -1615518 -3876238 -6410105
11921 -6410105 -9129228 -11938621 -14752390 -17513808 -20201188 -22808975 -25312378 -27638793
11913 -27638793 -29668201 -31266741 -32335278 -32845694 -32848392 -32452767 -31792314 -30987129 -30116612
11904 -30116612 -29213265 -28277112 -27295270 -26250357 -25117834 -23866145 -22467956 -20915458
11896b0915458J688335J786135J842144J868967J886724J907943J926426J920631
11888f088153J870089J770410J634801J483859J334152J191566J048570Q84431
11880E129725O71770L91257M8702l17248o44495q69990r52917q87989p06898m70973
11870A390944k56510j33333j41955k79813n04654p52837r62152j088310j110865
11861c839485j031024q66337o44726l96919j46347R9629L49852O17409R02411
11852d955537J183290J424993J597632J689420J703830J646673J517220J310189
11844G117710J023771O65878K56627j71474n76533r15791j158446j297017j350461
11835C594264j354854j343495j327111j289110j201005j045179q25170n57693
$$ plain form
11896 -20915458 -19227123 -17440988 -15598844 -13729877 -11843153 -9935210 -8008784 -6088153
11888 -6088153 -4218064 -2447654 -812853 671006 2005158 3196724 4245294 5129725
11880 5129725 5801495 6192752 6241454 5924206 5279711 4409721 3456804 2568815 1861917 1390944
11870 1390944 1134434 1001101 859146 579333 74679 -678158 -1640310 -2728620 -3839485
11861 -3839485 -4870509 -5736846 -6381572 -6778491 -6924838 -6825209 -6475357 -5857948 -4955537
11852 -4955537 -3772247 -2347254 -749622 939798 2643628 4290301 5807521 7117710
11844 7117710 8141481 8807359 9063986 8892512 8315979 7400188 6241742 4944725 3594264
11835 3594264 2239410 895915 -431196 -1720306 -2921311 -3966490 -4791660 -5349353
11827e349353k58837O1700L97380P40486J080736J404786J695177J930155K085533
11818C787763K138244K072261J886766J601749J253950Q82766N15891J65059j67506
11809A4136943m80507p69913j029767j253765j436641j576682j678559j752572
11801D158537j808447j847075j856434j815371j703777j513841j256151r56679
11793h599238o46272l49640q0928J53334L49227N03442O14426O83694P15640P16210
11783e940105O91149O44750N80940N07701M41984M09394M35549N32807O90193
11774a005638Q72141J025879J093890J028214Q04402M31366m7975n67578j056186
11765B578515j453460j718174j829264j784693j601013j311563r59008n81554
$$ plain form
11827 -5349353 -5608190 -5546490 -5149110 -4408624 -3327888 -1923102 -227925 1702230 3787763
11818 3787763 5926007 7998268 9885034 11486783 12740733 13623499 14139390 14304449 14136943
11809 14136943 13656436 12886523 11856756 10602991 9166350 7589668 5911109 4158537
11801 4158537 2350090 503015 -1353419 -3168790 -4872567 -6386408 -7642559 -8599238
11793 -8599238 -9245510 -9595150 -9676078 -9522744 -9173517 -8670075 -8055649 -7371955 -6656315 -5940105
11783 -5940105 -5248956 -4604206 -4023266 -3515565 -3073581 -2664187 -2228638 -1695831 -1005638
11774 -1005638 -133497 892382 1986272 3014486 3818888 4250254 4202279 3634701 2578515
11765 2578515 1125055 -593119 -2422383 -4207076 -5808089 -7119652 -8078660 -8660214
11757h660214j99328J88605N92137J010647J420652J777874K027693K114729J991684
11748B264479J634313J061626L46135m01203j068545j580781j914239k083745
11740a741960k116706k033722j844638j555658j177529p28259k31125K86989P93110
11731a0349498J243501J584296J763974J754944J570746J264675R07264N55303
11723B95205K30347q2352m16304p99189j234907j700291k154355k550294k842825
11714a1254965k991792k967369k757686k373281j844540j215594n40617J17653
11706b5828191O93075J127796J385172J455855J355160J116849P88185M25105
11698a7480994Q3292j94737l89901n06997n64937n84098n79328n61587n43536
$$ plain form
11757 -8660214 -8859542 -8670937 -8078800 -7068153 -5647501 -3869627 -1841934 272795 2264479
11748 2264479 3898792 4960418 5306553 4905350 3836805 2256024 341785 -1741960
11740 -1741960 -3858666 -5892388 -7737026 -9292684 -10470213 -11198472 -11429597 -11142608 -10349498
11731 -10349498 -9105997 -7521701 -5757727 -4002783 -2432037 -1167362 -260098 295205
11723 295205 525552 443200 26896 -772293 -2007200 -3707491 -5861846 -8412140 -11254965
11714 -11254965 -14246757 -17214126 -19971812 -22345093 -24189633 -25405227 -25945844 -25828191
11706 -25828191 -25135116 -24007320 -22622148 -21166293 -19811133 -18694284 -17906099 -17480994
11698 -17480994 -17397702 -17592439 -17982340 -18489337 -19054274 -19638372 -20217700 -20779287 -21322823
11689b1322823n40813n63858o04082o26528n79566m19265j31881K62039P22864
11680b3803913J211202J695874K148826K537438K824112K973891K964045K789889
11672d658636K465154K018718J490374R27469L82283r1507m45321o45458o83629
11663G59447n83001l94291j80602L413J28074J93175K19819K35065K56812K85503
11653I23414L06721L03223K68235K09742J42855P8401J9275l2217o4077n2577
11643B102995K7881J89391M20283O86552R43219J147963J270191J294448J220619
11634I303542J061788Q38275N69137K67700n3317l70753o45863q34248r07387
11625I228874q70718p63429o37896n32152m54353l87878l09351k04097p0148Q6598
$$ plain form
11689 -21322823 -21863636 -22427494 -23031576 -23658104 -24237670 -24656935 -24788816 -24526777 -23803913
11680 -23803913 -22592711 -20896837 -18748011 -16210573 -13386461 -10412570 -7448525 -4658636
11672 -4658636 -2193482 -174764 1315610 2243079 2625362 2533855 2088534 1443076 759447
11663 759447 176446 -217845 -398447 -395034 -266960 -73785 146034 381099 637911 923414
11653 923414 1230135 1533358 1801593 2011335 2154190 2232591 2251866 2219649 2155572 2102995
11643 2102995 2130876 2320267 2740550 3427102 4370321 5518284 6788475 8082923 9303542
11634 9303542 10365330 11203605 11772742 12040442 11987125 11616372 10970509 10136261 9228874
11625 9228874 8358156 7594727 6956831 6424679 5970326 5582448 5273097 5069000 4998852 5085450
11615E085450K58459M38323O17706P83056R14261R88097R84425Q89685O96226
11606A1655688M02599J9208m25171q85697j315204j680598j970608k191731k357416
11597A251070k476927k548034k556350k483329k320037k078281j789997j493241
11589a6495126j213162r50490o85454l94974p2686K60795N64792P99557R48305
11580a7238443J025138J062877J089722J112327J117692J091349J036678R79721
11572h722939R55042R82264J049425J114105J120778J022618P95515M40608j8942
11563a261526n39823j059720j505407j812780j951292j937045j824252j680090
11555a3571935j558171j483226j449836j431259j392554j303060j144278r11859
$$ plain form
11615 5085450 5343909 5782232 6399938 7182994 8097255 9085352 10069777 10959462 11655688
11606 11655688 12058287 12077495 11652324 10766627 9451423 7770825 5800217 3608486 1251070
11597 1251070 -1225857 -3773891 -6330241 -8813570 -11133607 -13211888 -15001885 -16495126
11589 -16495126 -17708288 -18658778 -19344232 -19739206 -19811892 -19551097 -18986305 -18186748 -17238443
11580 -17238443 -16213305 -15150428 -14060706 -12948379 -11830687 -10739338 -9702660 -8722939
11572 -8722939 -7767897 -6785633 -5736208 -4622103 -3501325 -2478707 -1683192 -1242584 -1261526
11563 -1261526 -1801349 -2861069 -4366476 -6179256 -8130548 -10067593 -11891845 -13571935
11555 -13571935 -15130106 -16613332 -18063168 -19494427 -20886981 -22190041 -23334319 -24246178
11547b4246178o13262k63722J17465N08674Q84665J213914J459913J590890J594615
11538a7753026J487379J307848J098391Q87268O84339M90867L12664J65180O8703
11529a1250387M0613R1801K27311M45813P34431J062177J379034J625032J746886
11520c897289J715406J536571J251915R27426O34216M27816L33640L43595M24130
11511C697426N32262O33316P12581P75116Q34192Q96253R52386R80962R57892
11502A0972386Q66422P00256M59888J47090k36716o86491j186976j708590k209149
11493G118120k641186k961432l138487l156770l017735k739987k358103j918922
11485a4814502j475436j079349p72590n77900m92143m88303n27077n70382n87713
$$ plain form
11547 -24246178 -24859440 -25123162 -25005697 -24497023 -23612358 -22398444 -20938531 -19347641 -17753026
11538 -17753026 -16265647 -14957799 -13859408 -12972140 -12287801 -11796934 -11484270 -11319090 -11250387
11529 -11250387 -11209774 -11117973 -10890662 -10444849 -9710418 -8648241 -7269207 -5644175 -3897289
11520 -3897289 -2181883 -645312 606603 1534029 2168245 2596061 2929701 3273296 3697426
11511 3697426 4229688 4863004 5575585 6350701 7184893 8081146 9033532 10014494 10972386
11502 10972386 11838808 12539064 12998952 13146042 12909326 12222835 11035859 9327269 7118120
11493 7118120 4476934 1515502 -1622985 -4779755 -7797490 -10537477 -12895580 -14814502
11485 -14814502 -16289938 -17369287 -18141877 -18719777 -19211920 -19700223 -20227300 -20797682 -21385395
11476b1385395n55399m57119k90420p2917J62353L83889N79483P60128R46024
11467a9929373J145788J345834J517938J637503J697304J707467J684763J640645
11459g552131J575208J477941J332421J122287Q37580M81889P8303l31377o98883
11450a676762r89251j195443j337163j445728j547238j653769j762413j858000
11442a3465767j918302j922353j857483j718592j500685j195657q01382l35798
11434b4716019J60291O38320J063294J424197J728334J988700K215117K411237
11426a3086529K572995K686028K725509K663321K481649K184098J794785J345823
11418E367679Q64863L73778j03398n35124q86946j131000j251349j243739j115632
$$ plain form
11476 -21385395 -21940794 -22397913 -22688333 -22761250 -22598897 -22215008 -21635525 -20875397 -19929373
11467 -19929373 -18783585 -17437751 -15919813 -14282310 -12585006 -10877539 -9192776 -7552131
11459 -7552131 -5976923 -4498982 -3166561 -2044274 -1206694 -724805 -646502 -977879 -1676762
11450 -1676762 -2666013 -3861456 -5198619 -6644347 -8191585 -9845354 -11607767 -13465767
11442 -13465767 -15384069 -17306422 -19163905 -20882497 -22383182 -23578839 -24380221 -24716019
11434 -24716019 -24555728 -23917408 -22854114 -21429917 -19701583 -17712883 -15497766 -13086529
11426 -13086529 -10513534 -7827506 -5101997 -2438676 42973 2227071 4021856 5367679
11418 5367679 6232542 6606320 6502922 5967798 5080852 3949852 2698503 1454764 339132
11409C39132q89667o05814l15356o6130J13629K23328K84839L27259L71030M21047
11399B03297M71390N15566N53090N88132O23636O57290O82653O93715O88935O71839
11389F349543O48444O24478O05458N98879O13998O56231P19644P84676Q23394
11380A2424745Q07612P14939N33328K66767o0104m04569p18126r63227j125666
11371A1475699j216382j261927j288220j305590j302914j254068j133381r31528
11363A781689o62367l56652m8823K30687M51923N79504N78329M32529J62754j74210
11353B975363n05019p65612r18621r56033q90703p45847n49820l35505j37833
11344b829630J4090J05281J36486J18264O2869k1651j34458k81252m67452o85953
$$ plain form
11409 339132 -550535 -1156349 -1471705 -1537835 -1424206 -1200878 -916039 -588780 -217750 203297
11399 203297 674687 1190253 1743343 2331475 2955111 3612401 4295054 4988769 5677704 6349543
11389 6349543 6997987 7622465 8227923 8826802 9440800 10097031 10816675 11601351 12424745
11380 12424745 13232357 13947296 14480624 14747391 14687287 14282718 13564592 12601365 11475699
11371 11475699 10259317 8997390 7709170 6403580 5100666 3846598 2713217 1781689
11363 1781689 1119322 762670 713847 944534 1396457 1975961 2554290 2986819 3149573 2975363
11353 2975363 2470344 1704732 786111 -169922 -1060625 -1806472 -2356292 -2691797 -2829630
11344 -2829630 -2815540 -2710259 -2573773 -2455509 -2392640 -2414291 -2548749 -2830001 -3297453 -3983406
11334c983406r07077j080347j150539j079724q62320n25703j18707L03921O95196
11325h708706J025379J285387J481713J624741J718967J763231J759529J720048
11317C670289J664134J607155J550751J482579J386041J253713J095808R37869
11309A4648339Q08114P20845O65280O06943N02464L20951O1026k44972n41298
11300A7547692p68872q86591q85015p86416o32586m68195l28059k30502j74701
11291A2386755j41110r7415j1004J35706L33363N42157O98877P34621N99554K86128
11281A5467632j60525o52733j088545j385976j507852j468165j320657j137300
11273F745879r85140r08090r17979r96246j103784j194149j226007j172626j026975
$$ plain form
11334 -3983406 -4890483 -5970830 -7121369 -8201093 -9063413 -9589116 -9707823 -9403902 -8708706
11325 -8708706 -7683327 -6397940 -4916227 -3291486 -1572519 190712 1950241 3670289
11317 3670289 5334423 6941578 8492329 9974908 11360949 12614662 13710470 14648339
11309 14648339 15456453 16177298 16842578 17449521 17951985 18272936 18333962 18088990 17547692
11300 17547692 16778820 15892229 15007214 14220798 13588212 13120017 12791958 12561456 12386755
11291 12386755 12245645 12148230 12137226 12272932 12606295 13148452 13847329 14581950 15181504 15467632
11281 15467632 15307107 14654374 13565829 12179853 10672001 9203836 7883179 6745879
11273 6745879 5760739 4852649 3934670 2938424 1834640 640491 -585516 -1758142 -2785117
11264b785117q01392n22234k21958O8552L25942N38368P06841Q42725R61272J073935
11254A86934J184097J288755J384195J470749J553506J638937J728803J813451
11246A2249427J868573J860101J757111J546139J239062Q71257M91007J42938
11238B2025615j48628l87016n95118p96725j000245j194390j355798j462112j503327
11229A3582256j485638j426334j344979j258781j183838j135405j121428j132512
11221C493341j137530j090915r50915p02252l71878k5959K54580M07124M08843
11212B84439K75790M5651k40788n48685q48031j109487j305378j417548j445368
11203f309405j404845j318277j204010j075716r48948q43479p74226p37579p07334
$$ plain form
11264 -2785117 -3586509 -4108743 -4330701 -4262149 -3936207 -3397839 -2690998 -1848273 -887001 186934
11254 186934 1371031 2659786 4043981 5514730 7068236 8707173 10435976 12249427
11246 12249427 14118000 15978101 17735212 19281351 20520413 21391670 21882677 22025615
11238 22025615 21876987 21489971 20894853 20098128 19097883 17903493 16547695 15085583 13582256
11229 13582256 12096618 10670284 9325305 8066524 6882686 5747281 4625853 3493341
11221 3493341 2355811 1264896 313981 -388271 -760149 -786108 -531528 -124404 284439
11212 284439 560229 605880 365092 -183593 -1031624 -2141111 -3446489 -4864037 -6309405
11203 -6309405 -7714250 -9032527 -10236537 -11312253 -12261201 -13104680 -13878906 -14616485 -15323819
11194a5323819o46523n26794l40958j02187J64993M32878O73530Q58505R60637
11185a3849738R62069Q66685P07017N35093L98797L20286K92820K95930L13798
11176i157243L43750L93627M74144N90952P39468R05579J072952J231959J382627
11167b022185J528522J665273J771132J806637J726139J496799J114654O09058
11159I696029L6279n30226j008713j320883j410353j262683r14428m43110N7676
11150B899588N05619Q48394J069014J177948J195935J136112R97058P72584M71010
11141A1073262J27524k01649m59730o10846o50916o05484n17712m30948l71650
11132G351851l40691l19145k85560k33003j74525j35546j40171j99256l03957
$$ plain form
11194 -15323819 -15970342 -16497136 -16838094 -16940281 -16775288 -16342410 -15668880 -14810375 -13849738
11185 -13849738 -12887669 -12020984 -11313967 -10778874 -10380077 -10059791 -9766971 -9471041 -9157243
11176 -9157243 -8813493 -8419866 -7945722 -7354770 -6615302 -5709723 -4636771 -3404812 -2022185
11167 -2022185 -493663 1171610 2942742 4749379 6475518 7972317 9086971 9696029
11159 9696029 9732308 9202082 8193369 6872486 5462133 4199450 3285022 2841912 2899588
11150 2899588 3405207 4253601 5322615 6500563 7696498 8832610 9829668 10602252 11073262
11141 11073262 11200786 10999137 10539407 9928561 9277645 8672161 8154449 7723501 7351851
11132 7351851 7011160 6692015 6406455 6173452 5998927 5863381 5723210 5523954 5219997
11123E219997m26727n31357n89872n97698n77306n67392o03982p03349q54764
11114b32450j025634j175519j270638j291225j231222j095617q99647o68726m36086
11105i326764k36793r8582l1431k1801l9134n4612n9553o7815r9353j57668k18140
11094a0411646k35488j66468N052K55387N28432P57672Q89661Q99442P96394O20197
11084f061365M25799K62201J58530J26851J74460L08418N25511P98693J074985
11075b205917J287867J375817J298431J047201O50176J67832l21642p44688j053960
11066A501117j239685j325528j351250j351371j341576j319961j280286j225415
11058h933955j169523j128311j107539j100795j097013j089026j074706j050218
$$ plain form
11123 5219997 4793270 4261913 3672041 3074343 2497037 1929645 1325663 622314 -232450
11114 -232450 -1258084 -2433603 -3704241 -4995466 -6226688 -7322305 -8221952 -8890678 -9326764
11105 -9326764 -9563557 -9662139 -9693570 -9715371 -9754505 -9809117 -9868670 -9936485 -10035838 -10193506 -10411646
11094 -10411646 -10647134 -10813602 -10808550 -10553163 -10024731 -9267059 -8377398 -7477956 -6681562 -6061365
11084 -6061365 -5635566 -5373365 -5214835 -5087984 -4913524 -4605106 -4079595 -3280902 -2205917
11075 -2205917 -918050 457767 1756198 2803399 3453575 3621407 3299765 2555077 1501117
11066 1501117 261432 -1064096 -2415346 -3766717 -5108293 -6428254 -7708540 -8933955
11058 -8933955 -10103478 -11231789 -12339328 -13440123 -14537136 -15626162 -16700868 -17751086
11050a7751086j001848r04475p30193m62633j06470L15445P73903J242502J696455
11041a6928400K104643K424828K608554K614995K427466K063649J572124J015294
11033i6847M49077q7584n69025r72680j274391j454113j506632j446733j302184
11024h261112j098202q44984n38307j72388K45420O88565J116457J486284J765221
11015e613046J938738K012866K010058J959713J885606J793722J666003J466039
11007I119699J158039P31211K15506l21368p93792j123072j255502j170090q80686
10998E679945m38221O8519N23272Q11801Q63697O82896L44650m1082l75250n97638
10988G522589o89424o61575n42113l66248j68055K6075J99387L40722M37109M69551
$$ plain form
11050 -17751086 -18752934 -19657409 -20387602 -20850235 -20956705 -20641260 -19867357 -18624855 -16928400
11041 -16928400 -14823757 -12398929 -9790375 -7175380 -4747914 -2684265 -1112141 -96847
11033 -96847 352230 264646 -304379 -1277059 -2551450 -4005563 -5512195 -6958928 -8261112
11024 -8261112 -9359314 -10204298 -10742605 -10914993 -10669573 -9981008 -8864551 -7378267 -5613046
11015 -5613046 -3674308 -1661442 348616 2308329 4193935 5987657 7653660 9119699
11007 9119699 10277738 11008949 11224455 10903087 10109295 8986223 7730721 6560631 5679945
10998 5679945 5241724 5310243 5833515 6645316 7509013 8191909 8536559 8495477 8120227 7522589
10988 7522589 6833165 6171590 5629477 5263229 5095174 5121249 5320636 5661358 6098467 6568018
10978F568018M18656K78798O8414j76575m23751o60538q89685j109055j296920
10969B777362j417718j442641j366478j207548r93662p47804m83827k09916O8892
10960e023340L51535O38034R18125J159685J311296J322630J169580Q65782M53166
10951C166493k0070n17287j015089j490313j904558k198756k302001k152124j722498
10942a0156203j045358k17108O24262J341981J840427K082371K082438J889839
10934a557351J572276J203268Q49571N57651L43114J89023N5414j03837l24058
10925B785071o17995r70857j342701j678450j923235k037261k004313j831921
10917i621662j544879j175972p58538l23876R8093M79765Q00469J050501J228899
$$ plain form
10978 6568018 6986674 7265472 7333886 7157311 6733560 6073022 5183337 4074282 2777362
10969 2777362 1359644 -82997 -1449475 -2657023 -3650685 -4398489 -4882316 -5092232 -5023340
10960 -5023340 -4671805 -4033771 -3115646 -1955961 -644665 677965 1847545 2713327 3166493
10951 3166493 3146423 2629136 1614047 123734 -1780824 -3979580 -6281581 -8433705 -10156203
10942 -10156203 -11201561 -11418669 -10794407 -9452426 -7611999 -5529628 -3447190 -1557351
10934 -1557351 14925 1218193 2067764 2625415 2968529 3157552 3212966 3109129 2785071
10925 2785071 2167076 1196219 -146482 -1824932 -3748167 -5785428 -7789741 -9621662
10917 -9621662 -11166541 -12342513 -13101051 -13424927 -13326834 -12847069 -12046600 -10996099 -9767200
10908i767200J334704J358229J279964J080486P57373L38554j19245n48458q92950
10899e178543j118663j209176j158614r74830o89909l61420n4100J87741L55196
10890a0202318M66173N43608N99753O35226O46728O34164O03905N68598N42624
10881d961539N33495N35028N29898N01293M43863L64075K70612J65328M4146r3169
10871a666970k34729l59672m52794n20392n94105p16763r16966j188176j486279
10862h136846j745975j903171j909904j740114j393367q99905l21114K60886P62277
10853a7027233J116795J289631J284659J143350R31690P15744N35508L91689K54107
10844i364060Q6924j25277l66330n96652p72146q60890q50760p49420n80953l80538
$$ plain form
10908 -9767200 -8432496 -7074267 -5794303 -4713817 -3956444 -3617890 -3737135 -4285593 -5178543
10899 -5178543 -6297206 -7506382 -8664996 -9639826 -10329735 -10691155 -10745255 -10557514 -10202318
10890 -10202318 -9736145 -9192537 -8592784 -7957558 -7310830 -6676666 -6072761 -5504163 -4961539
10881 -4961539 -4428044 -3893016 -3363118 -2861825 -2417962 -2053887 -1783275 -1617947 -1573801 -1666970
10871 -1666970 -1901699 -2261371 -2714165 -3234557 -3828662 -4545425 -5462391 -6650567 -8136846
10862 -8136846 -9882821 -11785992 -13695896 -15436010 -16829377 -17729282 -18050396 -17789510 -17027233
10853 -17027233 -15910438 -14620807 -13336148 -12192798 -11261108 -10545364 -10009856 -9618167 -9364060
10844 -9364060 -9277136 -9402413 -9768743 -10365395 -11137541 -11998431 -12849191 -13598611 -14179564 -14560102
10834a4560102j85979k6750Q4287J50733J84314J95813J93044J85663J89522K24074
10824a3365381L03669M29018N85059P46968Q90225R97435J057763J063247J010051
10815f281946R06302P78047O64105O00856O07464O81022Q02391R46241J087896
10806G92378J204044J270201J260787J155474R50487O69210L64789J09080l1308
10797G745142k1091J30911L79640O64418R26957J118540J200664J147933R56065
10788A4249179O48789K74481j10153m60927p57802j000663j195829j345443j445676
10779H855956j490614j476600j405336j286112j136746r81632q46829p54223p17610
10770a239746p41821q23082r48533j095876j236484j342317j392476j375289j287013
$$ plain form
10834 -14560102 -14746081 -14772831 -14688544 -14537811 -14353497 -14157684 -13964640 -13778977 -13589455 -13365381
10824 -13365381 -13061712 -12632694 -12047635 -11300667 -10410442 -9413007 -8355244 -7291997 -6281946
10815 -6281946 -5375644 -4597597 -3933492 -3332636 -2725172 -2044150 -1241759 -295518 792378
10806 792378 1996422 3266623 4527410 5682884 6633371 7302581 7667370 7776450 7745142
10797 7745142 7724051 7854962 8234602 8899020 9825977 10944517 12145181 13293114 14249179
10788 14249179 14897968 15172449 15062296 14601369 13843567 12842904 11647075 10301632 8855956
10779 8855956 7365342 5888742 4483406 3197294 2060548 1078916 232087 -522136 -1239746
10770 -1239746 -1981567 -2804649 -3753182 -4849058 -6085542 -7427859 -8820335 -10195624 -11482637
10761a1482637j131264r20871o79926m42560k46009j18661o8802q1957j28781
10752a5301468j76054j91975j46557j5280K10495N13215Q49070J161386J401127
10743a1696041J543336J590523J562531J481280J360304J202531J003577P57413
10735a194546M62984J29637k21259n58350q44148j040874j119485j068668q97756
10726f352465o32755l11362J9605L08961N13394O13150O20576N75464N30777N36567
10716c578088O26703Q08675J056070J307022J475290J477188J266682Q61085L40500
10707E641127j82748o10806q97294j052067j112005j101484j013560q23407n18210
10698a670454j19406L14816P04528R73532J076067J012765Q27321N87447L62431
$$ plain form
10761 -11482637 -12613901 -13534772 -14214698 -14657258 -14903267 -15021928 -15090730 -15172687 -15301468
10752 -15301468 -15477522 -15669497 -15816054 -15831334 -15620839 -15107624 -14258554 -13097168 -11696041
10743 -11696041 -10152705 -8562182 -6999651 -5518371 -4158067 -2955536 -1951959 -1194546
10735 -1194546 -731562 -601925 -823184 -1381534 -2225682 -3266556 -4386041 -5454709 -6352465
10726 -6352465 -6985220 -7296582 -7276977 -6968016 -6454622 -5841472 -5220896 -4645432 -4114655 -3578088
10716 -3578088 -2951385 -2142710 -1086640 220382 1695672 3172860 4439542 5300627 5641127
10707 5641127 5458379 4847573 3950279 2898212 1786207 684723 -328837 -1152244 -1670454
10698 -1670454 -1789860 -1475044 -770516 203016 1279083 2291848 3119169 3706616 4069047
10689D069047K06096J45706J76618K66158L67973M40353M58489M16310L21231
10680F867981J87731L2807j27377k81164m24688n62082p01174q46604r94259j130099
10670B021072j235629j299986j332881j366932j442525j582839j777516j986899
10662a0004135k161556k261670k265468k166733j968653j681365j325340r35496
10654b4770416n56984k29138L4499K55923M83756P69775J143841J599590K096144
10645a9173010K572311K965249L226666L333812L294031L140898K921154K677321
10637D958432K434664K197960J955962J688775J376629J010853O03981J91031
10629A6418287j82309m78071o77511p78489p84758o99844n31235k98968l8694
$$ plain form
10689 4069047 4275143 4420849 4597467 4863625 5231598 5671951 6130440 6546750 6867981
10680 6867981 7055712 7088519 6961142 6679978 6255290 5693208 4992034 4145430 3151171 2021072
10670 2021072 785443 -514543 -1847424 -3214356 -4656881 -6239720 -8017236 -10004135
10662 -10004135 -12165691 -14427361 -16692829 -18859562 -20828215 -22509580 -23834920 -24770416
10654 -24770416 -25327400 -25556538 -25522039 -25266116 -24782360 -24012585 -22868744 -21269154 -19173010
10645 -19173010 -16600699 -13635450 -10408784 -7074972 -3780941 -640043 2281111 4958432
10637 4958432 7393096 9591056 11547018 13235793 14612422 15623275 16227256 16418287
10629 16418287 16235978 15757907 15080396 14301907 13517149 12817305 12286070 11987102 11948408
10620A1948408K04969L90904M93318N07833M49530L43768K14212P4368p3251k30963
10610A4323096l97201n61275p06481q20644r05444r74368j038619j092775j112939
10601F713350j068390r36502p11700m07541n5320L00141O09529Q32813R52761
10592F229141R80834R51147R05078Q74498Q70919Q82484Q77457Q14446O59662
10583A4045666M06345Q6157k35588m80196n83450n20349l16610m0346K24444M10632
10573A2996705M90042M73491L91450K71316J28463k5856j73912k93433l70349
10564A3887917m06364m12087l94023l50113k77551j83670q8379j4190K9303N3070
10554A1843913Q0015J27460J97499K81984L71357M55352N18608N41707N09185
$$ plain form
10620 11948408 12153377 12544281 13037599 13545432 13994962 14338730 14552942 14627310 14554059 14323096
10610 14323096 13925895 13364620 12658139 11837495 10932051 9957683 8919064 7826289 6713350
10601 6713350 5644960 4708458 3996758 3589217 3533897 3834038 4443567 5276380 6229141
10592 6229141 7209975 8161122 9066200 9940698 10811617 11694101 12571558 13386004 14045666
10583 14045666 14452011 14538168 14302580 13822384 13238934 12718585 12401975 12361629 12586073 12996705
10573 12996705 13486747 13960238 14351688 14623004 14751467 14725611 14551699 14258266 13887917
10564 13887917 13481553 13069466 12675443 12325330 12047779 11864109 11775730 11761540 11790843 11843913
10554 11843913 11923928 12051388 12248887 12530871 12902228 13357580 13876188 14417895 14927080
10545A4927080M17009K75011J05789n9992j92959k74714l00945k78508k23255
10536A4394516j59535j15296j11119j50497k17402k79876k97683k35973q3184
10527A2743951J37733L75492N72471O89339P19117O85920O32187O02105O27885
10518A7786200P22498Q81178J091352J344569J639920J976705K347335K741497
10510C0531254L157269L605248M100725M651908N253923N892138O553703P241007
10502G0987175P976799Q797380R743565J0858447J2186523J3765126J5611585
10495A49926600J7711350J9997029K2307979K4342833K5627201K5513299K3254734
10488C08681025J8237154J0367833M11475j0060144j9217527k5711688k9107646
$$ plain form
10545 14927080 15344089 15619100 15724889 15664897 15471938 15197224 14896279 14617771 14394516
10536 14394516 14234981 14119685 14008566 13858069 13640667 13360791 13063108 12827135 12743951
10527 12743951 12881684 13257176 13829647 14518986 15238103 15924023 16556210 17158315 17786200
10518 17786200 18508698 19389876 20481228 21825797 23465717 25442422 27789757 30531254
10510 30531254 33688523 37293771 41394496 46046404 51300327 57192465 63746168 70987175
10502 70987175 78963974 87761354 97504919 108363366 120549889 134315015 149926600
10495 149926600 167637950 187634979 209942958 234285791 259912992 285426291 308681025
10488 308681025 326918179 337286012 337697487 327637343 308419816 282708128 253600482
10481B53600482k9788909k8535724k6134161k3194843k0135279j7220166j4606402
10474I3984998j2377637j0561399r135883q042495p205519o547049n996134n500965
10466B8617917n040279m619442m251118l938251l670209l425697l174987k883696
10458b385762k521698k074978j556661j012352n11266j19845J28295K44873K75977
10449i533417K80236L08036L84455N00384O21532P14527P70760Q08068Q50956
10440d294463R08415R66531R98073R78793Q98504P62351N86522L94076K10808
10431B409610N8331n4266j34758k04994k92091m15759n75844p47674q90837r66379
10421a814661r50558q38472o40172l74391o2770K72927O09406R20208J179466
$$ plain form
10481 253600482 223811573 195275849 169141688 145946845 125811566 108591400 93984998
10474 93984998 81607361 71045962 61910079 53867584 46662065 40115016 34118882 28617917
10466 28617917 23577638 18958196 14707078 10768827 7098618 3672921 497934 -2385762
10458 -2385762 -4907460 -6982438 -8539099 -9551451 -10062717 -10182562 -10054267 -9809394 -9533417
10449 -9533417 -9253181 -8945145 -8560690 -8060306 -7438774 -6724247 -5953487 -5145419 -4294463
10440 -4294463 -3386048 -2419517 -1421444 -442651 455853 1218204 1804726 2198802 2409610
10431 2409610 2467941 2413675 2278917 2073923 1781832 1366073 790229 42555 -848282 -1814661
10421 -1814661 -2765219 -3603691 -4243863 -4618254 -4681024 -4408097 -3798691 -2878483 -1699017
10412a699017J369688J485903J532865J519678J456393J351752J211473J038835
10404I267570Q37602O14005L76611J36030r6176l11724n08177o80560q05508q38665
10394G991008p39472n07666j98141J01006L09288L82908L17153J29962j55799
10385G630247n18990r35233j369010j772420k093773k291312k343843k252280
10377e946614k032141j704318j293043q31824l67126N0440L84461O26346P94236
10368a0319583R20385J036201J159424J283753J375522J385957J279771J064532
10360h14038P97740N61398M18412L80357M07898M40474M31474L65231K50444J03322
10350C342712o3246k40110m18622n89113p38787q46345q79097q01663n95443k75100
$$ plain form
10412 -1699017 -329329 1156574 2689439 4209117 5665510 7017262 8228735 9267570
10404 9267570 10105172 10719177 11095788 11231818 11135642 10823918 10315741 9635181 8829673 7991008
10394 7991008 7251536 6743870 6545729 6646735 6956023 7338931 7656084 7786046 7630247
10385 7630247 7111257 6176024 4807014 3034594 940821 -1350491 -3694334 -5946614
10377 -5946614 -7978755 -9683073 -10976116 -11807940 -12175066 -12124626 -11740165 -11113819 -10319583
10368 -10319583 -9399198 -8362997 -7203573 -5919820 -4544298 -3158341 -1878570 -814038
10360 -814038 -16298 545100 963512 1343869 1751767 2192241 2623715 2988946 3239390 3342712
10350 3342712 3279466 3039356 2620734 2031621 1292834 446489 -432608 -1234271 -1829714 -2104814
10340b104814J12210N05576Q54157J131182J331856J460130J515543J489784J374675
10331G670299J175422R20078O58457M48217L32007L16544L67489M25533M33607
10322A2747653L56569J83690p7997m05062p51544j049239j226944j241658j099298
10313G436170q49510n60963k95889r6088K0363N6649L0390l6942j30191k44151
10303E329838l78527n27692o72114p78453q10725p47527n94128l81122j50868
10294B88682N8902K25791L45133M25884M82410N25121N54726N64273N47274N04472
10284D522668M43120L70728K90126J99440R4423l0145j79883l59401n69884q05921
10274C975271j051815j280025j455935j548433j538662j421384j203170r04736
$$ plain form
10340 -2104814 -1992604 -1487028 -632871 498311 1830167 3290297 4805840 6295624 7670299
10331 7670299 8845721 9765799 10424256 10872473 11204480 11521024 11888513 12314046 12747653
10322 12747653 13104222 13287912 13209915 12804853 12053309 11004070 9777126 8535468 7436170
10313 7436170 6586660 6025697 5729808 5633720 5654083 5710732 5741122 5704180 5573989 5329838
10303 5329838 4951311 4423619 3751505 2973052 2162327 1414800 820672 439550 288682
10294 288682 347584 573375 918508 1344392 1826802 2351923 2906649 3470922 4018196 4522668
10284 4522668 4965788 5336516 5626642 5826082 5920505 5890360 5710477 5351076 4781192 3975271
10274 3975271 2923456 1643431 187496 -1360937 -2899599 -4320983 -5524153 -6428889
10266f428889n65266k38335K4139J89973K53771K30392J42912J4933j28518k55274
10256f760162l24959k99739j62511P1835L62685O62875R36461J164671J340673
10247c008171J460448J517030J501066J405326J228070R73163O49787K74853j23970
10238E877602n09251q39621j077086j193939j180376j051814q49889o31680m50413
10229a906467l38863l05148l40557m30715n61983p21641q94764j060721j192348
10220g753207j262411j258700j198417j126344j091513j117619j190685j272755
10212a7271651j327422j335341j290397j185640j005281p31863l63408P4338N32688
10203b3903977R59917J321169J604423J813235J959440K064195K160834K286957
$$ plain form
10266 -6428889 -6994155 -7232490 -7208351 -7018378 -6764607 -6534215 -6391303 -6376370 -6504888 -6760162
10256 -6760162 -7085121 -7384860 -7547371 -7475536 -7112851 -6449976 -5513515 -4348844 -3008171
10247 -3008171 -1547723 -30693 1470373 2875699 4103769 5076932 5726719 6001572 5877602
10238 5877602 5368351 4528730 3451644 2257705 1077329 25515 -824374 -1456054 -1906467
10229 -1906467 -2245330 -2550478 -2891035 -3321750 -3883733 -4605374 -5500138 -6560859 -7753207
10220 -7753207 -9015618 -10274318 -11472735 -12599079 -13690592 -14808211 -15998896 -17271651
10212 -17271651 -18599073 -19934414 -21224811 -22410451 -23415732 -24147595 -24511003 -24436665 -23903977
10203 -23903977 -22944060 -21622891 -20018468 -18205233 -16245793 -14181598 -12020764 -9733807
10195i733807K465406K688934K922792L123088L255559L302238L256099L112543
10187A4392852K866384K516761K075445J570259J038316N12374J0121m65405r14175
10178B3602932j324141j663717j889134j963814j876841j647591j315626r26973
10170A0995095n27033j60269J30439L09540L58895K87107J31730n0290k01686
10161A1273528k83998k87199k27426j36634m7982K0545P8573J62435L15702N59033
10151A1426577Q68422J178092J408009J499319J437370J251897R97385P25898
10143B0792969M67762K31103J7957j59196k76522l13341k66751j53333J040J73599
10133B0515287L51731N32332P14230Q87885J029027J100780J064012Q93239N94008
$$ plain form
10195 -9733807 -7268401 -4579467 -1656675 1466413 4721972 8024210 11280309 14392852
10187 14392852 17259236 19775997 21851442 23421701 24460017 24972391 24982512 24517107 23602932
10178 23602932 22278791 20615074 18725940 16762126 14885285 13237694 11922068 10995095
10170 10995095 10468062 10307793 10438232 10747772 11106667 11393774 11525504 11475214 11273528
10161 11273528 10989530 10702331 10474905 10338271 10290289 10310834 10389407 10551842 10867544 11426577
10151 11426577 12294999 13473091 14881100 16380419 17817789 19069686 20067071 20792969
10143 20792969 21260731 21491834 21509791 21350595 21074073 20760732 20493981 20340648 20341688 20515287
10133 20515287 20867018 21399350 22113580 23001465 24030492 25131272 26195284 27088523 27682531
10124B7682531K12983j70915m76296o54524p07516o77459o18203n68480n42136
10115B3479985n35902n42735n57934n76614n91988o01105o12505o45365p17509
10106A8098328q29951r58223j057767j083592j013873q60382o57437m40639k34403
10097A0962061n3793Q9763J87749K35996K32907J76625O5733r8267l10836n64514
10087A0923424q43299j112833j318408j401083j327014j110841q15674n29104
10079B465168l30561k66277l37373m99216o72375p67286p17579n07191j76887
10070a809577J92830N12778P15706P74874P05838N53237L69176J92775M1515q0639
10060B168513j66141j95258j46460j7089J64830L46846M69557M84340L66948J26288
$$ plain form
10124 27682531 27895514 27724599 27248303 26593779 25886263 25208804 24590601 24022121 23479985
10115 23479985 22944083 22401348 21843414 21266800 20674812 20073707 19461202 18815837 18098328
10106 18098328 17268377 16310154 15252387 14168795 13154922 12294540 11637103 11196464 10962061
10097 10962061 10908268 10998031 11185780 11421776 11654683 11831308 11897041 11798774 11487938 10923424
10087 10923424 10080125 8967292 7648884 6247801 4920787 3809946 2994272 2465168
10079 2465168 2134607 1868330 1530957 1031741 359366 -407920 -1125499 -1632690 -1809577
10070 -1809577 -1616747 -1103969 -388263 386611 1092449 1645686 2014862 2207637 2249152 2168513
10060 2168513 2002372 1807114 1660654 1643565 1808395 2155241 2624798 3109138 3476086 3602374
10050C602374j94972n31340q14688r95525j056661j014030r05721p76268o64443
10041c351274n96915n84136o16082o61512o76219o20024m74645k51584J5626K89533
10031g527232N43903P66284R51133J093842J190188J237853J236926J190320J103895
10022A787112R83626Q31536O46955M35026K13825J0852j49899k60119l29905l78878
10012C790131m20207m47788m37986l67568k35621p3434O3511J15714M2376j61701
10002A867427m62219p97412j100580j321711j438512j453932j383615j241484
9994g332038j033006p60437m34948q5495K42624M99813O49506O81837O14933M82830
9984f474381L19511J50764l987j27613k06044k33009k13681j64910j13257r1233
$$ plain form
10050 3602374 3407402 2876062 2061374 1065849 9188 -1004842 -1910563 -2686831 -3351274
10041 -3351274 -3948189 -4532325 -5148407 -5809919 -6486138 -7106162 -7580807 -7832391 -7816765 -7527232
10031 -7527232 -6983329 -6217045 -5265912 -4172070 -2981882 -1744029 -507103 683217 1787112
10022 1787112 2770738 3602274 4249229 4684255 4898080 4908932 4759033 4498914 4169009 3790131
10012 3790131 3369924 2922136 2484150 2116582 1880961 1807527 1871038 1986752 2029128 1867427
10002 1867427 1405208 607796 -492784 -1814495 -3253007 -4706939 -6090554 -7332038
9994 -7332038 -8365044 -9125481 -9560429 -9645924 -9403300 -8903487 -8253981 -7572144 -6957211 -6474381
9984 -6474381 -6154870 -6004106 -6008093 -6135706 -6341750 -6574759 -6788440 -6953350 -7066607 -7157840
9974g157840j29376k43073m19991o18802p84954q75717q78276q09741p00901n74625
9964a3193296m31370k50726r411K95331O33209R47210J173231J262359J198806
9955h374657J008653P54061N11964L45970K85490L21427M18756N37651O49532
9946c541153P38105P90050P91293P37549O48392N67746N47297O24882Q10017J079534
9936C793712J380767J640426J779338J732711J471448J014376M22254k23236q41430
9927A2170366j365886j751799j981911k066310k030988j901624j694143j415038
9919b037333j066470o52638j85155L17422Q37673J368037J913670K492290L134357
9910F121853L878725M761876N813256P067101Q578677J0422998J2670178J5344914
$$ plain form
9974 -7157840 -7287216 -7530289 -7950280 -8569082 -9354036 -10229753 -11108029 -11917770 -12618671 -13193296
9964 -13193296 -13624666 -13875392 -13884803 -13589472 -12956263 -12009053 -10835822 -9573463 -8374657
9955 -8374657 -7366004 -6611943 -6099979 -5754009 -5468519 -5147092 -4728336 -4190685 -3541153
9946 -3541153 -2803048 -2012998 -1221705 -484156 164236 731982 1279279 1904161 2714178 3793712
9936 3793712 5174479 6814905 8594243 10326954 11798402 12812778 13235032 13011796 12170366
9927 12170366 10804480 9052681 7070770 5004460 2973472 1071848 -622295 -2037333
9919 -2037333 -3103803 -3756441 -3941596 -3624174 -2786501 -1418464 495206 2987496 6121853
9910 6121853 10000578 14762454 20575710 27642811 36221488 46644486 59314664 74659578
9902G4659578J8373318K1525673K4387314K6391813K6916813K5423119K1632631
9895B39310259J5721728Q420709Q73935n745430j0653425j3642655j4968563j5090616
9887B04225942j4461670j3433478j2241445j1025238r866454q823356p941544
9880A26432757p242798o714929o318354o006929n751742n554452n439189n426125
9872G7978239n507043n640798n765463n812555n717461n430269m927437m219259
9864C4957954l350946k398725j459427o31105J0965M32794O47094P03141O63153
9855B9574898N74668M55416L01071J07422j12965l30956n12949o33468o81904
9846B8741233o63212n95081n04142m21723l77758l92899m72675o06970p73220
$$ plain form
9902 74659578 93032896 114558569 138945883 165337696 192254509 217677628 239310259
9895 239310259 255031987 263452696 264326631 258581201 247927776 234285121 219316558 204225942
9887 204225942 189764272 176330794 164089349 153064111 143197657 134374301 126432757
9880 126432757 119189959 112475030 106156676 100149747 94398005 88843553 83404364 77978239
9872 77978239 72471196 66830398 61064935 55252380 49534919 44104650 39177213 34957954
9864 34957954 31607008 29208283 27748856 27117751 27128716 27561510 28208604 28911745 29574898
9855 29574898 30149566 30604982 30906053 31013475 30900510 30569554 30056605 29423137 28741233
9846 28741233 28078021 27482940 26978798 26557075 26179317 25786418 25313743 24706773 23933553
9837B3933553r40130j072086j136297j111635r95074q02410n61614k99357k6863
9828A6988087K64599N93517R70784J387222J810611K189846K465049K583330K513884
9819C1766929K253476J821791J255021O02480p7556p25829j289639j726478k007738
9810C1872457k126229k101583j974610j792347j595729j417628j286465j225676
9802A8352190j245832j334558j452740j542984j549441j439350j213126q97803
9794G676356n32942j62838J62440L88734M72404M02213K11441l0612k43206l61822
9784G982168l57774k43503o1705J36100L08503M29299M80012M42357L01440N7967
9774I474864k62166o11908r40924j215625j426483j578405j675369j714925j696292
$$ plain form
9837 23933553 22993423 21921337 20785040 19673405 18678331 17875921 17314307 17014950 16988087
9828 16988087 17252686 17846203 18816987 20204209 22014820 24204666 26669715 29253045 31766929
9819 31766929 34020405 35842196 37097217 37699697 37622141 36896312 35606673 33880195 31872457
9810 31872457 29746228 27644645 25670035 23877688 22281959 20864331 19577866 18352190
9802 18352190 17106358 15771800 14319060 12776076 11226635 9787285 8574159 7676356
9794 7676356 7143414 6980576 7143016 7531750 8004154 8406367 8617808 8587196 8343990 7982168
9784 7982168 7624394 7380891 7319186 7455286 7763789 8193088 8673100 9115457 9416897 9474864
9774 9474864 9212698 8600790 7659866 6444241 5017758 3439353 1763984 49059 -1647233
9765a647233j631342j546042j470721j426741j417875j430518j442792j438541
9757a3451805j417902j396514j393059j413906j445578j458450j416368j285170
9749b4678752j038439o63787j71392L99122R79911J487560J844584K002818J959473
9740a7878902J758221J474315J191027R77177Q71610Q76595R62492J084549J204485
9731g478431J302959J375115J417010J418634J370575J276496J157995J046354
9723B886707R67277R29272R21940R22281R03117Q40470P20855N48589L48788J61160
9713A0150456K6253k7782R300J32134L24743N63803Q19653J057107J238177J327543
9703A5621387J299828J146753Q81930N41499J79237j44334l77150m90412m86744
$$ plain form
9765 -1647233 -3278575 -4824617 -6295338 -7722079 -9139954 -10570472 -12013264 -13451805
9757 -13451805 -14869707 -16266221 -17659280 -19073186 -20518764 -21977214 -23393582 -24678752
9749 -24678752 -25717191 -26380978 -26552370 -26153248 -25173337 -23685777 -21841193 -19838375 -17878902
9740 -17878902 -16120681 -14646366 -13455339 -12478162 -11606552 -10729957 -9767465 -8682916 -7478431
9731 -7478431 -6175472 -4800357 -3383347 -1964713 -594138 682358 1840353 2886707
9723 2886707 3853984 4783256 5705196 6627477 7530594 8371064 9091919 9640508 9989296 10150456
9713 10150456 10176709 10148927 10158227 10290361 10615104 11178907 11998560 13055667 14293844 15621387
9703 15621387 16921215 18067968 18949898 19491397 19670634 19526300 19149150 18658738 18171994
9694A8171994l96942k65872j34485k7694M5621Q2920P8263K2141q7351k30464
9684A7258131l62357m28772l95757k75041j25517k5944l4793j62971l75237o15014
9674A4456728q33037j003413j124552j212268j290214j377208j472706j549203
9666D594127j561274j468774j259230r55618o08642k81347l1695J05061J28928
9657a338464P3978q910p5256j02321r1378o1989m5021p5568j83132l78131o40036
9646b926228r17174j144686j273797j293409j228553j119207r98490q85112p87711
9637a2574367p09069o44268n78756m94489l83513k58508j49805q8956r0256j42620
9627a6114607k14336k63765k49455j39647P7081L83623P36159J078819J364319
$$ plain form
9694 18171994 17775052 17509180 17374695 17347001 17392622 17475542 17553805 17575946 17488595 17258131
9684 17258131 16895774 16467002 16071245 15796204 15670687 15644743 15609950 15446979 15071742 14456728
9674 14456728 13623691 12620278 11495726 10283458 8993244 7616036 6143330 4594127
9666 4594127 3032853 1564079 304849 -650769 -1259411 -1540758 -1572453 -1467392 -1338464
9657 -1338464 -1264486 -1273396 -1348652 -1450973 -1542351 -1604340 -1649361 -1724929 -1908061 -2286192 -2926228
9646 -2926228 -3843402 -4988088 -6261885 -7555294 -8783847 -9903054 -10901544 -11786656 -12574367
9637 -12574367 -13283436 -13927704 -14506460 -15000949 -15384462 -15642970 -15792775 -15881731 -15971987 -16114607
9627 -16114607 -16328943 -16592708 -16842163 -16981810 -16904729 -16521106 -15784947 -14706128 -13341809
9618a3341809J568295J689355J737484J721559J644716J506308J303166J028196
9610a142730O73901K46276k18919o54272r80501j136956j103993r06522o01140
9601e824856k55336P2902L48437N61110P17756Q30037R04237R35178R05224P90872
9591a4439N78205K80561n4764l59112n68907o50475o10268m87278l33537j93037
9581b413051q9410k6849j6l947l7948j03134j95379k97131l75110l90810l20657
9570d253442j71161K3924K22297L93199N26413O28383P11662P85228Q49666Q95896
9560F12065R04795Q49944P09320M83830K07091o7847k98599m76005o21646p65696
9550A537252r24150j089554j237285j341149j387700j379189j324068j225835
$$ plain form
9618 -13341809 -11773514 -10084159 -8346675 -6625116 -4980400 -3474092 -2170926 -1142730
9610 -1142730 -468829 -222553 -441472 -1095744 -2076245 -3213201 -4317194 -5223716 -5824856
9601 -5824856 -6080192 -6007290 -5658853 -5097743 -4379987 -3549950 -2645713 -1710535 -805311 -14439
9591 -14439 563766 844327 789563 430451 -138456 -788931 -1399199 -1886477 -2220014 -2413051
9581 -2413051 -2502461 -2529310 -2529326 -2533273 -2571221 -2674355 -2869734 -3166865 -3541975 -3932785 -4253442
9570 -4253442 -4424603 -4400679 -4178382 -3785183 -3258770 -2630387 -1918725 -1133497 -283831 612065
9560 612065 1516860 2366804 3076124 3559954 3767045 3699198 3400599 2924594 2302948 1537252
9550 1537252 613102 -476452 -1713737 -3054886 -4442586 -5821775 -7145843 -8371678
9542h371678j081698q90669o60875m09658j59445O6076K46100L69259M39669M76423
9532i976496N04765N44224O00762O66126P22709P50678P35140O71454N66296M33341
9522c781001K86744J38432R58j09604j77608j97485j79846j47678j26818j39829
9512d433735k05525l36883n31999p64708r87965j153027j230889j218655j128413
9503a1991799r72267p57159m89588j81661J46425M65618P38094R22139R84546
9494a1135652R15832P39006N06025K83142J30869Q6061J53338L09457N17004P38424
9484f756494R43394J109503J220433J264371J233222J124090R44232P16514M78677
9475B277942K73577J36323Q6898J30751K62763M69699P30372J014763J283330
$$ plain form
9542 -8371678 -9453376 -10344045 -11004920 -11414578 -11574023 -11507947 -11261847 -10892588 -10452919 -9976496
9532 -9976496 -9471731 -8927507 -8326745 -7660619 -6937910 -6187232 -5452092 -4780638 -4214342 -3781001
9522 -3781001 -3494257 -3355825 -3354867 -3464471 -3642079 -3839564 -4019410 -4167088 -4293906 -4433735
9512 -4433735 -4639260 -4976143 -5508142 -6272850 -7260815 -8413842 -9644731 -10863386 -11991799
9503 -11991799 -12964066 -13721225 -14210813 -14392474 -14246049 -13780431 -13042337 -12120198 -11135652
9494 -11135652 -10219820 -9480814 -8974789 -8691647 -8560778 -8474717 -8321379 -8011922 -7494918 -6756494
9484 -6756494 -5813100 -4703597 -3483164 -2218793 -985571 138519 1082751 1799265 2277942
9475 2277942 2551519 2687842 2774740 2905491 3168254 3637953 4368325 5383088 6666418
9466F666418J488482J581055J522451J299063R32608M79888J8072l81512o79365
9457A2927160q79814j024478j174172j387938j701594k107419k544663k913477
9449h06395l111861l076302k802738k340228j768641j175825o39989k14668Q2927
9440a5853720K72209L93197M82919N60793O30726O92094P47147Q01154Q59491
9431a0413990R25437R99066J077672J157853J236286J306436J354693J363255
9423i93292J320441J229656J108899R82298Q71137P89092P41265P25061P31199
9414G505756P43723P39870O92892N79376L88608J30397j61179m31587o21630o92192
9404H874034o42808n08864l39737j76434m3338M8759R8617J11909R5753N1271
$$ plain form
9466 6666418 8154900 9735955 11258406 12557469 13490077 13969965 13988037 13606525 12927160
9457 12927160 12047346 11022868 9848696 8460758 6759164 4651745 2107082 -806395
9449 -806395 -3918256 -6994558 -9797296 -12137524 -13906165 -15081990 -15721979 -15936647 -15853720
9440 -15853720 -15581511 -15188314 -14705395 -14144602 -13513876 -12821782 -12074635 -11273481 -10413990
9431 -10413990 -9488553 -8489487 -7411815 -6253962 -5017676 -3711240 -2356547 -993292
9423 -993292 327149 1556805 2665704 3648002 4519139 5308231 6049496 6774557 7505756
9414 7505756 8249479 8989349 9682241 10261617 10650225 10780622 10619443 10187856 9566226 8874034
9404 8874034 8231226 7722362 7382625 7206191 7162853 7211612 7310229 7422138 7517891 7569162
9394G569162k8008j48121l03747m74730o33269p55416q27717q45336q06576p11787
9384B034455n68124l92737k07533k9374J34346K81673M10871N20744O14212O98912
9374C497445P83187Q70116R52261J010349J020370R68646Q64464P38041O23757
9365A1328636N41858M91201M54109M06475L27564K07615N2551j15577k64053l61679
9355A3068700l94522l75963l41589l29900l63104m42442n58201p00810q61034
9346H701135j021110j149742j211095j184322j078932r33407p98631p19304p24486
9337a19894q27375j027637j311978j652589k004550k304625k477266k452408k191011
9328a6369333j704994j058891l51028L16171Q62480J242199J441388J467826J343613
$$ plain form
9394 7569162 7541154 7393033 7089286 6614556 5981287 5225871 4398154 3552818 2746242 2034455
9384 2034455 1466331 1073594 866061 836687 971033 1252706 1663577 2184321 2798533 3497445
9374 3497445 4280632 5150748 6103009 7113358 8133728 9102374 9966838 10704879 11328636
9365 11328636 11870494 12361695 12815804 13222279 13549843 13757458 13810009 13694432 13430379 13068700
9355 13068700 12674178 12298215 11956626 11626726 11263622 10821180 10262979 9562169 8701135
9346 8701135 7680025 6530283 5319188 4134866 3055934 2122527 1323896 604592 -119894
9337 -119894 -947269 -1974906 -3286884 -4939473 -6944023 -9248648 -11725914 -14178322 -16369333
9328 -16369333 -18074327 -19133218 -19484246 -19168075 -18305595 -17063396 -15622008 -14154182 -12810569
9319a2810569J104441Q01311M97500K57071J27772J26384K34959M10479O01692
9310h648960P63165Q61800Q79217Q14662O86909N29237L76970K55876J81103J65203
9300c134818K23121L64449N77755Q21984J034380J150850J127004R50747O42880
9291C758352K46374j90122o25116j026843j367910j620028j753725j742904j572839
9282e894761j250118q09474l10502J76525N87423Q73673J003611R61510P49973
9273c912140L94506n5192n30523r53763j247601j344061j198410q10881k45643
9264i903708L73115Q98623J218497J299869J196704J016636Q67673Q13140Q54574
9255a364877R44207J013889J004565Q87025O71058M01105J37842o7707j93088
$$ plain form
9319 -12810569 -11706128 -10904817 -10407317 -10150246 -10022474 -9896090 -9661131 -9250652 -8648960
9310 -8648960 -7885795 -7023995 -6144778 -5330116 -4643207 -4113970 -3737000 -3481124 -3300021 -3134818
9300 -3134818 -2911697 -2547248 -1969493 -1147509 -113129 1037721 2164725 3115472 3758352
9291 3758352 4004726 3814604 3189488 2162645 794735 -825293 -2579018 -4321922 -5894761
9282 -5894761 -7144879 -7954353 -8264855 -8088330 -7500907 -6627234 -5623623 -4662113 -3912140
9273 -3912140 -3517634 -3572826 -4103349 -5057112 -6304713 -7648774 -8847184 -9658065 -9903708
9264 -9903708 -9530593 -8631970 -7413473 -6113604 -4916900 -3900264 -3032591 -2219451 -1364877
9255 -1364877 -420670 593219 1597784 2484809 3155867 3556972 3694814 3627107 3434019
9246C434019k44447k40478j96264j20673k5129P0343J42806J77972J74992J40776
9236C313917Q1782K077r3133j95343k95323l87158m69341n42949o09609o70002
9226A34918p21394p54515p54576p09935o23504n15316m11012l25952k60817k12999
9216e155102j90698k13214k94476m22831n54080o25616n85366m19002j58764J31871
9206h487278L88629N74050O87374P53294P99182Q37028Q61432Q61240Q31492P75142
9196a118415O96516N96935M78988L55555K53974K08791K45088L61921N26905O86454
9186C292712P86365P92065O99485N32957L32234J35136l5581j75882k96303m15282
9176E647906n52369p19722r12045j101306j244050j301679j262191j147430r99239
$$ plain form
9246 3434019 3189572 2949094 2752830 2632157 2607028 2677371 2820177 2998149 3173141 3313917
9236 3313917 3395699 3397776 3304643 3109300 2813977 2426819 1957478 1414529 804920 134918
9226 134918 -586476 -1340991 -2095567 -2805502 -3429006 -3944322 -4355334 -4681286 -4942103 -5155102
9216 -5155102 -5345800 -5559014 -5853490 -6276321 -6830401 -7456017 -8041383 -8460385 -8619149 -8487278
9206 -8487278 -8098649 -7524599 -6837225 -6083931 -5284749 -4447721 -3586289 -2725049 -1893557 -1118415
9196 -1118415 -421899 175036 654024 1009579 1263553 1472344 1717432 2079353 2606258 3292712
9186 3292712 4079077 4871142 5570627 6103584 6435818 6570954 6535373 6359491 6063188 5647906
9176 5647906 5095537 4375815 3463770 2362464 1118414 -183265 -1445456 -2592886 -3592125
9167c592125q54159p25286o02153m63922k93336q3923J58738M19064O76872R15675
9157d444555J130142J327541J521269J719040J910968K063461K124021K038558
9149I390445J776488J352461Q31356L09432j22304m14437n75424o59540p35012
9140A1153465q51931j027135j249303j493442j731265j933860k072766k124639
9132a330876k076766j928530j689171j375326j009090o14949k16804J62299M98919
9123i580294P70490R58733J050473J034738R02389O52937L03832j07035n28658
9114d542395r08275j199464j365485j381711j241014r60871n85407j76765K01647
9105a2159740N00518O91253P65319P32403O19857M70340L33482K51710K46225
$$ plain form
9167 -3592125 -4446284 -5171570 -5773723 -6237645 -6530981 -6614904 -6456166 -6037102 -5360230 -4444555
9157 -4444555 -3314413 -1986872 -465603 1253437 3164405 5227866 7351887 9390445
9149 9390445 11166933 12519394 13350750 13660182 13537878 13123441 12548017 11888477 11153465
9140 11153465 10301534 9274399 8025096 6531654 4800389 2866529 793763 -1330876
9132 -1330876 -3407642 -5336172 -7025343 -8400669 -9409759 -10024708 -10241512 -10079213 -9580294
9123 -9580294 -8809804 -7851071 -6800598 -5765860 -4863471 -4210534 -3906702 -4013737 -4542395
9114 -4542395 -5450670 -6650134 -8015619 -9397330 -10638344 -11599215 -12184622 -12361387 -12159740
9105 -12159740 -11659222 -10967969 -10202650 -9470247 -8850390 -8380050 -8046568 -7794858 -7548633
9096g548633L12229M27553N67592P13028Q45527R41646R76974R37724Q25667O50155
9086c50538M17002J26786k17218o01199j000481j385374j727414k001171k181925
9077h921532k245586k177925j990005j724333j439163j178936r54467p48008n35096
9068b1915051l04061o2379J68959L69476N37633P03166R18695J228119J630910
9059a6724533K069300K448965K678598K703379K517666K159255J695290J206100
9051G54020P67357M31837K17747J11095Q0764R4805J27309J56218J61397J28903
9041C031452N7916l7252j32461k02662k29993k09492j51328p7004q325M5404R1762
9030B178017J45813K14045K86383L43762L73647L78083L67020L44312L01075K24569
$$ plain form
9096 -7548633 -7236404 -6808851 -6241259 -5528231 -4682704 -3741058 -2764084 -1826360 -1000693 -350538
9086 -350538 66464 193250 -23968 -625167 -1625648 -3011022 -4738436 -6739607 -8921532
9077 -8921532 -11167118 -13345043 -15335048 -17059381 -18498544 -19677480 -20631947 -21379955 -21915051
9068 -21915051 -22219112 -22281491 -22112532 -21743056 -21205423 -20502257 -19583562 -18355443 -16724533
9059 -16724533 -14655233 -12206268 -9527670 -6824291 -4306625 -2147370 -452080 754020
9051 754020 1521377 1953214 2170961 2282056 2362820 2457625 2584934 2741152 2902549 3031452
9041 3031452 3089368 3052116 2919655 2716993 2487000 2277508 2126180 2049176 2040851 2086255 2178017
9030 2178017 2323830 2537875 2824258 3168020 3541667 3919750 4286770 4631082 4932157 5156726
9020E156726J16594M814o6569o3925J0643J16760J98300K13537J52028L1269j18618
9009E751559k69533m02195n05305n71732n96706n79322n24139m38710l27456j86886
8999A349575o991K21803N01006Q19813J154397J469505J723512J878914J915485
8990A1027019J837242J666391J428138J138744Q05634M37129N1873l19928o44253
8981A7427989q94323j057516j134418j133534j067917r54804q13317o58072m94461
8972I219627l21705j41340L6431J91535K95868L18544K37094N0885k13972n13473
8962I159494q00415j034057j184002j234784j191183j076595r20997p46586n61751
8953D09124l65339j54759O7941K93059N02272O70078P69132P79806P01111N56455
$$ plain form
9020 5156726 5273320 5278134 5211565 5147640 5158283 5275043 5473343 5686880 5838908 5870177 5751559
9009 5751559 5482026 5079831 4574526 4002794 3406088 2826766 2302627 1863917 1536461 1349575
8999 1349575 1342584 1564387 2065393 2885206 4039603 5509108 7232620 9111534 11027019
8990 11027019 12864261 14530652 15958790 17097534 17903168 18340297 18392170 18072242 17427989
8981 17427989 16533666 15476150 14341732 13208198 12140281 11185477 10372160 9714088 9219627
8972 9219627 8897922 8756582 8793013 8984548 9280416 9598960 9836054 9886939 9672967 9159494
8962 9159494 8359079 7325022 6141020 4906236 3715053 2638458 1717461 970875 409124
8953 409124 43785 -110974 -43033 250026 752298 1422376 2191508 2971314 3672425 4228880
8943D228880L88058K40985J47015J18962J55688K47907L77233N12325O12002O39106
8933G668161N77681M41664K68585J01528l0419j22717j93264k72024l89239n64971
8923G484985p99406j066245j315473j488369j537997j443417j211752q71940m67505
8914b717119n0725L24852O16330Q04553Q99767R32875R35179R20151Q80792Q03050
8904D349705O81773N25808L52241J79684K6201r2669j70647k17396k55866l09064
8894E069770l85894m75859n53342n86328n46435m19769k15852L1706K76422M77220
8884B671639O12586O82168O97353O71235O16940N52142M99630M78633M94471N38080
8874H514877N96619O63995P40625Q23314Q95180R24736Q76066P24773M69971J34454
$$ plain form
8943 4228880 4616938 4857923 5004938 5123900 5279588 5527495 5904728 6417053 7029055 7668161
8933 7668161 8245842 8687506 8956091 9057619 9027200 8904483 8711219 8439195 8049956 7484985
8923 7484985 6685579 5619334 4303861 2815492 1277495 -165922 -1377674 -2249614 -2717119
8914 -2717119 -2767844 -2442992 -1826662 -1022109 -122342 810533 1745712 2665863 3546655 4349705
8904 4349705 5031478 5557286 5909527 6089211 6115412 6022743 5852096 5634700 5378834 5069770
8894 5069770 4683876 4208017 3654675 3068347 2521912 2102143 1886291 1917997 2194419 2671639
8884 2671639 3284225 3966393 4663746 5334981 5951921 6504063 7003693 7482326 7976797 8514877
8874 8514877 9111496 9775491 10516116 11339430 12234610 13159346 14035412 14760185 15230156 15364610
8864A5364610k46516o38584j014640j353937j640695j866184k031137k143629
8856D429288k212418k240355k221922k145158j996156j764668j449958j065265
8848a0666612o37927k03594K03135N56806Q44502J064388J220967J318627J356465
8839d943243J328614J231525J073496Q78746O81685N14201L93518L18784K80097
8830A757423K74406L14578M20506N96392Q12869J010799J126038J118478R87725
8821H419214P69364N17329K82617R7512k8913j03849j38753j41853j20697r0928
8811I461043q0892j24468k43996m33968o57180q58258r88884j030680j001988
8802D040729r44804r01144q93598r19464r57968r83642r78008r34910q59443p64207
$$ plain form
8864 15364610 15118094 14479510 13464870 12110933 10470238 8604054 6572917 4429288
8856 4429288 2216870 -23485 -2245407 -4390565 -6386721 -8151389 -9601347 -10666612
8848 -10666612 -11304539 -11508133 -11304998 -10748192 -9903690 -8839302 -7618335 -6299708 -4943243
8839 -4943243 -3614629 -2383104 -1309608 -430862 250823 765024 1158542 1477326 1757423
8830 1757423 2031829 2346407 2766913 3363305 4176174 5186973 6313011 7431489 8419214
8821 8419214 9188578 9705907 9988524 10086036 10057123 9953274 9814521 9672668 9551971 9461043
8811 9461043 9380151 9255683 9011687 8577719 7920539 7062281 6073397 5042717 4040729
8802 4040729 3095925 2194781 1301183 381719 -576249 -1559891 -2537899 -3472809 -4332252 -5096459
8792e096459o65835n80617n17068m68313m12188l23527j92890l8870R6416J68922
8782h030429J60198R3513K5893J9168J08462K87813N17895P44918R17188R94960
8772d160421R57092Q06833N73660L06774O1037j17998k03119j87156q1190Q7817
8762a956671K81258M57551N83409O42366O37190N87406N24241M82744M90941N59532
8752C289967O77181Q12472R20062R50003Q61824O41422L11448p4143m50048p61956
8742G178232r78719j090480j097782j000928p98530m97965j29324K51811N79968
8733B416283Q05022R10873R18881Q78295Q48898Q79571R88754J156141J331071
8724A1133789J452976J472945J367746J143887Q33883M87592J59669j07412l00784
$$ plain form
8792 -5096459 -5762294 -6342911 -6859979 -7328292 -7740480 -8064007 -8256897 -8295767 -8199351 -8030429
8782 -8030429 -7870231 -7776718 -7750825 -7731657 -7623195 -7335382 -6817487 -6072569 -5155381 -4160421
8772 -4160421 -3203329 -2396496 -1822836 -1516062 -1455025 -1573023 -1776142 -1963298 -2044488 -1956671
8762 -1956671 -1675413 -1217862 -634453 7913 645103 1232509 1756750 2239494 2730435 3289967
8752 3289967 3967148 4779620 5699682 6649685 7511509 8152931 8464379 8390236 7940188 7178232
8742 7178232 6199513 5109033 4011251 3010323 2211793 1713828 1584504 1836315 2416283
8733 2416283 3221305 4132178 5051059 5929354 6778252 7657823 8646577 9802718 11133789
8724 11133789 12586765 14059710 15427456 16571343 17405226 17892818 18052487 17945075 17644291
8715A7644291m43361n78850p42338r38824j145582j331056j470791j551453j569063
8706G872973j528062j440159j321303j189144j061144r48972q49630p42998o02683
8697a811122m12171j71692J07370M10158P19093J010372J254200J421536J493068
8688D020812J464172J342166J138077Q60600N18724J30281k73935o56711r86768
8679G557418j247247j436236j561651j634109j660220j639268j564960j429586
8671d615859j226099r48415n95177j79050K64549O78140R94753J157132J136217
8662c333809R43173O30316K78009k9920k31866l02562k49529r7467J26298L95661
8652a871696O80594R44272J151012J281022J338628J345476J323962J283933J220728
$$ plain form
8715 17644291 17200930 16622080 15879742 14940918 13795336 12464280 10993489 9442036 7872973
8706 7872973 6344911 4904752 3583449 2394305 1333161 384189 -465441 -1208439 -1811122
8697 -1811122 -2223293 -2394985 -2287615 -1877457 -1158364 -147992 1106208 2527744 4020812
8688 4020812 5484984 6827150 7965227 8825827 9344551 9474832 9200897 8544186 7557418
8679 7557418 6310171 4873935 3312284 1678175 17955 -1621313 -3186273 -4615859
8671 -4615859 -5841958 -6790373 -7385550 -7564600 -7300051 -6621911 -5627158 -4470026 -3333809
8662 -3333809 -2390636 -1760320 -1482311 -1512231 -1744097 -2046659 -2296188 -2393655 -2267357 -1871696
8652 -1871696 -1191102 -246830 904182 2185204 3523832 4869308 6193270 7477203 8697931
8643H697931J122675R81755Q01720N99212L95724K05052K6239j52630l46284n69413
8633A1761981q38156j165419j546524j947120k307667k563674k666997k596535
8625c870111k359167j987253j533748j061876o29342k73284l185J95843L52727
8616a1169396M98964O59651Q47018J055447J259589J419261J491698J446466J276098
8607a215204R98485O51375K82548n9065l27700m82505m93233l52569q7816K39483
8597h46201N49230P65368Q34250P34284M78254J09889l05122o92830r87131j145632
8587e05641j161611j066462r18728p82437p04397p00306p53885q27000q75202
8578h295669q61720p64307n74722k96770N1645M35114Q04410J110117J317052
$$ plain form
8643 8697931 9820606 10802361 11604081 12203293 12599017 12804069 12830308 12677678 12331394 11761981
8633 11761981 10923825 9758406 8211882 6264762 3957095 1393421 -1273576 -3870111
8625 -3870111 -6229278 -8216531 -9750279 -10812155 -11441497 -11714781 -11717966 -11522123 -11169396
8616 -11169396 -10670432 -10010781 -9163763 -8108316 -6848727 -5429466 -3937768 -2491302 -1215204
8607 -1215204 -216719 434656 717204 658139 330439 -152066 -645299 -997868 -1085684 -846201
8597 -846201 -296971 468397 1302647 2036931 2515185 2625074 2319952 1627122 639991 -505641
8587 -505641 -1667252 -2733714 -3652442 -4434879 -5139276 -5839582 -6593467 -7420467 -8295669
8578 -8295669 -9157389 -9921696 -10496418 -10793188 -10741543 -10306429 -9502019 -8391902 -7074850
8569g074850J407256J371974J206677R20263N51029J68996j46469l41736m11804
8560b348664l95684l50559l24114l40281m00107m89971n89619o78150p39317p66413
8550g422879p64843p51198p48775p79567q52991r55316j047782j078435j002821
8541a5404607q01303m84506q7852L39523P48872J107250J407522J663882J892991
8532i618228K094711K249002K331544K334112K272544K177244K075108J976921
8524G892958J878351J772416J662668J565956J501748J475987J471259J449264
8516B0670607J363145J173780Q65079M53747j1277m61472q29222j067813j163704
8507B0992870j137713j035124r08648q01771p40178p32809p76849q59621r56427
$$ plain form
8569 -7074850 -5667594 -4295620 -3088943 -2168680 -1617651 -1448655 -1595124 -1936860 -2348664
8560 -2348664 -2744348 -3094907 -3419021 -3759302 -4159409 -4649380 -5238999 -5917149 -6656466 -7422879
8550 -7422879 -8187722 -8938920 -9687695 -10467262 -11320253 -12275569 -13323351 -14401786 -15404607
8541 -15404607 -16205910 -16690416 -16778268 -16438745 -15689873 -14582623 -13175101 -11511219 -9618228
8532 -9618228 -7523517 -5274515 -2942971 -608859 1663685 3840929 5916037 7892958
8524 7892958 9771309 11543725 13206393 14772349 16274097 17750084 19221343 20670607
8516 20670607 22033752 23207532 24072611 24526358 24515081 24053609 23224387 22156574 20992870
8507 20992870 19855157 18820033 17911385 17109614 16369436 15636627 14859778 14000157 13043730
8498A3043730j030126j038423r48252p49274m57281j05282K70768O41245R82648
8489A0609753J272396J486755J605509J619754J536250J375050J162937R27887
8481B1596291O96861M94103L36070K23942J39518M8875q7410l02230o11073j003528
8471B1531419j439948j857987k190252k387040k433148k350298k185060j989976
8463D697710j807894j664255j565259j497930j432452j331026j163457r21830
8455f686393o24491l07236q989K39518M21939N39772O12717O71560P42247Q29222
8445c570134R10466R49566R16030P98983O06167L52663N0821k90704o59524j032024
8435i67690j374285j652068j841325j930467j915776j799509j594650j328130
$$ plain form
8498 13043730 12013604 10975181 10026929 9277655 8820374 8715092 8985860 9627105 10609753
8489 10609753 11882149 13368904 14974413 16594167 18130417 19505467 20668404 21596291
8481 21596291 22293152 22787255 23123325 23347267 23486785 23535660 23448250 23146020 22534947 21531419
8471 21531419 20091471 18233484 16043232 13656192 11223044 8872746 6687686 4697710
8463 4697710 2889816 1225561 -339698 -1837628 -3270080 -4601106 -5764563 -6686393
8455 -6686393 -7310884 -7618120 -7627109 -7387591 -6965652 -6425880 -5813163 -5141603 -4399356 -3570134
8445 -3570134 -2659668 -1710102 -794072 4911 611078 963741 1014562 723858 64334 -967690
8435 -967690 -2341975 -3994043 -5835368 -7765835 -9681611 -11481120 -13075770 -14403900
8427a4403900j033436p36437m47712j67405J04865L64704O03185Q08928R71869
8418a3935339J090623J179629J268596J391783J573187J815263K094824K366500
8410a154934K572947K658812K584074K334332J928180J419852Q92065M36496J27482
8401A3799306k16L9597J92361L84554N50120O48720O68452O17550N15537L88794
8391A7804775K67260J79043J44460J71548K51852L56925M41493M57898L75673
8382B0450927J92381p0935l82209p06006j002675j226522j331973j288265j094433
8373A3540290p84398m17939o1940K28571M22324N15611N30730N10568N08092N70602
8363A5562511P22974R57150J233683J495795J689913J782818J767186J654833
$$ plain form
8427 -14403900 -15437336 -16173773 -16621485 -16788890 -16684025 -16319321 -15716136 -14907208 -13935339
8418 -13935339 -12844716 -11665087 -10396491 -9004708 -7431521 -5616258 -3521434 -1154934
8410 -1154934 1418013 4076825 6660899 8995231 10923411 12343263 13235328 13671824 13799306
8401 13799306 13799090 13838687 14031048 14415602 14965722 15614442 16282894 16900444 17415981 17804775
8391 17804775 18072035 18251078 18395538 18567086 18818938 19175863 19617356 20075254 20450927
8382 20450927 20643308 20572373 20190164 19484158 18481483 17254961 15922988 14634723 13540290
8373 13540290 12755892 12337953 12276013 12504584 12926908 13442519 13973249 14483817 14991909 15562511
8363 15562511 16285485 17242635 18476318 19972113 21662026 23444844 25212030 26866863
8355B6866863J465128J217936R34073O38763L62090J35477j2656o0721k68J53485
8345C1700170L53025N23408N85316M85879K18386j79741o44819j106473j500306
8336C0434845j774932j897829j861420j687315j425383j144827r17329p97035
8328A8928775q05544r28097j122382j336547j529400j683288j802765j901279
8320G819473j986097k050426k074020k029254j891180j650259j323077r55403
8312f140243o16012l82562l19754m52332p44444j101255j398283j524867j419320
8303a4099072j081030n59615O8592P24201J339689J863803K259937K504757K590612
8294d388126K531074K364695K149701J945621J788774J677138J575951J440190
$$ plain form
8355 26866863 28331991 29549927 30484000 31122763 31484853 31620330 31607674 31546953 31546685 31700170
8345 31700170 32053195 32576603 33161919 33647798 33866184 33686443 33041624 31935151 30434845
8336 30434845 28659913 26762084 24900664 23213349 21787966 20643139 19725810 18928775
8328 18928775 18123231 17195134 16072752 14736205 13206805 11523517 9720752 7819473
8320 7819473 5833376 3782950 1708930 -320324 -2211504 -3861763 -5184840 -6140243
8312 -6140243 -6756255 -7138817 -7458571 -7910903 -8655347 -9756602 -11154885 -12679752 -14099072
8303 -14099072 -15180102 -15739717 -15671125 -14946924 -13607235 -11743432 -9483495 -6978738 -4388126
8294 -4388126 -1857052 507643 2657344 4602965 6391739 8068877 9644828 11085018
8286A1085018J238405R64113O31545K63010j20323m96518q33331j084037j198119
8277A0449763j142101r16107n56382j24738L08874O85253R70490J159596J266880
8268A2101528J309429J294760J220309J083087Q90024O58852M08260J47346j24040
8259A8989555m03995o77808r17967j094197j185782j190194j125255j023602r21006
8250A0449749q44447q05443p98388q01032p77797o89344n07119k25588J34061
8241E134652N28510R01261J193083J352766J346589J165484Q29792L90656p5552
8232A2767241m82963p58996q64161p99225n98124l13267p30K91640N32634P10605
8222A0484654Q28947Q97215R24266R16301Q76976Q07273P07836N85284M56785
$$ plain form
8286 11085018 12323423 13287536 13919081 14182091 14061768 13565250 12731919 11647882 10449763
8277 10449763 9307662 8391555 7835173 7710435 8019309 8704562 9675052 10834648 12101528
8268 12101528 13410957 14705717 15926026 17009113 17899137 18557989 18966249 19113595 18989555
8259 18989555 18585560 17907752 16989785 15895588 14709806 13519612 12394357 11370755 10449749
8250 10449749 9605302 8799859 8001471 7200439 6422642 5733298 5226179 5000591 5134652
8241 5134652 5663162 6564423 7757506 9110272 10456861 11622345 12452137 12842793 12767241
8232 12767241 12284278 11525282 10661121 9861896 9263772 8950505 8949775 9241415 9774049 10484654
8222 10484654 11313601 12210816 13135082 14051383 14928359 15735632 16443468 17028752 17485537
8213A7485537L45256K66571K19790J89174J55575J07046M0910m2550j48179k88318
8203A8330812m77150p22034j019270j356159j714227k068326k383180k614311
8195E976155k718608k672047k484445k200050j880929j582318j334025j135593
8187a0031860r62937p81026n59095k84516L1424L60272O70843R40193J154222
8178i462480J301521J370197J353469J259960J117571R62567Q17710O75211N00170
8169a04104K56099o3735m21394p47167r71727j056059j002034q42943o25943l97598
8159e976605j95650m5132M2839P1039N5818K4343N153J3269M0144N8610M0563
8148e865609k5828j31145k53076l70953m76473n72432o59217p20310p22260o32448
$$ plain form
8213 17485537 17830793 18097364 18317154 18506328 18661903 18768949 18809859 18767309 18619130 18330812
8203 18330812 17853662 17131628 16112358 14756199 13041972 10973646 8590466 5976155
8195 5976155 3257547 585500 -1898945 -4098995 -5979924 -7562242 -8896267 -10031860
8187 -10031860 -10994797 -11775823 -12334918 -12619434 -12588010 -12227738 -11556895 -10616702 -9462480
8178 -9462480 -8160959 -6790762 -5437293 -4177333 -3059762 -2097195 -1279485 -604274 -104104
8169 -104104 151995 88260 -333134 -1080301 -2052028 -3108087 -4110121 -4953064 -5579007 -5976605
8159 -5976605 -6172255 -6217387 -6174548 -6103509 -6047691 -6023348 -6018195 -6004926 -5964782 -5906172 -5865609
8148 -5865609 -5891437 -6022582 -6275658 -6646611 -7123084 -7695516 -8354733 -9075043 -9797303 -10429751
8138a0429751m40524j65459J55201M81888P82316J031657J210366J305647J315833
8129d752826J252471J136159R88012Q23438O53277M89895L50448K52613K06619
8120A400106K10922K54020L18575L84535M32684M50170M34227L88943L16998K15475
8110D806655Q1564p6808k35972l63125m31751m37310m03131l70497l77248m38989
8100A753388n45044o67404p70911q17683p70345o00824l03129R8634N54045J002151
8090a067122J392910J704108J944257K139289K310788K458512K557081K568830
8082A6008653K465887K247850J942928J592383J231350Q79706N44725K27358p3643
8073B7067197l58530o22377q52971j034362j154460j210613j209103j159557j068887
$$ plain form
8138 -10429751 -10870275 -11035734 -10880533 -10398645 -9616329 -8584672 -7374306 -6068659 -4752826
8129 -4752826 -3500355 -2364196 -1376184 -552746 100531 590426 940874 1193487 1400106
8120 1400106 1611028 1865048 2183623 2568158 3000842 3451012 3885239 4274182 4591180 4806655
8110 4806655 4888219 4811411 4575439 4212314 3780563 3343253 2940122 2569625 2192377 1753388
8100 1753388 1208344 540940 -229971 -1047654 -1817999 -2418823 -2721952 -2623318 -2069273 -1067122
8090 -1067122 325788 2029896 3974153 6113442 8424230 10882742 13439823 16008653
8082 16008653 18474540 20722390 22665318 24257701 25489051 26368757 26913482 27140840 27067197
8073 27067197 26708667 26086290 25233319 24198957 23044497 21833884 20624781 19465224 18396337
8064A8396337r39554p74546n87144m08631k85529k62350l56501n41333p51924
8055A3488825r12894r69716r02413p17284m31804p0082L29491P07947R93759J124223
8045A2640052J067518Q32590M62911J9232m39701q70671j250084j570080j831569
8036I060198k038405k192854k290708k317380k250030k068226j768577j375029
8028g241011r38953n27952k05435p186P3632Q2391P9600J11234J89302K91588
8018h092790L77749M11428L76069K77397J35212k5849j79870k99471l57697l33399
8008g711221k17260j6354K43098N17378P55041R12900R69033R24707P96919O10469
7998b215290L95598J88233K5446o6389q4060m9371M485N4169J00124J63947K72934
$$ plain form
8064 18396337 17456783 16682237 16095093 15686462 15400933 15138583 14782082 14240749 13488825
8055 13488825 12575931 11606215 10703802 9986518 9554714 9484632 9814123 10522070 11515829 12640052
8045 12640052 13707570 14540160 15003071 15022303 14582602 13711931 12461847 10891767 9060198
8036 9060198 7021793 4828939 2538231 220851 -2029179 -4097405 -5865982 -7241011
8028 -7241011 -8179964 -8707916 -8913351 -8920537 -8846905 -8764514 -8684914 -8573680 -8384378 -8092790
8018 -8092790 -7715041 -7303613 -6927544 -6650147 -6514935 -6540784 -6720654 -7020125 -7377822 -7711221
8008 -7711221 -7928481 -7944835 -7701737 -7184359 -6429318 -5516418 -4547385 -3622678 -2825759 -2215290
7998 -2215290 -1819692 -1631459 -1606013 -1672402 -1756462 -1805833 -1801348 -1747179 -1647055 -1483108 -1210174
7987a210174M42771O66567R12040J126613J250444J236228J069786P81960M43139
7978F719374J39251o0995j30200q4387L5677J89560L53594N23284P05355R05835
7968I296348J120017J329334J507019J627807J673835J633789J500638J274192
7960B0962979R67039O06582K30073j22128m09308n91499o35990n29779k88740
7951B0189229M4581M12030P51086J003499J125775J102501R53511P25103M67485
7942B6774800K12911l1503k73724n18994p57837r68300j129151j231278j276627
7933B0800297j266959j195238j048619q19230n12540j49138K36650N98783Q85515
7924A7529521J052608J079295R76553P81205N39008K86223L8607k07816m65027
$$ plain form
7987 -1210174 -767403 -100836 811204 1937817 3188261 4424489 5494275 6276235 6719374
7978 6719374 6858625 6797630 6667430 6583043 6618720 6808280 7161874 7685158 8390513 9296348
7968 9296348 10416365 11745699 13252718 14880525 16554360 18188149 19688787 20962979
7960 20962979 21930018 22536600 22766673 22644545 22235237 21643738 21007748 20477969 20189229
7951 20189229 20233810 20645840 21396926 22400425 23526200 24628701 25582212 26307315 26774800
7942 26774800 26987711 26956208 26682484 26163490 25405653 24437353 23308202 22076924 20800297
7933 20800297 19533338 18338100 17289481 16470251 15957711 15808573 16045223 16644006 17529521
7924 17529521 18582129 19661424 20637977 21419182 21958190 22244413 22283020 22075204 21610177
7915B1610177p36861j008561j249146j424089j508629j494262j388489j211027
7907A1589113r86875p36391m67472j77576J33367M48821P33010R44025J054012
7898A2534034J060892R82647Q40713O49136M18784J67444q0208l05079n03642
7889A5764721o82240q40345r59215j006870r56868q09115n98036l78302j93823
7880I339907n2967O8222J97685L40492M76004N75491O20009O06091N42984M49017
7870A3162935L47239K57756J89844J40990J04458P7979O4700O5377P0032N8423
7860A4539733J0867p8759j98275l23662m30309n00588n25380n02585m34983l27664
$$ plain form
7915 21610177 20873316 19864755 18615609 17191520 15682891 14188629 12800140 11589113
7907 11589113 10602238 9865847 9398375 9220799 9354166 9802987 10535997 11480022 12534034
7898 12534034 13594926 14577573 15418286 16067422 16486206 16653650 16573442 16268363 15764721
7889 15764721 15082481 14242136 13282921 12276051 11319183 10510068 9912032 9533730 9339907
7880 9339907 9286940 9355162 9552847 9893339 10369343 10944834 11564843 12170934 12713918 13162935
7870 13162935 13510174 13767930 13957774 14098764 14203222 14281201 14345901 14411278 14481310 14539733
7860 14539733 14550600 14471841 14273566 13949904 13519595 13019007 12493627 11991042 11556059 11228395
$$ [...]
##END NTUPLES=NMR SPECTRUM
##END=
