##TITLE=31Pdec_LR-780-B2-M1
 CDCl3
  24 sc
 9.1.2024
##JCAMPDX= 6.0         $$ Bruker NMR JCAMP-DX V2.0
##DATA TYPE= NMR SPECTRUM
##DATA CLASS= NTUPLES
##ORIGIN= UXNMR, Bruker Analytische Messtechnik GmbH
##OWNER= root
$$ XWIN-NMR		Version 3.5
$$ Tue Jan  9 14:33:07 2024 Russian Standard Time (UT+4h)  she@DPX200
##.OBSERVE FREQUENCY= 81.013821
##.OBSERVE NUCLEUS= ^31P
##.ACQUISITION MODE= SIMULTANEOUS
##.ACQUISITION SCHEME= undefined
##.AVERAGES= 24
##.DIGITISER RES= 16
##SPECTROMETER/DATA SYSTEM= spect
##.PULSE SEQUENCE= zgpg30
##.SOLVENT NAME= CD2Cl2
##.SHIFT REFERENCE= (INTERNAL, CD2Cl2, 0, 248.564)
##AUDIT TRAIL= $$ (NUMBER, WHEN, WHO, WHERE, WHAT)
$$ ##TITLE= Audit trail, XWIN-NMR		Version 3.5
$$ ##JCAMPDX= 5.01
$$ ##ORIGIN= Bruker BioSpin GmbH
$$ ##OWNER= she
$$ F:/spectra/data/she/nmr/P31/1/pdata/1/auditp.txt
$$ ##AUDIT TRAIL=  $$ (NUMBER, WHEN, WHO, WHERE, WHAT)
(   1,<2024-01-09 14:32:19.59 +0400>,<she>,<DPX200>,
      <acquisition in progress>)
(   2,<2024-01-09 14:32:27.20 +0400>,<she>,<DPX200>,
      <Start of raw data processing
       efp BC_mod = 2 LB = 10 FT_mod = 6 PKNL = 1 PHC0 = -12246.51 PHC1 = 310.2938 SI = 64K 
       data hash MD5: 64K
       CD A8 33 76 CE A1 39 16 93 BB 3A FC 15 41 F5 41>)
(   3,<2024-01-09 14:32:37.43 +0400>,<she>,<DPX200>,
      <pk PHC0 = 2.502893 PHC1 = 0 
       data hash MD5: 64K
       F1 12 EB FA 0C B8 18 8B 1B 3C CB 6C 6E E9 16 11>)
(   4,<2024-01-09 14:32:40.78 +0400>,<she>,<DPX200>,
      <abs ABSG = 5 
       data hash MD5: 64K
       DE 56 7E 2F D9 DB 01 51 34 23 27 EB 67 B4 72 AB>)
$$ ##END=
$$ 
$$ hash MD5
$$ E1 6E 99 DD 4A A8 D3 05 BD 18 7D 7E BC 4A 98 55
##$RELAX= 
##$RELAX= 
##$RELAX= 
##$RELAX= 
##$RELAX= 
##$RELAX= 
##$RELAX= 
##$RELAX= 
##$RELAX= 
$$ Bruker specific parameters
$$ --------------------------
##$DU= <F:/spectra>
##$EXPNO= 1
##$NAME= <P31>
##$PROCNO= 1
##$TYPE= <nmr>
##$USER= <she>
##$AMP= (0..31)
100 100 100 100 100 100 100 100 100 100 100 100 100 100 100 100 100 100 
100 100 100 100 100 100 100 100 100 100 100 100 100 100 
##$AQSEQ= 0
##$AQ_mod= 1
##$AUNM= <au_zg>
##$AUTOPOS= <>
##$BF1= 81.014009
##$BF2= 200.13
##$BF3= 200.13
##$BF4= 200.13
##$BF5= 200.13
##$BF6= 200.13
##$BF7= 200.13
##$BF8= 200.13
##$BYTORDA= 1
##$CFDGTYP= 0
##$CFRGTYP= 5
##$CHEMSTR= <none>
##$CNST= (0..31)
1 1 145 1 1 1 1 1 1 1 1 1 1 1 1 1 1 1 1 1 1 1 1 1 1 1 1 1 1 1 1 1 
##$CPDPRG= <waltz16>
##$CPDPRG1= <>
##$CPDPRG2= <waltz16>
##$CPDPRG3= <>
##$CPDPRG4= <mlev>
##$CPDPRG5= <mlev>
##$CPDPRG6= <mlev>
##$CPDPRG7= <mlev>
##$CPDPRG8= <mlev>
##$CPDPRGB= <>
##$CPDPRGT= <>
##$D= (0..31)
0 1 0 0 0 0 0 0 0 0 0 0.03 2e-05 3e-06 0 0 0 0 0 0 0 0 0 0 0 0 0 0 0 0 
0 0 
##$DATE= 1704796379
##$DBL= (0..7)
120 120 120 11 120 120 24 19 
##$DBP= (0..7)
150 150 150 150 150 150 150 150 
##$DBP07= 0
##$DBPNAM0= <>
##$DBPNAM1= <>
##$DBPNAM2= <>
##$DBPNAM3= <>
##$DBPNAM4= <>
##$DBPNAM5= <>
##$DBPNAM6= <>
##$DBPNAM7= <>
##$DBPOAL= (0..7)
0.5 0.5 0.5 0.5 0.5 0.5 0.5 0.5 
##$DBPOFFS= (0..7)
0 0 0 0 0 0 0 0 
##$DE= 6
$$ [...]
##$SUBNAM3= <"">
##$SUBNAM4= <"">
##$SUBNAM5= <"">
##$SUBNAM6= <"">
##$SUBNAM7= <"">
##$SUBNAM8= <"">
##$SUBNAM9= <"">
##$SW= 501.771253377433
##$SWIBOX= (0..15)
0 1 3 0 0 0 0 0 0 0 0 0 0 0 0 0 
##$SW_h= 40650.406504065
##$TD= 32768
##$TD0= 1
##$TE= 0
##$TE2= 300
##$TE3= 300
##$TEG= 300
##$TL= (0..7)
0 120 53 12 22 120 120 120 
##$TP= (0..7)
150 150 150 150 150 150 150 150 
##$TP07= 0
##$TPNAME0= <>
##$TPNAME1= <>
##$TPNAME2= <>
##$TPNAME3= <>
##$TPNAME4= <>
##$TPNAME5= <>
##$TPNAME6= <>
##$TPNAME7= <>
##$TPOAL= (0..7)
0.5 0.5 0.5 0.5 0.5 0.5 0.5 0.5 
##$TPOFFS= (0..7)
0 0 0 0 0 0 0 0 
##$TUNHIN= 0
##$TUNHOUT= 0
##$TUNXOUT= 0
##$USERA1= <user>
##$USERA2= <user>
##$USERA3= <user>
##$USERA4= <user>
##$USERA5= <user>
##$V9= 5
##$VALIST= <valist>
##$VCLIST= <CCCCCCCCCCCCCCC>
##$VD= 0
##$VDLIST= <DDDDDDDDDDDDDDD>
##$VPLIST= <PPPPPPPPPPPPPPP>
##$VTLIST= <TTTTTTTTTTTTTTT>
##$WBST= 1024
##$WBSW= 4
##$XGAIN= (0..3)
0 0 0 0 
##$XL= 0
##$YL= 0
##$YMAX_a= 1535
##$YMIN_a= -1324
##$ZGOPTNS= <>
##$ZL1= 120
##$ZL2= 120
##$ZL3= 120
##$ZL4= 120
##$ABSF1= 248.5645
##$ABSF2= -253.2056
##$ABSG= 5
##$ABSL= 3
##$ALPHA= 0
##$AQORDER= 0
##$ASSFAC= 0
##$ASSFACI= 0
##$ASSFACX= 0
##$ASSWID= 0
##$AUNMP= <proc_1d>
##$AZFE= 0.1
##$AZFW= 0.5
##$BCFW= 0
##$BC_mod= 2
##$BYTORDP= 0
##$COROFFS= 0
##$CY= -3
##$DATMOD= 1
##$DC= 0
##$DFILT= <>
##$DTYPP= 0
##$F1P= 0
##$F2P= 0
##$FCOR= 1
##$FTSIZE= 65536
##$FT_mod= 6
##$GAMMA= 0
##$GB= 0
##$INTBC= 1
##$INTSCL= 6.047779e-11
##$ISEN= 30
##$LB= 10
##$LEV0= 0
##$LPBIN= 0
##$MAXI= 10000
##$MC2= 0
##$MEAN= 0
##$ME_mod= 0
##$MI= 50
##$NCOEF= 0
##$NC_proc= -11
##$NLEV= 6
##$NOISF1= 182.463
##$NOISF2= 159.3651
##$NSP= 0
##$NTH_PI= 0
##$NZP= 0
##$OFFSET= 248.5645
##$PC= 4
##$PHC0= -12244.01
##$PHC1= 310.2938
##$PH_mod= 1
##$PKNL= yes
##$PPARMOD= 0
##$PSCAL= 0
##$PSIGN= 0
##$REVERSE= no
##$SF= 81.0140089999694
##$SI= 65536
##$SIGF1= 159.3651
##$SIGF2= -187.1042
##$SINO= 113.3802
##$SIOLD= 16384
##$SREGLST= <1H.CDCl3>
##$SSB= 0
##$STSI= 65536
##$STSR= 0
##$SW_p= 40650.406504065
##$SYMM= 0
##$S_DEV= 0
##$TDeff= 32768
##$TDoff= 0
##$TI= <>
##$TILT= no
##$TM1= 0
##$TM2= 0
##$TOPLEV= 0
##$USERP1= <user>
##$USERP2= <user>
##$USERP3= <user>
##$USERP4= <user>
##$USERP5= <user>
##$WDW= 1
##$XDIM= 65536
##$YMAX_p= 351956867
##$YMIN_p= -111448705
$$ End of Bruker specific parameters
$$ ---------------------------------
##NTUPLES= NMR SPECTRUM
##VAR_NAME=  FREQUENCY,     SPECTRUM/REAL,   SPECTRUM/IMAG
##SYMBOL=    X,             R,               I
##VAR_TYPE=  INDEPENDENT,   DEPENDENT,       DEPENDENT
##VAR_FORM=  AFFN,          ASDF,            ASDF
##VAR_DIM=   65536,         65536,           65536
##UNITS=     HZ,            ARBITRARY UNITS, ARBITRARY UNITS
##FACTOR=    0.620285442955139, 1,           1
##FIRST=     20137.2065510682, 0,            0
##LAST=      -20513.1999529968, 0,           0
##MIN=       -20513.1999529968, -111448705,  0
##MAX=       20137.2065510682, 351956867,    0
$$ Real data points
##PAGE= N=1
##DATA TABLE= (X++(R..R)), XYDATA
$$ [...]
$$ plain form
13025 -15594259 -14800180 -14338075 -14293578 -14704126 -15547679 -16746140 -18175647 -19679017 -21085677
13016 -21085677 -22243862 -23056006 -23499743 -23626203 -23543060 -23393711 -23336577 -23524029 -24082727
13007 -24082727 -25097253 -26594338 -28526262 -30762514 -33104635 -35327434 -37229580 -38669304
12999 -38669304 -39573537 -39926862 -39753903 -39104994 -38048895 -36672187 -35080032 -33388623 -31703490
12990 -31703490 -30090829 -28559417 -27065533 -25537830 -23909868 -22150742 -20287537 -18409301
12982 -18409301 -16642246 -15102263 -13852036 -12890786 -12179039 -11673437 -11343332 -11161136 -11079979
12973 -11079979 -11018334 -10862425 -10484845 -9771062 -8645992 -7095937 -5182360 -3043368 -879375
12964 -879375 1077477 2606505 3545097 3824290 3478441 2624341 1419956 20512 -1454632
$$ packed form
13025a5594259P94079M62105M4497m10548q43553j198461j429507j503370j406660
13016b1085677j158185q12144m43737j26460Q3143J49349N7134j87452n58698
13007b4082727j014526j497085j931924k236252k342121k222799j902146j439724
12999c8669304r04233l53325J72959O48909J056099J376708J592155J691409J685133
12990c1703490J612661J531412J493884J527703J627962J759126J863205J878236
12982a8409301J767055J539983J250227R61250P11747N05602L30105J82196Q1157
12973a1079979O1645J55909L77580P13783J125070J550055J913577K138992K163993
12964h79375J956852J529028R38592K79193l45849q54100j204385j399444j475144
$$ plain form
12955 -1454632 -2938786 -4416800 -5907008 -7433319 -9000283 -10581836 -12124539 -13557303
12947 -13557303 -14799291 -15765463 -16376881 -16581441 -16379142 -15836276 -15077530 -14260287 -13545017
12938 -13545017 -13071166 -12939934 -13203990 -13865749 -14882814 -16176226 -17641088 -19163287 -20640120
12929 -20640120 -21993657 -23169684 -24130162 -24852091 -25332837 -25589445 -25645349 -25513833 -25192859
12920 -25192859 -24675432 -23967068 -23098107 -22123509 -21111740 -20132208 -19250906 -18533678 -18045916
12911 -18045916 -17840496 -17941694 -18342733 -19024092 -19978071 -21215893 -22747610 -24548919 -26540294
12902 -26540294 -28594341 -30567707 -32340211 -33842518 -35061762 -36025951 -36777686 -37350259
12894 -37350259 -37753468 -37969474 -37958808 -37679551 -37117120 -36307459 -35331060 -34273733 -33179692
$$ packed form
12955a454632j484154j478014j490208j526311j566964j581553j542703j432764
12947a3557303j241988r66172o11418k04560K02299N42866P58746Q17243P15270
12938a3545017M73851J31232k64056o61759j017065j293412j464862j522199j476833
12929b0640120j353537j176027r60478p21929m80746k56608n5904J31516L20974
12920b5192859N17427P08364Q68961R74598J011769R79532Q81302P17228M87762
12911a8045916K05420j01198m01039o81359r53979j237822j531717j801309j991375
12902b6540294k054047j973366j772504j502307j219244r64189p51735n72573
12894c7350259m03209k16006J0666K79257N62431Q09661R76399J057327J094041
$$ plain form
12885 -33179692 -32032605 -30778344 -29369921 -27801576 -26113422 -24372206 -22645504 -20982032
12877 -20982032 -19400787 -17888689 -16409238 -14924604 -13424868 -11948107 -10575883 -9403413
12869 -9403413 -8501399 -7892216 -7552134 -7432508 -7481094 -7648646 -7881982 -8118376 -8294965 -8371841
12859 -8371841 -8353067 -8289407 -8259016 -8335675 -8558631 -8915108 -9341414 -9743383 -10029300 -10140720
12849 -10140720 -10066040 -9832246 -9484850 -9071697 -8638432 -8230979 -7895519 -7671332 -7579200 -7611297
12839 -7611297 -7727381 -7858953 -7919630 -7817385 -7464735 -6785550 -5719553 -4226258 -2290455
12830 -2290455 69009 2788253 5750620 8788447 11696569 14255838 16264612 17575378
12822 17575378 18127882 17964246 17214991 16057903 14665187 13159991 11600054 9994270
$$ packed form
12885c3179692J147087J254261J408423J568345J688154J741216J726702J663472
12877b0982032J581245J512098J479451J484634J499736J476761J372224J172470
12869i403413R02014O09183L40082J19626m8586j67552k33336k36394j76589p6876
12859h371841J8774O3660L0391p6659k22956l56477m26306m01969k85917j11420
12849a0140720P4680K33794L47396M13153M33265M07453L35460K24187R2132l2097
12839g611297j16084j31572o0677J02245L52650O79185J065997J493295J935803
12830b290455K359464K719244K962367L037827K908122K559269K008774J310766
12822A7575378N52504j63636p49255j157088j392716j505196j559937j605784
$$ plain form
12814 9994270 8340019 6655330 4983852 3372614 1844235 387345 -1028247 -2424422
12806 -2424422 -3794896 -5104300 -6303624 -7348775 -8209180 -8864306 -9297364 -9495968 -9459334
12797 -9459334 -9203195 -8756065 -8150182 -7415782 -6582813 -5685648 -4763307 -3853105 -2982622
12788 -2982622 -2165227 -1398711 -663768 76256 868009 1750544 2734388 3788542 4842181
12779 4842181 5801362 6577739 7122336 7450943 7646886 7838655 8165871 8750675 9679864
12770 9679864 10991369 12660548 14592321 16629288 18579138 20254719 21515028 22294287
12762 22294287 22608429 22536787 22190955 21690116 21152360 20693416 20418493 20405155 20688099 21254931
12752 21254931 22051753 22994283 23983888 24926862 25749432 26402391 26859537 27118113 27200072
$$ packed form
12814I994270j654251j684689j671478j611238j528379j456890j415592j396175
12806b424422j370474j309404j199324j045151q60405o55126m33058j98604L6634
12797i459334K56139M47130O05883P34400Q32969Q97165R22341R10202Q70483
12788b982622Q17395P66516P34943P40024P91753Q82535R83844J054154J053639
12779D842181R59181P76377N44597L28607J95943J91769L27216N84804R29189
12770I679864J311505J669179J931773K036967J949850J675581J260309P79259
12762B2294287L14142p1642l45832n00839n37756m58944k74923j3338K82944N66832
12752B1254931P96822R42530R89605R42974Q22570O52959M57146K58576Q1959
$$ plain form
12743 27200072 27144353 26987339 26743021 26396702 25914187 25257373 24397024 23318939 22023841
12734 22023841 20524165 18842997 17018094 15107393 13188958 11351834 9680164 8235681
12726 8235681 7044324 6092947 5338534 4724503 4193675 3692066 3167450 2570584 1862501
12717 1862501 1024467 64815 -981178 -2058294 -3101827 -4048070 -4844513 -5460943 -5898451
12708 -5898451 -6188329 -6376489 -6500493 -6573944 -6587652 -6524713 -6379537 -6172862 -5958978 -5822345
12698 -5822345 -5860435 -6153853 -6733538 -7560969 -8533630 -9514540 -10371436 -11008549 -11381875 -11498042
12688 -11498042 -11400292 -11145708 -10780898 -10326765 -9779791 -9127515 -8368425 -7527017 -6659742
12679 -6659742 -5851052 -5200301 -4802525 -4728433 -5008706 -5625661 -6514462 -7575464 -8695907
$$ packed form
12743B7200072n5719j57014k44318l46319m82515o56814q60349j078085j295098
12734B2023841j499676j681168j824903j910701j918435j837124j671670j444483
12726H235681j191357r51377p54413o14031n30828n01609n24616n96866p08083
12717A862501q38034r59652j045993j077116j043533r46243p96443o16430m37508
12708e898451k89878j88160j24004p3451j3708O2939J45176K06675K13884J36633
12698e822345l8090k93418n79685q27431r72661r80910q56896o37113l73326j16167
12688a1498042R7750K54584L64810M54133N46974O52276P59090Q41408Q67275
12679f659742Q08690O50751L97776P4092k80273o16955q88801j061002j120443
$$ plain form
12670 -8695907 -9773849 -10735555 -11542252 -12188301 -12694760 -13100420 -13451459 -13792091 -14158286
12661 -14158286 -14573215 -15040491 -15534821 -15997176 -16344010 -16492069 -16387450 -16022888 -15436240
12652 -15436240 -14697247 -13895074 -13131583 -12514274 -12139829 -12066703 -12286363 -12709131 -13177173
12643 -13177173 -13504831 -13531569 -13165204 -12399204 -11303478 -10001019 -8643664 -7391163 -6389809
12634 -6389809 -5748508 -5518513 -5687345 -6190815 -6935291 -7817539 -8735852 -9595191 -10310735
12625 -10310735 -10809700 -11029975 -10918992 -10439461 -9583049 -8383209 -6915216 -5279619 -3577484
12616 -3577484 -1891542 -282084 1205112 2529684 3655377 4556337 5224558 5674769 5948850
12607 5948850 6120234 6290588 6568993 7035739 7708808 8533959 9404790 10200457 10821202
$$ packed form
12670h695907j077942r61706q06697o46049n06459m05660l51039l40632l66195
12661a4158286m14929m67276m94330m62355l46834j48059J04619L64562N86648
12652a5436240P38993Q02173P63491O17309L74445P3126k19660m22768m68042
12643a3177173l27658k6738L66365P66000J095726J302459J357355J252501J001354
12634f389809O41301K29995j68832n03470p44476q82248r18313q59339p15544
12625a0310735m98965k20275J10983M79531Q56412J199840J467993J635597J702135
12616c577484J685942J609458J487196J324572J125693R00960O68221M50211K74081
12607E948850J71384J70354K78405M66746O73069Q25151Q70831P95667O20745
$$ plain form
12598 10821202 11208037 11344648 11247838 10954189 10506681 9940501 9267067 8459962 7451242
12589 7451242 6145441 4450870 2317753 -232904 -3102787 -6134233 -9142847 -11950457
12581 -11950457 -14408409 -16408136 -17880276 -18786532 -19112439 -18869886 -18110560 -16939992 -15517592
12572 -15517592 -14035853 -12684187 -11611086 -10899449 -10564773 -10575072 -10879707 -11431077 -12191568
12563 -12191568 -13129422 -14210728 -15391437 -16611429 -17793879 -18851512 -19695143 -20236983
12555 -20236983 -20386994 -20050337 -19137108 -17588033 -15406877 -12681569 -9578873 -6311269
12547 -6311269 -3090386 -87530 2584791 4869444 6748712 8229253 9337757 10126949
12539 10126949 10680417 11102980 11495307 11926930 12425027 12982997 13576447 14170675 14716588
$$ packed form
12598A0821202L86835J36611r6810k93649m47508n66180o73434q07105j008720
12589G451242j305801j694571k133117k550657k869883l031446l008614k807610
12581a1950457k457952j999727j472140r06256l25907K42553P59326J170568J422400
12572a5517592J481739J351666J073101P11637L34676j0299l04635n51370p60491
12563a2191568r37854j081306j180709j219992j182450j057633q43631n41840
12555b0236983j50011L36657R13229J549075K181156K725308L102696L267604
12547f311269L220883L002856K672321K284653J879268J480541J108504P89192
12539A0126949N53468M22563L92327M31623M98097N57970N93450N94228N45913
$$ plain form
12530 14716588 15148161 15397612 15428667 15267246 15003859 14761289 14647695 14723612 14995416 15427047
12520 15427047 15956040 16507153 17002632 17367781 17532412 17435018 17036951 16342316 15407761
12511 15407761 14330563 13221076 12177962 11279609 10589943 10166900 10063396 10318631 10944976
12502 10944976 11918205 13175978 14624146 16146983 17618275 18912398 19914819 20530533
12494 20530533 20689487 20350182 19503529 18177228 16437983 14387209 12147492 9842474
12486 9842474 7578844 5439259 3486501 1769249 319496 -857582 -1790075 -2532467
12478 -2532467 -3147634 -3689304 -4194898 -4688255 -5183636 -5683557 -6171804 -6610439 -6948412
12469 -6948412 -7140554 -7167293 -7044480 -6819374 -6557905 -6333239 -6222684 -6310521 -6686500 -7431873
$$ packed form
12530A4716588M31573K49451L1055j61421k63387k42570j13594P5917K71804M31631
12520A5427047N28993N51113M95479L65149J64631r7394l98067o94635r34555
12511A5407761j077198j109487j043114q98353o89666m23043j03504K55235O26345
12502A0944976R73229J257773J448168J522837J471292J294123J002421O15714
12494B0530533J58954l39305q46653j326301j739245k050774k239717k305018
12486I842474k263630k139585j952758j717252j449753j177078r32493p42392
12478b532467o15167n41670n05594m93357m95381m99921m88247m38635l37973
12469f948412j92142k6739J22813K25106K61469K24666J10555q7837l75979p45373
$$ plain form
12459 -7431873 -8596253 -10178712 -12125150 -14342843 -16722246 -19153777 -21533664 -23762714
12451 -23762714 -25747795 -27411977 -28708156 -29624130 -30173644 -30381199 -30272716 -29874967 -29217281
12442 -29217281 -28331186 -27251204 -26019831 -24691531 -23327182 -21977892 -20667345 -19384189
12434 -19384189 -18090885 -16747970 -15345294 -13925562 -12585243 -11447890 -10620260 -10151381
12426 -10151381 -10012742 -10107205 -10302417 -10475829 -10554638 -10535995 -10480788 -10485558 -10645627 -11022870
12416 -11022870 -11624376 -12392291 -13207468 -13914441 -14368813 -14488729 -14279374 -13813255 -13181367
12407 -13181367 -12450632 -11652311 -10798117 -9903185 -8998648 -8129973 -7345933 -6684026 -6157001
12398 -6157001 -5745598 -5403678 -5078704 -4740923 -4404148 -4120582 -3947532 -3904833 -3950510 -3989860
$$ packed form
12459g431873j164380j582459j946438k217693k379403k431531k379887k229050
12451b3762714j985081j664182j296179r15974n49514k07555J08483L97749O57686
12442b9217281Q86095J079982J231373J328300J364349J349290J310547J283156
12434a9384189J293304J342915J402676J419732J340319J137353Q27630M68879
12426a0151381J38639r4463j95212j73412p8809J8643N5207m770j60069l77243
12416a1022870o01506p67915q15177p06973m54372j19916K09355M66119O31888
12407a3181367P30735P98321Q54194Q94932R04537Q68675P84040O61907N27025
12398f157001M11403L41920L24974L37781L36775K83566J73050M2699m5677l9350
$$ plain form
12388 -3989860 -3909682 -3614612 -3046359 -2182947 -1028426 396291 2059323 3924250 5958205
12379 5958205 8136690 10438979 12833301 15258097 17610116 19749305 21522691 22797373
12371 22797373 23485140 23546300 22975107 21781067 19980513 17603509 14710314 11405330 7837480
12362 7837480 4184624 630546 -2652894 -5512561 -7814903 -9450447 -10346380 -10482834
12354 -10482834 -9903875 -8716358 -7075967 -5164710 -3164978 -1233822 518811 2042333
12346 2042333 3342992 4466296 5470592 6401245 7273231 8065256 8723542 9171401 9323100
12337 9323100 9103509 8472093 7441044 6073660 4459714 2683022 804372 -1129776
12329 -1129776 -3065242 -4928750 -6641082 -8146234 -9434283 -10542092 -11534157 -12477553
$$ packed form
12388c989860Q0178K95070N68253Q63412J154521J424717J663032J864927K033955
12379E958205K178485K302289K394322K424796K352019K139189J773386J274682
12371B2797373O87767O1160n71193j194040j800554k377004k893195l304984l567850
12362G837480l652856l554078l283440k859667k302342j635544q95933j36454
12354a0482834N78959J187517J640391J911257J999732J931156J752633J523522
12346B042333J300659J123304J004296R30653Q71986P92025O58286M47859J51699
12337I323100k19591o31416j031049j367384j613946j776692j878650j934148
12329a129776j935466j863508j712332j505152j288049j107809r92065r43396
$$ plain form
12321 -12477553 -13422140 -14388701 -15365104 -16312786 -17183962 -17942840 -18579767 -19111234 -19567153
12312 -19567153 -19972768 -20333757 -20629655 -20814844 -20823039 -20575474 -19999462 -19060277 -17793140
12303 -17793140 -16311376 -14778486 -13358176 -12170211 -11268484 -10636868 -10192293 -9794888 -9273672
12294 -9273672 -8469219 -7278889 -5682962 -3739638 -1555419 749887 3066157 5299344
12286 5299344 7368749 9205149 10753965 11981264 12878791 13465950 13788106 13911269 13913960
12277 13913960 13877692 13876998 13969397 14186471 14528505 14964905 15440822 15888805 16242667 16448903
12267 16448903 16471161 16288317 15892913 15296105 14536249 13680533 12812468 12009739 11324713
12258 11324713 10776827 10357045 10038893 9790800 9586893 9413665 9269381 9155891 9069314
$$ packed form
12321a2477553r44587r66561r76403r47682q71176p58878o36927n31467m55919
12312a9567153m05615l60989k95898j85189q195K47565N76012R39185J267137
12303a7793140J481764J532890J420310J187965R01727O31616M44575L97405N21216
12294i273672Q04453J190330J595927J943324K184219K305306K316270K233187
12286E299344K069405J836400J548816J227299Q97527N87159L22156J23163K691
12277A3913960l6268o94R2399K17074L42034M36400M75917M47983L53862K06236
12267A6448903K2258j82844l95404n96808p59856q55716q68065q02729o85026
12258A1324713n47886m19782l18152k48093k03907j73228j44284j13490q6577
$$ plain form
12249 9069314 8999146 8937895 8890278 8868162 8871187 8869105 8801144 8591627 8169859 7486657 6528064
12238 6528064 5324939 3950441 2500935 1069062 -276060 -1495593 -2580669 -3551177
12230 -3551177 -4451086 -5334914 -6248176 -7212826 -8226150 -9270726 -10325609 -11371064 -12386832
12221 -12386832 -13349505 -14234600 -15024653 -15719261 -16339633 -16921224 -17493565 -18054126 -18549226
12212 -18549226 -18875578 -18907796 -18541803 -17731449 -16498526 -14915136 -13076348 -11082885 -9038790
12203 -9038790 -7054590 -5245132 -3719470 -2567197 -1846328 -1574571 -1722491 -2206978 -2888070
12194 -2888070 -3577467 -4064800 -4156197 -3709435 -2651984 -980233 1251815 3945397 6967492
12185 6967492 10160502 13355601 16392843 19144582 21531947 23525737 25133448 26383013
$$ packed form
12249I069314p0168o1251m7617k2116L025k082o7961k09517m21768o83202r58593
12238F528064j203125j374498j449506j431873j345122j219533j085076r70508
12230c551177q99909q83828r13262r64650j013324j044576j054883j045455j015768
12221a2386832r62673q85095p90053o94608o20372n81591n72341n60561m95100
12212a8549226l26352l2218L65993Q10354J232923J583390J838788J993463K044095
12203i038790J984200J809458J525662J152273P20869K71757j47920m84487o81092
12194b888070o89397m87333r1397M46762J057451J671751K232048K693582L022095
12185F967492L193010L195099L037242K751739K387365J993790J607711J249565
$$ plain form
12177 26383013 27311977 27961383 28368278 28554734 28519648 28241564 27692641 26852873 25712933
12168 25712933 24267374 22513428 20467100 18188870 15797364 13456434 11340999 9599443
12160 9599443 8327655 7560366 7278278 7425219 7927092 8706040 9688620 10810311 12016785
12151 12016785 13259884 14488710 15641807 16647582 17434915 17950340 18176272 18144571 17937632
12142 17937632 17669268 17446690 17329462 17307198 17305660 17211549 16899066 16251028 15178618 13641944
12132 13641944 11664144 9329729 6767365 4126307 1554550 -820728 -2912307 -4687444
12124 -4687444 -6166771 -7400182 -8427627 -9247375 -9812494 -10057066 -9934124 -9444249 -8645076
12115 -8645076 -7642492 -6567402 -5543667 -4657811 -3943461 -3387744 -2957061 -2632148 -2437929
$$ packed form
12177B6383013R28964O49406M06895J86456l5086k78084n48923q39768j139940
12168B5712933j445559j753946k046328k278230k391506k340930k115435j741556
12160I599443j271788p67289k82088J46941N01873P78948R82580J121691J206474
12151A2016785J243099J228826J153097J005775P87333N15425K25932l1701k06939
12142A7937632k68364k22578j17228k2264j538r4111l12483o48038j072410j536674
12132A3641944j977800k334415k562364k641058k571757k375278k091579j775137
12124d687444j479327j233411j027445q19748n65119k44572J22942M89875P99173
12115h645076J002584J075090J023735Q85856P14350N55717M30683L24913J94219
$$ plain form
12106 -2437929 -2452085 -2783027 -3525565 -4718973 -6330739 -8269027 -10406684 -12597844 -14683031
12097 -14683031 -16493356 -17865182 -18665160 -18814306 -18298906 -17165095 -15503458 -13432184
12089 -13432184 -11082517 -8585930 -6062938 -3616352 -1330958 723707 2494444 3951660
12081 3951660 5095424 5949685 6543634 6893040 6996998 6853407 6481877 5938729 5316004
12072 5316004 4726443 4282600 4079046 4182589 4628871 5420033 6520247 7850913 9290066
12063 9290066 10680157 11846846 12628276 12908528 12643651 11868799 10681746 9207923 7561078
12054 7561078 5817544 4016343 2182451 356146 -1391337 -2965994 -4280361 -5291984
12046 -5291984 -6033944 -6620700 -7222244 -8016076 -9137919 -10649051 -12525445 -14664354 -16903479
$$ packed form
12106b437929j4156l30942p42538j193408j611766j938288k137657k191160k085187
12097a4683031j810325j371826p99978j49146N15400J133811J661637K071274
12089a3432184K349667K496587K522992K446586K285394K054665J770737J457216
12081C951660J143764Q54261N93949L49406J03958j43591l71530n43148o22725
12072E316004n89561m43843k03554J03543M46282P91162J100214J330666J439153
12063I290066J390091J166689P81430K80252k64877p74852j187053j473823j646845
12054G561078j743534j801201j833892j826305j747483j574657j314367j011623
12046e291984p41960n86756o01544p93832j121843j511132j876394k138909k239125
$$ plain form
12037 -16903479 -19051375 -20926910 -22399525 -23415950 -24001111 -24232159 -24198800 -23969874 -23580917
12028 -23580917 -23043869 -22367356 -21571975 -20692602 -19772196 -18857036 -17996143 -17237609 -16616133
12019 -16616133 -16138895 -15784444 -15519566 -15322025 -15191424 -15141658 -15183704 -15312729 -15507330 -15739699
12009 -15739699 -15990686 -16263537 -16591135 -17032524 -17657606 -18525220 -19665183 -21072786 -22714889
12000 -22714889 -24538636 -26474667 -28434529 -30308497 -31970135 -33289634 -34153278 -34483486
11992 -34483486 -34253130 -33489707 -32269750 -30708920 -28953966 -27175939 -25555543 -24252102
11984 -24252102 -23361927 -22887191 -22735565 -22751954 -22764762 -22626324 -22237578 -21556664 -20593821 -19395989
11974 -19395989 -18027621 -16555451 -15040926 -13538213 -12093806 -10746147 -9525974 -8457231
$$ packed form
12037a6903479k147896j875535j472615j016425n85161k31048L3359K28926L88957
12028b3580917N37048O76513P95381Q79373R20406R15160Q60893P58534O21476
12019a6616133M77238L54451K64878J97541J30601M9766m2046j29025j94601k32369
12009a5739699k50987k72851l27598m41389o25082q67614j139963j407603j642103
12000b2714889j823747j936031j959862j873968j661638j319499q63644l30208
11992c4483486K30356P63423J219957J560830J754954J778027J620396J303441
11984b4252102Q90175M74736J51626j6389j2808J38438L88746O80914R62843J197832
11974a9395989J368368J472170J514525J502713J444407J347659J220173J068743
$$ plain form
11966 -8457231 -7556577 -6830233 -6270265 -5854195 -5549232 -5318791 -5129331 -4958658 -4806157
11957 -4806157 -4699730 -4691485 -4840904 -5194667 -5775883 -6588702 -7633736 -8922299 -10476917
11948 -10476917 -12312366 -14404449 -16665261 -18944224 -21060698 -22854784 -24231068 -25173769
11940 -25173769 -25728375 -25963144 -25931531 -25650824 -25099953 -24230174 -22979949 -21289510 -19117442
11931 -19117442 -16464152 -13399135 -10075984 -6717532 -3570733 -852099 1291525 2796226
11923 2796226 3672680 3984753 3822637 3279752 2442662 1396376 237370 -917263 -1932411
11914 -1932411 -2671013 -3020552 -2923661 -2404043 -1577496 -639141 175069 641907 598571 -32949
11904 -32949 -1246207 -2963149 -5049408 -7333592 -9636758 -11809391 -13761797 -15473336
$$ packed form
11966h457231R00654P26344N59968M16070L04963K30441J89460J70673J52501
11957d806157J06427Q245j49419l53763n81216q12819j045034j288563j554618
11948a0476917j835449k092083k260812k278963k116474j794086j376284r42701
11940b5173769n54606k34769L1613K80707N50871Q69779J250225J690439K172068
11931a9117442K653290L065017L323151L358452L146799K718634K143624J504701
11923B796226Q76454L12073j62116n42885q37090j046286j159006j154633j015148
11914a932411p38602l49539R6891N19618Q26547R38355Q14210M66838m3336o31520
11904c2949j213258j716942k086259k284184k303166k172633j952406j711539
$$ plain form
11896 -15473336 -16977889 -18336334 -19610331 -20844438 -22055460 -23227924 -24319078 -25275503
11888 -25275503 -26054421 -26637288 -27029550 -27251694 -27330304 -27292686 -27164224 -26968839 -26733643 -26495310
11878 -26495310 -26301899 -26206542 -26256100 -26481340 -26892625 -27481727 -28230301 -29125688 -30179533
11869 -30179533 -31436500 -32960149 -34796666 -36934751 -39285207 -41692119 -43970683 -45956664
11861 -45956664 -47549541 -48731995 -49555199 -50094746 -50398202 -50448956 -50160125 -49397237 -48019175
11852 -48019175 -45923768 -43084388 -39566589 -35520338 -31151310 -26681219 -22310020 -18191001
11844 -18191001 -14423287 -11058660 -8115741 -5595276 -3491818 -1798342 -503670 412561
11836 412561 981768 1245048 1253490 1071684 777412 448788 140095 -140065 -432941 -811026
$$ packed form
11896a5473336j504553j358445j273997j234107j211022j172464j091154r56425
11888b5275503p78918n82867l92262k22144p8610L7618J28462J95385K35196K38333
11878b6495310J93411R5357m9558k25240m11285n89102p48574q95387j053845
11869c0179533j256967j523649j836517k138085k350456k406912k278564j985981
11861d5956664j592877j182454q23204n39547l03456n0754K88831P62888J378062
11852d8019175K095407K839380L517799M046251M369028M470091M371199M119019
11844a8191001L767714L364627K942919K520465K103458J693476J294672R16231
11836D12561N69207K63280Q442j81806k94272l28624l08693k80160k92876l78085
$$ plain form
11826 -811026 -1344172 -2063833 -2938671 -3872637 -4731388 -5390530 -5783790 -5924399 -5887027 -5761954
11816 -5761954 -5608641 -5432060 -5188476 -4811752 -4244719 -3462505 -2481216 -1352118 -146132
11807 -146132 1064675 2222772 3295244 4278172 5194573 6082862 6975178 7874372 8745948
11798 8745948 9534882 10199632 10743301 11226102 11756429 12465798 13473498 14848364 16579861
11789 16579861 18570473 20652280 22620411 24274196 25459679 26105108 26234370 25945346
11781 25945346 25358089 24559272 23573560 22373567 20914762 19171103 17155098 14919637
11773 14919637 12546154 10124888 7733985 5425541 3223808 1133232 -852028 -2743807
11765 -2743807 -4559644 -6319662 -8036402 -9702448 -11286423 -12743660 -14036554 -15151667
$$ packed form
11826h11026n33146p19661q74838r33966q58751o59142l93260j40609L7372J25073
11816e761954J53313J76581K43584L76724N67033P82214R81289J129098J205986
11807a46132J210807J158097J072472R82928R16401Q88289Q92316Q99194Q71576
11798H745948P88934O64750N43669M82801N30327P09369J007700J374866J731497
11789A6579861J990612K081807J968131J653785J185483O45429J29262k89024
11781B5945346n87257p98817r85712j199993j458805j743659k016005k235461
11773A4919637k373483k421266k390903k308444k201733k090576j985260j891779
11765b743807j815837j760018j716740j666046j583975j457237j292894j115113
$$ plain form
11757 -15151667 -16103315 -16922998 -17641341 -18269834 -18787077 -19133236 -19216571 -18933102 -18194523
11748 -18194523 -16955201 -15230442 -13102649 -10714120 -8244386 -5872877 -3737240 -1906352
11740 -1906352 -382706 869321 1889377 2700833 3308593 3706099 3883452 3837470 3586722
11731 3586722 3186106 2727236 2315801 2034055 1910676 1917773 1997403 2101726 2224822 2410964
11721 2410964 2736947 3278111 4075065 5116460 6341486 7651994 8921989 10003879 10742491
11712 10742491 11004104 10712159 9871890 8572446 6968021 5245957 3588969 2138513
11704 2138513 968690 78719 -595325 -1156076 -1715584 -2366478 -3158048 -4083101 -5080684
11695 -5080684 -6054397 -6899718 -7530594 -7897246 -7991126 -7837274 -7478454 -6958380 -6310728 -5555905
$$ packed form
11757a5151667r51648q19683p18343o28493n17243l46159q3335K83469P38579
11748a8194523J239322J724759K127793K388529K469734K371509K135637J830888
11740a906352J523646J252027J020056Q11456O07760L97506J77353m5982k50748
11731C586722m00616m58870m11435k81746j23379P097P9630J04323J23096J86142
11721B410964L25983N41164P96954J041395J225026J310508J269995J081890P38612
11712A0742491K61613k91945q40269j299444j604425j722064j656988j450456
11704B138513j169823q89971o74044n60751n59508o50894p91570r25053r97583
11695e080684r73713q45321o30876l66652r3880J53852L58820N20074O47652P54823
$$ plain form
11685 -5555905 -4702683 -3751897 -2703051 -1565239 -368600 831659 1963450 2955146 3754698
11676 3754698 4344086 4744637 5009889 5206363 5388200 5573495 5727236 5754147 5508028 4824422
11666 4824422 3573308 1712731 -682364 -3431714 -6296634 -9039424 -11468662 -13455963
11658 -13455963 -14929044 -15857134 -16240979 -16108702 -15513569 -14531854 -13260307 -11810173 -10294497
11649 -10294497 -8812071 -7437582 -6224376 -5214815 -4444828 -3933065 -3659192 -3549221 -3485886
11640 -3485886 -3346870 -3054144 -2609176 -2096306 -1652591 -1417065 -1480881 -1859478 -2496684 -3293389
11630 -3293389 -4142697 -4956579 -5678903 -6285372 -6772374 -7140860 -7386128 -7500612 -7485009 -7356535
11620 -7356535 -7149305 -6910953 -6699393 -6577092 -6598968 -6795923 -7160741 -7642097 -8150130 -8575868
$$ packed form
11685e555905Q53222R50786J048846J137812J196639J200259J131791R91696P99552
11676C754698N89388M00551K65252J96474J81837J85295J53741K6911k46119o83606
11666D824422j251114j860577k395095k749350k864920k742790k429238j987301
11658a3455963j473081r28090l83845J32277N95133R81715J271547J450134J515676
11649a0294497J482426J374489J213206J009561P69987N11763K73873J09971O3335
11640c485886J39016K92726M44968N12870M43715K35526o3816l78597o37206p96705
11630c293389q49308q13882p22324o06469m87002l68486k45268j14484J5603J28474
11620g356535K07230K38352K11560J22301k1876j96955l64818m81356n08033m25738
$$ plain form
11610 -8575868 -8822220 -8835666 -8623266 -8245769 -7789939 -7331674 -6903658 -6480429 -5989877 -5349617
11600 -5349617 -4512000 -3493947 -2375775 -1271873 -290751 497105 1074420 1475036 1767491
11591 1767491 2029166 2320715 2672456 3086460 3545622 4018855 4462778 4828836 5077762
11582 5077762 5190719 5167702 5018551 4760550 4427417 4079196 3798271 3666792 3735903 4006050
11572 4006050 4433053 4956518 5529617 6129582 6747528 7373605 7991865 8585088 9140469
11563 9140469 9648289 10091962 10435053 10617300 10569918 10246205 9648162 8830449 7879517 6880769
11553 6880769 5889335 4915070 3926394 2870205 1697424 382838 -1065312 -2604702 -4166167
11544 -4166167 -5668105 -7033069 -8199373 -9125446 -9790814 -10196763 -10365394 -10336475 -10165026
$$ packed form
11610h575868k46352j3446K12400L77497M55830M58265M28016M23229M90552O40260
11600e349617Q37617J018053J118172J103902R81122P87856N77315M00616K92455
11591A767491K61675K91549L51741M14004M59162M73233M43923L66058K48926
11582E077762J12957k3017j49151k58001l33133l48221k80925j31479O9111K70147
11572D006050M27003N23465N73099N99965O17946O26077O18260N93223N55381
11563I140469N07820M43673L43091J82247m7382l23713n98043q17713r50932r98748
11553F880769r91434r74265r88676j056189j172781j314586j448150j539390j561465
11544d166167j501938j364964j166304r26073o65368m05949j68631K8919J71449
$$ plain form
11535 -10165026 -9921434 -9690542 -9565420 -9636622 -9980770 -10649504 -11658067 -12977083 -14535616
11526 -14535616 -16239036 -17993499 -19722808 -21370532 -22893052 -24253593 -25420323 -26365174
11518 -26365174 -27063041 -27496966 -27671018 -27621313 -27412881 -27122237 -26819025 -26559331 -26391336
11509 -26391336 -26364628 -26534203 -26954337 -27662202 -28656648 -29882627 -31231263 -32559099 -33721299
11500 -33721299 -34607317 -35165040 -35403148 -35371195 -35127875 -34712969 -34135706 -33384342 -32451314
11491 -32451314 -31358743 -30166723 -28956781 -27799449 -26724847 -25711408 -24694510 -23584873
11483 -23584873 -22284640 -20699045 -18753279 -16421670 -13756873 -10891672 -7999153 -5231699
11475 -5231699 -2679314 -370953 1693144 3509152 5058533 6317833 7275939 7944856
$$ packed form
11535a0165026K43592K30892J25122p1202l44148o68734j008563j319016j558533
11526a4535616j703420j754463j729309j647724j522520j360541j166730r44851
11518b6365174o97867m33925j74052M9705K08432K90644L03212K59694J67995
11509b6391336K6708j69575m20134p07865r94446j225979j348636j327836j162200
11500c3721299q86018n57723k38108L1953K43320M14906N77263P51364R33028
11491c2451314J092571J192020J209942J157332J074602J013439J016898J109637
11483b3584873J300233J585595J945766K331609K664797K865201K892519K767454
11475e231699K552385K308361K064097J816008J549381J259300R58106O68917
$$ plain form
11467 7944856 8356699 8548447 8542450 8331614 7875310 7109768 5974381 4448274 2581411
11458 2581411 501743 -1608875 -3559765 -5197293 -6434090 -7254568 -7699968 -7842839 -7762141
11449 -7762141 -7526223 -7185339 -6772552 -6311712 -5829130 -5360919 -4947188 -4612464 -4343647
11440 -4343647 -4080905 -3728831 -3182365 -2354922 -1198495 287557 2056513 4018923 6050174
11431 6050174 8003052 9728223 11101203 12047496 12555113 12669560 12476512 12082653 11600529
11422 11600529 11134770 10765279 10530971 10425565 10413018 10455668 10536390 10659151 10828406 11023902
11412 11023902 11191222 11257127 11160459 10877940 10427958 9850579 9176063 8398835 7470237 6315127
11402 6315127 4865982 3096784 1036240 -1247613 -3679341 -6201298 -8776344 -11371263
$$ packed form
11467G944856M11843J91748n997k10836m56304p65542j135387j526107j866863
11458B581411k079668k110618j950890j637528j236797q20478m45400j42871Q0698
11449g762141K35918L40884M12787M60840M82582M68211M13731L34724K68817
11440d343647K62742L52074N46466Q27443J156427J486052J768956J962410K031251
11431F050174J952878J725171J372980R46293N07617J14447j93048l93859m82124
11422A1600529m65759l69491k34308j05406j2547M2650Q0722J22761J69255J95496
11412A1023902J67320O5905r6668k82519m49982n77379o74516p77228r28598j155110
11402F315127j449145j769198k060544k283853k431728k521957k575046k594919
$$ plain form
11394 -11371263 -13937970 -16408508 -18707024 -20769205 -22556327 -24056622 -25275024 -26218166
11386 -26218166 -26884055 -27263570 -27352958 -27167298 -26742917 -26124612 -25343073 -24391720 -23212119
11377 -23212119 -21697439 -19720471 -17181079 -14053505 -10410750 -6415551 -2284677 1756767
11369 1756767 5514862 8851301 11692457 14027090 15894089 17358229 18476905 19271531
11361 19271531 19719926 19773368 19385864 18538902 17253194 15587875 13630226 11478978 9226099
11352 9226099 6943925 4682795 2478796 366079 -1613075 -3403878 -4939826 -6148006
11344 -6148006 -6961026 -7337284 -7284696 -6876001 -6244649 -5558999 -4982494 -4632839 -4553938 -4711132
11334 -4711132 -5012684 -5349435 -5635530 -5831691 -5941156 -5983213 -5962482 -5854222 -5614097 -5203061
$$ packed form
11394a1371263k566707k470538k298516k062181j787122j500295j218402r43142
11386b6218166o65889l79515q9388J85660M24381O18305P81539R51353J179601
11377b3212119J514680J976968K539392L127574L642755L995199M130874M041444
11369A756767L758095L336439K841156K334633J866999J464140J118676P94626
11361A9271531M48395N3442l87504q46962j285708j665319j957649k151248k252879
11352I226099k282174k261130k203999k112717j979154j790803j535948j208180
11344f148006q13020l76258N2588M08695O31352O85650N76505L49655P8901j57194
11334d711132l01552l36751k86095j96161j09465m2057K0731J08260K40125M11036
$$ plain form
11324 -5203061 -4608849 -3852320 -2981085 -2059501 -1158386 -340750 356734 936651 1436275
11315 1436275 1905638 2381413 2869733 3340720 3731660 3959005 3940838 3623305 2995381 2080267
11305 2080267 908575 -506508 -2172257 -4093079 -6234713 -8498362 -10721122 -12704115
11297 -12704115 -14256832 -15241577 -15604006 -15381291 -14686873 -13678811 -12523191 -11362567 -10294658
11288 -10294658 -9362647 -8556705 -7825807 -7098425 -6308858 -5421563 -4442747 -3413498 -2391216
11279 -2391216 -1434275 -598801 57477 476633 613932 459175 55267 -496830 -1052866
11270 -1052866 -1457443 -1582413 -1356326 -774306 111450 1210462 2410355 3587168 4615397
11261 4615397 5383395 5810119 5852896 5503022 4777476 3716016 2382759 864537 -737638
$$ packed form
11324e203061N94212P56529Q71235R21584R01115Q17636O97484N79917M99624
11315A436275M69363M75775M88320M70987L90940K27345j8167l17533o27924r15114
11305B080267j171692j415083j665749j920822k141634k263649k222760j982993
11297a2704115j552717r84745l62429K22715O94418J008062J155620J160624J067909
11288a0294658R32011Q05942P30898P27382P89567Q87295R78816J029249J022282
11279b391216R56941Q35474O56278M19156J37299j54757m03908n52097n56036
11270a052866m04577j24970K26087N82020Q85756J099012J199893J176813J028229
11261D615397P67998M26724M2777l49874p25546j061460j333257j518222j602175
$$ plain form
11252 -737638 -2321236 -3795804 -5096411 -6193589 -7093303 -7823509 -8412678 -8871764 -9189083
11243 -9189083 -9339452 -9299956 -9060766 -8624057 -7994695 -7173294 -6159024 -4959601 -3599445
11234 -3599445 -2119465 -570152 993901 2512231 3913999 5122887 6076178 6744722
11226 6744722 7133570 7260228 7132501 6750530 6133200 5344354 4494631 3715490 3120411
11217 3120411 2772490 2672271 2770104 2994455 3277359 3561752 3792905 3910691 3855464 3583681
11207 3583681 3080373 2362348 1476641 499143 -469562 -1317592 -1944648 -2286146 -2327851 -2104919
11197 -2104919 -1687018 -1157896 -599194 -81295 346113 672575 950084 1300741 1889203
11188 1889203 2862265 4283575 6098169 8144232 10202645 12057995 13545650 14573328
$$ packed form
11252g37638j583598j474568j300607j097178q99714p30206n89169m59086l17319
11243i189083j50369L9496K39190M36709O29362Q21401J014270J199423J360156
11234c599445J479980J549313J564053J518330J401768J208888R53291O68544
11226F744722L88848J26658j27727l81971o17330p88846q49723p79141n95079
11217C120411l47921j00219R7833K24351K82904K84393K31153J17786n5227k71783
11207C583681n03308p18025q85707r77498r68705q48030o27056l41498m1705K22932
11197b104919M17901N29122N58702N17899M27408L26462K77509L50657N88462
11188A889203R73062J421310J814594K046063K058413J855350J487655J027678
$$ plain form
11180 14573328 15120470 15225456 14968160 14450368 13776577 13041444 12329126 11719896 11289712
11171 11289712 11092361 11131669 11346341 11625336 11849430 11934630 11853138 11626149 11301873 10935824
11161 10935824 10578858 10267210 10011267 9790666 9565822 9302318 8990204 8644147 8290869
11152 8290869 7963573 7713421 7626700 7826810 8450999 9610136 11350304 13633261 16343245
11143 16343245 19315115 22368995 25335453 28064323 30422816 32294170 33583537 34229284
11135 34229284 34213815 33570217 32384680 30794053 28974289 27114619 25378268 23860950
11127 23860950 22566065 21413514 20284908 19087225 17803121 16502281 15312429 14371483
11119 14371483 13785551 13603043 13802131 14289158 14911759 15488958 15850332 15868506 15472208
$$ packed form
11180A4573328N47142J04986k57296n17792o73791p35133p12318o09230m30184
11171A1289712j97351L9308K14672K78995K24094Q5200q1492k26989l24276l66049
11161A0935824l56966l11648k55943k20601k24844k63504l12114l46057l53278
11152H290869l27296k50152q6721K00110O24189J159137J740168K282957K709984
11143A6343245K971870L053880K966458K728870K358493J871354J289367O45747
11135C4229284j5469o43598j185537j590627j819764j859670j736351j517318
11127B3860950j294885j152551j128606j197683j284104j300840j189852r40946
11119A4371483n85932j82508J99088M87027O22601N77199L61374J8174l96298
$$ plain form
11110 15472208 14638968 13378497 11721773 9724106 7477760 5120930 2830977 797745
11102 797745 -818799 -1934804 -2573800 -2863068 -2988093 -3121791 -3362870 -3713729 -4104690
11093 -4104690 -4445247 -4671210 -4764629 -4743813 -4639427 -4476878 -4274149 -4048507 -3818934 -3597557
11083 -3597557 -3375491 -3115045 -2756372 -2236544 -1511736 -573684 543439 1766154 2994414
11074 2994414 4121149 5051614 5715209 6068786 6096608 5809979 5242180 4432886 3405482
11065 3405482 2151694 638035 -1164947 -3246692 -5536535 -7912067 -10229515 -12357194
11057 -12357194 -14195804 -15682120 -16783128 -17489800 -17815509 -17798039 -17499034 -16994458 -16356419
11048 -16356419 -15635579 -14854770 -14015896 -13112360 -12137977 -11090175 -9971851 -8796033 -7591518
$$ packed form
11110A5472208q33240j260471j656724j997667k246346k356830k289953k033232
11102G97745j616544j116005o38996k89268j25025j33698k41079l50859l90961
11093d104690l40557k25963r3419K0816J04386J62549K02729K25642K29573K21377
11083c597557K22066K60446L58673N19828P24808R38052J117123J222715J228260
11074B994414J126735R30465O63595L53577K7822k86629n67799q09294j027404
11065C405482j253788j513659j802982k081745k289843k375532k317448k127679
11057a2357194j838610j486316j101008p06672l25709J7470K99005N04576O38039
11048a6356419P20840P80809Q38874R03536R74383J047802J118324J175818J204515
$$ plain form
11039 -7591518 -6402146 -5273321 -4228272 -3246850 -2262443 -1183832 65622 1510411
11031 1510411 3107331 4762408 6373143 7873947 9260934 10585134 11920248 13321920
11023 13321920 14796860 16294663 17724554 18987474 20007891 20753343 21237998 21512125
11015 21512125 21641765 21685600 21678291 21627067 21521316 21348737 21109596 20822224 20516893 20221407
11005 20221407 19946808 19681106 19392866 19040186 18579036 17967976 17170953 16161581 14928963
10996 14928963 13480292 11836522 10025836 8084685 6069011 4065216 2186958 553640
10988 553640 -741568 -1661277 -2237833 -2561262 -2740966 -2858398 -2937704 -2950373 -2846147 -2588013
10978 -2588013 -2174114 -1643433 -1069730 -547303 -170680 -13307 -114407 -482153 -1113362
$$ packed form
11039g591518J189372J128825J045049R81422R84407J078611J249454J444789
11031A510411J596920J655077J610735J500804J386987J324200J335114J401672
11023A3321920J474940J497803J429891J262920J020417P45452M84655K74127
11015B1512125J29640M3835p309n1224j05751j72579k39141k87372l05331k95486
11005B0221407k74599k65702k88240l52680m61150o11060p97023j009372j232618
10996A4928963j448671j643770j810686j941151k015674k003795j878258j633318
10988E53640j295208r19709n76556l23429j79704j17432p9306j2669J04226K58134
10978b588013M13899N30681N73703N22427L76623J57373j01100l67746o31209
$$ plain form
10969 -1113362 -2019791 -3245184 -4859604 -6927909 -9464463 -12398493 -15573853 -18788066
10961 -18788066 -21849910 -24623485 -27040215 -29084448 -30770898 -32126884 -33181832 -33962896
10953 -33962896 -34496503 -34814236 -34958333 -34982939 -34951007 -34927325 -34965538 -35089127 -35275605 -35458479
10943 -35458479 -35551542 -35481051 -35203897 -34703657 -33977044 -33028505 -31877503 -30568095 -29168897
10934 -29168897 -27760877 -26419037 -25195967 -24112501 -23157045 -22292308 -21467343 -20632771 -19755873
10925 -19755873 -18829866 -17872768 -16917206 -15997960 -15142619 -14365061 -13659680 -12998147 -12333621
10916 -12333621 -11613884 -10798124 -9869690 -8841058 -7752474 -6666327 -5655909 -4786117 -4089126
10907 -4089126 -3545701 -3083527 -2595048 -1967174 -1112187 7828 1368418 2886527 4440216
$$ packed form
10969a113362r06429j225393j614420k068305k536554k934030l175360l214213
10961a8788066l061844k773575k416730k044233j686450j355986j054948p81064
10953c3962896n33607l17733j44097k4606L1932K3682l8213j23589j86478j82874
10943c5458479r3063P0491K77154N00240P26613R48539J151002J309408J399198
10934b9168897J408020J341840J223070J083466R55456Q64737Q24965Q34572Q76898
10925a9755873R26007R57098R55562R19246Q55341P77558P05381O61533O64526
10916a2333621P19737Q15760R28434J028632J088584J086147J010418Q69792O96991
10907d089126N43425M62174M88479O27874Q54987J120015J360590J518109J553689
$$ plain form
10898 4440216 5895903 7131949 8054029 8604904 8769679 8571804 8056938 7272430 6256014
10889 6256014 5039606 3661065 2172747 642652 -849125 -2216385 -3376558 -4265212
10881 -4265212 -4852106 -5152058 -5224580 -5160796 -5063175 -5027995 -5136660 -5451931 -6009998 -6806587
10871 -6806587 -7787082 -8852264 -9880214 -10753849 -11383339 -11720167 -11765054 -11571231 -11240679
10862 -11240679 -10908758 -10715392 -10768453 -11112550 -11717060 -12489355 -13308231 -14064450 -14692227
10853 -14692227 -15179218 -15553999 -15863815 -16158820 -16487775 -16896199 -17417005 -18055013 -18775114
10844 -18775114 -19500290 -20117395 -20486770 -20456466 -19884787 -18671203 -16789028 -14308400 -11397262
10835 -11397262 -8292051 -5240794 -2437566 21925 2141653 3987449 5638461 7157988
$$ packed form
10898D440216J455687J236046R22080N50875J64775j97875n14866p84508j016416
10889F256014j216408j378541j488318j530095j491777j367260j160173q88654
10881d265212n86894k99952p2522O3784R7621L5180j08665l15271n58067p96589
10871f806587r80495j065182j027950q73635o29490l36828m4887J93823L30552
10862a1240679L31921J93366n3061l44097o04510p72295q18876p56219o27777
10853a4692227m86991l74781l09816k95005l28955m08424n20806o38008p20101
10844a8775114p25176o17105l69375L0304N71679J213584J882175K480628K911138
10835a1397262L105211L051257K803228K459491K119728J845796J651012J519527
$$ plain form
10827 7157988 8592781 9987368 11394129 12869418 14458315 16176556 17997879 19851354
10819 19851354 21630031 23211171 24486522 25393716 25932439 26154242 26133991 25945166 25653288
10810 25653288 25321355 25012464 24784296 24680956 24726812 24921471 25235556 25610922 25967993
10801 25967993 26218438 26279969 26090915 25620834 24871829 23869690 22652433 21265557 19764814
10792 19764814 18217557 16694103 15250280 13911533 12669669 11496106 10366378 9284628
10784 9284628 8296274 7481623 6931229 6711698 6835128 7244783 7824243 8428339 8924074
10775 8924074 9223833 9297263 9161463 8861941 8458591 8020997 7626083 7348930 7245475 7335762
10765 7335762 7598864 7983767 8430648 8891931 9344034 9785448 10222243 10648604 11034361
$$ packed form
10827G157988J434793J394587J406761J475289J588897J718241J821323J853475
10819A9851354J778677J581140J275351R07194N38723K21803k0251j88825k91878
10810B5653288l31933l08891k28168j03340M5856J94659L14085L75366L57071
10801B5967993K50445O1531j89054m70081p49005j002139j217257j386876j500743
10792A9764814j547257j523454j443823j338747j241864j173563j129728j081750
10784I284628r88354q14651n50394k19531J23430M09655N79460O04096M95735
10775H924074K99759P3430j35800k99522m03350m37594l94914k77153j03455R0287
10765G335762K63102L84903M46881M61283M52103M41414M36795M26361L85757
$$ plain form
10756 11034361 11327618 11469318 11408905 11114438 10580171 9836111 8955781 8051596 7251597
10747 7251597 6663497 6341367 6269628 6368951 6516958 6572740 6399847 5888409 4975424 3657299
10737 3657299 1990271 81880 -1919969 -3838459 -5482987 -6670906 -7256069 -7161570 -6408960
10728 -6408960 -5129555 -3544628 -1914437 -472663 629770 1352079 1754585 1960477 2108141
10719 2108141 2315306 2663951 3199820 3936454 4860054 5935819 7113591 8328593 9498486
10710 9498486 10524948 11305974 11754860 11815227 11466791 10727309 9657763 8366487 6997958
10701 6997958 5699308 4578421 3679455 2990615 2475571 2106326 1880156 1816544 1939933
10692 1939933 2258021 2746148 3346770 3986718 4604694 5173830 5706416 6239985 6815769
$$ packed form
10756A1034361K93257J41700o0413k94467n34267p44060q80330r04185p99999
10747G251597n88100l22130p1739R9323J48007N5782j72893n11438r12985j318125
10737C657299j667028j908391k001849j918490j644528j187919n85163R4499P52610
10728f408960J279405J584927J630191J441774J102433P22309M02506K05892J47664
10719B108141K07165L48645N35869P36634R23600J075765J177772J215002J169893
10710I498486J026462P81026M48886O0367l48436p39482j069546j291276j368529
10701F997958j298650j120887q98966o88840n15044l69245k26170o3612J23389
10692A939933L18088M88127O00622O39948O17976N69136N32586N33569N75784
$$ plain form
10683 6815769 7461986 8187118 8981870 9827859 10710172 11626439 12583105 13577447 14576753
10674 14576753 15511540 16291811 16840260 17124649 17170743 17047657 16832368 16570113 16247873
10665 16247873 15792196 15093271 14045663 12586913 10717077 8495506 6023513 3422669
10657 3422669 813402 -1702356 -4048850 -6172493 -8031053 -9582257 -10774521 -11544578
10649 -11544578 -11832558 -11619143 -10967907 -10040090 -9061730 -8257262 -7787748 -7724821 -8062446
10640 -8062446 -8745233 -9691494 -10805796 -11989436 -13154885 -14238222 -15199068 -16007744 -16632553
10631 -16632553 -17040476 -17211165 -17151806 -16900929 -16519628 -16076649 -15633537 -15232416 -14888930
10622 -14888930 -14595211 -14334845 -14102251 -13912208 -13791464 -13759619 -13815526 -13938956 -14102631 -14282241
$$ packed form
10683F815769O46217P25132P94752Q45989Q82313R16267R56666R94342R99306
10674A4576753R34787P80271N48449K84389M6094j23086k15289k62255l22240
10665A6247873m55677o98925j047608j458750j869836k221571k471993k600844
10657C422669k609267k515758k346494k123643j858560j551204j192264p70057
10649a1544578k87980K13415O51236R27817R78360Q04468M69514O2927l37625
10640h062446o82787r46261j114302j183640j165449j083337r60846q08676o24809
10631a6632553m07923j70689N9359K50877L81301M42979M43112M01121L43486
10622a4888930K93719K60366K32594J90043J20744L1845n5907j23430j63675j79610
$$ plain form
10612 -14282241 -14456846 -14600719 -14671409 -14598467 -14278833 -13587679 -12409765 -10683879 -8440980
10603 -8440980 -5816884 -3032926 -352216 1973900 3754932 4894103 5396661 5350622 4885083
10594 4885083 4120878 3134185 1949592 563773 -1016701 -2746654 -4537926 -6278849
10586 -6278849 -7864223 -9218556 -10301872 -11100603 -11615703 -11857027 -11842083 -11592708 -11129676
10577 -11129676 -10471372 -9638332 -8657035 -7555962 -6355631 -5062359 -3675452 -2209000
10569 -2209000 -717073 695616 1887894 2714228 3057841 2854501 2107365 893563 -642623
10560 -642623 -2312422 -3913145 -5255640 -6186493 -6609964 -6509495 -5958654 -5110193 -4161456
10551 -4161456 -3305570 -2682202 -2340233 -2222549 -2181902 -2029768 -1602947 -815731 330639
$$ packed form
10612a4282241j74605j43873p0690P2942L19634O91154J177914J725886K242899
10603h440980K624096K783958K680710K326116J781032J139171N02558m6039m65539
10594D885083p64205r86693j184593j385819j580474j729953j791272j740923
10586f278849j585374j354333j083316p98731n15100k41324J4944K49375M63032
10577a1129676O58304Q33040R81297J101073J200331J293272J386907J466452
10569b209000J491927J412689J192278Q26334L43613k03340p47136j213802j536186
10560f42623j669799j600723j342495r30853m23471J00469N50841Q48461R48737
10551d161456Q55886O23368L41969J17684M0647J52134M26821P87216J146370
$$ plain form
10542 330639 1780539 3467934 5337971 7336748 9387542 11380901 13193449 14726973
10534 14726973 15942177 16864642 17562001 18110880 18572788 18985325 19364928 19714564 20029632
10525 20029632 20298982 20506691 20643238 20722625 20788724 20901125 21112324 21456136 21952080 22613468
10515 22613468 23447608 24449374 25598632 26871484 28265998 29829518 31668853 33936073
10507 33936073 36801027 40426896 44955458 50500936 57151800 64979537 74049842 84433321
10499 84433321 96217124 109515875 124475284 141267287 160080739 181096893 204418165
10492 204418165 229925704 257074684 284671130 310720162 332503625 347048118 351956867
10485 351956867 346261783 330805460 307908871 280546356 251515405 222955664 196248025
$$ packed form
10542C30639J449900J687395J870037J998777K050794J993359J812548J533524
10534A4726973J215204R22465O97359N48879M61908M12537L79603L49636L15068
10525B0029632K69350K07709J36547P9387O6099J12401K11199L43812M95944O61388
10515B2613468Q34140J001766J149258J272852J394514J563520J839335K267220
10507C3936073K864954L625869M528562N545478O650864P827737R070305J0383479
10499H4433321J1783803J3298751J4959409J6792003J8813452K1016154K3321272
10492B04418165K5507539K7148980K7596446K6049032K1783463J4544493M908749
10485C51956867n695084j5456323k2896589k7362515k9030951k8559741k6707639
$$ plain form
10478 196248025 172128616 150864566 132422255 116602503 103129887 91700370 82005706
10471 82005706 73750769 66671685 60557185 55267710 50738773 46959505 43932511 41630848
10463 41630848 39966844 38783035 37869795 37002253 35977955 34639683 32882577 30654400
10455 30654400 27956128 24844250 21431848 17881805 14386227 11135507 8290857 5972608
10447 5972608 4264622 3225696 2897736 3303268 4430097 6210240 8507649 11125179
10439 11125179 13829618 16386928 18600920 20348475 21600724 22420518 22935611 23297063
10431 23297063 23637001 24039586 24534244 25109845 25738003 26391774 27053040 27708765 28339402
10422 28339402 28906568 29350832 29605971 29622425 29383507 28903766 28213249 27339463 26296368
$$ packed form
10478A96248025k4119409k1264050j8442311j5819752j3472616j1429517r694664
10471H2005706q254937p079084o114500n289475m528937l779268l026994k301663
10463D1630848j664004j183809r13240q67542j024298j338272j757106k228177
10455C0654400k698272l111878l412402l550043l495578l250720k844650k318249
10447E972608j707986j038926l27960M05532J126829J780143K297409K617530
10439A1125179K704439K557310K213992J747555J252249Q19794N15093L61452
10431B3297063L39938M02585M94658N75601O28158O53771O61266O55725O30637
10422B8339402N67166M44264K55139J6454k38918m79741o90517q73786j043095
$$ plain form
10413 26296368 25084072 23700039 22159979 20519650 18881403 17372363 16099067 15103145
10405 15103145 14343579 13710402 13054373 12217842 11065910 9520664 7589584 5371632 3035245
10396 3035245 780036 -1200579 -2746876 -3750215 -4161543 -3991162 -3301818 -2199909 -828498
10387 -828498 639502 2014423 3114717 3801392 4009441 3759250 3138268 2260292 1224861
10378 1224861 98913 -1074830 -2258686 -3410535 -4491452 -5483030 -6403074 -7311409 -8298962
10369 -8298962 -9456403 -10831385 -12397714 -14057687 -15677477 -17134627 -18354366 -19323292
10361 -19323292 -20079766 -20685498 -21188387 -21592915 -21852774 -21887906 -21614069 -20969608 -19931212
10352 -19931212 -18518966 -16793645 -14847136 -12786357 -10714405 -8717117 -6863169 -5218297
$$ packed form
10413B6296368j212296j384033j540060j640329j638247j509040j273296r95922
10405A5103145p59566o33177o56029q36531j151932j545246j931080k217952k336387
10396C035245k255209j980615j546297j003339m11328J70381O89344J101909J371411
10387h28498J468000J374921J100294O86675K08049k50191o20982q77976j035431
10378A224861j125948j173743j183856j151849j080917r91578r20044r08335r87553
10369h298962j157441j374982j566329j659973j619790j457150j219739r68926
10361a9323292p56474o05732n02889m04528k59859l5132K73837O44461J038396
10352a9931212J412246J725321J946509K060779K071952J997288J853948J644872
$$ plain form
10344 -5218297 -3863076 -2898221 -2428752 -2533661 -3236916 -4491674 -6180620 -8132912 -10158710
10335 -10158710 -12094218 -13836342 -15345082 -16612534 -17621952 -18324859 -18646987 -18513788
10327 -18513788 -17878256 -16737093 -15130577 -13132299 -10841084 -8382237 -5912184 -3612714
10319 -3612714 -1666957 -222789 641503 935127 749713 233655 -445162 -1136653 -1735353
10310 -1735353 -2190656 -2500703 -2695845 -2818893 -2906568 -2974745 -3011574 -2982845 -2848499 -2581915
10300 -2581915 -2182963 -1682090 -1138472 -635003 -269278 -137703 -312745 -819690 -1623983
10291 -1623983 -2637075 -3738161 -4801012 -5716146 -6404626 -6822619 -6956564 -6812868 -6410232
10282 -6410232 -5778918 -4962427 -4014785 -2994053 -1958702 -969971 -95807 590359 1019606
$$ packed form
10344e218297J355221R64855M69469j04909p03255j254758j688946j952292k025798
10335a0158710j935508j742124j508740j267452j009418p02907l22128J33199
10327a8513788O35532J141163J606516J998278K291215K458847K470053K299470
10319c612714J945757J444168Q64292K93624j85414n16058o78817o91491n98700
10310a735353m55303l10047j95142j23048q7675o8177l6829K8729J34346K66584
10300b581915L98952N00873N43618N03469L65725J31575j75042n06945q04293
10291a623983j013092j101086j062851r15134o88480m17993j33945J43696M02636
10282f410232O31314Q16491R47642J020732J035351R88731Q74164O86166M29247
$$ plain form
10273 1019606 1144706 957369 495151 -168139 -943363 -1744910 -2497834 -3134693 -3590670
10264 -3590670 -3803370 -3717169 -3288010 -2486103 -1297837 270506 2187410 4391513 6788620
10255 6788620 9250148 11617092 13717134 15395518 16547060 17132643 17175029 16742236 15928599
10246 15928599 14837245 13564240 12186544 10757167 9308626 7861634 6432546 5033424
10238 5033424 3665525 2315854 966371 -385927 -1710814 -2939633 -3974265 -4704478
10230 -4704478 -5027976 -4870022 -4201885 -3058470 -1552110 127317 1736689 3026845 3795794
10221 3795794 3927333 3404117 2295751 729416 -1144715 -3179370 -5239920 -7202367
10213 -7202367 -8949705 -10372287 -11372420 -11873652 -11835128 -11264985 -10221275 -8795457 -7088613
$$ packed form
10273A019606J25100j87337m62218o63290p75224q01547p52924o36859m55977
10264c590670k12700Q6201M29159Q01907J188266J568343J916904K204103K397107
10255F788620K461528K366944K100042J678384J151542N85583M2386m32793q13637
10246A5928599j091354j273005j377696j429377j448541j446992j429088j399122
10238E033424j367899j349671j349483j352298j324887j228819j034632p30213
10230d704478l23498J57954O68137J143415J506360J679427J609372J290156P68949
10221C795794J31539n23216j108366j566335j874131k034655k060550j962447
10213g202367j747338j422582j000133n01232L8524N70143J043710J425818J706844
$$ plain form
10204 -7088613 -5197519 -3217558 -1252178 587909 2202548 3527651 4551930 5313567
10196 5313567 5876830 6298587 6600714 6763216 6741230 6492450 5994837 5245349 4248136 3006895
10186 3006895 1527977 -169542 -2044727 -4033410 -6058612 -8050209 -9963269 -11782410
10178 -11782410 -13507992 -15131537 -16613667 -17876495 -18816819 -19337330 -19381853 -18955595 -18120236
10169 -18120236 -16971642 -15618344 -14171689 -12742108 -11428843 -10300199 -9376632 -8632193
10161 -8632193 -8017839 -7494741 -7060384 -6755364 -6647663 -6799352 -7228046 -7880196 -8630709
10152 -8630709 -9312166 -9762074 -9866977 -9584376 -8936997 -7989987 -6827978 -5541561 -4220226
10143 -4220226 -2943651 -1768564 -717323 222200 1080940 1882949 2622742 3256658 3710321
$$ packed form
10204g088613J891094J979961J965380J840087J614639J325103J024279P61637
10196E313567N63263M21757L02127J62502k1986k48780m97613p49488r97213j241241
10186C006895j478918j697519j875185j988683k025202j991597j913060j819141
10178a1782410j725582j623545j482130j262828r40324n20511m4523M26258Q35359
10169a8120236J148594J353298J446655J429581J313265J128644R23567P44439
10161h632193O14354N23098M34357L05020J07701j51689m28694o52150p50513
10152h630709o81457m49908j04903K82601O47379R47010J162009J286417J321335
10143d220226J276575J175087J051241R39523Q58740Q02009P39793O33916M53663
$$ plain form
10134 3710321 3897498 3744778 3216213 2329344 1154703 -200092 -1611602 -2958348 -4134444
10125 -4134444 -5060886 -5692394 -6016909 -6050862 -5836405 -5441126 -4953763 -4470906 -4078164 -3835959
10115 -3835959 -3778982 -3929755 -4316233 -4979141 -5961891 -7288504 -8942497 -10857974 -12928054
10106 -12928054 -15028512 -17046035 -18895806 -20519833 -21872624 -22909416 -23586304 -23870074
10098 -23870074 -23750230 -23246957 -22411568 -21319377 -20059590 -18727794 -17421896 -16237601
10090 -16237601 -15260783 -14557763 -14165577 -14084474 -14277128 -14678505 -15212880 -15807600 -16396636
10081 -16396636 -16917618 -17311581 -17530341 -17548519 -17371766 -17032147 -16568322 -16000749 -15319929
10072 -15319929 -14497850 -13515044 -12385330 -11165056 -9944924 -8830630 -7922332 -7302696 -7036377
$$ packed form
10134C710321J87177j52720n28565q86869j174641j354795j411510j346746j176096
10125d134444r26442o31508l24515l3953K14457L95279M87363M82857L92742K42205
10115c835959N6977j50773l86478o62908r82750j326613j653993j915477k070080
10106a2928054k100458k017523j849771j624027j352791j036792o76888k83770
10098b3870074J19844N03273Q35389J092191J259787J331796J305898J184295
10090a6237601R76818P03020L92186Q1103j92654m01377n34375n94720n89036
10081a6396636n20982l93963k18760j8178J76753L39619M63825N67573O80820
10072a5319929Q22079R82806J129714J220274J220132J114294R08298O19636K66319
$$ plain form
10063 -7036377 -7173308 -7744860 -8750542 -10144008 -11829124 -13670187 -15513409 -17213459
10055 -17213459 -18658330 -19787341 -20599997 -21154452 -21552832 -21912495 -22330979 -22860043 -23500378
10046 -23500378 -24215542 -24955093 -25678552 -26375348 -27073605 -27829409 -28697840 -29702171 -30821150
10037 -30821150 -32000236 -33174795 -34288541 -35299817 -36179669 -36909939 -37486793 -37928490 -38279600
10028 -38279600 -38603427 -38962812 -39400375 -39930422 -40544419 -41221101 -41930915 -42631432 -43258228
10019 -43258228 -43720454 -43909941 -43725377 -43102355 -42035249 -40582657 -38857222 -37003912 -35170053
10010 -35170053 -33472689 -31973684 -30672837 -29521665 -28451341 -27403534 -26353625 -25321099
10002 -25321099 -24368659 -23594559 -23119536 -23065818 -23527930 -24542184 -26067042 -27985293 -30130998
$$ packed form
10063g036377j36931n71552j005682j393466j685116j841063j843222j700050
10055a7213459j444871j129011q12656n54455l98380l59663m18484n29064o40335
10046b3500378p15164p39551p23459o96796o98257p55804q68431j004331j118979
10037c0821150j179086j174559j113746j011276q79852p30270n76854m41697l51110
10028c8279600l23827l59385m37563n30047o13997o76682p09814p00517o26796
10019d3258228m62226j89487J84564O23022J067106J452592J725435J853310J833859
10010c5170053J697364J499005J300847J151172J070324J047807J049909J032526
10002b5321099R52440P74100M75023N3718m62112j014254j524858j918251k145705
$$ plain form
9993 -30130998 -32331025 -34440244 -36353671 -37999199 -39330771 -40334477 -41038208 -41508159
9985 -41508159 -41830973 -42095848 -42385960 -42773156 -43306509 -43996943 -44810213 -45677668 -46522593
9976 -46522593 -47289015 -47956685 -48533276 -49029645 -49435450 -49710994 -49798966 -49647687 -49232861 -48567826
9966 -48567826 -47700391 -46703241 -45667591 -44702079 -43927918 -43460305 -43378550 -43701212 -44382454
9957 -44382454 -45331165 -46439260 -47603828 -48737811 -49772997 -50659521 -51362969 -51860468 -52138907
9948 -52138907 -52195630 -52037468 -51675164 -51115933 -50358422 -49390946 -48193931 -46751915 -45078098
9939 -45078098 -43241276 -41375008 -39656738 -38264774 -37334242 -36930772 -37048701 -37629324 -38588624
9930 -38588624 -39843689 -41331041 -43014811 -44885947 -46955974 -49249032 -51792484 -54603297
$$ packed form
9993c0130998k200027k109219j913427j645528j331572j003706p03731m69951
9985d1508159l22814k64875k90112l87196n33353o90434q13270q67455q44925
9976d6522593p66422o67670n76591m96369m05805k75544q7972J51279M14826O65035
9966d8567826Q67435R97150J035650R65512P74161M67613Q1755l22662o81242
9957d4382454r48711j108095j164568j133983j035186q86524p03448m97499k78439
9948e2138907n6723J58162L62304N59231P57511R67476J197015J442016J673817
9939d5078098J836822J866268J718270J391964R30532M03470j17929n80623r59300
9930c8588624j255065j487352j683770j871136k070027k293058k543452k810813
$$ plain form
9922 -54603297 -57671631 -60951549 -64368951 -67844686 -71319171 -74765476 -78186226 -81596494
9914 -81596494 -85000159 -88372125 -91657099 -94784318 -97688149 -100326178 -102691405 -104813369
9906 -104813369 -106740257 -108499112 -110038292 -111158881 -111448705 -110248482 -106685435 -99792395
9898 -99792395 -88709901 -72958341 -52733166 -29098144 -3907872 20605883 42427827
9891 42427827 60233794 73535010 82514743 87741423 89924999 89774132 87936030 84984330
9883 84984330 81423683 77685437 74106405 70904547 68170781 65884007 63943122 62204340
9875 62204340 60513311 58729076 56746752 54525637 52115582 49663742 47390779 45542246
9867 45542246 44329859 43877858 44189503 45145346 46531575 48082318 49520645 50596874 51129712
$$ packed form
9922e4603297l068334l279918l417402l475735l474485l446305l420750l410268
9914h1596494l403665l371966l284974l127219k903831k638029k365227k121964
9906a04813369j926888j758855j539180j120589k89824J200223L563047O893040
9898i9792395J1082494J5751560K0225175K3635022K5190272K4513755K1821944
9891D2427827J7805967J3301216Q979733N226680K183576j50867j838102k951700
9883H4984330l560647l738246l579032l201858k733766k286774j940885j738782
9875F2204340j691029j784235j982324k221115k410055k451840k272963j848533
9867D5542246j212387m52001L11645R55843J386229J550743J438327J076229N32838
$$ plain form
9858 51129712 51045959 50401284 49365104 48169001 47038735 46140076 45559684 45318596 45396155
9849 45396155 45742902 46278854 46889550 47433899 47768081 47777707 47402274 46637425 45514317 44072900
9839 44072900 42350199 40390113 38262408 36073038 33956957 32056387 30493633 29349089
9831 29349089 28653375 28395883 28541846 29044601 29845782 30869154 32021152 33205063 34342576
9822 34342576 35389101 36334182 37189466 37973911 38704101 39390000 40030094 40601244 41047925
9813 41047925 41283951 41215914 40781518 39982292 38892244 37638576 36364348 35188142 34174939
9804 34174939 33327617 32599209 31915984 31198418 30373099 29375581 28146990 26629379 24769010
9795 24769010 22536146 19958110 17147059 14300948 11670473 9504822 7999795 7267952
$$ packed form
9858E1129712q3753o44675j036180j196103j130266q98659n80392k41088P7559
9849D5396155L46747N35952O10696N44349L34182R626l75433p64849j123108j441417
9839D4072900j722701j960086k127705k189370k116081j900570j562754j144544
9831B9349089o95714k57492J45963N02755Q01181J023372J151998J183911J137513
9822C4342576J046525R45081Q55284P84445P30190O85899O40094N71150M46681
9813D1047925K36026o8037m34396p99226j090048j253668j274228j176206j013203
9804C4174939q47322p28408o83225p17566q25319r97518j228591j517611j860369
9795B4769010k232864k578036k811051k846111k630475k165651j505027p31843
$$ plain form
9787 7267952 7336647 8164846 9662884 11705105 14138253 16795186 19517013 22174627 24677286
9778 24677286 26965885 29001441 30761416 32245907 33483293 34523113 35414298 36180487
9770 36180487 36808936 37261329 37499311 37507142 37296771 36895177 36327548 35611467 34765929 33825632
9760 33825632 32846864 31898304 31040829 30306501 29686117 29129562 28557623 27880161 27014645
9751 27014645 25900900 24510540 22850835 20963081 18917436 16808878 14757597 12909206
9743 12909206 11422957 10440777 10046053 10233540 10907586 11908929 13056509 14188414 15191328
9734 15191328 16013904 16664916 17200710 17705857 18267864 18948022 19758021 20655828 21565436
9725 21565436 22409208 23134039 23719787 24171439 24504143 24730232 24853358 24869083 24766239 24523729
$$ packed form
9787G267952O8695Q28199J498038K042221K433148K656933K721827K657614K502659
9778B4677286K288599K035556J759975J484491J237386J039820Q91185P66189
9770C6180487O28449M52393K37982P831k10371m01594n67629p16081q45538r40297
9760C3825632r78768r48560q57475p34328o20384n56555n71939o77462q65516
9751B7014645j113745j390360j659705j887754k045645k108558k051281j848391
9743A2909206j486249r82180l94724J87487O74046J001343J147580J131905J002914
9734A5191328Q22576O51012N35794N05147N62007O80158Q09999Q97807R09608
9725B1565436Q43772P24831N85748M51652L32704K26089J23126J5725j02844k42510
$$ plain form
9715 24523729 24104813 23458212 22533366 21305914 19799958 18094594 16311263 14587168 13044170
9706 13044170 11763635 10776069 10068191 9600979 9328004 9208775 9219759 9365077 9680216
9697 9680216 10219386 11028199 12117741 13456254 14979539 16607461 18254548 19832769 21250921
9688 21250921 22414214 23225543 23590928 23432165 22706340 21425976 19670158 17578699 15328141
9679 15328141 13096654 11029648 9216720 7685545 6413374 5351761 4453296 3684863
9671 3684863 3018496 2407764 1771293 1002136 3862 -1264411 -2758678 -4353210 -5875228
9662 -5875228 -7152305 -8048536 -8477695 -8400544 -7820954 -6786930 -5391157 -3764434 -2061895
9653 -2061895 -444975 940667 1991929 2674540 3036485 3196190 3302953 3482188 3789059
$$ packed form
9715B4523729m18916o46601r24846j227452j505956j705364j783331j724095j542998
9706A3044170j280535r87566p07878m67212k72975j19229J0984J45318L15139
9697I680216N39170Q08813J089542J338513J523285J627922J647087J578221J418152
9688B1250921J163293Q11329L65385j58763p25825j280364j755818k091459k250558
9679A5328141k231487k067006j812928j531175j272171j061613q98465p68433
9671C684863o66367o10732o36471p69157r98274j268273j494267j594532j522018
9662e875228j277077q96231m29159P7151N79590J034024J395773J626723J702539
9653b061895J616920J385642J051262O82611L61945J59705J06763J79235L06871
$$ plain form
9644 3789059 4191938 4591541 4862766 4898366 4639580 4090010 3315370 2431917 1585199 922506
9634 922506 566908 603991 1087839 2059561 3559564 5617407 8221373 11287480 14648771
9625 14648771 18072077 21295412 24073285 26217220 27620777 28263362 28195101 27511074 26323112
9616 26323112 24734316 22820458 20623969 18165078 15468008 12590383 9638366 6754450
9608 6754450 4079228 1704237 -360537 -2187754 -3900458 -5618898 -7408196 -9250199
9600 -9250199 -11053343 -12694903 -14071905 -15134216 -15888386 -16380009 -16670661 -16820429 -16878494
9591 -16878494 -16880415 -16850659 -16808363 -16772253 -16761035 -16789702 -16865909 -16989355 -17151807 -17333208 -17494089
9580 -17494089 -17572010 -17490279 -17178825 -16597231 -15748193 -14676395 -13455950 -12173186 -10911030
$$ packed form
9644C789059M02879L99603K71225L5600k58786n49570p74640q83453q46718o62693
9634I22506l55598L7083M83848R71722J500003K057843K603966L066107L361291
9625A4648771L423306L223335K777873K143935J403557O42585o8261o84027j187962
9616B6323112j588796j913858k196489k458891k697070k877625k952017k883916
9608F754450k675222k374991k064774j827217j712704j718440j789298j842003
9600i250199j803144j641560j377002j062311p54170m91623k90652j49768n8065
9591a6878494j921K9756M2296L6110J1218k8667p6207j23446j62452j81401j60881
9580a7494089p7921Q1731L11454N81594Q49038J071798J220445J282764J262156
$$ plain form
9571 -10911030 -9738987 -8709878 -7861386 -7218745 -6795861 -6594063 -6598741 -6774694 -7062935
9562 -7062935 -7383388 -7646203 -7769044 -7693480 -7395068 -6886540 -6215842 -5458525 -4701740 -4020464
9552 -4020464 -3453134 -2986715 -2556745 -2061198 -1384270 -426082 868111 2489851 4370082
9543 4370082 6402157 8473815 10493761 12404387 14179794 15812859 17297881 18617466
9535 18617466 19740825 20634294 21277426 21675210 21859477 21877311 21769735 21549425 21189041
9526 21189041 20627287 19789089 18607702 17038366 15063595 12698139 9998639 7072387
9518 7072387 4073590 1181528 -1431998 -3631023 -5329211 -6489888 -7119952 -7263143 -6992135
9509 -6992135 -6397030 -5571416 -4600950 -3558759 -2507729 -1505704 -608122 135410 689017
$$ packed form
9571a0911030J172043J029109Q48492O42641M22884K01798m678j75953k88241
9562g062935l20453k62815j22841P5564K98412N08528O70698P57317P56785O81276
9552d020464N67330M66419M29970M95547O76928R58188J294193J621740J880231
9543D370082K032075K071658K019946J910626J775407J633065J485022J319585
9535A8617466J123359Q93469O43132L97784J84267J7834j07576k20310l60384
9526B1189041n61754q38198j181387j569336j974771k365456k699500k926252
9518G072387k998797k892062k613526k199025j698188j160677o30064j43191K71008
9509f992135N95105Q25614R70466J042191J051030J002025Q97582P43532N53607
$$ plain form
9500 689017 1036408 1178885 1127596 899361 522810 50609 -433866 -823321 -1005114 -883236
9490 -883236 -394528 487137 1758526 3398042 5368497 7608157 10019244 12467339 14796989
9481 14796989 16857890 18531600 19750377 20502753 20824662 20780824 20445326 19888568 19171986
9472 19171986 18348368 17465368 16569768 15708360 14921554 14230699 13626561 13067427 12489414
9463 12489414 11824545 11020780 10061428 8981309 7872136 6867601 6107877 5697368 5675206
9454 5675206 6009878 6616538 7387545 8224534 9060469 9864064 10627350 11345414 11999188 12547814
9444 12547814 12932075 13087281 12961725 12534614 11826854 10900220 9844726 8759442 7735393
9435 7735393 6847279 6153505 5698000 5507937 5587353 5911163 6423952 7044913 7676848 8215859
$$ packed form
9500F89017L47391J42477n1289k28235l76551m72201m84475l89455j81793J21878
9490h83236M88708Q81665J271389J639516J970455K239660K411087K448095K329650
9481A4796989K060901J673710J218777P52376L21909m3838l35498n56758p16582
9472A9171986q23618q83000q95600q61408p86806o90855o04138n59134n78013
9463A2489414o64869q03765r59352j080119j109173j004535p59724m10509k2162
9454E675206L34672O06660P71007Q36989Q35935Q03595P63286P18064O53774N48626
9444A2547814L84261J55206j25556m27111p07760r26634j055494j085284j024049
9435G735393q88114o93774m55505j90063P9416L23810N12789O20961O31935N39011
$$ plain form
9425 8215859 8560157 8620318 8334348 7686352 6720594 5540085 4284160 3090471 2057354
9416 2057354 1224340 577599 70468 -357985 -774811 -1250714 -1855355 -2648892 -3672889
9407 -3672889 -4942345 -6439370 -8111014 -9874261 -11627131 -13260953 -14669332 -15752868
9399 -15752868 -16422539 -16607082 -16267200 -15410485 -14093948 -12407245 -10445768 -8290743 -6004703
9390 -6004703 -3638169 -1241230 1122984 3368908 5393626 7099554 8421094 9335963
9382 9335963 9855512 10005454 9810848 9289749 8453629 7313708 5891719 4228521 2382417
9373 2382417 417448 -1608079 -3643686 -5642545 -7563333 -9384886 -11124419 -12839550
9365 -12839550 -14601130 -16444669 -18327668 -20122462 -21654880 -22770333 -23391805 -23541043
$$ packed form
9425H215859L44298O0161k85970o47996r65758j180509j255925j193689j033117
9416B057354q33014o46741n07131m28453m16826m75903o04641p93537j023997
9407c672889j269456j497025j671644j763247j752870j633822j408379j083536
9399a5752868o69671j84543L39882Q56715J316537J686703J961477K155025K286040
9390f004703K366534K396939K364214K245924K024718J705928J321540R14869
9382I335963N19549J49942j94606n21099q36120j139921j421989j663198j846104
9373B382417j964969k025527k035607j998859j920788j821553j739533j715131
9365a2839550j761580j843539j882999j794794j532418j115453o21472j49238
$$ plain form
9357 -23541043 -23318211 -22857726 -22285565 -21696085 -21152200 -20699706 -20380433 -20232358 -20274972 -20488321
9347 -20488321 -20799411 -21087920 -21213933 -21055686 -20536107 -19624809 -18323661 -16657350 -14680031
9338 -14680031 -12486213 -10205078 -7972681 -5898878 -4051542 -2464562 -1155192 -130126
9330 -130126 626552 1170920 1602834 2047587 2624444 3417425 4457552 5716876 7111614
9321 7111614 8513931 9774209 10754373 11366383 11601307 11532251 11286398 11001474 10792044
9312 10792044 10740262 10904175 11325161 12022795 12980521 14134206 15374253 16565075 17578279
9303 17578279 18328523 18796929 19031060 19123612 19184286 19319371 19621181 20158473 20961242 22005562
9293 22005562 23211804 24463301 25638223 26638557 27404175 27912110 28170317 28214042 28104482
$$ packed form
9357b3541043K22832M60485N72161N89480N43885M52494L19273J48075m2614k13349
9347b0488321l11090k88509j26013J58247N19579R11298J301148J666311J977319
9338a4680031K193818K281135K232397K073803J847336J586980J309370J025066
9330a30126P56678N44368M31914M44753N76857P92981J040127J259324J394738
9321G111614J402317J260278R80164O12010K34924o9056k45853k84924k09430
9312A0792044n1782J63913M20986O97634R57726J153685J240047J190822J013204
9303A7578279P50244M68406K34131R2552O0674J35085L01810N37292Q02769J044320
9293B2005562J206242J251497J174922J000334P65618N07935K58207M3725j09560
$$ plain form
9284 28104482 27923051 27756290 27674105 27710106 27852780 28050764 28228804 28307612 28221801 27932378
9274 27932378 27430358 26727746 25837125 24750863 23435667 21849623 19972792 17833160 15514297
9265 15514297 13143084 10865371 8819915 7117777 5828934 4974397 4523092 4395622 4477301
9256 4477301 4639417 4764196 4767542 4613799 4318790 3941643 3569626 3299268 3213750 3358375
9246 3358375 3723122 4243898 4824694 5368803 5802201 6079485 6174609 6066414 5730167 5141825
9236 5141825 4292987 3206746 1943668 593704 -742146 -1972554 -3032124 -3890063 -4551844
9227 -4551844 -5055661 -5463392 -5843602 -6247094 -6683171 -7109385 -7441971 -7581994 -7444357 -6979242
9217 -6979242 -6183657 -5104684 -3833662 -2488229 -1183520 -2047 1023767 1906998 2680741
$$ packed form
9284B8104482j81431j66761q2185L6001J42674J97984J78040P8808q5811k89423
9274B7932378n02020p02612q90621j086262j315196j586044j876831k139632k318863
9265A5514297k371213k277713k045456j702138j288843q54537m51305j27470Q1679
9256D477301J62116J24779L346j53743k95009l77147l72017k70358q5518J44625
9246C358375L64747N20776N80796N44109M33398K77284R5124j08195l36247n88342
9236E141825q48838j086241j263078j349964j335850j230408j059570q57939o61781
9227d551844n03817m07731l80210m03492m36077m26214l32586j40023J37637M65115
9217f979242P95585J078973J271022J345433J304709J181473J025814Q83231P73743
$$ plain form
9208 2680741 3363377 3931654 4315904 4421158 4164041 3507489 2478404 1163814 -309451
9199 -309451 -1802989 -3194704 -4399522 -5378329 -6134221 -6699522 -7119152 -7435422 -7677633
9190 -7677633 -7858801 -7980260 -8041011 -8044591 -7997527 -7902028 -7753350 -7548844 -7302770 -7052766
9180 -7052766 -6851024 -6748086 -6782558 -6980701 -7357533 -7910662 -8608695 -9385414 -10148699 -10802163
9170 -10802163 -11268739 -11505943 -11509705 -11309175 -10955007 -10501672 -9985743 -9406560 -8718860 -7844654
9160 -7844654 -6703935 -5252830 -3509803 -1552993 512431 2598397 4663782 6715329
9152 6715329 8783516 10887824 13005545 15054995 16901776 18390406 19390013 19831175 19714445
9143 19714445 19089791 18024845 16583349 14822967 12805891 10608419 8319267 6026138
$$ packed form
9208B680741O82636N68277L84250J05254k57117o56552j029085j314590j473265
9199c09451j493538j391715j204818r78807p55892n65301m19630l16270k42211
9190g677633j81168j21459o0751l580M7064R5499J48678K04506K46074K50004
9180g052766K01742J02938l4472j98143l76832n53129o98033p76719p63285o53464
9170a0802163m66576k37204l762K00530L54168M53335N15929N79183O87700Q74206
9160g844654J140719J451105J743027J956810K065424K085966K065385K051547
9152F715329K068187K104308K117721K049450J846781J488630R99607M41162j16730
9143A9714445o24654j064946j441496j760382k017076k197472k289152k293129
$$ plain form
9135 6026138 3798856 1679821 -313038 -2175144 -3905600 -5504484 -6973107 -8309077
9127 -8309077 -9494901 -10490235 -11240399 -11702241 -11872292 -11796891 -11555363 -11226102 -10856487 -10453389
9117 -10453389 -9996256 -9460532 -8835344 -8126871 -7350381 -6519894 -5642263 -4717099 -3740915
9108 -3740915 -2713095 -1640410 -536980 580043 1694799 2793321 3861373 4882716
9100 4882716 5838220 6703417 7444496 8017183 8373171 8473517 8303161 7879158 7248087 6474176
9090 6474176 5626188 4772095 3982706 3335293 2907550 2763175 2940308 3451075 4288529 5431076
9080 5431076 6840325 8457836 10208713 12014337 13809356 15554319 17237102 18863560
9072 18863560 20446120 21999688 23544003 25101404 26682488 28267279 29798146 31192562
$$ packed form
9135F026138k227282k119035j992859j862106j730456j598884j468623j335970
9127h309077j185824r95334p50164m61842j70051P5401K41528L29261L69615M03098
9117a0453389M57133N35724O25188P08473P76490Q30487Q77631R25164R76184
9108c740915J027820J072685J103430J117023J114756J098522J068052J021343
9100D882716R55504Q65197P41079N72687L55988J00346j70356m24003o31071p73911
9090F474176q47988q54093p89389o47413m27743j44375J77133N10767Q37454J142547
9080E431076J409249J617511J750877J805624J795019J744963J682783J626458
9072A8863560J582560J553568J544315J557401J581084J584791J530867J394416
$$ plain form
9064 31192562 32368640 33270296 33883127 34237128 34395061 34430239 34404517 34358150 34314143 34288767
9054 34288767 34296788 34345674 34422754 34486812 34475141 34326067 34003196 33505322 32858673 32102341
9044 32102341 31278913 30432360 29607569 28846401 28179202 27614504 27133519 26696983 26264426
9035 26264426 25813851 25346774 24875942 24408839 23942502 23473075 23011058 22590547 22265977
9026 22265977 22096209 22121243 22341592 22710757 23144918 23545115 23823270 23924374 23838022 23593011
9016 23593011 23235364 22802724 22313998 21782063 21238004 20747032 20405075 20318991 20579870 21238745
9006 21238745 22292619 23685046 25317871 27065534 28787285 30340666 31600001 32475180
8998 32475180 32920333 32927391 32510627 31694130 30510599 29010997 27276622 25422696 23586885
$$ packed form
9064C1192562J176078R01656O12831L54001J57933L5178k5722m6367m4007k5376
9054C4288767Q021M8886P7080O4058j1671j49074l22871m97874o46649p56332
9044C2102341q23428q46553q24791p61168o67199n64698m80985m36536m32557
9035B6264426m50575m67077m70832m67103m66337m69427m62017m20511l24570
9026B2265977j69768K5034K20349L69165M34161M00197K78155J01104q6352k45011
9016B3593011l57647m32640m88726n31935n44059m90972l41957q6084K60879O58875
9006B1238745J053874J392427J632825J747663J721751J553381J259335Q75179
8998C2475180M45153P058m16764q16497j183531j499602j734375j853926j835811
$$ plain form
8989 23586885 21904659 20480473 19365562 18550254 17972881 17541180 17157727 16741227 16239812
8980 16239812 15636338 14945839 14203753 13445352 12683211 11894313 11024635 10008065 8788535
8971 8788535 7336654 5659498 3803944 1849728 -110841 -1999384 -3768869 -5402790
8963 -5402790 -6902108 -8273744 -9528156 -10682720 -11763282 -12799426 -13814352 -14813996
8955 -14813996 -15780788 -16675532 -17448211 -18056233 -18484425 -18755225 -18917479 -19015275 -19056222 -19002637
8945 -19002637 -18792534 -18375144 -17737922 -16911482 -15953556 -14922836 -13855951 -12757397 -11604686
8936 -11604686 -10364112 -9010605 -7546481 -6013850 -4493414 -3084516 -1870721 -886682
8928 -886682 -104803 549604 1162707 1795135 2461265 3131796 3755140 4286047 4707939 5038876
$$ packed form
8989B3586885j682226j424186j114911q15308n77373m31701l83453m16500n01415
8980A6239812o03474o90499p42086p58401p62141p88898q69678j016570j219530
8971H788535j451881j677156j855554j954216j960569j888543j769485j633921
8963e402790j499318j371636j254412j154564j080562j036144j014926r99644
8955a4813996r66792q94744p72679o08022m28192k70800j62254r7796m0947N3585
8945a9002637K10103M17390O37222Q26440R57926J030720J066885J098554J152711
8936a1604686J240574J353507J464124J532631J520436J408898J213795R84039
8928h86682P81879O54407O13103O32428O66130O70531O23344N30907M21892L30937
$$ plain form
8918 5038876 5319551 5590824 5872005 6149031 6378307 6508047 6511035 6412537 6294999 6273011
8908 6273011 6449564 6874523 7524038 8310050 9116187 9843474 10443036 10920673 11315656 11669922
8898 11669922 12004368 12309818 12550954 12677754 12639389 12397639 11938423 11279516 10470669 9582463
8888 9582463 8685287 7827386 7023183 6256162 5490282 4681330 3786980 2780546 1668656
8879 1668656 502747 -626893 -1614360 -2366573 -2823969 -2967942 -2816627 -2413866 -1817040
8870 -1817040 -1087666 -284864 540213 1348370 2112092 2811226 3428800 3949435 4357122 4627935
8860 4627935 4719476 4566293 4091621 3237974 2006062 481302 -1170315 -2739179 -4026279
8851 -4026279 -4892523 -5286448 -5243445 -4859892 -4255896 -3545102 -2822989 -2171210 -1667203 -1390098
$$ packed form
8918E038876K80675K71273K81181K77026K29276J29740K988r8498j17538k1988
8908F273011J76553M24959O49515P86012Q06137P27287N99562M77637L94983L54266
8898A1669922L34446L05450K41136J26800l8365k41750m59216o58907q08847q88206
8888I582463q97176q57901q04203p67021p65880q08952q94350j006434j111890
8879A668656j165909j129640r87467p52213m57396j43973J51315M02761N96826
8870a817040P29374Q02802Q25077Q08157P63722O99134O17574N20635M07687K70813
8860D627935R1541j53183m74672q53647j231912j524760j651617j568864j287100
8851d026279q66244l93925M3003L83553O03996P10794P22113O51779N04007K77105
$$ plain form
8841 -1390098 -1417710 -1811818 -2594842 -3730482 -5122723 -6635403 -8120106 -9438448 -10475195
8832 -10475195 -11146769 -11408097 -11255330 -10720693 -9859713 -8735957 -7410193 -5937648 -4371061
8823 -4371061 -2763526 -1167033 372205 1817208 3139391 4315056 5324892 6160802
8815 6160802 6835942 7385798 7851503 8252346 8567854 8745443 8730226 8496823 8062966 7477992
8805 7477992 6794209 6036775 5187078 4188112 2970276 1486093 -262865 -2219473 -4286016
8796 -4286016 -6350338 -8310045 -10086759 -11628481 -12901774 -13878985 -14529204 -14819537 -14724334
8787 -14724334 -14233202 -13352552 -12104703 -10530643 -8695516 -6690030 -4623251 -2607930
8779 -2607930 -742203 907283 2313690 3482899 4431825 5163778 5656960 5875171 5795918
$$ packed form
8841a390098k7612l94108p83024j135640j392241j512680j484703j318342j036747
8832a0475195o71574k61328J52767N34637Q60980J123756J325764J472545J566587
8823d371061J607535J596493J539238J445003J322183J175665J009836Q35910
8815F160802O75140N49856M65705M00843L15508J77589j5217k33403m33857n84974
8805G477992o83783p57434q49697r98966j217836j484183j748958j956608k066543
8796d286016k064322j959707j776714j541722j273293r77211o50219k90333R5203
8787a4724334M91132Q80650J247849J574060J835127K005486K066779K015321
8779b607930J865727J649486J406407J169209R48926P31953M93182K18211p9253
$$ plain form
8770 5795918 5439099 4877258 4219322 3577575 3038134 2648785 2422321 2345124 2384918 2497279
8760 2497279 2629263 2717088 2682083 2437271 1911315 1078604 -25693 -1317055 -2692002
8751 -2692002 -4060205 -5364087 -6580205 -7705074 -8735232 -9653292 -10425830 -11010745 -11369321
8742 -11369321 -11480337 -11352641 -11029153 -10577527 -10071817 -9575664 -9134102 -8773530 -8505346
8733 -8505346 -8328684 -8229087 -8173343 -8105518 -7950092 -7623210 -7048103 -6171315 -4978623 -3507658
8723 -3507658 -1850058 -136902 1491045 2917495 4074225 4943731 5542485 5897783 6032591
8714 6032591 5962923 5702864 5271823 4702741 4049618 3389129 2812299 2408549 2248202 2367760
8704 2367760 2760127 3372797 4116890 4885906 5578002 6114018 6446175 6557118 6453739 6161636
$$ packed form
8770E795918l56819n61841o57936o41747n39441l89349k26464p7197L9794J12361
8760B497279J31984Q7825l5005k44812n25956q32711j104297j291362j374947
8751b692002j368203j303882j216118j124869j030158r18060p72538n84915l58576
8742a1369321j11016J27696L23488M51626N05710M96153M41562L60572K68184
8733h505346J76662R9597N5744O7825J55426L26882N75107Q76788J192692J470965
8723c507658J657600J713156J627947J426450J156730Q69506N98754L55298J34808
8714F032591o9668k60059m31041n69082o53123o60489n76830m03750j60347J19558
8704B367760L92367O12670P44093P69016O92096N36016L32157J10943j03379k92103
$$ plain form
8694 6161636 5722475 5191462 4630959 4100202 3645142 3292957 3053360 2925557 2907058 2999914
8684 2999914 3211340 3547481 4001063 4537801 5091401 5575545 5909939 6046441 5981960 5754381
8674 5754381 5424097 5044562 4630229 4139512 3489487 2599993 1442268 62834 -1429424
8665 -1429424 -2901946 -4239220 -5365438 -6244480 -6868581 -7250588 -7424572 -7447871 -7396631
8656 -7396631 -7353519 -7390250 -7547459 -7816769 -8134641 -8396141 -8485997 -8313786 -7839094 -7080168
8646 -7080168 -6107869 -5031083 -3979774 -3089393 -2487009 -2278046 -2533851 -3281848 -4499841
8637 -4499841 -6115385 -8011639 -10041698 -12051398 -13906507 -15516546 -16846113 -17907422
8629 -17907422 -18736445 -19367065 -19821991 -20126517 -20328948 -20503188 -20726655 -21052108 -21495409
$$ packed form
8694F161636m39161n31013n60503n30757m55060l52185k39597j27803j8499R2856
8684B999914K11426L36141M53582N36738N53600M84144L34394J36502o4481k27579
8674E754381l30284l79535m14333m90717o50025q89494j157725j379434j492258
8665a429424j472522j337274j126218q79042o24101l82007j73984k3299N1240
8656g396631M3112l6731j57209k69310l17872k61500q9856J72211M74692P58926
8646g080168R72299J076786J051309Q90381O02384K08963k55805p47997j217993
8637d499841j615544j896254k030059k009700j855109j610039j329567j061309
8629a7907422q29023o30620m54926l04526k02431j74240k23467l25453m43301
$$ plain form
8620 -21495409 -22040401 -22645517 -23245380 -23758401 -24110119 -24262504 -24228308 -24060619 -23825149 -23568334
8610 -23568334 -23290844 -22934842 -22393526 -21544756 -20297893 -18634190 -16621371 -14392500 -12095701
8601 -12095701 -9838567 -7656108 -5516743 -3357919 -1129191 1177956 3524312 5838972
8593 5838972 8042969 10063880 11837343 13307074 14433848 15206495 15637937 15742216 15509964
8584 15509964 14904676 13885618 12442545 10619649 8514518 6254379 3965331 1751391
8576 1751391 -310485 -2164927 -3770513 -5093663 -6105218 -6782663 -7121148 -7149950 -6943011
8567 -6943011 -6611936 -6280327 -6051730 -5987362 -6100662 -6363371 -6715883 -7082265 -7394061 -7618876
8557 -7618876 -7779051 -7946878 -8215551 -8657371 -9285013 -10030743 -10754637 -11283008 -11463226 -11210920
$$ packed form
8620b1495409n44992o05116n99863n13021l51718j52385L4196J67689K35470K56815
8610b3568334K77490L56002N41316Q48770J246863J663703K012819K228871K296799
8601a2095701K257134K182459K139365K158824K228728K307147K346356K314660
8593E838972K203997K020911J773463J469731J126774P72647M31442J04279k32252
8584A5509964o05288j019058j443073j822896k105131k260139k289048k213940
8576A751391k061876j854442j605586j323150j011555o77445l38485k8802K06939
8567f943011L31075L31609K28597O4368j13300k62709l52512l66382l11796k24815
8557g618876j60175j67827k68673m41820o27642p45730p23894n28371j80218K52306
$$ plain form
8547 -11210920 -10530020 -9502032 -8255949 -6934828 -5670366 -4568844 -3705442 -3121430 -2820438
8538 -2820438 -2764681 -2875937 -3045936 -3156461 -3104627 -2826030 -2308489 -1591238 -749572 128692
8528 128692 965425 1706826 2329216 2835142 3237594 3535230 3692108 3638131 3293978 2607883
8518 2607883 1587093 313653 -1059884 -2336991 -3321296 -3862036 -3881649 -3379242 -2419023
8509 -2419023 -1113858 395617 1969244 3497343 4919402 6223244 7428702 8566176
8501 8566176 9657893 10705308 11685581 12559620 13288825 13850148 14238580 14456073 14496871
8492 14496871 14339595 13946746 13266309 12235524 10794548 8913783 6624639 4035382 1321107
8483 1321107 -1308253 -3648749 -5538944 -6882969 -7655650 -7891827 -7668290 -7088224 -6272587
$$ packed form
8547a1210920O80900J027988J246083J321121J264462J101522Q63402N84012L00992
8538b820438N5757j11256j69999j10525N1834K78597N17541P17251Q41666Q78264
8528A28692Q36733P41401O22390N05926M02452K97636J56878n3977l44153o86095
8518B607883j020790j273440j373537j277107r84305n40740j9613N02407R60219
8509b419023J305165J509475J573627J528099J422059J303842J205458J137474
8501H566176J091717J047415R80273Q74039P29205N61323L88432K17493M0798
8492A4496871j57276l92849o80437j030785j440976j880765k289144k589257k714275
8483A321107k629360k340496j890195j344025p72681k36177K23537N80066Q15637
$$ plain form
8474 -6272587 -5355232 -4474562 -3756915 -3293965 -3123923 -3227475 -3541889 -3985812 -4483101 -4979734
8464 -4979734 -5455310 -5930125 -6461610 -7122165 -7961641 -8973069 -10082959 -11171355 -12105972
8455 -12105972 -12769378 -13071983 -12959976 -12428390 -11536698 -10414188 -9245474 -8237777 -7579605
8446 -7579605 -7402126 -7752877 -8588605 -9788119 -11178269 -12561978 -13741003 -14534320 -14797744
8437 -14797744 -14446645 -13475307 -11962624 -10058768 -7956763 -5858599 -3945308 -2357735
8429 -2357735 -1191324 -501973 -313243 -615604 -1359136 -2451934 -3774261 -5204039 -6638214
8420 -6638214 -7998003 -9219725 -10242857 -11006467 -11456938 -11561971 -11323003 -10781171 -10016191
8411 -10016191 -9138614 -8273903 -7537059 -7001644 -6673366 -6480376 -6288346 -5940056 -5308004
$$ packed form
8474f272587R17355Q80670P17647M62950J70042j03552l14414m43923m97289m96633
8464d979734m75576m74815n31485o60555q39476j011428j109890j088396r34617
8455a2105972o63406l02605J12007N31586Q91692J122510J168714J007697O58172
8446g579605J77479l50751q35728j199514j390150j383709j179025p93317k63424
8437a4797744L51099R71338J512683J903856K102005K098164J913291J587573
8429b357735J166411O89351J88730l02361p43532j092798j322327j429778j434175
8420f638214j359789j221722j023132p63610m50471j05033K38968N41832P64980
8411a0016191Q77577Q64711P36844N35415L28278J92990J92030L48290O32052
$$ plain form
8402 -5308004 -4339007 -3070087 -1610224 -103044 1306267 2487847 3334066 3769313 3766476
8393 3766476 3361599 2655126 1794947 945549 253391 -179907 -308063 -132782 315321 997599
8383 997599 1881028 2938660 4136185 5412899 6673514 7803382 8701476 9308550 9611597
8374 9611597 9627591 9386026 8924703 8296245 7574084 6851476 6233901 5826349 5716067 5953931
8364 5953931 6541325 7428963 8529144 9737197 10954105 12102122 13129567 14007693 14726223
8355 14726223 15291256 15723569 16052914 16306274 16492673 16590855 16547678 16292541 15765028 14943082
8345 14943082 13855607 12572335 11180175 9765208 8412490 7216697 6283788 5710709
8337 5710709 5551063 5789212 6340399 7076384 7861722 8584033 9169331 9582588 9819562 9897020
$$ packed form
8402e308004R68997J268920J459863J507180J409311J181580Q46219M35247k837
8393C766476m04877p06473q60179q49398o92158m33298j28156J75281M48103O82278
8383I97599Q83429J057632J197525J276714J260615J129868Q98094O07074L03047
8374I611597J5994k41565m61323o28458p22161p22608o17575m07552j10282K37864
8364E953931N87394Q87638J100181J208053J216908J148017J027445Q78126P18530
8355A4726223N65033M32313L29345K53360J86399R8182m3177k55137n27513q21946
8345A4943082j087475j283272j392160j414967j352718j195793r32909n73079
8337E710709j59646K38149N51187P35985P85338P22311N85298M13257K36974P7458
$$ plain form
8327 9897020 9845237 9701490 9501276 9266735 8996516 8662806 8217462 7603742 6768330 5672411
8317 5672411 4305423 2703247 963269 -758158 -2273922 -3410217 -4043471 -4112400 -3607838
8308 -3607838 -2559528 -1035768 847596 2928061 5021413 6963401 8644414 10018514
8300 10018514 11088765 11886250 12458428 12869870 13208217 13585781 14129653 14958826 16155107
8291 16155107 17741704 19681471 21894662 24282684 26741993 29163136 31423588 33387315
8283 33387315 34916490 35890769 36226618 35892606 34918366 33392568 31444907 29214843 26820392
8274 26820392 24342685 21832903 19334926 16909176 14643526 12644262 11010515 9804540
8266 9804540 9031945 8639088 8525606 8565852 8633846 8627130 8482939 8179729 7723117 7125032
$$ packed form
8327I897020n1783j43747k00214k34541k70219l33710m45344o13720q35412j095919
8317E672411j366988j602176j739978j721427j515764j136295o33254o8929N04562
8308c607838J048310J523760J883364K080465K093352J941988J681013J374100
8300A0018514J070251P97485N72178M11442L38347L77564N43872Q29173J196281
8291A6155107J586597J939767K213191K388022K459309K421143K260452J963727
8283C3387315J529175R74279L35849l34012r74240j525798j947661k230064k394451
8274B6820392k477707k509782k497977k425750k265650j999264j633747j205975
8266I804540p72595l92857j13482M0246O7994o716j44191l03210m56612n98085
$$ plain form
8256 7125032 6389660 5514122 4499735 3362241 2132963 852493 -435882 -1688944 -2864565
8247 -2864565 -3924456 -4838319 -5585868 -6154456 -6533576 -6708928 -6657656 -6345403 -5727065 -4754202
8237 -4754202 -3389816 -1626218 501777 2914527 5497358 8119406 10655646 13004367
8229 13004367 15092518 16867434 18283165 19294398 19864694 19983749 19682141 19035766 18159315
8220 18159315 17191299 16272610 15521497 15011195 14758478 14728264 14852531 15055539 15275255 15472823
8210 15472823 15626904 15716979 15706899 15541851 15164153 14540178 13682999 12659618 11581683
8201 11581683 10584558 9799522 9324385 9200815 9406882 9866877 10472676 11108273 11671582
8192 11671582 12090138 12328987 12391442 12315324 12165770 12022781 11963177 12043190 12291570 12717099
$$ packed form
8256G125032p35372q75538j014387j137494j229278j280470j288375j253062j175621
8247b864565j059891r13863p47549n68588l79120j75352N1272L12253O18338R72863
8237d754202J364386J763598K127995K412750K582831K622048K536240K348721
8229A3004367K088151J774916J415731J011233N70296J19055l01608o46375q76451
8220A8159315r68016r18689p51113n10302k52717l0214J24267K03008K19716J97568
8210A5472823J54081R0075j0080j65048l77698o23975q57179j023381j077935
8201A1581683r97125p85036m75137j23570K06067M59995O05799O35597N63309
8192A1671582M18556K38849O2455p6118j49554j42989n9604Q0013K48380M25529
$$ plain form
8182 12717099 13323099 14115808 15099418 16262384 17567032 18951430 20342182 21667890 22862750
8173 22862750 23857871 24568468 24889972 24712454 23952043 22586580 20677359 18364445 15837435
8164 15837435 13296841 10924147 8870167 7259400 6200373 5789683 6100337 7153972
8156 7153972 8890022 11152688 13709001 16292092 18650237 20585100 21974545 22782287
8148 22782287 23055573 22910763 22509616 22031850 21648873 21501835 21686685 22248144 23181813
8139 23181813 24441826 25951597 27614648 29320825 30945565 32348034 33379473 33906809
8131 33906809 33842114 33160647 31897303 30126845 27943932 25456087 22788669 20086956 17500115
8122 17500115 15148394 13093889 11337525 9846077 8590065 7565687 6786250 6249852
$$ packed form
8182A2717099O06000P92709R83610J162966J304648J384398J390752J325708J194860
8173B2862750R95121P10597L21504j77518p60411j365463j909221k312914k527010
8164A5837435k540594k372694k053980j610767j059027m10690L10654J053635
8156G153972J736050K262666K556313K583091K358145J934863J389445Q07742
8148B2782287K73286j44810m01147m77766l82977j47038J84850N61459R33669
8139B3181813J260013J509771J663051J706177J624740J402469J031439N27336
8131C3906809o4695o81467j263344j770458k182913k487845k667418k701713k586841
8122A7500115k351721k054505j756364j491448j256012j024378p79437n36398
$$ plain form
8114 6249852 5905904 5644829 5321773 4804569 4022016 2990119 1808227 631976 -363167
8105 -363167 -1016120 -1206036 -868359 -1828 1331400 3009773 4859966 6672192 8228176
8096 8228176 9338484 9874695 9781801 9070774 7805062 6092529 4080749 1946613 -122280
8087 -122280 -1948192 -3378770 -4295783 -4619457 -4312158 -3384567 -1902925 10079 2187439
8078 2187439 4439713 6576144 8421069 9833037 10731531 11119335 11079151 10737413 10214282
8069 10214282 9590685 8910618 8211797 7559687 7059221 6833865 6983072 7542068 8464193
8060 8464193 9630263 10875665 12022371 12907293 13403151 13430705 12962787 12021723 10671964
8051 10671964 9009401 7149038 5212854 3319090 1572394 52624 -1198950 -2191987
$$ packed form
8114F249852l43948k61075l23056n17204p82553j031897j181892j176251r95143
8105c63167o52953j89916L37677Q66531J333228J678373J850193J812226J555984
8096H228176J110308N36211r2894p11027j265712j712533k011780k134136k068893
8087a22280j825912j430578r17013l23674L07299R27591J481642J913004K177360
8078B187439K252274K136431J844925J411968Q98494L87804m0184l41738n23131
8069A0214282o23597o80067o98821o52110n00466k25356J49207N58996R22125
8060H464193J166070J245402J146706Q84922M95858K7554m67918r41064j349759
8051A0671964j662563j860363j936184j893764j746696j519770j251574r93037
$$ plain form
8043 -2191987 -2987457 -3675815 -4334688 -4984668 -5567973 -5962619 -6023960 -5632819 -4732207 -3345426
8033 -3345426 -1576866 400803 2370762 4105929 5408638 6147110 6276475 5835759 4922446
8024 4922446 3656717 2151734 501841 -1210119 -2896783 -4457278 -5785404 -6791746
8016 -6791746 -7426055 -7687315 -7619561 -7300773 -6832130 -6327522 -5897614 -5625786 -5542851 -5614363
8006 -5614363 -5750565 -5836069 -5764452 -5462338 -4898233 -4082987 -3070078 -1954423 -859293
7997 -859293 95535 835561 1361156 1745655 2101126 2530031 3086768 3763920 4503528 5223674
7987 5223674 5848289 6330564 6662904 6868925 6979104 7002214 6911463 6657076 6197803 5529203
7977 5529203 4690933 3753547 2798616 1903696 1133398 533632 130299 -63600 -34641 239634
$$ packed form
8043b191987p95470o88358o58873o49980n83305l94646o1341L91141R00612J386781
8033c345426J768560J977669J969959J735167J302709P38472J29365m40716r13313
8024D922446j265729j504983j649893j711960j686664j560495j328126j006342
8016f791746o34309k61260O7754L18788M68643N04608M29908K71828Q2935p1512
8006e614363j36202q5504P1617L02114N64105Q15246J012909J115655J095130
7997h59293R54828P40026N25595L84499L55471M28905N56737O77152P39608P20146
7987E223674O24615M82275L32340K06021J10179K3110r0751k54387m59273o68600
7977E529203q38270r37386r54931q94920p70298n99766m03333j93899K8959K74275
$$ plain form
7967 239634 784231 1607433 2683905 3954599 5344388 6784837 8227477 9641312 10998786
7958 10998786 12260678 13369443 14253973 14842137 15077379 14938785 14460929 13739853 12910071
7949 12910071 12095653 11361945 10697922 10037539 9304182 8453964 7498787 6498620 5525405
7940 5525405 4619021 3765284 2911951 2009907 1049912 74184 -836456 -1586387 -2088043 -2279545
7930 -2279545 -2137238 -1682289 -977585 -112090 823395 1758098 2650717 3485313 4260365 4978621
7920 4978621 5642129 6254350 6828708 7398284 8017808 8751975 9652310 10732189 11951169
7911 11951169 13215436 14393815 15342948 15933526 16071689 15711847 14859299 13565048 11919809
$$ packed form
7967B39634N44597Q23202J076472J270694J389789J440449J442640J413835J357474
7958A0998786J261892J108765Q84530N88164K35242j38594m77856p21076q29782
7949A2910071q14418p33708o64023o60383p33357q50218r55177j000167r73215
7940E525405r06384q53737q53333r02044r59995r75728r10640p49931n01656j91502
7930b279545J42307M54949P04704Q65495R35485R34703Q92619Q34596P75052P18256
7920D978621O63508O12221N74358N69576O19524P34167R00335J079879J218980
7911A1951169J264267J178379R49133N90578J38163l59842q52548j294251j645239
$$ [...]
##END NTUPLES=NMR SPECTRUM
##END=
