##TITLE=31Pdec_LR-777-R2-B2-KM1
 CDCl3_CD3OD
  24 sc
 9.1.2024
##JCAMPDX= 6.0         $$ Bruker NMR JCAMP-DX V2.0
##DATA TYPE= NMR SPECTRUM
##DATA CLASS= NTUPLES
##ORIGIN= UXNMR, Bruker Analytische Messtechnik GmbH
##OWNER= root
$$ XWIN-NMR		Version 3.5
$$ Tue Jan  9 14:24:51 2024 Russian Standard Time (UT+4h)  she@DPX200
##.OBSERVE FREQUENCY= 81.013821
##.OBSERVE NUCLEUS= ^31P
##.ACQUISITION MODE= SIMULTANEOUS
##.ACQUISITION SCHEME= undefined
##.AVERAGES= 24
##.DIGITISER RES= 16
##SPECTROMETER/DATA SYSTEM= spect
##.PULSE SEQUENCE= zgpg30
##.SOLVENT NAME= CD2Cl2
##.SHIFT REFERENCE= (INTERNAL, CD2Cl2, 0, 248.564)
##AUDIT TRAIL= $$ (NUMBER, WHEN, WHO, WHERE, WHAT)
$$ ##TITLE= Audit trail, XWIN-NMR		Version 3.5
$$ ##JCAMPDX= 5.01
$$ ##ORIGIN= Bruker BioSpin GmbH
$$ ##OWNER= she
$$ F:/spectra/data/she/nmr/P31/1/pdata/1/auditp.txt
$$ ##AUDIT TRAIL=  $$ (NUMBER, WHEN, WHO, WHERE, WHAT)
(   1,<2024-01-09 14:23:25.01 +0400>,<she>,<DPX200>,
      <created by zg, POWCHK disabled, PULCHK disabled
       configuration hash MD5:
       00 E9 B6 7A A2 85 ED C7 34 08 36 98 17 FE 4E 26
       data hash MD5: 32K
       18 B8 3F 4C EF 45 E5 D5 7D B8 A7 B3 A9 3D B3 0A>)
(   2,<2024-01-09 14:23:55.59 +0400>,<she>,<DPX200>,
      <Start of raw data processing
       efp BC_mod = 2 LB = 10 FT_mod = 6 PKNL = 1 PHC0 = -12334.56 PHC1 = 478.2938 SI = 64K 
       data hash MD5: 64K
       47 9E 70 22 BA 12 FD AC C6 04 5C F6 FA 2D 4B FA>)
(   3,<2024-01-09 14:24:20.15 +0400>,<she>,<DPX200>,
      <pk PHC0 = 88.04758 PHC1 = -168 
       data hash MD5: 64K
       34 C8 21 A5 C0 E8 76 2C 17 E8 E6 20 DC 90 3C D2>)
(   4,<2024-01-09 14:24:23.57 +0400>,<she>,<DPX200>,
      <abs ABSG = 5 
       data hash MD5: 64K
       72 B6 8C 75 32 28 09 2D A1 29 C2 A4 A2 21 75 05>)
$$ ##END=
$$ 
$$ hash MD5
$$ 3B 00 E0 A5 53 FE 90 D8 20 1F E5 6E D6 B7 5B C4
##$RELAX= 
##$RELAX= 
##$RELAX= 
##$RELAX= 
##$RELAX= 
##$RELAX= 
##$RELAX= 
##$RELAX= 
##$RELAX= 
$$ Bruker specific parameters
$$ --------------------------
##$DU= <F:/spectra>
##$EXPNO= 1
##$NAME= <P31>
##$PROCNO= 1
##$TYPE= <nmr>
##$USER= <she>
##$AMP= (0..31)
100 100 100 100 100 100 100 100 100 100 100 100 100 100 100 100 100 100 
100 100 100 100 100 100 100 100 100 100 100 100 100 100 
##$AQSEQ= 0
##$AQ_mod= 1
##$AUNM= <au_zg>
##$AUTOPOS= <>
##$BF1= 81.014009
##$BF2= 200.13
##$BF3= 200.13
##$BF4= 200.13
##$BF5= 200.13
##$BF6= 200.13
##$BF7= 200.13
##$BF8= 200.13
##$BYTORDA= 1
##$CFDGTYP= 0
##$CFRGTYP= 5
##$CHEMSTR= <none>
##$CNST= (0..31)
1 1 145 1 1 1 1 1 1 1 1 1 1 1 1 1 1 1 1 1 1 1 1 1 1 1 1 1 1 1 1 1 
##$CPDPRG= <waltz16>
##$CPDPRG1= <>
##$CPDPRG2= <waltz16>
##$CPDPRG3= <>
##$CPDPRG4= <mlev>
##$CPDPRG5= <mlev>
##$CPDPRG6= <mlev>
##$CPDPRG7= <mlev>
##$CPDPRG8= <mlev>
##$CPDPRGB= <>
##$CPDPRGT= <>
##$D= (0..31)
0 1 0 0 0 0 0 0 0 0 0 0.03 2e-05 3e-06 0 0 0 0 0 0 0 0 0 0 0 0 0 0 0 0 
0 0 
##$DATE= 1704795804
##$DBL= (0..7)
120 120 120 11 120 120 24 19 
##$DBP= (0..7)
150 150 150 150 150 150 150 150 
##$DBP07= 0
##$DBPNAM0= <>
$$ [...]
##$SUBNAM3= <"">
##$SUBNAM4= <"">
##$SUBNAM5= <"">
##$SUBNAM6= <"">
##$SUBNAM7= <"">
##$SUBNAM8= <"">
##$SUBNAM9= <"">
##$SW= 501.771253377433
##$SWIBOX= (0..15)
0 1 3 0 0 0 0 0 0 0 0 0 0 0 0 0 
##$SW_h= 40650.406504065
##$TD= 32768
##$TD0= 1
##$TE= 0
##$TE2= 300
##$TE3= 300
##$TEG= 300
##$TL= (0..7)
0 120 53 12 22 120 120 120 
##$TP= (0..7)
150 150 150 150 150 150 150 150 
##$TP07= 0
##$TPNAME0= <>
##$TPNAME1= <>
##$TPNAME2= <>
##$TPNAME3= <>
##$TPNAME4= <>
##$TPNAME5= <>
##$TPNAME6= <>
##$TPNAME7= <>
##$TPOAL= (0..7)
0.5 0.5 0.5 0.5 0.5 0.5 0.5 0.5 
##$TPOFFS= (0..7)
0 0 0 0 0 0 0 0 
##$TUNHIN= 0
##$TUNHOUT= 0
##$TUNXOUT= 0
##$USERA1= <user>
##$USERA2= <user>
##$USERA3= <user>
##$USERA4= <user>
##$USERA5= <user>
##$V9= 5
##$VALIST= <valist>
##$VCLIST= <CCCCCCCCCCCCCCC>
##$VD= 0
##$VDLIST= <DDDDDDDDDDDDDDD>
##$VPLIST= <PPPPPPPPPPPPPPP>
##$VTLIST= <TTTTTTTTTTTTTTT>
##$WBST= 1024
##$WBSW= 4
##$XGAIN= (0..3)
0 0 0 0 
##$XL= 0
##$YL= 0
##$YMAX_a= 2172
##$YMIN_a= -1372
##$ZGOPTNS= <>
##$ZL1= 120
##$ZL2= 120
##$ZL3= 120
##$ZL4= 120
##$ABSF1= 248.5645
##$ABSF2= -253.2056
##$ABSG= 5
##$ABSL= 3
##$ALPHA= 0
##$AQORDER= 0
##$ASSFAC= 0
##$ASSFACI= 0
##$ASSFACX= 0
##$ASSWID= 0
##$AUNMP= <proc_1d>
##$AZFE= 0.1
##$AZFW= 0.5
##$BCFW= 0
##$BC_mod= 2
##$BYTORDP= 0
##$COROFFS= 0
##$CY= -3
##$DATMOD= 1
##$DC= 0
##$DFILT= <>
##$DTYPP= 0
##$F1P= 0
##$F2P= 0
##$FCOR= 1
##$FTSIZE= 65536
##$FT_mod= 6
##$GAMMA= 0
##$GB= 0
##$INTBC= 1
##$INTSCL= 6.047779e-11
##$ISEN= 30
##$LB= 10
##$LEV0= 0
##$LPBIN= 0
##$MAXI= 10000
##$MC2= 0
##$MEAN= 0
##$ME_mod= 0
##$MI= 50
##$NCOEF= 0
##$NC_proc= -11
##$NLEV= 6
##$NOISF1= 182.463
##$NOISF2= 159.3651
##$NSP= 0
##$NTH_PI= 0
##$NZP= 0
##$OFFSET= 248.5645
##$PC= 4
##$PHC0= -12246.51
##$PHC1= 310.2938
##$PH_mod= 1
##$PKNL= yes
##$PPARMOD= 0
##$PSCAL= 0
##$PSIGN= 0
##$REVERSE= no
##$SF= 81.0140089999694
##$SI= 65536
##$SIGF1= 159.3651
##$SIGF2= -187.1042
##$SINO= 113.3802
##$SIOLD= 16384
##$SREGLST= <1H.CDCl3>
##$SSB= 0
##$STSI= 65536
##$STSR= 0
##$SW_p= 40650.406504065
##$SYMM= 0
##$S_DEV= 0
##$TDeff= 32768
##$TDoff= 0
##$TI= <>
##$TILT= no
##$TM1= 0
##$TM2= 0
##$TOPLEV= 0
##$USERP1= <user>
##$USERP2= <user>
##$USERP3= <user>
##$USERP4= <user>
##$USERP5= <user>
##$WDW= 1
##$XDIM= 65536
##$YMAX_p= 475166617
##$YMIN_p= -49469410
$$ End of Bruker specific parameters
$$ ---------------------------------
##NTUPLES= NMR SPECTRUM
##VAR_NAME=  FREQUENCY,     SPECTRUM/REAL,   SPECTRUM/IMAG
##SYMBOL=    X,             R,               I
##VAR_TYPE=  INDEPENDENT,   DEPENDENT,       DEPENDENT
##VAR_FORM=  AFFN,          ASDF,            ASDF
##VAR_DIM=   65536,         65536,           65536
##UNITS=     HZ,            ARBITRARY UNITS, ARBITRARY UNITS
##FACTOR=    0.620285442955139, 1,           1
##FIRST=     20137.2065510682, 0,            0
##LAST=      -20513.1999529968, 0,           0
##MIN=       -20513.1999529968, -49469410,   0
##MAX=       20137.2065510682, 475166617,    0
$$ Real data points
##PAGE= N=1
##DATA TABLE= (X++(R..R)), XYDATA
$$ [...]
42196a7842618Q93112J009775J076540J066041R76450Q35300O85909N67564N00280
42187a0231647M78183M73008M48671L81321K71194J36573l773j42053k77003m01644
42177h867170m98937n50963n52549n16730m68210m30910m18778m35210m79899
42168a3219356n56113o71108q29043j023694j238243j450986j639894j783292
42160b2411729j860878j858567j773359j612779j389900j119507q16721m94330
42152c3337770j58010J94138N62371R31635J266260J520308J657522J667351J568220
42143b4127975J399068J205828J028588Q92656Q05727P61608P47483P49639P55623
42134a5781755P55539P44774P25654P03912O81507O53036O10161N49913M78996
$$ plain form
42196 -17842618 -16949506 -15939731 -14863191 -13797150 -12820700 -11985400 -11299491 -10731927 -10231647
42187 -10231647 -9753464 -9280456 -8831785 -8450464 -8179270 -8042697 -8046470 -8188523 -8465526 -8867170
42177 -8867170 -9366107 -9917070 -10469619 -10986349 -11454559 -11885469 -12304247 -12739457 -13219356
42168 -13219356 -13775469 -14446577 -15275620 -16299314 -17537557 -18988543 -20628437 -22411729
42160 -22411729 -24272607 -26131174 -27904533 -29517312 -30907212 -32026719 -32843440 -33337770
42152 -33337770 -33495780 -33301642 -32739271 -31807636 -30541376 -29021068 -27363546 -25696195 -24127975
42143 -24127975 -22728907 -21523079 -20494491 -19601835 -18796108 -18034500 -17287017 -16537378 -15781755
42134 -15781755 -15026216 -14281442 -13555788 -12851876 -12170369 -11517333 -10907172 -10357259 -9878263
42125i878263M10674L57439L23914L02361K72270K06278Q2787r9662l15464n19541
42115h857207o67740p38686p43161p15369o93821p05780p61935q55965r61984
42106a5701648j033743j017076q77202o23795l12063j6441K03776L23876L51972
42097a8702344L16578K55063K04865J93982K31480L04552L86993M55367N02033
42088a5851431N35600N69178O06781O39473O53298O39512N96074N20405M05061
42079a0686049K45849N6562j26221k56724l01365k49816j10886R4971L35192N61476
42069a0437011P17465P62388O96824N70251M62061M46542N62164P99855J110907
42060d308554J425295J671977J798354J785954J654766J449822J216026R78536
$$ plain form
42125 -9878263 -9467589 -9110150 -8786236 -8483875 -8211605 -8005327 -7922540 -8022202 -8337666 -8857207
42115 -8857207 -9524947 -10263633 -11006794 -11722163 -12415984 -13121764 -13883699 -14739664 -15701648
42106 -15701648 -16735391 -17752467 -18629669 -19253464 -19565527 -19581968 -19378192 -19054316 -18702344
42097 -18702344 -18385766 -18130703 -17925838 -17731856 -17500376 -17195824 -16808831 -16353464 -15851431
42088 -15851431 -15315831 -14746653 -14139872 -13500399 -12847101 -12207589 -11611515 -11091110 -10686049
42079 -10686049 -10440200 -10383638 -10509859 -10766583 -11067948 -11317764 -11428650 -11333679 -10998487 -10437011
42069 -10437011 -9719546 -8957158 -8260334 -7690083 -7228022 -6781480 -6219316 -5419461 -4308554
42060 -4308554 -2883259 -1211282 587072 2373026 4027792 5477614 6693640 7672176
42052G672176P42206N07221K85698J05716M40r892O8701K03706L48609M58851
42042A0383432N01365M55767L12836P5069k41937o10939r97646j365192j676091
42033F836664j892686j979188j907726j668283j279379p93394k90072J43973M43078
42024b387013N83070N81589M78298L09434R3949j62139m49195p36948r68446j072992
42014c730393r96375p32249l32401J12744N09553P89909R22279R09653P82442
42005a764838N89277L85612K21207J28487J14683J62232K39311L14538L65398
41996G55907L77678L43457K63983J53201L4697o5572j21872j05481J4509K59197
41986A909704O23173J066514J521376J907468K148320K186050J996180J599949
$$ plain form
42052 7672176 8414382 8921603 9207301 9313017 9313457 9303565 9372266 9575972 9924581 10383432
42042 10383432 10884797 11340564 11653400 11728469 11486532 10875593 9877947 8512755 6836664
42033 6836664 4943978 2964790 1057064 -611219 -1890598 -2683992 -2974064 -2830091 -2387013
42024 -2387013 -1803943 -1222354 -744056 -434622 -340673 -502812 -952007 -1688955 -2657401 -3730393
42014 -3730393 -4726768 -5459017 -5791418 -5678674 -5169121 -4379212 -3456933 -2547280 -1764838
42005 -1764838 -1175561 -789949 -568742 -440255 -325572 -163340 75971 390509 755907
41996 755907 1133585 1477042 1741025 1894226 1928923 1863351 1741479 1635998 1650507 1909704
41986 1909704 2532877 3599391 5120767 7028235 9176555 11362605 13358785 14958734
41978A4958734J065274M88849l6595m53236p49681r47878j076599j150023j163739
41969A0935106j106793r77348p89647n69751l46442j43578K5632J62655K82141
41960G471975M01237N24637O36681P06940P04947O14586M41358K10192m4286k89001
41950A1379266m97730o48799p21701o99914n79403l75142j19095J49935L98059
41941H285476O02366P49171Q29323Q36930P71151O35264M32052J63476j59509
41932A3145700n05152q22639j060853j189568j205781j123239r57853p21358m24565
41923E134692q3596K76613O22448R13877J108397J167564J066526Q04763M14034
41914A1425318m2069m81011q24943j025487j077309j014065q89966p55993o40735
$$ plain form
41978 14958734 16024008 16512857 16476262 16023026 15273345 14325467 13248868 12098845 10935106
41969 10935106 9828313 8850965 8061318 7491567 7145125 7001547 7027179 7189834 7471975
41960 7471975 7873212 8397849 9034530 9741470 10446417 11061003 11502361 11712553 11668267 11379266
41950 11379266 10881536 10232737 9511036 8811122 8231719 7856577 7737482 7887417 8285476
41941 8285476 8887842 9637013 10466336 11303266 12074417 12709681 13141733 13305209 13145700
41932 13145700 12640548 11817909 10757056 9567488 8361707 7238468 6280615 5559257 5134692
41923 5134692 5051096 5327709 5950157 6864034 7972431 9139995 10206521 11011284 11425318
41914 11425318 11383249 10902238 10077295 9051808 7974499 6960434 6070468 5314475 4673740
41905D673740n44329m48691l37236k09384q0154L1102J11146J56945J76523J88566
41895C718228K17034K78564L69842M66127N33884N48355N03348M08542K79741
41886G323665J30198l4117k16211m25062o63831r12535j119465j214156j137655
41877A730831q70425m41362Q3138O20835J096993J462890J703238J829255J862136
41868I077529J818138J704764J528773J307358J070967Q52775O71582N21338L75240
41859A8928464K01721j6562k69674n20145p18172q25544q33453p62549o47538
41850A4536548n19434l96684k86765j92263j13924m7941J7168R4542J82311K49117
41840A3522675K38874R7680j93763o04292j063033j488642j818818k024557k105464
$$ plain form
41905 4673740 4129411 3680720 3343484 3134100 3053946 3085048 3196194 3353139 3529662 3718228
41895 3718228 3935262 4213826 4583668 5049795 5583679 6132034 6635382 7043924 7323665
41886 7323665 7453863 7419746 7203535 6778473 6114642 5202107 4082642 2868486 1730831
41877 1730831 860406 419044 502182 1123017 2220010 3682900 5386138 7215393 9077529
41868 9077529 10895667 12600431 14129204 15436562 16507529 17360304 18031886 18553224 18928464
41859 18928464 19130185 19113623 18843949 18323804 17605632 16780088 15946635 15184086 14536548
41850 14536548 14017114 13620430 13333665 13141402 13027478 12979537 12996705 13091247 13273558 13522675
41840 13522675 13761549 13859229 13665466 13061174 11998141 10509499 8690681 6666124 4560660
41831D560660k074625j945165j725265j421465j046344o24898j94085K05396N38706
41822c727085P81008R16629R39175Q53805O76585M29324J35795j75557m66493
41813C63186o90255q02516p77357o20491l72324r6414J43535L06645L85986M05124
41803a754881M05529M30358N07930O40446Q04858R65985J092255J163009J165630
41794E421119J089486R23983O62542L10188j09180n50138r51805j252645j407653
41785D135897j398410j231014r26473n13109k6304M87609R70509J358425J593133
41776D450263J635995J480154J156729P31001K87662r1819l52973m84044n14900
41767H298068m97406m76852m70668m65668m33037l50397k18303o2392P8893J72016
$$ plain form
41831 4560660 2486035 540870 -1184395 -2605860 -3652204 -4277102 -4471187 -4265791 -3727085
41822 -3727085 -2946077 -2029448 -1090273 -236468 440117 869441 1005236 829679 363186
41813 363186 -327069 -1129585 -1906942 -2527433 -2899757 -2996171 -2852636 -2545991 -2160005 -1754881
41803 -1754881 -1349352 -918994 -411064 229382 1034240 2000225 3092480 4255489 5421119
41794 5421119 6510605 7434588 8097130 8407318 8298138 7748000 6796195 5543550 4135897
41785 4135897 2737487 1506473 580000 66891 40587 528196 1498705 2857130 4450263
41776 4450263 6086258 7566412 8723141 9454142 9741804 9649985 9297012 8812968 8298068
41767 8298068 7800662 7323810 6853142 6387474 5954437 5604040 5385737 5323345 5402238 5574254
41757E574254J98974J55899M6161j21981l31088n51343p46885q91567r83801j047079
41747A301544j111372j186865j251698j266446j205139j077186r22663p86412
41739g506237o91807o31032n74290m88334l52225j63021O7742L20766N73869Q04974
41729h639595R95071J130683J203768J209259J143478J005293P98778N34902K31564
41720c86799q8110l99788o84108r31881j144610j330251j499007j663464j840942
41711i968960k050240k298030k561015k778234k864097k738510k358702j736959
41703b9354747r37894n9393P92612J525652K073359K400362K503063K407588K163382
41694a6486016J832625J479120J160311R22507P97376P99439R25115J152967J444854
$$ plain form
41757 5574254 5773228 5929127 5975288 5853307 5522219 4970876 4223991 3332424 2348623 1301544
41747 1301544 190172 -996693 -2248391 -3514837 -4719976 -5797162 -6719825 -7506237
41739 -7506237 -8198044 -8829076 -9403366 -9891700 -10243925 -10406946 -10339204 -10018438 -9444569 -8639595
41729 -8639595 -7644524 -6513841 -5310073 -4100814 -2957336 -1952043 -1153265 -618363 -386799
41720 -386799 -474909 -874697 -1558805 -2490686 -3635296 -4965547 -6464554 -8128018 -9968960
41711 -9968960 -12019200 -14317230 -16878245 -19656479 -22520576 -25259086 -27617788 -29354747
41703 -29354747 -30292641 -30352034 -29559422 -28033770 -25960411 -23560049 -21056986 -18649398 -16486016
41694 -16486016 -14653391 -13174271 -12013960 -11091453 -10294077 -9494638 -8569523 -7416556 -5971702
41685e971702J750615K018716K209731K304416K301208K207405K032401J786826
41677A0639616J483670J136704P57341L55754n1219m31890p42130r42270j018630
41668A1186946r93227r13390q28686p71108p48960p52888p65232p65812p34335
41659C913308o53921n18044l37123j38610M0885J66390K12190J64547K1492k08846
41649B662268n10270q58776j220153j549098j796159j921800j908276j761037
41641h863301j502276j165832p96573m47578j68703R656Q6178Q4343L8247k0478
41631a2746317o6754p8847l6886P0676K36820M33408O22543P74570Q78447R37845
41621h974495R59969R49149R09746Q52896P99489P76703Q10594R18220J101533
$$ plain form
41685 -5971702 -4221087 -2202371 7360 2311776 4612984 6820389 8852790 10639616
41677 10639616 12123286 13259990 14017331 14373085 14321866 13889976 13147846 12205576 11186946
41668 11186946 10193719 9280329 8451643 7680535 6931575 6178687 5413455 4647643 3913308
41659 3913308 3259387 2741343 2404220 2265610 2306495 2472885 2685075 2849622 2871114 2662268
41649 2662268 2151998 1293222 73069 -1476029 -3272188 -5193988 -7102264 -8863301
41641 -8863301 -10365577 -11531409 -12327982 -12775560 -12944263 -12934607 -12848429 -12764086 -12725839 -12746317
41631 -12746317 -12813071 -12891918 -12928804 -12858128 -12621308 -12187900 -11565357 -10790787 -9912340 -8974495
41621 -8974495 -8014526 -7065377 -6155631 -5302735 -4503246 -3726543 -2915949 -1997729 -896196
41612h96196J344349J613610J865354K053939K141962K108771J956217J709629
41604A3897635J411291J106573Q29145N94549M04673K55633J40017M4468m8238
41595A8635746j48576k49799l29777l66849l58902l32969l39293m31620o41123
41586A5436838r56213j320078j648668j860030j901175j763428j482390j121458
41578C383398p43190l82298l7166L14597O88385J071493J420245J675113J785408
41569I175985J730391J524350J203041Q04490L62328q3849m76706p47345q42282
41560A2650403p53933n32546k69897o3166K1953k8489j79139l65337n20641o02567
41550I356641o07611n67821n29057n23813n56587o09703o61083o99269p26897
$$ plain form
41612 -896196 448153 2061763 3927117 5981056 8123018 10231789 12188006 13897635
41604 13897635 15308926 16415499 17244644 17839193 18243866 18499499 18639516 18683984 18635746
41595 18635746 18487170 18237371 17907594 17540745 17181843 16848874 16509581 16077961 15436838
41586 15436838 14480625 13160547 11511879 9651849 7750674 5987246 4504856 3383398
41578 3383398 2640208 2257910 2220744 2535341 3223726 4295219 5715464 7390577 9175985
41569 9175985 10906376 12430726 13633767 14438257 14800585 14716736 14240030 13492685 12650403
41560 12650403 11896470 11363924 11094027 11030861 11052814 11024325 10845186 10479849 9959208 9356641
41550 9356641 8749030 8181209 7652152 7128339 6571752 5962049 5300966 4601697 3874800
41541C874800p53220p81181p97134p71660o73911m90972k38626M2251K97232M69410
41531A76989N10023L93774J37367j91510m88291o48761o12018l84897l4086L47091
41521g94319O74727Q93317R75315R14144P22854M36864J10263j99443m50469o27039
41511B656214p36224p97794q36078q75919r38411j033331j151851j266024j337089
41502f316507j327624j210593r73134o18538j69862L26845Q05764J194157J430620
41493f858872J479859J337694J026577N86197O4361m88572j020985j479844j814259
41484g167844j985384j978684j810169j521727j168746q07569m86848k41517q7874
41475a7256362k2392k7897q4403j75368k83183l79456m23966l79381k32644n298
$$ plain form
41541 3874800 3121580 2340399 1543265 771605 97694 -393278 -631904 -589653 -292421 176989
41531 176989 687012 1080786 1218153 1026643 538352 -110409 -722427 -1107324 -1141410 -794319
41521 -794319 -119592 773725 1749040 2663184 3386038 3822902 3933165 3733722 3283253 2656214
41511 2656214 1919990 1122196 286118 -589801 -1528212 -2561543 -3713394 -4979418 -6316507
41502 -6316507 -7644131 -8854724 -9827858 -10446396 -10616258 -10289413 -9483649 -8289492 -6858872
41493 -6858872 -5379013 -4041319 -3014742 -2428545 -2364184 -2852756 -3873741 -5353585 -7167844
41484 -7167844 -9153228 -11131912 -12942081 -14463808 -15632554 -16440123 -16926971 -17168488 -17256362
41475 -17256362 -17278754 -17306651 -17391054 -17566422 -17849605 -18229061 -18653027 -19032408 -19265052 -19270350
41465a9270350K56720N06298P14747Q76510R99908J092599J150322J153941J077089
41456a1442216R03570O47348L61952J28096K1640P8913K79814N57905Q30954J035554
41446f596470J148566J185249J176994J145010J088611R94081Q53015O73311M75002
41437B143369K76501Q3767j08459l04641m96838o64306p83334q36383q14143p15833
41427b220300n54296l60582j77247m0485L5538O1503O5144Q0082J33324K31656
41417b745663L53699M56889M98438M56873L40430J79885J3430j27934k30051k98652
41407a102656l54683m22990n18850o38095p53625q18326p75316n77098k08960
41398f170599K97004Q69007J419910J871249K163914K258671K137371J808782
$$ plain form
41465 -19270350 -19013630 -18507332 -17792585 -16916075 -15916167 -14823568 -13673246 -12519305 -11442216
41456 -11442216 -10538646 -9891298 -9529346 -9401250 -9379610 -9300697 -9020883 -8462978 -7632024 -6596470
41446 -6596470 -5447904 -4262655 -3085661 -1940651 -852040 142041 995056 1668367 2143369
41437 2143369 2419870 2503637 2395178 2090537 1593699 929393 146059 -690324 -1504467 -2220300
41427 -2220300 -2774596 -3135178 -3312425 -3352910 -3317372 -3255869 -3190725 -3110643 -2977319 -2745663
41417 -2745663 -2391964 -1935075 -1436637 -979764 -639334 -459449 -446019 -573953 -804004 -1102656
41407 -1102656 -1457339 -1880329 -2399179 -3037274 -3790899 -4609225 -5384541 -5961639 -6170599
41398 -6170599 -5873595 -5004588 -3584678 -1713429 450485 2709156 4846527 6655309
41390F655309J314087P26541J42615l37447o38069p34265o58092m78988k70559
41381E721132q4836N4039J40319J73589J53551Q6800j318o4507n2619N9713K53860
41370F439723M72074O41772P02789O25497M16839J13966k33481n83840r11656
41361G683683j197628j413010j518126j479564j291425r83591o12877k44190O8945
41352i87783K96860M33848M87440M66427L77001K26560K7862j99936m30532o29460
41342F8287p58705p90837p24469n85520m07638k04742M1291L65629P89108J295018
41332i12578J830373K327450K728451K999073L128279L120916K992058K766847
41324B0980869K481240K175641J881500J611985J366494J144584R55341Q15134
$$ plain form
41390 6655309 7969396 8695937 8838552 8501105 7863036 7128771 6470679 5991691 5721132
41381 5721132 5636296 5690335 5830654 6004243 6157794 6244594 6243276 6178769 6126150 6185863 6439723
41370 6439723 6911797 7553569 8256358 8881855 9298694 9412660 9179179 8595339 7683683
41361 7683683 6486055 5073045 3554919 2075355 783930 -199661 -812538 -1056728 -987783
41352 -987783 -690923 -257075 230365 696792 1073793 1300353 1328215 1128279 697747 68287
41342 68287 -690418 -1481255 -2205724 -2791244 -3198882 -3403624 -3362333 -2996704 -2207596 -912578
41332 -912578 917795 3245245 5973696 8972769 12101048 15221964 18214022 20980869
41324 20980869 23462109 25637750 27519250 29131235 30497729 31642313 32597654 33412788
41316C3412788P39260P34509P92799Q84691R58091R49261Q04206M98192M1811
41307C9815608n27214j156500j785284k344188k759431k970815k957169k749130
41299B2565877k415015k027468j634783j256238r01024n92492l75936l01136l91448
41290A2670337o22957r29243j227078j445159j541242j504893j350757j109469
41282B939539q21753n36225l05235j72868j58114k44101l81391n03238n44284
41273g27670m55577k12774J82037P01226J291753J876484K363578K665669K719844
41264A0404570K497604K005132J282878M07431n13820j364038k048011k514286
41256A0157460k755297k789470k641273k332710j888178j344600p57107j95781
$$ plain form
41316 33412788 34152048 34886557 35679356 36564047 37522138 38471399 39275605 39773797 39815608
41307 39815608 39288394 38131894 36346610 34002422 31242991 28272176 25315007 22565877
41299 22565877 20150862 18123394 16488611 15232373 14331349 13738857 13362921 13061785 12670337
41290 12670337 12047380 11118137 9891059 8445900 6904658 5399765 4049008 2939539
41282 2939539 2117786 1581561 1276326 1103458 945344 701243 319852 -183386 -727670
41273 -727670 -1183247 -1396021 -1213984 -512758 778995 2655479 5019057 7684726 10404570
41264 10404570 12902174 14907306 16190184 16597615 16083795 14719757 12671746 10157460
41256 10157460 7402163 4612693 1971420 -361290 -2249468 -3594068 -4351175 -4546956
41248d546956K65400N64480O69168N90421L82795J26589j01527k53039l14559
41239b617228k97752k22748j05161M9142K41836M74302P37671J006196J239267
41230E05525J393537J440281J378400J235028J054146Q81870P56907P07313P48408
41221A0101415Q78235J072604J285711J461184J552630J543871J454582J324343
41213B0674575J185104J042322Q77296O64929L90890N7393l21000p22799j120019
41204B2728691j475546j745752j893449j904849j796438j604405j364439j097682
41196I846131q12376n17749k38405j7083R8705P8542p6308l36035o57957j000097
41186F367368j324694j596841j787040j878256j870448j778077j623757j433778
$$ plain form
41248 -4546956 -4281556 -3717076 -3047908 -2457487 -2074692 -1948103 -2049630 -2302669 -2617228
41239 -2617228 -2914980 -3137728 -3242889 -3193747 -2951911 -2477609 -1739938 -733742 505525
41230 505525 1899062 3339343 4717743 5952771 7006917 7888787 8645694 9353007 10101415
41221 10101415 10979650 12052254 13337965 14799149 16351779 17895650 19350232 20674575
41213 20674575 21859679 22902001 23779297 24444226 24835116 24892509 24571509 23848710 22728691
41204 22728691 21253145 19507393 17613944 15709095 13912657 12308252 10943813 9846131
41196 9846131 9033755 8516006 8277601 8260518 8359223 8437765 8361457 8025422 7367465 6367368
41186 6367368 5042674 3445833 1658793 -219463 -2089911 -3867988 -5491745 -6925523
41178f925523j235768j053823q99971p69413o47824n27081m14500l25572k67536
41169a3067011k30518j93866j39789o1707L7703J54128K86385M32256N77268O87229
41159a1517922P16590O32869M42234J97525j8597j27050q5169R6129L57723O16814
41149h688854Q00156Q73494Q55665Q09086Q06729Q89935J041327J190546J249448
41140a72468J154562Q93470N05788O4841l48454o70754q75111r77602j026870
41131a452598j080100j179722j344486j574102j854579k156670k434997k638544
41123a5715798k729776k697515k553215k314982j993178j588872j106474n70854
41115c1270664l3824M38639P91269R99253J071325J039122R43212Q22344P07078
$$ plain form
41178 -6925523 -8161291 -9215114 -10115085 -10884498 -11532322 -12059403 -12473903 -12799475 -13067011
41169 -13067011 -13297529 -13491395 -13631184 -13692891 -13655188 -13501060 -13214675 -12782419 -12205151 -11517922
41159 -11517922 -10801332 -10168463 -9726229 -9528704 -9547301 -9674351 -9759520 -9663391 -9305668 -8688854
41149 -8688854 -7888698 -7015204 -6159539 -5350453 -4543724 -3653789 -2612462 -1421916 -172468
41140 -172468 982094 1875564 2381352 2446193 2097739 1426985 551874 -425728 -1452598
41131 -1452598 -2532698 -3712420 -5056906 -6631008 -8485587 -10642257 -13077254 -15715798
41123 -15715798 -18445574 -21143089 -23696304 -26011286 -28004464 -29593336 -30699810 -31270664
41115 -31270664 -31304488 -30865849 -30074580 -29075327 -28004002 -26964880 -26021668 -25199324 -24492246
41106b4492246O17154N61859N41340N47591N66938N86670O04524O36033P14561
41097a9115576Q80842J161952J546506J971471K335327K536470K516929K287327
41089c878752J922518J533444J228287J077424J096019J251379J487088J744454
41081G461861J968463K104734K103970J938649J618397J188187P09459K39331
41073A9333051j78341n09793p26360q07456p51894n88064l70446j58769Q279J25429
41063A5375636K10453K82062L45124L91251M07274L81578L07137J84817K6484
41054A7911816j46779l11898m50381n47718n86323n39829l77955q4468L20758
41045A5187223P71994J171302J420542J454706J261429Q81829L94620j11141n63932
$$ plain form
41106 -24492246 -23875092 -23313233 -22771893 -22224302 -21657364 -21070694 -20466170 -19830137 -19115576
41097 -19115576 -18234734 -17072782 -15526276 -13554805 -11219478 -8683008 -6166079 -3878752
41089 -3878752 -1956234 -422790 805497 1882921 2978940 4230319 5717407 7461861
41081 7461861 9430324 11535058 13639028 15577677 17196074 18384261 19093720 19333051
41073 19333051 19154710 18644917 17918557 17111101 16359207 15771143 15400697 15241928 15250207 15375636
41063 15375636 15586089 15868151 16213275 16604526 17011800 17393378 17700515 17885332 17911816
41054 17911816 17765037 17453139 17002758 16455040 15868717 15328888 14950933 14866465 15187223
41045 15187223 15959217 17130519 18551061 20005767 21267196 22149025 22543645 22432504 21868572
41036B1868572r24557j182081j340728j412291j416973j382919j336950j291081
41028A1580992j235232j141614r79602p35761m30649j21669J14070K10895J43570
41019G405000o1946l41094o18164q31687r44781r40878q17209n86269k82182M0522
41009B021312L22044N18567O14505O17556N42132L95565J78056j04934m30430
41000D674373p57932j042293j248811j359979j373063j295587j144003r43934
40992d491229p27318n25563l63015k54483k05860k13209k58836l09383l24016
40983g672912k74470j66490m4886K7740Q260r9951k50849l87025m73646n10968
40973i845197n21403n26543n33082n34924n24625n01458m69615m30616l78794
$$ plain form
41036 21868572 20944015 19761934 18421206 17008915 15591942 14209023 12872073 11580992
41028 11580992 10345760 9204146 8224544 7488783 7058134 6936465 7050535 7261430 7405000
41019 7405000 7343054 7001960 6383796 5552109 4607328 3666450 2849241 2262972 1980790 2021312
41009 2021312 2343356 2861923 3476428 4093984 4636116 5031681 5209737 5104803 4674373
41000 4674373 3916441 2874148 1625337 265358 -1107705 -2403292 -3547295 -4491229
40992 -4491229 -5218547 -5744110 -6107125 -6361608 -6567468 -6780677 -7039513 -7348896 -7672912
40983 -7672912 -7947382 -8113872 -8158758 -8131018 -8122758 -8222709 -8473558 -8860583 -9334229 -9845197
40973 -9845197 -10366600 -10893143 -11426225 -11961149 -12485774 -12987232 -13456847 -13887463 -14266257
40964a4266257l03355j92684l6356J74334M44047P69986J140085J532857J916647
40955h820696K250086K488744K598195K565752K403136K140936J821238J490894
40947H938285J192519R52148P69993O22749M78434L14544J27964o7612k51470
40938A3077554m04734n15247n80225o07317o11434o06486n97643n80875n49428
40929H024165m99668m30619l39715k20136o1762J45092M02559O95028R83130J211992
40919I910066J333804J329769J214368J019999P75113M89340J50279k68261p87071
40910A5167406j397321k046616k648648l112402l370862l393741l186869k789641
40902f778694k272753j727526j242123q73811o32607m84530l71380k37366n1689
$$ plain form
40964 -14266257 -14569612 -14762296 -14798652 -14624318 -14180271 -13410285 -12270200 -10737343 -8820696
40955 -8820696 -6570610 -4081866 -1483671 1082081 3485217 5626153 7447391 8938285
40947 8938285 10130804 11082952 11852945 12475694 12954128 13268672 13396636 13329024 13077554
40938 13077554 12672820 12157573 11577348 10970031 10358597 9752111 9154468 8573593 8024165
40929 8024165 7524497 7093878 6754163 6534027 6472265 6617357 7019916 7714944 8698074 9910066
40919 9910066 11243870 12573639 13788007 14808006 15583119 16072459 16222738 15954477 15167406
40910 15167406 13770085 11723469 9074821 5962419 2591557 -802184 -3989053 -6778694
40902 -6778694 -9051447 -10778973 -12021096 -12894907 -13527514 -14012044 -14383424 -14620790 -14672479
40893a4672479J81134M25140O25692P24581O75330M58637R3448l64066q35189
40884a2687772j238403j504591j586452j466365j162793p29332k42626K17116
40876b0401218N84563Q20672R15988Q88193P76147O30221M97978M09080L68889
40867a4509487L67088L94763M54444N54137O91004Q37433R39087R29555P61025
40858h580951M39157L8442l20576n24259n16500l16823j101L37824O28008Q39907
40848g976872R84914J094195J191957J280565J343901J360176J311224J184570
40840A774630R74381O86631L46053k435l02706n04955n83967n48372m34931k90985
40830A113344j56713n8528j4400m0430j47537l28473n47461p44876q57323q40897
$$ plain form
40893 -14672479 -14491345 -14066205 -13440513 -12715932 -12040602 -11581965 -11488517 -11852583 -12687772
40884 -12687772 -13926175 -15430766 -17017218 -18483583 -19646376 -20375708 -20618334 -20401218
40876 -20401218 -19816655 -18995983 -18079995 -17191802 -16415655 -15785434 -15287456 -14878376 -14509487
40867 -14509487 -14142399 -13747636 -13293192 -12739055 -12048051 -11210618 -10271531 -9341976 -8580951
40858 -8580951 -8141794 -8103352 -8423928 -8948187 -9464687 -9781510 -9782611 -9444787 -8816779 -7976872
40848 -7976872 -6991958 -5897763 -4705806 -3425241 -2081340 -721164 590060 1774630
40840 1774630 2749011 3435642 3781695 3779260 3476554 2971599 2387632 1839260 1404329 1113344
40830 1113344 956631 898103 883703 843273 695736 367263 -180198 -925074 -1782397 -2623294
40820b623294o83982m05788m6832L41563P07724J011824J236677J389006J486908
40811B413806J540501J539993J461126J285446J021712P13015M23389K11772J09133
40802A0719893J09806J76894K55446K88963K36545Q5185j48663m27227p01000
40793A0595842r14239j010347r43642o96162k89428K17818P45848J215715J566442
40784A0487847J762423J793057J669842J422508J091411P15606L22752p2239m61263
40775A8731944q37344j192358j513483j775417j935434j941919j757138j381054
40767F397797q60027k74455K86403P48123J064370J220461J231827J137992R89571
40758A1942062Q30561O85403N58501M43669L34791K32209J44703Q6630O8464Q3684
$$ plain form
40820 -2623294 -3307276 -3713064 -3759896 -3418333 -2710609 -1698785 -462108 926898 2413806
40811 2413806 3954307 5494300 6955426 8240872 9262584 9975599 10398988 10610760 10719893
40802 10719893 10829699 11006593 11262039 11551002 11787547 11872732 11724069 11296842 10595842
40793 10595842 9681603 8671256 7727614 7031452 6742024 6959842 7705690 8921405 10487847
40784 10487847 12250270 14043327 15713169 17135677 18227088 18942694 19265446 19193207 18731944
40775 18731944 17894600 16702242 15188759 13413342 11477908 9535989 7778851 6397797
40767 6397797 5537770 5263315 5549718 6297841 7362211 8582672 9814499 10952491 11942062
40758 11942062 12772623 13458026 14016527 14460196 14794987 15027196 15171899 15258529 15326993 15410677
40748A5410677J01101P0778n6604l04704o52293j031472j349304j525672j527852
40739I134655j383107j164655r60375q38910q27153r09008j044752j196872j344729
40730e34906j482654j610176j724263j815262j865449j852652j760288j587796
40722a4233446j352568j082173q03744n36941k91452o7896J38573L33826N22998
40713a7372823P12204R09960J124332J357178J600300J836602K044419K201286
40705e586542K285717K278933K169192J958099J664758J324553R83503O90676
40697G768889M87776L93900L90470M19595M04914K86893N1224k65879n93873q51875
40687H492034r69089q98582o25473j69812M15720J052886J650707K125341K423301
$$ plain form
40748 15410677 15511778 15582556 15525952 15221248 14568955 13537483 12188179 10662507 9134655
40739 9134655 7751548 6586893 5626518 4787608 3960455 3051447 2006695 809823 -534906
40730 -534906 -2017560 -3627736 -5351999 -7167261 -9032710 -10885362 -12645650 -14233446
40722 -14233446 -15586014 -16668187 -17471931 -18008872 -18300324 -18368220 -18229647 -17895821 -17372823
40713 -17372823 -16660619 -15750659 -14626327 -13269149 -11668849 -9832247 -7787828 -5586542
40705 -5586542 -3300825 -1021892 1147300 3105399 4770157 6094710 7078213 7768889
40697 7768889 8256665 8650565 9041035 9460630 9865544 10152437 10203661 9937782 9343909 8492034
40687 8492034 7522945 6624363 5998890 5829078 6244798 7297684 8948391 11073732 13497033
40678A3497033K536624K498787K361578K166680J929232J642044J296200R03981
40670B8832159N07974J68049o6900j83261k05663j77664j35984r7090o2245l1888
40660B8547487j4991k6995q1334j84375l38539n49662q29503j186733j609392
40651B3725963k052509k445320k718381k832219k786480k606019k320118j951976
40643D012941j521477j053092n80986j47498K05871M51686N85423O23688N95045
40634C171601N31946M65725M19760L99989L90898L63959K94048J71618L228j96607
40624F016165m13330o32819q33615r78392j016624r04758o35734k57848J33802
40615D76847M32711N64288N13260L22095O5009j85695l83226n10547n68438n59982
$$ plain form
40678 13497033 16033657 18532444 20894022 23060702 24989934 26631978 27928178 28832159
40670 28832159 29340133 29508182 29441282 29258021 29052358 28874694 28738710 28641620 28579375 28547487
40660 28547487 28532496 28505501 28424167 28239792 27901253 27351591 26522088 25335355 23725963
40651 23725963 21673454 19228134 16509753 13677534 10891054 8285035 5964917 4012941
40643 4012941 2491464 1438372 857386 709888 915759 1367445 1952868 2576556 3171601
40634 3171601 3703547 4169272 4589032 4989021 5379919 5743878 6037926 6209544 6212772 6016165
40624 6016165 5602835 4970016 4136401 3158009 2141385 1236627 600893 343045 476847
40615 476847 909558 1473846 1987106 2309201 2374210 2188515 1805289 1294742 726304 166322
40605A66322m84147l41428j43407Q3757L04438M82741N91356O18927N75281M92099
40595B345939M16765L99170M73450O40112Q57690J051677J139195J058023P87741
40586I169762L56969j64072o84172j118673j411902j543771j521070j364196j099231
40577F19644p56064l66821L9080M40494Q24869J181127J490201J721942J842368
40568G036840J826485J668081J381738R98304N56785R4259l64235q10873j249766
40559A1137618j681482k087328k427129k655244k743449k691789k519589k247847
40551g916239j890716j461821r85185m97531l9055L59446O83059R28718J094478
40542i724846J171184J143613J000287P43916L94786j3581m41897q51336j206728
$$ plain form
40605 166322 -317825 -659253 -802660 -718903 -414465 68276 659632 1278559 1853840 2345939
40595 2345939 2762704 3161874 3635324 4275436 5133126 6184803 7323998 8382021 9169762
40586 9169762 9526731 9362659 8678487 7559814 6147912 4604141 3083071 1718875 619644
40577 619644 -136420 -503241 -464161 -23667 801202 1982329 3472530 5194472 7036840
40568 7036840 8863325 10531406 11913144 12911448 13468233 13562492 13198257 12387384 11137618
40559 11137618 9456136 7368808 4941679 2286435 -457014 -3148803 -5668392 -7916239
40551 -7916239 -9806955 -11268776 -12253961 -12751492 -12790547 -12431101 -11748042 -10819324 -9724846
40542 -9724846 -8553662 -7410049 -6409762 -5665846 -5271060 -5284641 -5726538 -6577874 -7784602
40533g784602j475866j625813j621681j435192j062177n35905P7667P00797J263787
40524a3498985J710451J993707K074625J929087J555249R77194K47651n49804
40516c560825j307457j916096k296456k422224k322827k067374j739258j411541
40508a9044058j130726r12677p49318o21512n12925m19283l47841l07288k97025
40499b4342653l05858l19235l24263l05939k41180j01840J31574M54967Q36018
40490b4518409J224324J571883J852612K068843K240637K385477K501899K566323
40482h106411K543730K406520K151868J806970J417862J030529O79967L92926
40474D323961J93325R6818R7208J61772K45154L10727L39948L23873K49702R8418
$$ plain form
40533 -7784602 -9260468 -10886281 -12507962 -13943154 -15005331 -15541236 -15463569 -14762772 -13498985
40524 -13498985 -11788534 -9794827 -7720202 -5791115 -4235866 -3258672 -3011021 -3560825
40516 -3560825 -4868282 -6784378 -9080834 -11503058 -13825885 -15893259 -17632517 -19044058
40508 -19044058 -20174784 -21087461 -21836779 -22458291 -22971216 -23390499 -23738340 -24045628 -24342653
40499 -24342653 -24648511 -24967746 -25292009 -25597948 -25839128 -25940968 -25809394 -25354427 -24518409
40490 -24518409 -23294085 -21722202 -19869590 -17800747 -15560110 -13174633 -10672734 -8106411
40482 -8106411 -5562681 -3156161 -1004293 802677 2220539 3251068 3931035 4323961
40474 4323961 4517286 4614104 4711312 4873084 5118238 5428965 5768913 6092786 6342488 6440906
40464F440906j43443m67818q37321j191540j464673j605574j591132j430308j162741
40455c453644q54000n82391m12839l67098m10880m70556m69103l56890j21286
40446g498687K21116O35852J077289J493193J832529K056572K147307K107703
40438D072874J955001J713643J412875J087105P73724N06701L09707J92007J46666
40429A2170303J50552J69746J72725J44753R0836K2172o3727j92064m00449p15679
40419A1549168j132239j604838k058669k411365k595800k575160k348451j948392
40411e125746j433088q73346l40266J02803M05823N39855N05348L32797P2114
40402e813706k22414n03106p35293r02618j008988j071196j103479j104709j057967
$$ plain form
40464 6440906 6297463 5829645 4992324 3800784 2336111 730537 -860595 -2290903 -3453644
40455 -3453644 -4307644 -4890035 -5302874 -5669972 -6080852 -6551408 -7020511 -7377401 -7498687
40446 -7498687 -7277571 -6641719 -5564430 -4071237 -2238708 -182136 1965171 4072874
40438 4072874 6027875 7741518 9154393 10241498 11015222 11521923 11831630 12023637 12170303
40429 12170303 12320855 12490601 12663326 12808079 12898915 12921087 12857360 12665296 12264847 11549168
40419 11549168 10416929 8812091 6753422 4342057 1746257 -828903 -3177354 -5125746
40411 -5125746 -6558834 -7432180 -7772446 -7669643 -7263820 -6723965 -6218617 -5885820 -5813706
40402 -5813706 -6036120 -6539226 -7274519 -8177137 -9186125 -10257321 -11360800 -12465509 -13523476
40393a3523476r42240p47791m85727j85981J14934L87698O15657P90861R09102
40384a3066963R71327R88681R82272R73710R72301R69647R47998Q97857Q31151
40375d532019P77899P68215Q14679R08307J026811J143624J230392J256223J190822
40366D584953J014145P29236L71524P093k84658m39977m37912l09796j24509M2041
40356E152140J35242J33828M5316j04101k75610m21091m91133m49682k87458k4713
40346C412738K97827O32585R34878J166167J294348J296677J167145R23693O07685
40337A1733743K73060k8956k59900l94180m13632l05780p1712K60772O32071R65610
40327A2391096J199193J312777J331595J302973J266463J239209J221369J209539
$$ plain form
40393 -13523476 -14465716 -15213507 -15699234 -15885215 -15770281 -15382583 -14766926 -13976065 -13066963
40384 -13066963 -12095636 -11106955 -10124683 -9150973 -8178672 -7209025 -6261027 -5363170 -4532019
40375 -4532019 -3754120 -2985905 -2171226 -1262919 -236108 907516 2137908 3394131 4584953
40366 4584953 5599098 6328334 6699858 6706951 6422293 5982316 5544404 5234608 5110099 5152140
40356 5152140 5287382 5421210 5466526 5362425 5086815 4665724 4174591 3724909 3437451 3412738
40346 3412738 3710565 4343150 5278028 6444195 7738543 9035220 10202365 11126058 11733743
40337 11733743 12006803 11977847 11717947 11323767 10910135 10604355 10532643 10793415 11425486 12391096
40327 12391096 13590289 14903066 16234661 17537634 18804097 20043306 21264675 22474214
40319B2474214J204232J206892J210559J191517J109477R20311N97177J47760
40311C0062139l83507r29161j419560j800519k041901k135820k087542j906232
40303A7357897j603163j198397p28464k46155J89671N28598P40226Q18856P81354
40294A6640423O59984M92574L12353J40276j6855j60750k91583m01188m75598
40285A6899636n04790m90164m41978l69106k72034j48120o013J24566J99735J82833
40275A5174565O5170j27930l47544n39524o61632o93953o39408n14484l36889
40266A1378371j20187J21595L67601N91333P68683Q84461R33171R17674Q49783
40257A6692485P51248O51248N78991N52648N67893N93055N78834M81020K80924
$$ plain form
40319 22474214 23678446 24885338 26095897 27287414 28396891 29317202 29914379 30062139
40311 30062139 29678632 28749471 27329911 25529392 23487491 21351671 19264129 17357897
40303 17357897 15754734 14556337 13827873 13581718 13771389 14299987 15040213 15859069 16640423
40294 16640423 17300407 17792981 18105334 18245610 18228755 18068005 17776422 17375234 16899636
40285 16899636 16394846 15904682 15462704 15093598 14821564 14673444 14667431 14791997 14991732 15174565
40275 15174565 15239735 15111805 14764261 14224737 13563105 12869152 12229744 11715260 11378371
40266 11378371 11258184 11379779 11747380 12338713 13107396 13991857 14925028 15842702 16692485
40257 16692485 17443733 18094981 18673972 19226620 19794513 20387568 20966402 21447422 21728346
40248B1728346j2423l76622p88740j223106j640556j986628k206806k269840k182700
40239I040925j986785j736691j473245j206823r21917n99901k43241J17257M37598
40230A427177O85610Q55604R61423J015079J009969R22803P32238M39548P7357
40221H126808k97870o23940q51786r56703r39142q18485o25483l96277j66888
40212B450234L3327J87618K93285L56493L82943L70505L09746J92984K6041j66052
40202D437124l43845m65413m97475m20486k29767O1763M18885P84364J090491
40193D835641J277716J308415J168844Q64074M14387j45085p65124j385563j939980
40184E633325k362772k599857k619490k416598k009421j434341p42731L281P39636
$$ plain form
40248 21728346 21715923 21339301 20550561 19327455 17686899 15700271 13493465 11223625 9040925
40239 9040925 7054140 5317449 3844204 2637381 1715464 1115563 872322 989579 1427177
40230 1427177 2112787 2968391 3929814 4944893 5954862 6877665 7609903 8049451 8126808
40221 8126808 7828938 7204998 6353212 5396509 4457367 3638882 3013399 2617122 2450234
40212 2450234 2483561 2671179 2964464 3320957 3703900 4074405 4384151 4577135 4603176 4437124
40202 4437124 4093279 3627866 3130391 2709905 2480138 2541901 2960786 3745150 4835641
40193 4835641 6113357 7421772 8590616 9454690 9869077 9723992 8958868 7573305 5633325
40184 5633325 3270553 670696 -1948794 -4365392 -6374813 -7809154 -8551885 -8548604 -7808968
40175g808968J410638J974882K406088K692164K833042K834717K700792K428752
40167A1472107K016919J479274Q57505K21243l43723p52543r38826q73826n86366
40158A2551764j70550K36299N04726N65298M28337J63514j38894l99053n62557
40149A3178884o04481n27194l53034j15023J50078M07066O29417Q05487R35365
40140A4506565J016639J031391R49072P44723M16576j1024m97996j001029j481253
40131A5673664j908346k263092k536092k720513k803134k762536k579076k251952
40123d151077j811497j316719q37704m33143j35484N1406J46808J86534K16608
40114h084268K84405M26015O53309R47327J263781J550634J769024J904246J959598
$$ plain form
40175 -7808968 -6398330 -4423448 -2017360 674804 3507846 6342563 9043355 11472107
40167 11472107 13489026 14968300 15825805 16047048 15703325 14950782 14011956 13138130 12551764
40158 12551764 12381214 12617513 13122239 13687537 14115874 14279388 14140494 13741441 13178884
40149 13178884 12574403 12047209 11694175 11579152 11729230 12136296 12765713 13571200 14506565
40140 14506565 15523204 16554595 17503667 18248390 18664966 18653942 18155946 17154917 15673664
40131 15673664 13765318 11502226 8966134 6245621 3442487 679951 -1899125 -4151077
40123 -4151077 -5962574 -7279293 -8116997 -8550140 -8685624 -8634218 -8487410 -8300876 -8084268
40114 -8084268 -7799863 -7373848 -6720539 -5773212 -4509431 -2958797 -1189773 714473 2674071
40105B674071J939226J835300J631720J324365R44321N64378K77212J54743K15986
40096A1561322M25104P15952J020230J283252J470851J576265J623375J654847
40088B1331198J704234J768531J800793J729273J492972J075349N20009p9389
40080C1342970o10760r82696j154030j142256j008990q30132o64479n35093m31024
40071B3983510l25930k00645n6346Q6788J99985K56269K36229J31170n3379k95820
40061B3961831n63498q25274j064018j279391j479280j667912j839571j979102
40053A3263785k064696k070390j970919j750963j415403r93722n34486r2304K86110
40044B657012N70933P52581Q42479Q72130Q86139R25752J009318J123115J229432
$$ plain form
40105 2674071 4613297 6448597 8080317 9404682 10349003 10913381 11190593 11345336 11561322
40096 11561322 11986426 12702378 13722608 15005860 16476711 18052976 19676351 21331198
40088 21331198 23035432 24803963 26604756 28334029 29827001 30902350 31422359 31342970
40080 31342970 30732210 29749514 28595484 27453228 26444238 25614106 24949627 24414534 23983510
40071 23983510 23657580 23456935 23400589 23487377 23687362 23943631 24179860 24311030 24257651 23961831
40061 23961831 23398333 22573059 21509041 20229650 18750370 17082458 15242887 13263785
40053 13263785 11199089 9128699 7157780 5406817 3991414 2997692 2463206 2370902 2657012
40044 2657012 3227945 3980526 4823005 5695135 6581274 7507026 8516344 9639459 10868891
40035A0868891J284903J257130J134508R30161O78248M18916J76365n5265l05398
40026A6388459o01939r44015j290551j571849j716647j678842j452008j070427
40018F062181o01157j29118K65060N28571O49275O50746N76112M73793L91138
40009H866601L70520M39881N97482Q00452R69757J015612Q72994N28547K5866
40000A4487712n50564j103413j551707j851247j999127k023168j966277j874502
39992A567707j787424j725423j678166j607583j470336j245792r49189o22689
39984i518895l14241n8736J31133K64056L61476M44251N20485N81629O10515N96708
39974f381619N48597M93538M66762M97634O00702P71460R83930J191869J340189
$$ plain form
40035 10868891 12153794 13410924 14545432 15475593 16153841 16572757 16749122 16693857 16388459
40026 16388459 15786520 14842505 13551954 11980105 10263458 8584616 7132608 6062181
40018 6062181 5461024 5331906 5596966 6125537 6774812 7425558 8001670 8475463 8866601
40009 8866601 9237121 9677002 10274484 11074936 12044693 13060305 13933299 14461846 14487712
40000 14487712 13937148 12833735 11282028 9430781 7431654 5408486 3442209 1567707
39992 1567707 -219717 -1945140 -3623306 -5230889 -6701225 -7947017 -8896206 -9518895
39984 -9518895 -9833136 -9891872 -9760739 -9496683 -9135207 -8690956 -8170471 -7588842 -6978327 -6381619
39974 -6381619 -5833022 -5339484 -4872722 -4375088 -3774386 -3002926 -2018996 -827127 513062
39965E13062J387274J326920J193926J047580R43248R09557R42154J012762J084312
39956A0360795J123659J109257J036188R19513P91872O89993O33245O07585N68097
39947A7840204M60584K49849o0268m24027p69263j024634j144887j121109r73903
39938A3032546p39358m57309j63196J18064L72932N92090P61313Q60525Q72121
39929A5249728P89147O16444L68393O9556k42690n19659p09273p67348o68620
39920A4185678m15978m6132L72385P52598J013076J104022J022079Q04564N07623
39911A9299915J83696j29534m09826o48772q50577j026921j186399j324924j424602
39902A2482056j461338j414295j270404j022598o66443k01545L59964R82605J602954
$$ plain form
39965 513062 1900336 3227256 4421182 5468762 6412010 7321567 8263721 9276483 10360795
39956 10360795 11484454 12593711 13629899 14549412 15341284 16031277 16664522 17272107 17840204
39947 17840204 18300788 18550637 18490369 18066342 17297079 16272445 15127558 14006449 13032546
39938 13032546 12293188 11835879 11672683 11790747 12163679 12755769 13517082 14377607 15249728
39929 15249728 16038875 16655319 17023712 17093268 16850578 16330919 15621646 14854298 14185678
39920 14185678 13769700 13723568 14095953 14848551 15861627 16965649 17987728 18792292 19299915
39911 19299915 19483611 19354077 18944251 18295479 17444902 16417981 15231582 13906658 12482056
39902 12482056 11020718 9606423 8336019 7313421 6646978 6445433 6805397 7788002 9390956
39893I390956K136896K498793K628021K514367K209584J814670J444712J187844
39885B5825843J078309J093443J172105J244917J263935J218931J133804J048365
39877C5079652R98359J003148J062387J159343J268069J360537J409489J388289
39869D4729273J273648J053180P31548L29265j23031n88322j024984j391868j657148
39860D3331561j804963j836331j767425j627697j454690j283072j133232j008156
39852C1415995r00156q00204p02753o05780n10602m23871l58976l32352l54042
39843B6427259m18295n01694n70841n94707n55660m56517l21355j85717p5787
39834B2746686J1544J08741K51144M41840O37121P66072P68979O26677L65797
$$ plain form
39893 9390956 11527852 14026645 16654666 19169033 21378617 23193287 24637999 25825843
39885 25825843 26904152 27997595 29169700 30414617 31678552 32897483 34031287 35079652
39877 35079652 36078011 37081159 38143546 39302889 40570958 41931495 43340984 44729273
39869 44729273 46002921 47056101 47787649 48116914 47993883 47405561 46380577 44988709 43331561
39860 43331561 41526598 39690267 37922842 36295145 34840455 33557383 32424151 31415995
39852 31415995 30515839 29715635 29012882 28407102 27896500 27472629 27113653 26781301 26427259
39843 26427259 26008964 25507270 24936429 24341722 23786062 23329545 23008190 22822473 22746686
39834 22746686 22758230 22866971 23118115 23559955 24197076 24963148 25732127 26358804 26724601
39825B6724601M6186k56548m68341n34801m36765j94877J39636N01060Q23902
39816B6344053J055289J167703J169071J101077J020539R70566R58558R56826
39808C4743682R27307Q52764P49156O48673N68793M94981L90753K24110j1052
39799C9589167k90856n72494q11474r76807j057489j056802r78153q13720n46738
39790C2484634j67053L12000Q47802J375730J822592K120760K223160K118708
39782D3138333J842011J469075J096100Q06727O40035N76265N53061N06357M08500
39773E1036464K76127J46896N0869M16j567M8348J54899L17848N25384P51133
39763E3306817R56874J102343J159636J125295J022840Q94068P83775P25301P31847
$$ plain form
39825 26724601 26770787 26514239 26045898 25511097 25074332 24879455 25019091 25520151 26344053
39816 26344053 27399342 28567045 29736116 30837193 31857732 32828298 33786856 34743682
39808 34743682 35670989 36523753 37272909 37921582 38490375 38985356 39376109 39600219 39589167
39799 39589167 39298311 38725817 37914343 36937536 35880047 34823245 33845092 33031372 32484634
39790 32484634 32317581 32629581 33477383 34853113 36675705 38796465 41019625 43138333
39782 43138333 44980344 46449419 47545519 48352246 48992281 49568546 50121607 50627964 51036464
39773 51036464 51312591 51459487 51510356 51510772 51509205 51557553 51712452 52030300 52555684 53306817
39763 53306817 54263691 55366034 56525670 57650965 58673805 59567873 60351648 61076949 61808796
39754F1808796P93299Q76793R32780R10004P76088N31948K10990j33311m40450
39745F6266937o52041p21131o24169l70975n850M02797P82966J084286J295599
39736F7458419J440939J553384J646374J706720J714127J668285J599949J558362
39728H0346559J586088J699115J883763K109151K343634K563042K748651K883032
39720I8163035K951096K944250K861349K706837K492884K246691K012401J837245
39712A18215788J747132J730572J744886J740196J684421J575681J439148J312484
39704A31190308J227219J195241J208048J248016J302029J366897J444452J532585
39696A41714795J619926J688052J720578J713978J682293J650771J642223J666818
$$ plain form
39754 61808796 62602095 63478888 64411668 65321672 66097760 66629708 66840698 66707387 66266937
39745 66266937 65614896 64893765 64269596 63898621 63892771 64295568 65078534 66162820 67458419
39736 67458419 68899358 70452742 72099116 73805836 75519963 77188248 78788197 80346559
39728 80346559 81932647 83631762 85515525 87624676 89968310 92531352 95280003 98163035
39720 98163035 101114131 104058381 106919730 109626567 112119451 114366142 116378543 118215788
39712 118215788 119962920 121693492 123438378 125178574 126862995 128438676 129877824 131190308
39704 131190308 132417527 133612768 134820816 136068832 137370861 138737758 140182210 141714795
39696 141714795 143334721 145022773 146743351 148457329 150139622 151790393 153432616 155099434
39688A55099434J722436J802185J900415K014466K146752K310331K532583K848894
39680A72377496L286197L845714M494561N168938N786321O264073O541289O597667
39672B14362256O461602O203641N917225N692048N587502N615864N743240N907725
39664B61491103O044874O109482O088311O001966N894102N809854N774881N789954
39656C09004527N845126N940277O093021O325948O642456P010579P370037P660763
39648C61892734P852968P955571P998357Q006659P990311P948973P878404P767444
39640D25291421P592533P321253O924464O387167N712110M918646M039493L114354
39632D71301441K181225J271482M12469l68290j047132j617371k100466k543414
$$ plain form
39688 155099434 156821870 158624055 160524470 162538936 164685688 166996019 169528602 172377496
39680 172377496 175663693 179509407 184003968 189172906 194959227 201223300 207764589 214362256
39672 214362256 220823858 227027499 232944724 238636772 244224274 249840138 255583378 261491103
39664 261491103 267535977 273645459 279733770 285735736 291629838 297439692 303214573 309004527
39656 309004527 314849653 320789930 326882951 333208899 339851355 346861934 354231971 361892734
39648 361892734 369745702 377701273 385699630 393706289 401696600 409645573 417523977 425291421
39640 425291421 432883954 440205207 447129671 453516838 459228948 464147594 468187087 471301441
39632 471301441 473482666 474754148 475166617 474798327 473751195 472133824 470033358 467489944
39624D67489944l002027l520892m121541m802192n543965o316870p082568p796115
39616D25303774q410786q887658r206541r370992r402299r325581r159075q915620
39608C52625222q612749q277734p939226p613056p297611o983802o668651o359338
39600B92873055o067089n800805n566917n371876n220657n111028n029270m951483
39592B49753930m848864m692784m458451m129581l705866l209366k682375k174101
39584B19852542j723824j352536j066407q63469p34313o59295o11746n68727n18858
39575B11753367m59009l86779l03055k26223k01589k89115n32360r30292j432321
39566B06992624j959267k436206k819146l104219l318609l501325l685066l886575
$$ plain form
39624 467489944 464487917 460967025 456845484 452043292 446499327 440182457 433099889 425303774
39616 425303774 416892988 408005330 398798789 389427797 380025498 370699917 361540842 352625222
39608 352625222 344012473 335734739 327795513 320182457 312884846 305901044 299232393 292873055
39600 292873055 286805966 281005161 275438244 270066368 264845711 259734683 254705413 249753930
39592 249753930 244905066 240212282 235753831 231624250 227918384 224709018 222026643 219852542
39584 219852542 218128718 216776182 215709775 214846306 214111993 213452698 212840952 212272225 211753367
39575 211753367 211294358 210907579 210604524 210378301 210176712 209887597 209355237 208424945 206992624
39566 206992624 205033357 202597151 199778005 196673786 193355177 189853852 186168786 182282211
39558A82282211m105544m327418m526823m671448m728024m671867m499940m242126
39550A46509021l959831l723944l579760l521540l495879l431171l271775k997069
39542A18528052k621404k182960j730666j314519r80970p70637p12840q15060
39534A07398996j053991j377595j719813k019594k234531k345668k355772k284301
39526I2007731k160927k018343j884746j777069j697995j639145j588430j535622
39518G7705454j472996j394038j294191j172831j033178q80906p25433n84081
39510F9147800m83363m52883n14289o71907r09183j191269j472785j709055j866432
39501E9876634j927017j887357j755453j549493j296179j024448p55398m95259
$$ plain form
39558 182282211 178176667 173849249 169322426 164650978 159922954 155251087 150751147 146509021
39550 146509021 142549190 138825246 135245486 131723946 128228067 124796896 121525121 118528052
39542 118528052 115906648 113723688 111993022 110678503 109697533 108926896 108214056 107398996
39534 107398996 106345005 104967410 103247597 101228003 98993472 96647804 94292032 92007731
39526 92007731 89846804 87828461 85943715 84166646 82468651 80829506 79241076 77705454
39518 77705454 76232458 74838420 73544229 72371398 71338220 70457314 69731881 69147800
39510 69147800 68664437 68211554 67697265 67025358 66116175 64924906 63452121 61743066 59876634
39501 59876634 57949617 56062260 54306807 52757314 51461135 50436687 49681289 49186030
39493D9186030k37622K6350K96905N60013P87831R44076R94132R19120P28183
39484E4205018M60018J69672r3480l04661m70004o18151p82342r82351j214723
39475E0368996j453864j660618j794196j825550j749089j585468j370706j137450
39467C7792055r01923o64612m21270j75494N3520K31545L19617K89927J37776
39458C6661141j16774m35179p69343j072445j311462j474873j568157j600229
39450B8312679j572867j479587j310500j059407p33914l65245o172K88175M83854
39441B2557016N76873N83669N27099M29739L12799J94292Q6450l832p2598j19178
39431B5072329j49973j79865k24865k86681l39347l32082k13748L3990L78595
$$ plain form
39493 49186030 48948408 48974758 49271663 49831676 50619507 51563583 52557715 53476835 54205018
39484 54205018 54665036 54834708 54741228 54436567 53966563 53348412 52566070 51583719 50368996
39475 50368996 48915132 47254514 45460318 43634768 41885679 40300211 38929505 37792055
39467 37792055 36890132 36225520 35804250 35628756 35682276 35913821 36233438 36523365 36661141
39458 36661141 36544367 36109188 35339845 34267400 32955938 31481065 29912908 28312679
39450 28312679 26739812 25260225 23949725 22890318 22156404 21791159 21784987 22073162 22557016
39441 22557016 23133889 23717558 24244657 24674396 24987195 25181487 25267937 25264105 25191507 25072329
39431 25072329 24922356 24742491 24517626 24230945 23891598 23559516 23345768 23379758 23758353
39422B3758353P47391J057580J243518J268404J123837Q26357M14143n8173n27977
39413B9853433r35113j232226j392021j408469j292998j071507p86337m98129
39405B1236633k77186j81253k30247l94311o04114p79182q60325q30112p11616
39396A6368287n48396l79843k26278q7413N1979K15370M27059P02410J037299
39387A7560474J401273J739003J982568K072366J977168J701179J274578P37623
39379C0446232J31846m98650j104132j632892k041648k306836k430333k435873
39371A8127714k356813k221968k048857j848402j635583j435636j278993j186554
39363D114908j154342j149179j121470j029445q60108o34418l96032j93312o4727
$$ plain form
39422 23758353 24505744 25563324 26806842 28075246 29199083 30025440 30439583 30381410 29853433
39413 29853433 28918320 27686094 26294073 24885604 23592606 22521099 21734762 21236633
39405 21236633 20959447 20778194 20547947 20153636 19549522 18770340 17910015 17079903 16368287
39396 16368287 15819891 15440048 15213770 15126357 15178336 15393706 15820765 16523175 17560474
39387 17560474 18961747 20700750 22683318 24755684 26732852 28434031 29708609 30446232
39379 30446232 30578078 30079428 28975296 27342404 25300756 22993920 20563587 18127714
39371 18127714 15770901 13548933 11500076 9651674 8016091 6580455 5301462 4114908
39363 4114908 2960566 1811387 689917 -339528 -1199636 -1834054 -2230086 -2423398 -2488125
39354b488125l1080r2179k25894l91598n40936o33103o45464n72908m20181j98057
39344f239525P2156L53111N95525P54181Q07302P66578O69971N61277M71376M14414
39334g73634L96575M22374M89937N83756O77771P47524P78873P66857P10867O13602
39324E414502M83251L34444J85991N4994n2622j50950k72845m53446p06316j008186
39314C828817j302470j518623j596104j502472j240998q48773l87876O9179M58155
39305d041165P39655R04526R65595R44596Q66007P59504O62127O12309O37202
39296C050356P40593Q97452J058016J162287J161332J035788Q00703M94089J57492
39287A0558108j78953m99847p98100j066049j291071j457920j554440j575021
$$ plain form
39354 -2488125 -2519205 -2611384 -2837278 -3228876 -3769812 -4402915 -5048379 -5621287 -6041468 -6239525
39344 -6239525 -6167369 -5814258 -5218733 -4464552 -3657250 -2890672 -2220701 -1659424 -1188048 -773634
39334 -773634 -377059 45315 535252 1119008 1796779 2544303 3323176 4090033 4800900 5414502
39324 5414502 5897753 6232197 6418188 6473182 6420560 6269610 5996765 5543319 4837003 3828817
39314 3828817 2526347 1007724 -588380 -2090852 -3331850 -4180623 -4568499 -4499320 -4041165
39305 -4041165 -3301510 -2396984 -1431389 -486793 379214 1138718 1800845 2413154 3050356
39296 3050356 3790949 4688401 5746417 6908704 8070036 9105824 9906527 10400616 10558108
39287 10558108 10379155 9879308 9081208 8015159 6724088 5266168 3711728 2136707
39279B136707j519371j389432j189318r29121o29061l19916l8675J79226L08717
39270c390244L40951K82213J47066m6430k72605m89855o41780o75505n68405l44815
39260e659409p0710J71117L12858L26453K31082Q0778o1168j47798j62974j21729
39250e101500n9726j6424j6676n7963j11265j37101j07332j8212J12533K58166
39240e255500L92076M87629N15457M48902K78747K5823k60935n21445p05107p84021
39230e378374p56639o44508m82766l04778j28177M6222K20152L81638N03556N59057
39220e984617N39526M60461L54246K58463K05972K16455K88836L98484N04257
39211b757917N64956N57174M83797L67567K34129R6438m9091k13916m03945o09861
$$ plain form
39279 2136707 617336 -772096 -1961414 -2890535 -3519596 -3839512 -3878187 -3698961 -3390244
39270 -3390244 -3049293 -2767080 -2620014 -2666444 -2939049 -3428904 -4070684 -4746189 -5314594 -5659409
39260 -5659409 -5730119 -5559002 -5246144 -4919691 -4688609 -4607831 -4668999 -4816797 -4979771 -5101500
39250 -5101500 -5161226 -5177650 -5194326 -5252289 -5363554 -5500655 -5607987 -5626199 -5513666 -5255500
39240 -5255500 -4863424 -4375795 -3860338 -3411436 -3132689 -3106866 -3367801 -3889246 -4594353 -5378374
39230 -5378374 -6135013 -6779521 -7262287 -7567065 -7695242 -7649020 -7428868 -7047230 -6543674 -5984617
39220 -5984617 -5445091 -4984630 -4630384 -4371921 -4165949 -3949494 -3660658 -3262174 -2757917
39211 -2757917 -2192961 -1635787 -1151990 -784423 -550294 -453856 -502947 -716863 -1120808 -1730669
39201a730669q04596r47525r95222r17900p16468m30276j27711J19149K64058
39192f287160L04946K81215K51519K64188L36038M49382N65566O44436O58712
39183b531158N98828M70645K90805Q2928j24422k98520m03583m04841k77317j7608
39173b614243L47665P64264J166022J497444J731650J875198J959136K021883
39165H749019K091272K172518K246959K281798K245252K119084J904165J619334
39157B5429401J295319R65400O56196L83944J58634q406j01611j07774k9278J05155
39147B8746980K42123L21714L05153J95681L7757j07431j96288k26092k32582
39138B9087015k63275l44020m60676n66509o06997n44623l72744j18502J62600
$$ plain form
39201 -1730669 -2535265 -3482790 -4478012 -5395912 -6112380 -6542656 -6670367 -6551218 -6287160
39192 -6287160 -5982214 -5700999 -5449480 -5185292 -4849254 -4399872 -3834306 -3189870 -2531158
39183 -2531158 -1932330 -1461685 -1170880 -1087952 -1212374 -1510894 -1914477 -2319318 -2596635 -2614243
39173 -2614243 -2266578 -1502314 -336292 1161152 2892802 4768000 6727136 8749019
39165 8749019 10840291 13012809 15259768 17541566 19786818 21905902 23810067 25429401
39157 25429401 26724720 27690120 28346316 28730260 28888894 28880488 28778877 28671103 28641825 28746980
39147 28746980 28989103 29310817 29615970 29811651 29849408 29741977 29545689 29319597 29087015
39138 29087015 28823740 28479720 28019044 27452535 26845538 26300915 25928171 25809669 25972269
39129B5972269M01749N40893N56251M67226L24962J87949R8538P0450R0190J28349
39119B8838826J52608J35232N5228r8591l20563n83596q45515j065076j216550
39110B5052003j294482j310640j289285j261413j254772j281293j330315j374023
39102A4655780j382258j336624j235230j086867r01611o87989m61229k55130j22421
39093G186421j15410k56275n17850q29234j102559j264720j279374j153873r32801
39084b65675o81637m65288l28405k84655l17865l92220m66066n04976m90894m24691
39074d622372l21648k03368r0994j521N4558P5163O5890L5195j1562p4421j56429
39063e251509k60030l85768n32903o98705q74419j040295j166052j221347j191699
$$ plain form
39129 25972269 26374018 26914911 27471162 27938388 28263350 28451299 28549837 28620287 28710477 28838826
39119 28838826 28991434 29126666 29181894 29083303 28762740 28179144 27333629 26268553 25052003
39110 25052003 23757521 22446881 21157596 19896183 18641411 17360118 16029803 14655780
39102 14655780 13273522 11936898 10701668 9614801 8713190 8025201 7563972 7308842 7186421
39093 7186421 7071011 6814736 6296886 5467652 4365093 3100373 1820999 667126 -265675
39084 -265675 -947312 -1412600 -1741005 -2025660 -2343525 -2735745 -3201811 -3706787 -4197681 -4622372
39074 -4622372 -4944020 -5147388 -5238382 -5239903 -5185345 -5110182 -5044292 -5009097 -5020659 -5095080 -5251509
39063 -5251509 -5511539 -5897307 -6430210 -7128915 -8003334 -9043629 -10209681 -11431028 -12622727
39054a2622727j086996r33300p53975n56885l37755r3586J66797M20717O35449
39045a5162261P75630Q14815P47910N95726L96345J88399l167j72142l25997m72843
39035a2617585o05553o93176o88815n52178k72404J24016N83930J048224J470431
39026a2203110J825657K108953K327152K489710K602524K666059K677484K635231
39018G129660K542646K407540K238243K040420J816664J565924J280558R46090
39010B1967745N50913J03343l58799p78868j107993j328452j457554j532417j589138
39001A4468780j649061j714999j773684j801488j773045j671450j496269j266030
38993A322754j014571p81595n98673m75866l97940l34634k57974j53727k1653
$$ plain form
39054 -12622727 -13709723 -14643023 -15396998 -15953883 -16291638 -16385224 -16218427 -15797710 -15162261
39045 -15162261 -14386631 -13571816 -12823906 -12228180 -11831835 -11643436 -11646603 -11818745 -12144742 -12617585
39035 -12617585 -13223138 -13916314 -14605129 -15157307 -15429711 -15305695 -14721765 -13673541 -12203110
39026 -12203110 -10377453 -8268500 -5941348 -3451638 -849114 1816945 4494429 7129660
39018 7129660 9672306 12079846 14318089 16358509 18175173 19741097 21021655 21967745
39010 21967745 22518658 22622001 22263202 21484334 20376341 19047889 17590335 16057918 14468780
39001 14468780 12819719 11104720 9331036 7529548 5756503 4085053 2588784 1322754
38993 1322754 308183 -473412 -1072085 -1547951 -1945891 -2280525 -2538499 -2692226 -2713879
38984b713879J29856K88190M40443N79328P07206Q31082R49073J039277J062064
38975C312640R75792P55733M05791m0423n27048r89513j371767j640937j790572
38966i10304j829737j767781j609340j363336j054708p25386m22494j82293j8459
38957i883838Q1485J49979K23714L24043M44403N52700O07155N76180M52382K55558
38947f216239K5552j89880l46368m10911l67824k23673q426K31757M49981O14608
38937f441423P15757P59200P55247P13050O42598N56909M67672L76925K73608
38928a180457J39145m1776k71948n38034q14227j072068j291176j463732j590283
38919h124556j672272j708014j692726j618632j473976j244772r22334n13613
$$ plain form
38984 -2713879 -2584023 -2295833 -1855390 -1276062 -568856 262226 1211299 2250576 3312640
38975 3312640 4288432 5044165 5449956 5409533 4882485 3892972 2521205 880268 -910304
38966 -910304 -2740041 -4507822 -6117162 -7480498 -8535206 -9260592 -9683086 -9865379 -9883838
38957 -9883838 -9802353 -9652374 -9428660 -9104617 -8660214 -8107514 -7500359 -6924179 -6471797 -6216239
38947 -6216239 -6190687 -6380567 -6726935 -7137846 -7505670 -7729343 -7737769 -7506012 -7056031 -6441423
38937 -6441423 -5725666 -4966466 -4211219 -3498169 -2855571 -2298662 -1830990 -1454065 -1180457
38928 -1180457 -1041312 -1083088 -1355036 -1893070 -2707297 -3779365 -5070541 -6534273 -8124556
38919 -8124556 -9796828 -11504842 -13197568 -14816200 -16290176 -17534948 -18457282 -18970895
38911a8970895m7032M31765Q73550J241328J519291J710403J825971J875631J864091
38902g675897J795345J680149J540545J406248J302410J235270J186185J120634
38894C590889J008229Q41668O42020M46069K83116J56413M1722r6952k86520n32118
38884F094536q17000j111149j382838j608312j774835j875205j899569j835085
38876f209457j676600j438617j155726q69952o15539m11462k62873j67182j21601
38867a2929009j30015k04708l58147n87176q60846j122827j308298j363776j258902
38858b0123704r89630n79600q1797M25554Q54824J133352J225753J143835R38929
38849a6052484O78354M17126J82021k2221j92839l14295l59917l05365j43679
$$ plain form
38911 -18970895 -19017927 -18586162 -17712612 -16471284 -14951993 -13241590 -11415619 -9539988 -7675897
38902 -7675897 -5880552 -4200403 -2659858 -1253610 48800 1284070 2470255 3590889
38894 3590889 4599118 5440786 6082806 6528875 6811991 6968404 7010126 6913174 6626654 6094536
38884 6094536 5277536 4166387 2783549 1175237 -599598 -2474803 -4374372 -6209457
38876 -6209457 -7886057 -9324674 -10480400 -11350352 -11965891 -12377353 -12640226 -12807408 -12929009
38867 -12929009 -13059024 -13263732 -13621879 -14209055 -15069901 -16192728 -17501026 -18864802 -20123704
38858 -20123704 -21113334 -21692934 -21774731 -21349177 -20494353 -19361001 -18135248 -16991413 -16052484
38849 -16052484 -15374130 -14957004 -14774983 -14797204 -14990043 -15304338 -15664255 -15969620 -16113299
38840a6113299J04635L91012O52160Q34821R18649R22966Q94766Q86094R30650
38831i577546J028596J148750J250526J312442J345597J382060J448983J547884
38823H87292J650367J708801J673325J505643J184775P08117R5222o05812j320126
38814G487604j964689k476368k830601l038863l130698l135418l073707k958849
38806a5121589k802075k616448k416178k211237k001009j773003j509569j198552
38798c1649660q39954m44814k9890L85976P82443J138134J433458J655440J802311
38789b5766556J884736J921088J928027J912950J874068J806437J707648J580400
38781a1151202J433569J280763J132251R83055Q09722N84854L00854j7246l21597
$$ plain form
38840 -16113299 -16008664 -15617652 -14965492 -14130671 -13212022 -12289056 -11394290 -10508196 -9577546
38831 -9577546 -8548950 -7400200 -6149674 -4837232 -3491635 -2109575 -660592 887292
38823 887292 2537659 4246460 5919785 7425428 8610203 9318320 9413542 8807730 7487604
38814 7487604 5522915 3046547 215946 -2822917 -5953615 -9089033 -12162740 -15121589
38806 -15121589 -17923664 -20540112 -22956290 -25167527 -27168536 -28941539 -30451108 -31649660
38798 -31649660 -32489614 -32934428 -32964318 -32578342 -31795899 -30657765 -29224307 -27568867 -25766556
38789 -25766556 -23881820 -21960732 -20032705 -18119755 -16245687 -14439250 -12731602 -11151202
38781 -11151202 -9717633 -8436870 -7304619 -6321564 -5511842 -4926988 -4626134 -4643380 -4964977
38772d964977n66596p31119q24973q79061r28175r96506j090586j199150j298595
38763a3479738j363098j374942j326889j213961j024075p40429l55851J14748
38755b0764235O35337J160225J645291K054302K362818K560162K645366K616473
38747e084261K461761K163042J710843J119615M30941k96243r99467j622408k120537
38738b236714k467328k660322k719239k670998k529560k288118j932939j468216
38730b0973434r29792l75924J36027N68903R10812J167589J348395J450994J456082
38721a5240348J339224J096397P64103M15705J33849k3216m2418M3921J75255
38712a1337528K88707L43086L31439K78652K28164K25156L01309M63845O91528
$$ plain form
38772 -4964977 -5531573 -6262692 -7087665 -7966726 -8894901 -9891407 -10981993 -12181143 -13479738
38763 -13479738 -14842836 -16217778 -17544667 -18758628 -19782703 -20523132 -20878983 -20764235
38755 -20764235 -20128898 -18968673 -17323382 -15269080 -12906262 -10346100 -7700734 -5084261
38747 -5084261 -2622500 -459458 1251385 2371000 2801941 2505698 1506231 -116177 -2236714
38738 -2236714 -4704042 -7364364 -10083603 -12754601 -15284161 -17572279 -19505218 -20973434
38730 -20973434 -21903226 -22279150 -22143123 -21574220 -20663408 -19495819 -18147424 -16696430 -15240348
38721 -15240348 -13901124 -12804727 -12040624 -11624919 -11491070 -11514286 -11556704 -11512783 -11337528
38712 -11337528 -11048821 -10705735 -10374296 -10095644 -9867480 -9642324 -9341015 -8877170 -8185642
38703h185642R40072J156344J296565J341718J304424J223975J149692J118125
38695A345273J134854J171489J179570J112447R43296O73648L33002l0091l65412
38686G498076o40947q52555j015284j142561j229058j249132j171219r79833o93390
38677a475903l66725p4374J17096J71463Q8595j04286l65188o45774q96038j070062
38667d621196j135595j084473r37142p36347n31496l61462k44119j75483j34881
38658i962194r1256r554J40369L71870O71238R95260J279674J457279J480926
38649c666388J341109J065657O98873K76637j80134o50651j099205j479293j751895
38640e445290j898900j924116j849396j710604j548066j389221j233617j052211
$$ plain form
38703 -8185642 -7245570 -6089226 -4792661 -3450943 -2146519 -922544 227148 1345273
38695 1345273 2480127 3651616 4831186 5943633 6886929 7560577 7893579 7863488 7498076
38686 7498076 6857129 6004574 4989290 3846729 2617671 1368539 197320 -782513 -1475903
38677 -1475903 -1842628 -1917002 -1799906 -1628443 -1539848 -1644134 -2009322 -2655096 -3551134 -4621196
38667 -4621196 -5756791 -6841264 -7778406 -8514753 -9046249 -9407711 -9651830 -9827313 -9962194
38658 -9962194 -10053450 -10063004 -9922635 -9550765 -8879527 -7884267 -6604593 -5147314 -3666388
38649 -3666388 -2325279 -1259622 -560749 -284112 -464246 -1114897 -2214102 -3693395 -5445290
38640 -5445290 -7344190 -9268306 -11117702 -12828306 -14376372 -15765593 -16999210 -18051421
38632a8051421q01358m41967M4821O48632J327913K014734K626547L085097L338827
38623f208175L377960L231436K947878K576213K158553J732824J335294R99598
38615A2151581P54989O22982O08365O86738P99987Q69501Q24272O28833K94574
38606A8241822j31053n88117j024888j407988j725653j988141k220652k444172
38598F711158k653429k810814k864226k775516k537656k170828j704805j162779
38590a1968895n58037R4298P58600J368817J840824K105141K139229J974657J673401
38581e71965J293399Q70366M23901k6749m55687q36386j153003j408598j625499
38572c490221j835898k065569k319945k580963k813352k972806l012827k893775
$$ plain form
38632 -18051421 -18852779 -19294746 -19249925 -18601293 -17273380 -15258646 -12632099 -9547002 -6208175
38623 -6208175 -2830215 401221 3349099 5925312 8083865 9816689 11151983 12151581
38615 12151581 12906570 13529552 14137917 14824655 15624642 16494143 17318415 17947248 18241822
38606 18241822 18110769 17522652 16497764 15089776 13364123 11375982 9155330 6711158
38598 6711158 4057729 1246915 -1617311 -4392827 -6930483 -9101311 -10806116 -11968895
38590 -11968895 -12526932 -12432634 -11674034 -10305217 -8464393 -6359252 -4220023 -2245366 -571965
38581 -571965 721434 1591800 2015701 1988952 1533265 696879 -456124 -1864722 -3490221
38572 -3490221 -5326119 -7391688 -9711633 -12292596 -15105948 -18078754 -21091581 -23985356
38564b3985356k595745k129285j536046q77220k14730M05956R62650J449835J864206
38555b6655735K193210K413989K502587K447808K261977J981394J654944J327936
38547i871890J031219P79007N72561M07777K86211K22376K36185L31469M79918
38538e525167O28863P27983P51716P02475O01217M79196L73761L21169L43562
38529e95225M37818N76068P18532Q29050Q83267Q67950P78486O20700M15730K02055
38519E734431L1684l8343M1955K99808P23867J257370J808114K273330K568050
38510A4700266K645326K503933K185172J760945J314609R18777O18115M24296
38502B7071439L23433K89398K94568L13285L19088K81238J66373n3613l92395
$$ plain form
38564 -23985356 -26581101 -28710386 -30246432 -31123652 -31338382 -30932426 -29969776 -28519941 -26655735
38555 -26655735 -24462525 -22048536 -19545949 -17098141 -14836164 -12854770 -11199826 -9871890
38547 -9871890 -8840671 -8061664 -7489103 -7081326 -6795115 -6572739 -6336554 -6005085 -5525167
38538 -5525167 -4896304 -4168321 -3416605 -2714130 -2112913 -1633717 -1259956 -938787 -595225
38529 -595225 -157407 418661 1137193 1966243 2849510 3717460 4495946 5116646 5532376 5734431
38519 5734431 5766115 5727772 5769727 6069535 6793402 8050772 9858886 12132216 14700266
38510 14700266 17345592 19849525 22034697 23795642 25110251 26029028 26647143 27071439
38502 27071439 27394872 27684270 27978838 28292123 28611211 28892449 29058822 29005209 28612814
38493B8612814q44139j382703j961831k516831k973133l264327l353179l244111
38485I072560k980399k627818k252847j904827j608934j370312j183373j039647
38477e895597r31825q54612q01864p60571p07814o18145m78891k98723r7816J13403
38467a1332455L45687O19311R38836J277185J582595J800867J894138J845076
38459a028760J651048J319978Q73147L50139j91671o85016j064675j279856j305809
38450a361475j152574q66610n22010k02770J8785J02430N3784p6299k12320k89088
38440d508147k82752k19237j55908j49305k28148l84849n86706p96583r88420
38431h300055j149548j274145j358069j398886j396284j348539j247852j079968
$$ plain form
38493 28612814 27768675 26385972 24424141 21907310 18934177 15669850 12316671 9072560
38485 9072560 6092161 3464343 1211496 -693331 -2302265 -3672577 -4855950 -5895597
38477 -5895597 -6827422 -7682034 -8483898 -9244469 -9952283 -10570428 -11049319 -11348042 -11445858 -11332455
38467 -11332455 -10986768 -10367457 -9428621 -8151436 -6568841 -4767974 -2873836 -1028760
38459 -1028760 622288 1942266 2815413 3165552 2973881 2288865 1224190 -55666 -1361475
38450 -1361475 -2514049 -3380659 -3902669 -4105439 -4086654 -3984224 -3930440 -4006739 -4219059 -4508147
38440 -4508147 -4790899 -5010136 -5166044 -5315349 -5543497 -5928346 -6515052 -7311635 -8300055
38431 -8300055 -9449603 -10723748 -12081817 -13480703 -14876987 -16225526 -17473378 -18553346
38423a8553346q29820m91439p9865L59943P56204J031242J133600J063590Q76451
38414a4733440O60541N02206M55488N31412P09438R59838J260146J596574J955166
38405f102631K314261K644588K913558L087505L132469L021232K749436K349515
38397A6109933J885450J425619J012769O54049L34856L9873k35353m83850o89956
38388B0053390q31863q87059q42313p03649n00039k79298r9398j8650q5124l24885
38378A5481112p31690j263506j848916k400681k831014l065407l054763k785358
38370b500223k284609j620203q90565k05502L39069O82038Q03706P18591M64913
38361d492785R9291l05299o66249r06927r77449q71491o28631l16777j411K80924
$$ plain form
38423 -18553346 -19383166 -19874605 -19954470 -19594527 -18838323 -17807081 -16673481 -15609891 -14733440
38414 -14733440 -14072899 -13570693 -13115205 -12583793 -11874355 -10914517 -9654371 -8057797 -6102631
38405 -6102631 -3788370 -1143782 1769776 4857281 7989750 11010982 13760418 16109933
38397 16109933 17995383 19421002 20433771 21087820 21422676 21462549 21227196 20743346 20053390
38388 20053390 19221527 18334468 17492155 16788506 16288467 16009169 15909771 15891121 15805997 15481112
38378 15481112 14749422 13485916 11637000 9236319 6405305 3339898 285135 -2500223
38370 -2500223 -4784832 -6405035 -7295600 -7501102 -7162033 -6479995 -5676289 -4957698 -4492785
38361 -4492785 -4393494 -4698793 -5365042 -6271969 -7249418 -8120909 -8749540 -9066317 -9067728 -8786804
38351h786804N29610P66402J012897J271697J518856J710189J799109J756715
38343A578671J582425J300054R44460N48098J34368k79704o73699j014962j260439
38334B859272j370521j324259j123549p86143l38803J80807P18367J205577J576698
38325A597446J790466J842038J756202J567621J303633R80840O12728K16203j89887
38316A1477290n88467r61239j280210j505005j592882j515509j271712q92368
38308A869898m39519K010L45494N32203N53701M50442K87225J22610j0086j04190
38298C609788j68816k15588k50872k75771k89751k92242k81175k52177k01313
38289A382083j29780m7066K9736Q1437R5910P5930L8682N308j2170j6716k1600
$$ plain form
38351 -8786804 -8257194 -7490792 -6477895 -5206198 -3687342 -1977153 -178044 1578671
38343 1578671 3161096 4461150 5405610 5953708 6088076 5808372 5134673 4119711 2859272
38334 2859272 1488751 164492 -959057 -1745200 -2084003 -1903196 -1184829 20748 1597446
38325 1597446 3387912 5229950 6986152 8553773 9857406 10838246 11450974 11667177 11477290
38316 11477290 10888823 9927584 8647374 7142369 5549487 4033978 2762266 1869898
38308 1869898 1430379 1432389 1777883 2310086 2863787 3314229 3601454 3724064 3713978 3609788
38298 3609788 3440972 3225384 2974512 2698741 2408990 2116748 1835573 1583396 1382083
38289 1382083 1252303 1205237 1234973 1316410 1412320 1488250 1526932 1532240 1520070 1503354 1481754
38278A481754l9423p1169j00139r4635k0086J44719L96231P04547J019903J284288
38268D705990J447635J485831J410854J262896J086028R02996P06524M71711J79321
38259A3659786j65383n27826q53342j084105j176547j114478r15263o26666l12991
38250F883185l4327J70779K88738L20071K66232J27652q6047l46089o07060q20500
38240F162634r47338r61335q48491o11388k77558R9890M57302P43522R34043J027733
38230E779014J034143R65745Q39581O79646N10543L44508J73845k2606k62822
38221A0041597n46503q50532j135723j360536j495626j532456j481179j360183
38213B78859j187149r79213p58829n55053l95501k95122k50359k41249k38765
$$ plain form
38278 1481754 1442331 1371162 1271023 1176388 1156302 1301021 1697252 2401799 3421702 4705990
38268 4705990 6153625 7639456 9050310 10313206 11399234 12302230 13008754 13480465 13659786
38259 13659786 13494403 12966577 12113235 11029130 9852583 8738105 7822842 7196176 6883185
38250 6883185 6848858 7019637 7308375 7628446 7894678 8022330 7936283 7590194 6983134 6162634
38240 6162634 5215296 4253961 3405470 2794082 2516524 2616414 3073716 3817238 4751281 5779014
38230 5779014 6813157 7778902 8618483 9298129 9808672 10153180 10327025 10304419 10041597
38221 10041597 9495094 8644562 7508839 6148303 4652677 3120221 1639042 278859
38213 278859 -908290 -1887503 -2646332 -3201385 -3596886 -3892008 -4142367 -4383616 -4622381
38204d622381k14940j54178o2087L2447Q3581M2450j22693m05043p48477j060208
38194g231529j245993j248459j064852p36935l26573J04177N02110Q28251J065670
38185i354133J224188J331648J413173J474389J502678J481952J404096J268330
38177A746321J075812Q29342N36749K10459j36975m93641q42127j153767j392505
38168C79668j528188j549749j468790j312330j111241q92331o76566m80166l14328
38159h954021j82714p8239J8973J39762L17083N71486Q99245J271462J642715
38150d354248J960679K172936K235654K126185J851361J441687R34528L60443
38142H729225k57231q92507j506396k043684k440077k639607k616092k385918
$$ plain form
38204 -4622381 -4837321 -4991499 -5053586 -5021139 -4937558 -4895108 -5017801 -5422844 -6171321 -7231529
38194 -7231529 -8477522 -9725981 -10790833 -11527768 -11854341 -11750164 -11248054 -10419803 -9354133
38185 -9354133 -8129945 -6798297 -5385124 -3910735 -2408057 -926105 477991 1746321
38177 1746321 2822133 3651475 4188224 4398683 4261708 3768067 2925940 1772173 379668
38168 379668 -1148520 -2698269 -4167059 -5479389 -6590630 -7482961 -8159527 -8639693 -8954021
38159 -8954021 -9136735 -9214974 -9196001 -9056239 -8739156 -8167670 -7268425 -5996963 -4354248
38150 -4354248 -2393569 -220633 2015021 4141206 5992567 7434254 8368782 8729225
38142 8729225 8471994 7579487 6073091 4029407 1589330 -1050277 -3666369 -6052287
38134f052287k002109j533097j041600n75717j70432J50235L75203N08912N70776
38125i770116N92152O10922O60552P53989Q72143R68373R88811Q96186O84682
38116b742306L81770L8668k86222n42881o95756p21440o09532l73414o0219K57408
38106e353924N09383O57243P03869O80765O25657N65334N10961M64009M25313
38097b11390L99045L88959L91161L90501L64562K93756J71786R180j73515l58426
38087A665619n38428p13387q77385j008064j068457j022835q57432n91784k71972
38078e284125N0454L40461N90221Q15226J040375J283166J540964J788144J985004
38069D149890K094294K095979J992080J799841J539310J224421Q62761M62130
$$ plain form
38134 -6052287 -8054396 -9587493 -10629093 -11204810 -11375242 -11225007 -10849804 -10340892 -9770116
38125 -9770116 -9177964 -8567042 -7906490 -7152501 -6280358 -5311985 -4323174 -3426988 -2742306
38116 -2742306 -2360536 -2321868 -2608090 -3150971 -3846727 -4568167 -5177699 -5551113 -5611332 -5353924
38106 -5353924 -4844541 -4187298 -3483429 -2802664 -2177007 -1611673 -1100712 -636703 -211390
38097 -211390 187655 576614 967775 1358276 1722838 2016594 2188380 2197560 2024045 1665619
38087 1665619 1127191 413804 -463581 -1471645 -2540102 -3562937 -4420369 -5012153 -5284125
38078 -5284125 -5233671 -4893210 -4302989 -3487763 -2447388 -1164222 376742 2164886 4149890
38069 4149890 6244184 8340163 10332243 12132084 13671394 14895815 15758576 16220706
38061A6220706L8503l79175p50295j031613j191436j220237j129672r41955o80295
38052H934531l67967l2806K91176N69229P75931R04156R66744R87891R88724R76845
38042A4994454R45844Q81716P70055O02238L81379J25664j34854l67559n47355
38033A7651582o62675p15627p16970o79997o19980n61147n42769o12238q03630
38024A1736549j114583j497306j870082k144028k252998k173557j926753j563213
38016b805971j141102p07836k91868R4393M44221P45995R78580J114112J126203
38007d43273J001915P54391M28721R4268j74206l16826l03680j43459J17307M09502
37997A424660O67063Q46921R31280R17971Q13164O30826L92122J20369j64912
$$ plain form
38061 16220706 16259209 15880034 15129739 14098126 12906690 11686453 10556781 9614826 8934531
38052 8934531 8566564 8533758 8824934 9394163 10170094 11074250 12040994 13028885 14017609 14994454
38042 14994454 15940298 16822014 17592069 18194307 18575686 18701350 18566496 18198937 17651582
38033 17651582 16988907 16273280 15556310 14876313 14256333 13695186 13152417 12540179 11736549
38024 11736549 10621966 9124660 7254578 5110550 2857552 683995 -1242758 -2805971
38016 -2805971 -3947073 -4654909 -4946777 -4852384 -4408163 -3662168 -2683588 -1569476 -443273
38007 -443273 558642 1313033 1741754 1836022 1661816 1344990 1041310 897851 1015158 1424660
37997 1424660 2091723 2938644 3869924 4787895 5601059 6231885 6624007 6744376 6579464
37988F579464m50964p32183j007876j275220j519299j708564j802334j766929
37980c683905j589766j283501q80528m25156K9032M16605O61917O94887M78629
37971e581786L3019n61948j185776j710053k030898k092110j893811j485259r45489
37962a7454111l59841J99588O85541J079044J385816J626505J823465J989821
37954i024172K126483K226981K283455K288070K231688K105500J906591J641893
37946G786489J326531R79279O19435K65093o9409l75224o45498q67402j017789
37937H001505j069934j009327q47263o21331l81195j68247q72J28225K44253L78078
37927D653892N53786P77574J029913J265707J426566J462191J349397J097367
$$ plain form
37988 6579464 6128500 5396317 4388441 3113221 1593922 -114642 -1916976 -3683905
37980 -3683905 -5273671 -6557172 -7437700 -7862856 -7833824 -7417219 -6755302 -6060415 -5581786
37971 -5581786 -5548767 -6110715 -7296491 -9006544 -11037442 -13129552 -15023363 -16508622 -17454111
37962 -17454111 -17813952 -17614364 -16928823 -15849779 -14463963 -12837458 -11013993 -9024172
37954 -9024172 -6897689 -4670708 -2387253 -99183 2132505 4238005 6144596 7786489
37946 7786489 9113020 10092299 10711734 10976827 10907418 10532194 9886696 9019294 8001505
37937 8001505 6931571 5922244 5074981 4453650 4072455 3904208 3903336 4031561 4275814 4653892
37927 4653892 5207678 5985252 7015165 8280872 9707438 11169629 12519026 13616393
37919A3616393P38725L17470j16067n05591p95330r46482r53273q44833o70919
37910I840093m82759l20958k12733j73333k06959l06843m56247o31993q10472
37901F237796r74082j114484j230872j325804j403401j471171j541073j624370
37893d447461j720969j811193j859099j828692j703661j497318j246732r97268
37885a7112393p88833o49477n93699o22019p22187q73204j049647j223221j362835
37876b4997515j437178j420741j300467j080527p84001m48491j13342J96700M80405
37867c0905157P55022J042450J356733J697205K045753K368373K624416K782912
37859a6232293K836992K805289K717522K593675K431793K212920J917940J542016
$$ plain form
37919 13616393 14355118 14672588 14556521 14050930 13255600 12309118 11355845 10511012 9840093
37910 9840093 9357334 9036376 8823643 8650310 8443351 8136508 7680261 7048268 6237796
37901 6237796 5263714 4149230 2918358 1592554 189153 -1282018 -2823091 -4447461
37893 -4447461 -6168430 -7979623 -9838722 -11667414 -13371075 -14868393 -16115125 -17112393
37885 -17112393 -17901226 -18550703 -19144402 -19766421 -20488608 -21361812 -22411459 -23634680 -24997515
37876 -24997515 -26434693 -27855434 -29155901 -30236428 -31020429 -31468920 -31582262 -31385562 -30905157
37867 -30905157 -30150135 -29107685 -27750952 -26053747 -24007994 -21639621 -19015205 -16232293
37859 -16232293 -13395301 -10590012 -7872490 -5278815 -2847022 -634102 1283838 2825854
37851B825854J096839O03583Q6677m26383r02819j305831j600534j761443j778772
37842c162829j663132j449005j194822r75152q62470r03285j099946j407746j748189
37833a4466576k031571k180288k146258j918195j518333r92618l99426K01012
37825b5452253P56494J230403J604476J876426K054422K150289K174159K134911
37817a1470673K047535J939345J844218J785070J758839J737087J680474J554470
37809B876365J337653J024088O24807J69410k95638p14815j035883j221497j256310
37800A508180j150605r42593o95518m81791l54012l17755l26584l07287k01017
37791c268982O831K87981N99676R14450J226604J535020J824157K062916K219300
$$ plain form
37851 2825854 3922693 4526276 4612953 4186570 3283751 1977920 377386 -1384057 -3162829
37842 -3162829 -4825961 -6274966 -7469788 -8444940 -9307410 -10210695 -11310641 -12718387 -14466576
37833 -14466576 -16498147 -18678435 -20824693 -22742888 -24261221 -25253839 -25653265 -25452253
37825 -25452253 -24695759 -23465356 -21860880 -19984454 -17930032 -15779743 -13605584 -11470673
37817 -11470673 -9423138 -7483793 -5639575 -3854505 -2095666 -358579 1321895 2876365
37809 2876365 4214018 5238106 5862913 6032323 5736685 5021870 3985987 2764490 1508180
37800 1508180 357575 -585018 -1280536 -1762327 -2116339 -2434094 -2760678 -3067965 -3268982
37791 -3268982 -3262151 -2974170 -2374494 -1460044 -233440 1301580 3125737 5188653 7407953
37782G407953K275123K230140K096638J889442J616006J273210Q56744L79950
37774B0025206j11331n40987q24436r00879p60850m54249p2805K83870N38546
37765A7182085O47936N97290L91795N4865l69412q19662j231698j557865j779026
37756A3116308j901669j943214j915056j812719j619009j320951r32655n07670
37748A163365j27728J28413K16256J38504o3478l29582o00714q32353j000879
37739a308196j104265j158760j191690j229957j287331j357975j422058j461667
37731a1521899j477076j491348j536860j629797j750762j849246j871931j793355
37723b4922274j625036j398818j141191q58207n37874j64954K61043P14014J143568
$$ plain form
37782 7407953 9683076 11913216 14009854 15899296 17515302 18788512 19645256 20025206
37774 20025206 19913875 19372888 18548452 17647573 16886723 16432474 16359669 16643539 17182085
37765 17182085 17830021 18427311 18819106 18873971 18504559 17684897 16453199 14895334 13116308
37756 13116308 11214639 9271425 7356369 5543650 3924641 2603690 1671035 1163365
37748 1163365 1035637 1164050 1380306 1518810 1455332 1125750 525036 -307317 -1308196
37739 -1308196 -2412461 -3571221 -4762911 -5992868 -7280199 -8638174 -10060232 -11521899
37731 -11521899 -12998975 -14490323 -16027183 -17656980 -19407742 -21256988 -23128919 -24922274
37723 -24922274 -26547310 -27946128 -29087319 -29945526 -30483400 -30648354 -30387311 -29673297 -28529729
37714b8529729J492772J721954J823275J817104J734902J602434J434907J245058
37706a5657323J054989Q99709Q17083Q30131R34483J099511J280384J431088J512429
37697e797516J497676J380378J181923R50504P46728O20879N93754O51326P54966
37688B580618Q59336R26842R34139Q75679P69180O56841N90515O01426O75023
37679I469599P54241P73161O97954N46226L72991K34632J55276J16163P2157j7869
37669A3174531j67095l56830n52004p23835q64203r83450j096088j207984j314795
37660E908247j409586j490281j561189j630099j703627j781642j851938j889162
37652g409277j860781j738362j509092j183308p95773l99882n5386J87359L01542
$$ plain form
37714 -28529729 -27036957 -25315003 -23491728 -21674624 -19939722 -18337288 -16902381 -15657323
37706 -15657323 -14602334 -13702625 -12885542 -12055411 -11120928 -10021417 -8741033 -7309945 -5797516
37697 -5797516 -4299840 -2919462 -1737539 -787035 -40307 580572 1174326 1825652 2580618
37688 2580618 3439954 4366796 5300935 6176614 6945794 7602635 8193150 8794576 9469599
37679 9469599 10223840 10997001 11694955 12241181 12614172 12848804 13004080 13120243 13192400 13174531
37669 13174531 13007436 12650606 12098602 11374767 10510564 9527114 8431026 7223042 5908247
37660 5908247 4498661 3008380 1447191 -182908 -1886535 -3668177 -5520115 -7409277
37652 -7409277 -9270058 -11008420 -12517512 -13700820 -14496593 -14896475 -14951861 -14764502 -14462960
37643a4462960K91155J88908M7520p0103j00281P679K71314O58696J092370J477251
37633a0598451J736105J831670J768658J582993J325554J043028P60705M76595
37625g3143J71249j73758n60328r66859j349887j654392j831985j858724j739832
37616a0037659j497637j155252p32229k53154K46311P28050J167265J557758J901230
37607h075317K193416K420671K565663K612850K551630K381992K121326J803121
37599A0575352J465121J137895Q45204O12301M68352M36248N16764O79293Q67072
37590A7603602J017213J087004J070980R96678R02571Q14799P36565O50778N29676
37581B5409866L47798R6323k06876n18315p82013r48391r91086r15132p52590
$$ plain form
37643 -14462960 -14171805 -13982897 -13935377 -14005480 -14105761 -14098082 -13826768 -13168072 -12075702 -10598451
37633 -10598451 -8862346 -7030676 -5262018 -3679025 -2353471 -1310443 -549738 -73143
37625 -73143 98106 -75652 -635980 -1602839 -2952726 -4607118 -6439103 -8297827 -10037659
37616 -10037659 -11535296 -12690548 -13422777 -13675931 -13429620 -12701570 -11534305 -9976547 -8075317
37607 -8075317 -5881901 -3461230 -895567 1717283 4268913 6650905 8772231 10575352
37599 10575352 12040473 13178368 14023572 14635873 15104225 15540473 16057237 16736530 17603602
37590 17603602 18620815 19707819 20778799 21775477 22678048 23492847 24229412 24880190 25409866
37581 25409866 25757664 25853987 25647111 25128796 24346783 23398392 22407306 21492174 20739584
37572B0739584n47758l41784j66386m5509N207j3958q0452j56354k09326k34553
37562A8948711k61906l41974n18190q01130j159533j531532j846735k045932k091636
37553H350143j971408j698455j310277q63110m21148m3855K23636L54983L44684
37544B965193K10642n171k44188m48727n81613o35739o27994n83547n22093m53085
37534i26322l78107k94411j97046q1566N1953J97561L47328M95230O33217P41696
37524E89533P87826P40234N90740L63945J05879j39724l51942n39450p30592r51178
37514D65271j202424j454355j659491j774844j774729j649708j401305j041898
37506a1493483n97527j06057L89924Q48435J227914J487249J594407J542919J364552
$$ plain form
37572 20739584 20191826 19850042 19683656 19638147 19643354 19629396 19548944 19392590 19183264 18948711
37562 18948711 18686805 18344831 17826641 17025511 15865978 14334446 12487711 10441779 8350143
37553 8350143 6378735 4680280 3370003 2506893 2085745 2041890 2265526 2620509 2965193
37544 2965193 3175835 3170664 2926476 2477749 1896136 1260397 632403 48856 -473237 -926322
37534 -926322 -1304429 -1598840 -1795886 -1877452 -1825499 -1627938 -1280610 -785380 -152163 589533
37524 589533 1377359 2117593 2708333 3072278 3178157 3038433 2686491 2147041 1416449 465271
37514 465271 -737153 -2191508 -3850999 -5625843 -7400572 -9050280 -10451585 -11493483
37506 -11493483 -12091010 -12197067 -11807143 -10958708 -9730794 -8243545 -6649138 -5106219 -3741667
37497c741667J125453R03227P55395O95771O91576O82796O12919M53830K12504
37488B391804p9887l84169o62340q77959r97084r98126q86763p01869n02847l44242
37478d043482k53769k25503k28232k22302j78267r0758J9422J17405J73714J78871
37468d752901J45227R6606N2984K0304o598k9856l7179p507O8282J70382K53083
37457d027173K65505J73919k7344l18135o62887j022825j363635j654028j857296
37448a0493899j925603j807360j469048r20026k22702N22170J208259J755377
37440a3352832K124527K314989K351699K270121K102907J873496J600260J306285
37432B591452J023779P88152O27900N57743N75154O57679P64370Q46736Q66513
$$ plain form
37497 -3741667 -2616214 -1712987 -957592 -261821 429755 1112551 1725470 2179300 2391804
37488 2391804 2311917 1927748 1265408 387449 -609635 -1607761 -2494524 -3196393 -3699240 -4043482
37478 -4043482 -4297251 -4522754 -4750986 -4973288 -5151555 -5242313 -5222891 -5105486 -4931772 -4752901
37468 -4752901 -4607674 -4511068 -4458084 -4437780 -4444378 -4474234 -4511413 -4518920 -4450638 -4280256 -4027173
37457 -4027173 -3761668 -3587749 -3615093 -3933228 -4596115 -5618940 -6982575 -8636603 -10493899
37448 -10493899 -12419502 -14226862 -15695910 -16615936 -16838638 -16316468 -15108209 -13352832
37440 -13352832 -11228305 -8913316 -6561617 -4291496 -2188589 -315093 1285167 2591452
37432 2591452 3615231 4403383 5031283 5589026 6164180 6821859 7586229 8432965 9299478
37423I299478Q09461O86810N24555L46306J56875o4290l52263p31094j188849
37414I486989j670727k096055k389990k512192k467010k291182k030759j725506
37406g696432j407643j104462q32697n89719l57994j26721Q7539K41962K90898
37397a1495269K13825L1030j98197l93150m81177m29187k60387m3222J43939K52184
37387a2659611K82571K77328K89458L50433M54729N67578O46918O63603O08590
37378h518403M87157L08278P8251j97577n07137q24084j106616j305838j381058
37369a2967027j314309j115849q17678m59446p5100L13023O90363J039522J330530
37360a3375971J521132J570678J460667J207980Q61038M81069J20363j90264m40150
$$ plain form
37423 9299478 10108939 10795749 11320304 11666610 11823485 11759195 11406932 10675838 9486989
37414 9486989 7816262 5720207 3330217 818025 -1648985 -3940167 -5970926 -7696432
37406 -7696432 -9104075 -10208537 -11041234 -11630953 -11988947 -12115668 -12028129 -11786167 -11495269
37397 -11495269 -11281444 -11250414 -11448611 -11841761 -12322938 -12752125 -13012512 -13055734 -12911795 -12659611
37387 -12659611 -12377040 -12099712 -11810254 -11459821 -11005092 -10437514 -9790596 -9126993 -8518403
37378 -8518403 -8031246 -7722968 -7644717 -7842294 -8349431 -9173515 -10280131 -11585969 -12967027
37369 -12967027 -14281336 -15397185 -16214863 -16674309 -16749409 -16436386 -15746023 -14706501 -13375971
37360 -13375971 -11854839 -10284161 -8823494 -7615514 -6754476 -6273407 -6153044 -6343308 -6783458
37351f783458o27612p47609p85754p21437n37726k32785J73565O43025J130746
37342h489045J597603K012937K346935K564000K629412K527812K277365J924679
37334I391698J523018J111939P13271L40360N517k82352n22392p17616q63204
37325A0700239r39560r18446p78122n17696j64480K27997N91865Q62927R96284
37316A0061008R73322Q02861N21988J93955j05413l13003m02058l89096l22009
37307A1021555k59193k49736l18273m55717o19461p47125p81796o97226n07985
37298F385043k58421L25K28313M01039N05975N41610N20412M68113M14183L77631
37288I584223L57571L34598K81856J78617J8045j94021m45125p20654j005131
$$ plain form
37351 -6783458 -7411070 -8158679 -8944433 -9665870 -10203596 -10436381 -10262816 -9619791 -8489045
37342 -8489045 -6891442 -4878505 -2531570 32430 2661842 5189654 7467019 9391698
37334 9391698 10914716 12026655 12739926 13080286 13085803 12803451 12281059 11563443 10700239
37325 10700239 9760679 8842233 8064111 7546415 7381935 7609932 8201797 9064724 10061008
37316 10061008 11034330 11837191 12359179 12553134 12447721 12134718 11732660 11343564 11021555
37307 11021555 10762362 10512626 10194353 9738636 9119175 8372050 7590254 6893028 6385043
37298 6385043 6126622 6126947 6355260 6756299 7262274 7803884 8324296 8792409 9206592 9584223
37288 9584223 9941794 10276392 10558248 10736865 10754910 10560889 10115764 9395110 8389979
37279H389979j283475j543378j775491j969127k106655k161267k099634j889227
37271f438275j510984r75079l29866L47044R73764J488584J857928K068041K114262
37262d04581J999258J739234J369373R41977N17690J54674j00150k17396j91239
37253E808840m4858J69975L84432N33381N75617N03705L40846J28848q6343k65744
37243H048699l81365m14092l51554j91976M6961L22538N72956P35652P70151O74158
37233I832128M83733K56047M2700j32266k77592m21396n88870p85761r97134j199341
37223F212248j374335j515909j625900j706225j753825j761466j723200j640918
37215f889530j527424j402072j279800j161113j032208q77338o94598n02416l31278
$$ plain form
37279 8389979 7106504 5563126 3787635 1818508 -288147 -2449414 -4549048 -6438275
37271 -6438275 -7949259 -8924338 -9254204 -8907160 -7933396 -6444812 -4586884 -2518843 -404581
37262 -404581 1594677 3333911 4703284 5645261 6162951 6317625 6217475 6000079 5808840
37253 5808840 5763982 5933957 6318389 6851770 7427387 7931092 8271938 8400786 8314443 8048699
37243 8048699 7667334 7253242 6901688 6709712 6756673 7079211 7652167 8387819 9157970 9832128
37233 9832128 10315861 10571908 10614608 10482342 10204750 9783354 9194484 8408723 7411589 6212248
37223 6212248 4837913 3322004 1696104 -10121 -1763946 -3525412 -5248612 -6889530
37215 -6889530 -8416954 -9819026 -11098826 -12259939 -13292147 -14169485 -14864083 -15366499 -15697777
37206a5697777k06765j35548j01584p2287j1306J04864K70676M43892N54606N30181
37196a4321048L25178n7588n62737j095666j549922j839922j925391j815428j552507
37187b4395031j189941p77216l56109L9622L86268O71727Q92925J051263J151667
37178b2524825J205424J230174J241481J239972J205404J106071R20238O55623
37170a3720438L52614O8014j49581k76311l13137k74433j76084k9509J58833L84899
37160a3975133O42504R17631J184668J407580J546763J569626J461465J233037
37152d011859R21833N85800K89324Q3320j4113k4947J331J3703j8922j03286k30001
37141b507817l81986n38422o79085p91414q74518r34571r73995r82353r35574
$$ plain form
37206 -15697777 -15904542 -16040090 -16141674 -16213961 -16225267 -16120403 -15849727 -15405835 -14851229 -14321048
37196 -14321048 -13995870 -14053458 -14616195 -15711861 -17261783 -19101705 -21027096 -22842524 -24395031
37187 -24395031 -25584972 -26362188 -26718297 -26678675 -26292407 -25620680 -24727755 -23676492 -22524825
37178 -22524825 -21319401 -20089227 -18847746 -17607774 -16402370 -15296299 -14376061 -13720438
37170 -13720438 -13367824 -13299810 -13449391 -13725702 -14038839 -14313272 -14489356 -14518865 -14360032 -13975133
37160 -13975133 -13332629 -12414998 -11230330 -9822750 -8275987 -6706361 -5244896 -4011859
37152 -4011859 -3090026 -2504226 -2214902 -2131582 -2145695 -2170642 -2169311 -2155608 -2174530 -2277816 -2507817
37141 -2507817 -2889803 -3428225 -4107310 -4898724 -5773242 -6707813 -7681808 -8664161 -9599735
37132i599735q06652n85305k95059Q489K63269M34167N30048N94446O81144Q31022
37122g944166J057433J340069J628837J859949J979643J963688J822291J589916
37114E297660J308461J014787P37677N00722L23216K15839J75302J83495K11052
37105I968211K22520J83724P3208j06684l29161n55808p53155r00363r86903j008899
37095E806690r70214q85167p77080o71075n84181n17823m58649l90640l12369
37086B39492k45387k24466k75462l96642n54936o97178p69637p37818n98936l81271
37076d642241j31027J05634K96320M27427N00667N24291N05035M47988L65968
$$ plain form
37132 -9599735 -10406387 -10991692 -11286751 -11278262 -11014993 -10580826 -10050778 -9456332 -8775188 -7944166
37122 -7944166 -6886733 -5546664 -3917827 -2057878 -78235 1885453 3707744 5297660
37114 5297660 6606121 7620908 8358585 8859307 9182523 9398362 9573664 9757159 9968211
37105 9968211 10190731 10374455 10447663 10340979 10011818 9456010 8702855 7802492 6815589 5806690
37095 5806690 4836476 3951309 3174229 2503154 1918973 1401150 942501 551861 239492
37086 239492 -5895 -230361 -505823 -902465 -1457401 -2154579 -2924216 -3662034 -4260970 -4642241
37076 -4642241 -4773268 -4667634 -4371314 -3943887 -3443220 -2918929 -2413894 -1965906 -1599938
$$ [...]
##END NTUPLES=NMR SPECTRUM
##END=
