##TITLE=31Pdec_LR-777-R2-B1-KM1
 H2O
  24 sc
 10.1.2024
##JCAMPDX= 6.0         $$ Bruker NMR JCAMP-DX V2.0
##DATA TYPE= NMR SPECTRUM
##DATA CLASS= NTUPLES
##ORIGIN= UXNMR, Bruker Analytische Messtechnik GmbH
##OWNER= root
$$ XWIN-NMR		Version 3.5
$$ Wed Jan 10 13:46:50 2024 Russian Standard Time (UT+4h)  she@DPX200
##.OBSERVE FREQUENCY= 81.013821
##.OBSERVE NUCLEUS= ^31P
##.ACQUISITION MODE= SIMULTANEOUS
##.ACQUISITION SCHEME= undefined
##.AVERAGES= 24
##.DIGITISER RES= 16
##SPECTROMETER/DATA SYSTEM= spect
##.PULSE SEQUENCE= zgpg30
##.SOLVENT NAME= CD2Cl2
##.SHIFT REFERENCE= (INTERNAL, CD2Cl2, 0, 248.564)
##AUDIT TRAIL= $$ (NUMBER, WHEN, WHO, WHERE, WHAT)
$$ ##TITLE= Audit trail, XWIN-NMR		Version 3.5
$$ ##JCAMPDX= 5.01
$$ ##ORIGIN= Bruker BioSpin GmbH
$$ ##OWNER= she
$$ F:/spectra/data/she/nmr/P31/1/pdata/1/auditp.txt
$$ ##AUDIT TRAIL=  $$ (NUMBER, WHEN, WHO, WHERE, WHAT)
(   1,<2024-01-10 13:44:04.75 +0400>,<she>,<DPX200>,
      <created by zg, POWCHK disabled, PULCHK disabled
       configuration hash MD5:
       00 E9 B6 7A A2 85 ED C7 34 08 36 98 17 FE 4E 26
       data hash MD5: 32K
       C5 95 C6 BF E9 8B 23 1E 73 21 40 35 F5 7F 99 28>)
(   2,<2024-01-10 13:44:51.98 +0400>,<she>,<DPX200>,
      <Start of raw data processing
       efp BC_mod = 2 LB = 10 FT_mod = 6 PKNL = 1 PHC0 = -12244.01 PHC1 = 310.2938 SI = 64K 
       data hash MD5: 64K
       74 B8 FE A0 56 C6 5D 70 86 32 25 E3 96 8C 34 80>)
(   3,<2024-01-10 13:45:30.28 +0400>,<she>,<DPX200>,
      <pk PHC0 = -13.93265 PHC1 = -18.00003 
       data hash MD5: 64K
       CE ED 1E BF 70 24 0B 38 C2 49 92 5B 95 47 6E FD>)
$$ ##END=
$$ 
$$ hash MD5
$$ A8 E4 F7 24 40 1E D6 BE 96 CB 8C 4E 1F 07 88 F0
##$RELAX= 
##$RELAX= 
##$RELAX= 
##$RELAX= 
##$RELAX= 
##$RELAX= 
##$RELAX= 
##$RELAX= 
##$RELAX= 
$$ Bruker specific parameters
$$ --------------------------
##$DU= <F:/spectra>
##$EXPNO= 1
##$NAME= <P31>
##$PROCNO= 1
##$TYPE= <nmr>
##$USER= <she>
##$AMP= (0..31)
100 100 100 100 100 100 100 100 100 100 100 100 100 100 100 100 100 100 
100 100 100 100 100 100 100 100 100 100 100 100 100 100 
##$AQSEQ= 0
##$AQ_mod= 1
##$AUNM= <au_zg>
##$AUTOPOS= <>
##$BF1= 81.014009
##$BF2= 200.13
##$BF3= 200.13
##$BF4= 200.13
##$BF5= 200.13
##$BF6= 200.13
##$BF7= 200.13
##$BF8= 200.13
##$BYTORDA= 1
##$CFDGTYP= 0
##$CFRGTYP= 5
##$CHEMSTR= <none>
##$CNST= (0..31)
1 1 145 1 1 1 1 1 1 1 1 1 1 1 1 1 1 1 1 1 1 1 1 1 1 1 1 1 1 1 1 1 
##$CPDPRG= <waltz16>
##$CPDPRG1= <>
##$CPDPRG2= <waltz16>
##$CPDPRG3= <>
##$CPDPRG4= <mlev>
##$CPDPRG5= <mlev>
##$CPDPRG6= <mlev>
##$CPDPRG7= <mlev>
##$CPDPRG8= <mlev>
##$CPDPRGB= <>
##$CPDPRGT= <>
##$D= (0..31)
0 1 0 0 0 0 0 0 0 0 0 0.03 2e-05 3e-06 0 0 0 0 0 0 0 0 0 0 0 0 0 0 0 0 
0 0 
##$DATE= 1704879844
##$DBL= (0..7)
120 120 120 11 120 120 24 19 
##$DBP= (0..7)
150 150 150 150 150 150 150 150 
##$DBP07= 0
##$DBPNAM0= <>
##$DBPNAM1= <>
##$DBPNAM2= <>
##$DBPNAM3= <>
##$DBPNAM4= <>
##$DBPNAM5= <>
##$DBPNAM6= <>
##$DBPNAM7= <>
##$DBPOAL= (0..7)
0.5 0.5 0.5 0.5 0.5 0.5 0.5 0.5 
$$ [...]
##$SUBNAM2= <"">
##$SUBNAM3= <"">
##$SUBNAM4= <"">
##$SUBNAM5= <"">
##$SUBNAM6= <"">
##$SUBNAM7= <"">
##$SUBNAM8= <"">
##$SUBNAM9= <"">
##$SW= 501.771253377433
##$SWIBOX= (0..15)
0 1 3 0 0 0 0 0 0 0 0 0 0 0 0 0 
##$SW_h= 40650.406504065
##$TD= 32768
##$TD0= 1
##$TE= 0
##$TE2= 300
##$TE3= 300
##$TEG= 300
##$TL= (0..7)
0 120 53 12 22 120 120 120 
##$TP= (0..7)
150 150 150 150 150 150 150 150 
##$TP07= 0
##$TPNAME0= <>
##$TPNAME1= <>
##$TPNAME2= <>
##$TPNAME3= <>
##$TPNAME4= <>
##$TPNAME5= <>
##$TPNAME6= <>
##$TPNAME7= <>
##$TPOAL= (0..7)
0.5 0.5 0.5 0.5 0.5 0.5 0.5 0.5 
##$TPOFFS= (0..7)
0 0 0 0 0 0 0 0 
##$TUNHIN= 0
##$TUNHOUT= 0
##$TUNXOUT= 0
##$USERA1= <user>
##$USERA2= <user>
##$USERA3= <user>
##$USERA4= <user>
##$USERA5= <user>
##$V9= 5
##$VALIST= <valist>
##$VCLIST= <CCCCCCCCCCCCCCC>
##$VD= 0
##$VDLIST= <DDDDDDDDDDDDDDD>
##$VPLIST= <PPPPPPPPPPPPPPP>
##$VTLIST= <TTTTTTTTTTTTTTT>
##$WBST= 1024
##$WBSW= 4
##$XGAIN= (0..3)
0 0 0 0 
##$XL= 0
##$YL= 0
##$YMAX_a= 1568
##$YMIN_a= -1410
##$ZGOPTNS= <>
##$ZL1= 120
##$ZL2= 120
##$ZL3= 120
##$ZL4= 120
##$ABSF1= 0
##$ABSF2= 0
##$ABSG= 0
##$ABSL= 0
##$ALPHA= 0
##$AQORDER= 0
##$ASSFAC= 0
##$ASSFACI= 0
##$ASSFACX= 0
##$ASSWID= 0
##$AUNMP= <proc_1d>
##$AZFE= 0.1
##$AZFW= 0.5
##$BCFW= 0
##$BC_mod= 2
##$BYTORDP= 0
##$COROFFS= 0
##$CY= -3
##$DATMOD= 1
##$DC= 0
##$DFILT= <>
##$DTYPP= 0
##$F1P= 0
##$F2P= 0
##$FCOR= 1
##$FTSIZE= 65536
##$FT_mod= 6
##$GAMMA= 0
##$GB= 0
##$INTBC= 1
##$INTSCL= 6.047779e-11
##$ISEN= 30
##$LB= 10
##$LEV0= 0
##$LPBIN= 0
##$MAXI= 10000
##$MC2= 0
##$MEAN= 0
##$ME_mod= 0
##$MI= 50
##$NCOEF= 0
##$NC_proc= -11
##$NLEV= 6
##$NOISF1= 182.463
##$NOISF2= 159.3651
##$NSP= 0
##$NTH_PI= 0
##$NZP= 0
##$OFFSET= 248.5645
##$PC= 4
##$PHC0= -12257.94
##$PHC1= 292.2938
##$PH_mod= 1
##$PKNL= yes
##$PPARMOD= 0
##$PSCAL= 0
##$PSIGN= 0
##$REVERSE= no
##$SF= 81.0140089999694
##$SI= 65536
##$SIGF1= 159.3651
##$SIGF2= -187.1042
##$SINO= 113.3802
##$SIOLD= 16384
##$SREGLST= <1H.CDCl3>
##$SSB= 0
##$STSI= 65536
##$STSR= 0
##$SW_p= 40650.406504065
##$SYMM= 0
##$S_DEV= 0
##$TDeff= 32768
##$TDoff= 0
##$TI= <>
##$TILT= no
##$TM1= 0
##$TM2= 0
##$TOPLEV= 0
##$USERP1= <user>
##$USERP2= <user>
##$USERP3= <user>
##$USERP4= <user>
##$USERP5= <user>
##$WDW= 1
##$XDIM= 65536
##$YMAX_p= 565393113
##$YMIN_p= -388463140
$$ End of Bruker specific parameters
$$ ---------------------------------
##NTUPLES= NMR SPECTRUM
##VAR_NAME=  FREQUENCY,     SPECTRUM/REAL,   SPECTRUM/IMAG
##SYMBOL=    X,             R,               I
##VAR_TYPE=  INDEPENDENT,   DEPENDENT,       DEPENDENT
##VAR_FORM=  AFFN,          ASDF,            ASDF
##VAR_DIM=   65536,         65536,           65536
##UNITS=     HZ,            ARBITRARY UNITS, ARBITRARY UNITS
##FACTOR=    0.620285442955139, 1,           1
##FIRST=     20137.2065510682, 0,            0
##LAST=      -20513.1999529968, 0,           0
##MIN=       -20513.1999529968, -388463140,  0
##MAX=       20137.2065510682, 565393113,    0
$$ Real data points
##PAGE= N=1
##DATA TABLE= (X++(R..R)), XYDATA
$$ [...]
$$ plain form
41802 18127131 19147782 19921059 20498405 20946079 21319447 21639094 21880942 21983181 21863708
41793 21863708 21440123 20647133 19447626 17836236 15840559 13527519 11012222 8453617
41785 8453617 6025666 3874628 2087720 688539 -346534 -1065535 -1520710 -1754284 -1793495
41776 -1793495 -1656367 -1363442 -947596 -457243 47830 507454 875524 1130003 1271330
41767 1271330 1310957 1260029 1127343 927586 693465 482526 371419 437154 733512 1274120
41757 1274120 2028159 2926541 3873773 4763698 5499516 6016329 6300117 6394243 6386996 6382950
41747 6382950 6471237 6705053 7096406 7620143 8222511 8835544 9396188 9859982 10199423 10391227
41737 10391227 10408170 10225836 9839952 9282796 8630523 7998234 7522739 7337773 7550776
$$ packed form
41802A8127131J020651P73277N77346M47674L73368L19647K41848J02239j19473
41793B1863708m23585p92990j199507j611390j995677k313040k515297k558605
41785H453617k427951k151038j786908j399181j035073p19001m55175k33574l9211
41776a793495J37128K92925M15846M90353N05073M59624L68070K54479J41327
41767A271330L9627n0928j32686j99757k34121k10939j11107O5735K96358N40608
41757A274120P54039Q98382R47232Q89925P35818N16813K83788R4126p247m046
41747F382950Q8287K33816L91353N23737O02368O13033N60644M63794L39441J91804
41737A0391227J6943j82334l85884n57156o52273o32289m75495j84966K13003
$$ plain form
41728 7550776 8226879 9377191 10947130 12809765 14775188 16618878 18118493 19085992
41720 19085992 19391071 18978668 17880010 16210974 14152957 11918826 9712729 7694230
41712 7694230 5955924 4520176 3355069 2402971 1609699 940564 374836 -116913 -594769
41703 -594769 -1151650 -1891271 -2896078 -4205122 -5811409 -7673621 -9730258 -11907196 -14116954
41694 -14116954 -16254916 -18200485 -19827258 -21018465 -21680019 -21748045 -21194936 -20037934 -18346787
41685 -18346787 -16241739 -13877140 -11414757 -8995195 -6714328 -4610258 -2667195 -839499
41677 -839499 912581 2595318 4179053 5619072 6880313 7946633 8811725 9463986 9878865
41668 9878865 10023123 9866286 9391736 8602200 7519095 6178377 4624924 2904868 1056285
$$ packed form
41728G550776O76103J150312J569939J862635J965423J843690J499615R67499
41720A9085992L05079m12403j098658j669036k058017k234131k206097k018499
41712G694230j738306j435748j165107r52098p93272o69135n65728m91749m77856
41703e94769n56881p39621j004807j309044j606287j862212k056637k176938k209758
41694a4116954k137962j945569j626773j191207o61554o8026N53109J157002J691147
41685a8346787K105048K364599K462383K419562K280867K104070J943063J827696
41677h39499J752080J682737J583735J440019J261241J066320Q65092O52261M14879
41668I878865J44258j56837m74550p89536j083105j340718j553453j720056j848583
$$ plain form
41659 1056285 -896339 -2936945 -5042450 -7166907 -9235548 -11150761 -12806313 -14108271
41651 -14108271 -15002428 -15500609 -15688674 -15702514 -15677770 -15699459 -15780675 -15881144 -15950523 -15967496
41641 -15967496 -15952642 -15952453 -16008098 -16126813 -16269366 -16359751 -16313856 -16073211 -15624833 -14996533
41631 -14996533 -14234226 -13378804 -12455499 -11475413 -10440931 -9349733 -8198433 -6988254 -5731034
41622 -5731034 -4451388 -3183874 -1968793 -850258 124901 911952 1477501 1806881 1901703
41613 1901703 1766198 1390526 744268 -210691 -1491180 -3064977 -4844360 -6706623 -8526289
41604 -8526289 -10197286 -11637599 -12786854 -13609451 -14103205 -14303582 -14276042 -14097272 -13831020
41595 -13831020 -13505863 -13103625 -12566471 -11824393 -10835480 -9624839 -8306752 -7077585 -6174757
$$ packed form
41659A056285j952624k040606k105505k124457k068641j915213j655552j301958
41651a4108271q94157m98181j88065j3840K4744k1689q1216j00469o9379j6973
41641a5967496J4854J89n5645j18715j42553r0385M5895K40645M48378O28300
41631a4996533P62307Q55422R23305R80086J034482J091198J151300J210179J257220
41622e731034J279646J267514J215081J118535R75159P87051N65549L29380R4822
41613A901703j35505l75672o46258r54959j280489j573797j779383j862263j819666
41604h526289j670997j440313j149255q22597m93754k00377K7540J78770K66252
41595a3831020L25157M02238N37154P42078R88913J210641J318087J229167R02828
$$ plain form
41586 -6174757 -5810602 -6104779 -7044666 -8492647 -10236934 -12062303 -13811535 -15418578 -16910330
41577 -16910330 -18384353 -19971851 -21794021 -23920330 -26338185 -28941437 -31539636 -33884302
41569 -33884302 -35705752 -36754435 -36841617 -35873201 -33868653 -30958439 -27360395 -23343307
41561 -23343307 -19188274 -15154657 -11453521 -8231213 -5565810 -3476151 -1939116 -908984
41553 -908984 -332411 -152646 -300744 -681744 -1171987 -1637975 -1969381 -2106399 -2047618 -1840850
41543 -1840850 -1567340 -1324157 -1202626 -1263775 -1520311 -1936337 -2447196 -2990621 -3534911 -4090807
41533 -4090807 -4699651 -5401418 -6198996 -7040300 -7830325 -8467059 -8882086 -9066109 -9068662 -8973894
41523 -8973894 -8866037 -8802851 -8807859 -8877819 -8994319 -9132869 -9269827 -9387357 -9473948 -9521246
$$ packed form
41586f174757L64155k94177r39887j447981j744287j825369j749232j607043j491752
41577a6910330j474023j587498j822170k126309k417855k603252k598199k344666
41569c3884302j821450j048683q7182R68416K004548K910214L598044M017088
41561b3343307M155033M033617L701136L222308K665403K089659J537035J030132
41553i08984N76573J79765j48098l81000m90243m65988l31406j37018N8781K06768
41543a840850K73510K43183J21531o1149k56536m16026n10859n43425n44290n55896
41533d090807o08844p01767p97578q41304p90025o36734m15027j84023k553R4768
41523h973894J07857O3186n008o9960j16500j38550j36958j17530q6591m7298
$$ plain form
41513 -9521246 -9523312 -9482553 -9419065 -9377338 -9427457 -9658583 -10160077 -10990099 -12143839 -13539588
41503 -13539588 -15031114 -16440091 -17597161 -18382276 -18753655 -18751857 -18473424 -18027154 -17498008
41494 -17498008 -16935961 -16366851 -15807616 -15269835 -14749500 -14215345 -13611166 -12876414 -11973876
41485 -11973876 -10907524 -9722215 -8489905 -7292931 -6211229 -5313817 -4651628 -4250006
41477 -4250006 -4102633 -4170599 -4388410 -4674533 -4941769 -5105270 -5090469 -4844640 -4352247 -3648337
41467 -3648337 -2820992 -1996694 -1310353 -870004 -729712 -881223 -1267429 -1812000 -2453148
41458 -2453148 -3168130 -3979184 -4938951 -6100816 -7485627 -9058959 -10729675 -12370489 -13850571
41449 -13850571 -15066961 -15966404 -16555442 -16898030 -17098257 -17267365 -17482229 -17752377 -18014923
$$ packed form
41513i521246k066M0759O3488M1727n0119k31126n01494q30022j153740j395749
41503a3539588j491526j408977j157070p85115l71379J798K78433M46270N29146
41494a7498008N62047N69110N59235N37781N20335N34155O04179P34752R02538
41485a1973876J066352J185309J232310J196974J081702Q97412O62189M01622
41477d250006J47373o7966k17811k86123k67236j63501J4801K45829M92393P03910
41467c648337Q27345Q24298O86341M40349J40292j51511l86206n44571o41148
41458b453148p14982q11054r59767j161865j384811j573332j670716j640814j480082
41449a3850571j216390q99443n89038l42588k00227j69108k14864k70148k62546
$$ plain form
41440 -18014923 -18164502 -18103715 -17785637 -17226481 -16487563 -15642424 -14746797 -13822122 -12856772
41431 -12856772 -11822843 -10698371 -9480835 -8185310 -6834679 -5455894 -4088821 -2800463
41423 -2800463 -1689541 -870163 -436306 -423554 -790547 -1432540 -2219410 -3036339 -3808410
41414 -3808410 -4504768 -5129913 -5711674 -6290907 -6913065 -7619268 -8434445 -9353287 -10329403
41405 -10329403 -11275266 -12076788 -12618290 -12807535 -12591453 -11960633 -10947734 -9625066 -8099979
41396 -8099979 -6501700 -4956995 -3562129 -2363994 -1357723 -496900 292344 1097051 1999696
41387 1999696 3054697 4265589 5576084 6884851 8081396 9087731 9886364 10521699
41379 10521699 11074432 11620028 12188669 12744408 13195313 13433441 13386784 13055279 12509519
$$ packed form
41440a8014923j49579O0787L18078N59156P38918Q45139Q95627R24675R65350
41431a2856772J033929J124472J217536J295525J350631J378785J367073J288358
41423b800463J110922Q19378M33857J2752l66993o41993p86870q16929p72071
41414c808410o96358o25145n81761n79233o22158p06203q15177r18842r76116
41405a0329403r45863q01522n41502j89245K16082O30820J012899J322668J525087
41396h099979J598279J544705J394866J198135J006271Q60823P89244Q04707R02645
41387A999696J055001J210892J310495J308767J196545J006335P98633O35335
41379A0521699N52733N45596N68641N55739M50905K38128m6657l31505n45760
$$ plain form
41370 12509519 11852929 11170746 10495843 9808587 9066833 8247326 7377175 6540955 5860317
41361 5860317 5455430 5406754 5734959 6404455 7340884 8448738 9624010 10766088 11791288
41352 11791288 12642136 13285629 13703439 13885614 13835470 13580759 13178011 12701202 12218395
41343 12218395 11770016 11361353 10970851 10564894 10108607 9569964 8921474 8144159 7234952
41334 7234952 6215227 5134890 4064478 3072233 2195042 1420846 694716 -54862 -884122
41325 -884122 -1810416 -2803909 -3796221 -4703019 -5450966 -5995285 -6319376 -6420953 -6299385 -5957023
41315 -5957023 -5415009 -4732032 -4011755 -3390989 -3009413 -2968879 -3296366 -3928043 -4725878 -5521491
41305 -5521491 -6165598 -6560614 -6668614 -6501648 -6104042 -5531118 -4826699 -4005137 -3045364
$$ packed form
41370A2509519o56590o82183o74903o87256p41754q19507q70151q36220o80638
41361E860317m04887m8676L28205O69496R36429J107854J175272J142078J025200
41352A1791288Q50848O43493M17810J82175n0144k54711m02748m76809m82807
41343A2218395m48379m08663l90502m05957m56287n38643o48490p77315r09207
41334G234952j019725j080337j070412r92245q77191p74196p26130p49578q29260
41325h84122r26294r93493r92312r06798p47947n44319l24091j01577J21568L42362
41315e957023N42014O82977P20277O20766L81576M0534l27487o31677p97835p95613
41305e521491o44107l95016j08000J66966L97606N72924P04419Q21562R59773
$$ plain form
41296 -3045364 -1900506 -520487 1118541 2986131 4981585 6941812 8677562 10027022
41288 10027022 10901840 11302102 11294997 10972930 10414070 9659932 8712374 7546369 6133617
41279 6133617 4469747 2594511 595363 -1407704 -3288812 -4942309 -6299181 -7331639
41271 -7331639 -8049026 -8488185 -8699189 -8728072 -8601951 -8323517 -7878280 -7252623 -6457789 -5553319
41261 -5553319 -4659912 -3949052 -3602466 -3750854 -4418875 -5506530 -6818983 -8128659 -9236441
41252 -9236441 -10005647 -10364799 -10293163 -9805475 -8943903 -7776614 -6397854 -4923891 -3482231
41243 -3482231 -2197052 -1176776 -506647 -243380 -407539 -974389 -1870008 -2979856 -4170072
41234 -4170072 -5313132 -6306947 -7083235 -7609624 -7890532 -7964749 -7894630 -7749307 -7592616 -7482457
$$ packed form
41296c045364J144858J380019J639028J867590J995454J960227J735750J349460
41288A0027022Q74818M00262p105l22067n58860p54138r47558j166005j412752
41279F133617j663870j875236j999148k003067j881108j653497j356872j032458
41271g331639p17387m39159k11004k8883J26121K78434M45237O25657P94834R04470
41261e553319Q93407P10860L46586j48388o68021j087655j312453j309676j107782
41252i236441p69206l59152P1636M87688Q61572J167289J378760J473963J441660
41243c482231J285179J020276O70129K63267j64159n66850q95619j109848j190216
41234d170072j143060r93815p76288n26389k80908p4217P0119J45323J56691J10159
$$ plain form
41224 -7482457 -7475864 -7628775 -7986829 -8572253 -9371814 -10326985 -11329079 -12227367 -12856963 -13082424
41214 -13082424 -12841202 -12167559 -11184728 -10066732 -8984709 -8058764 -7331798 -6770217 -6286388
41205 -6286388 -5773830 -5145723 -4366033 -3462015 -2512035 -1614263 -852170 -273093 114276
41196 114276 330263 413837 417311 402769 433032 554953 781641 1085000 1405534 1675753
41186 1675753 1844587 1889934 1815281 1637161 1374035 1041246 647858 190178 -355093 -1028704
41176 -1028704 -1873674 -2915052 -4146122 -5523826 -6968317 -8365946 -9583730 -10500021
41168 -10500021 -11040192 -11196108 -11017346 -10582000 -9966247 -9226787 -8398208 -7499939 -6547256
41159 -6547256 -5562362 -4581962 -3659187 -2861526 -2268702 -1970391 -2056784 -2595264 -3597717
$$ packed form
41224g482457O593j52911l58054n85424p99561r55171j002094q98288o29596k25461
41214a3082424K41222O73643R82831J117996J082023R25945P26966N61581M83829
41205f286388N12558O28107P79690R04018R49980Q97772P62093N79077L87369
41196A14276K15987Q3574L474j4542L0263J21921K26688L03359L20534K70219
41186A675753J68834M5347p4653j78120k63126l32789l93388m57680n45271o73611
41176a028704q44970j041378j231070j377704j444491j397629j217784r16291
41168a0500021n40171j55916J78762M35346O15753P39460Q28579Q98269R52683
41159f547256R84894R80400R22775P97661N92824K98311q6393n38480j002453
$$ plain form
41150 -3597717 -4995702 -6641295 -8338133 -9890549 -11149958 -12040312 -12556046 -12740086 -12657191
41141 -12657191 -12374089 -11947883 -11419293 -10810043 -10126024 -9364846 -8523439 -7603955 -6619238
41132 -6619238 -5595809 -4567313 -3555561 -2548905 -1495117 -318824 1042070 2597734
41124 2597734 4283398 5963746 7466344 8633480 9371772 9678587 9636777 9386356 9089975
41115 9089975 8903631 8954218 9323011 10037715 11075666 12374864 13847114 15392860 16920201
41106 16920201 18363181 19686225 20868465 21879860 22669258 23172890 23334859 23126747 22560509
41097 22560509 21693127 20619417 19449071 18271020 17117310 15942548 14631657 13038921
41089 13038921 11046594 8618373 5822782 2817620 -192438 -3003747 -5451999 -7436320
$$ packed form
41150c597717j397985j645593j696838j552416j259409q90354n15734j84040Q2895
41141a2657191K83102M26206N28590O09250O84019P61178Q41407R19484R84717
41132f619238J023429J028496J011752J006656J053788J176293J360894J555664
41124B597734J685664J680348J502598J167136P38292L06815m1810k50421k96381
41115I089975j86344N0587L68793P14704J037951J299198J472250J545746J527341
41106A6920201J442980J323044J182240J011395P89398N03632J61969k08112n66238
41097B2560509q67382j073710j170346j178051j153710j174762j310891j592736
41089A3038921j992327k428221k795591l005162l010058k811309k448252j984321
$$ plain form
41081 -7436320 -8928808 -9969387 -10649460 -11093339 -11444746 -11855798 -12470097 -13398457 -14697018
41072 -14697018 -16357232 -18306565 -20414526 -22507709 -24403910 -25962413 -27125310 -27921075
41064 -27921075 -28426221 -28710937 -28802006 -28678485 -28292737 -27598549 -26570602 -25209286 -23536651
41055 -23536651 -21595616 -19458203 -17233150 -15056366 -13060787 -11342800 -9946938 -8873522
41047 -8873522 -8095328 -7568632 -7236400 -7029361 -6868182 -6666540 -6336708 -5800635 -5004353
41038 -5004353 -3927286 -2579693 -990738 802408 2754850 4803122 6853735 8785807
41030 8785807 10474418 11825439 12802570 13433073 13793806 13988614 14125921 14299290 14572402
41021 14572402 14971214 15484191 16067495 16651633 17150209 17473935 17549929 17341050 16858278
$$ packed form
41081g436320j492488j040579o80073m43879l51407m11052o14299r28360j298561
41072a4697018j660214j949333k107961k093183j896201j558503j162897p95765
41064b7921075n05146k84716r1069J23521L85748O94188J027947J361316J672635
41055b3536651J941035K137413K225053K176784J995579J717987J395862J073416
41047h873522P78194N26696L32232K07039J61179K01642L29832N36073P96282
41038e004353J077067J347593J588955J793146J952442K048272K050613J932072
41030H785807J688611J351021R77131O30503L60733J94808J37307J73369K73112
41021A4572402L98812N12977N83304N84138M98576L23726P5994k08879m82772
$$ plain form
41012 16858278 16162008 15352024 14548050 13863962 13380797 13126822 13073524 13151475 13280014 13395669
41002 13395669 13463624 13466859 13382806 13166953 12758724 12108930 11211214 10115583 8914759 7713778
40992 7713778 6603072 5647459 4887516 4342355 4009682 3869429 3897898 4089441 4473384
40983 4473384 5114765 6096969 7494716 9350328 11662756 14389591 17453808 20746825
40975 20746825 24128871 27436886 30507729 33210411 35469764 37268368 38630329 39602861
40967 39602861 40247388 40637176 40849679 40947756 40956834 40851387 40559199 39982201 39026102 37628849
40957 37628849 35778866 33517843 30929232 28118861 25194711 22250351 19355183 16554375
40949 16554375 13878729 11358541 9031298 6936091 5097270 3508883 2132842 914927
$$ packed form
41012A6858278o96270q09984q03974o84088m83165k53975n3298P7951J28539J15655
41002A3395669O7955L235q4053k15853m08229o49794q97716j095631j200824j200981
40992G713778j110706r55613p59943n45161l32673j40253K8469J91543L83943
40983D473384O41381R82204J397747J855612K312428K726835L064217L293017
40975B0746825L382046L308015L070843K702682K259353J798604J361961R72532
40967C9602861O44527L89788K12503R8077R078j05447k92188n76998r56099j397253
40957C7628849j849983k261023k588611k810371k924150k944360k895168k800808
40949A6554375k675646k520188k327243k095207j838821j588387j376041j217915
$$ plain form
40941 914927 -190442 -1202788 -2115170 -2905921 -3548577 -4011109 -4248628 -4201258 -3804575
40932 -3804575 -3009759 -1804224 -224582 1641235 3662089 5679524 7527539 9051287
40924 9051287 10121931 10649492 10596692 9990326 8919573 7514580 5913325 4234623 2567877
40915 2567877 974757 -507272 -1861008 -3079291 -4148230 -5033772 -5681701 -6030940 -6032189
40906 -6032189 -5665489 -4954287 -3971646 -2830533 -1654914 -542868 456316 1335882 2103042
40897 2103042 2752776 3264738 3621921 3830984 3926018 3954765 3959349 3962195 3959535 3921684 3801096
40886 3801096 3548270 3130095 2542360 1812306 993100 153511 -635807 -1317553 -1859594
40877 -1859594 -2258376 -2533707 -2719060 -2851036 -2958758 -3053727 -3123260 -3131609 -3029695 -2769118
$$ packed form
40941I14927j105369j012346r12382p90751o42656m62532k37519M7370L96683
40932c804575P94816J205535J579642J865817K020854K017435J848015J523748
40924I051287J070644N27561n2800o06366j070753j404993j601255j678702j666746
40915B567877j593120j482029j353736j218283j068939q85542o47929l49239j249
40906f032189L66700P11202R82641J141113J175619J112046R99184Q79566P67160
40897B103042O49734N11962L57183K09063R5034K8747M584K846k660l7851j20588
40886C801096k52826m18175n87735p30054q19206q39589p89318o81746n42041
40877a859594l98782k75331j85353j31976j07722r4969o9533q349J01914K60577
$$ plain form
40867 -2769118 -2312697 -1635446 -717017 464907 1929317 3672901 5648399 7755026 9847335
40858 9847335 11758016 13326569 14427452 14990709 15005901 14504911 13532607 12125232 10312315
40849 10312315 8140358 5699681 3132968 615998 -1681481 -3635768 -5192249 -6364246
40841 -6364246 -7211903 -7811499 -8226133 -8487154 -8592563 -8522159 -8261093 -7819633 -7240407 -6591141
40831 -6591141 -5945128 -5353934 -4820992 -4289661 -3657376 -2815344 -1698201 -321410 1209639
40822 1209639 2721442 4015062 4913226 5296795 5122875 4424814 3298574 1880882 325406
40813 325406 -1216724 -2609952 -3745962 -4560202 -5050052 -5280284 -5363632 -5421116 -5543146
40804 -5543146 -5772107 -6110670 -6542848 -7050137 -7614104 -8209477 -8798209 -9331666 -9759920
$$ packed form
40867b769118M56421O77251R18429J181924J464410J743584J975498K106627K092309
40858I847335J910681J568553J100883N63257J5192n00990r72304j407375j812917
40849A0312315k171957k440677k566713k516970k297479j954287j556481j171997
40841f364246q47657n99596m14634k61021j05409P0404K61066M41460N79226O49266
40831f591141O46013N91194N32942N31331O32285Q42032J117143J376791J531049
40822A209639J511803J293620Q98164L83569j73920o98061j126240j417692j555476
40813C25406j542130j393228j136010q14240m89850k30232q3348n7484j22030
40804e543146k28961l38563m32178n07289n63967n95373n88732n33457m28254
$$ plain form
40795 -9759920 -10041690 -10149619 -10070463 -9803487 -9360724 -8770619 -8082956 -7369403 -6713719 -6190991
40785 -6190991 -5843435 -5664373 -5598671 -5560350 -5461297 -5241136 -4887099 -4435398 -3952579 -3504046
40775 -3504046 -3122723 -2791098 -2444648 -1995102 -1361793 -495145 617620 1962265 3512078
40766 3512078 5236818 7101917 9059927 11040435 12946486 14663453 16079329 17107919
40758 17107919 17704630 17869965 17643968 17099020 16335658 15479059 14669002 14038784 13687002
40749 13687002 13652843 13905504 14353263 14871231 15339840 15679605 15867491 15930897 15929789 15941897
40739 15941897 16055603 16362261 16938455 17819489 18976255 20309219 21666244 22880618 23815926
40730 23815926 24398863 24624265 24530257 24158908 23527005 22624501 21439046 19988186 18338235
$$ packed form
40795i759920k81770j07929P9156K66976M42763N90105O87663P13553O55684N22728
40785f190991L47556J79062O5702L8321R9053K20161L54037M51701M82819M48533
40775c504046L81323L31625L46450M49546O33309Q66648J112765J344645J549813
40766C512078J724740J865099J958010J980508J906051J716967J415876J028590
40758A7107919N96711J65335k25997n44948p63362q56599q10057o30218l51782
40749A3687002l4159K52661M47759N17968M68609L39765J87886O3406j108J2108
40739A5941897J13706L06658N76194Q81034J156766J332964J357025J214374R35308
40730B3815926N82937K25402r4008l71349o31903r02504j185455j450860j649951
$$ plain form
40721 18338235 16600227 14907693 13387826 12135956 11198762 10569072 10194069 9996752 9906283
40712 9906283 9887113 9953378 10159302 10568977 11222347 12116540 13209271 14435042 15720073
40703 15720073 16991139 18183735 19253579 20184981 20985363 21665311 22218733 22620797 22847184
40694 22847184 22899579 22816684 22661904 22496671 22356785 22242999 22124121 21943819 21625915 21081354
40684 21081354 20223092 18989573 17369450 15417289 13253677 11048148 8986744 7230074
40676 7230074 5874374 4932093 4341464 3997562 3784362 3591670 3318640 2878231 2212025
40667 2212025 1309313 215313 -980796 -2173557 -3269785 -4203300 -4930952 -5418038 -5627710
40658 -5627710 -5523453 -5081459 -4302677 -3217546 -1884183 -384328 1180831 2696479 4044611
$$ packed form
40721A8338235j738008j692534j519867j251870r37194o29690l75003j97317r0469
40712I906283j9170O6265K05924M09675O53370Q94193J092731J225771J285031
40703A5720073J271066J192596J069844R31402Q00382O79948N53422M02064K26387
40694B2847184N2395q2895j54780j65233j39886j13786j18878j80302l17904n44561
40684B1081354q58262j233519j620123j952161k163612k205529k061404j756670
40676G230074j355700r42281n90629l43902k13200j92692k73030m40409o66206
40667B212025r02712j094000j196109j192761j096228r33515p27652m87086k09672
40658e627710J04257M41994P78782J085131J333363J499855J565159J515648J348132
$$ plain form
40649 4044611 5120858 5855517 6231526 6289703 6115361 5809391 5456065 5102664 4759040
40640 4759040 4411816 4038539 3611464 3095427 2453415 1666317 757277 -196984 -1078931
40631 -1078931 -1764513 -2165593 -2262118 -2107774 -1804206 -1456617 -1135371 -863456 -631197 -422892
40621 -422892 -237166 -92468 -20225 -52127 -205665 -470188 -797854 -1106290 -1296322 -1279162
40611 -1279162 -1000690 -453028 326568 1262254 2247031 3155453 3868740 4309354 4467320
40602 4467320 4398603 4192787 3929217 3647629 3346791 3006543 2618545 2209859 1846491 1612047
40592 1612047 1571254 1741133 2089708 2561925 3112211 3721857 4396402 5154270 6017749 7006302
40582 7006302 8126445 9358440 10648474 11914292 13063091 14012739 14706785 15117985 15240338
$$ packed form
40649D044611J076247P34659L76009N8177j74342l05970l53326l53401l43624
40640D759040l47224l73277m27075n16037o42012p87098r09040r54261q81947
40631a078931o85582m01080r6525J54344L03568L47589L21246K71915K32259K08305
40621d22892J85726J44698P2243l1902j53538k64523l27666l08436j90032J7160
40611a279162K78472N47662P79596R35686R84777R08422P13287M40614J57966
40602D467320o8717k05816k63570k81588l00838l40248l87998m08686l63368k34444
40592A612047m0793J69879L48575M72217N50286O09646O74545P57868Q63479R88553
40582G006302J120143J231995J290034J265818J148799R49648O94046M11200J22353
$$ plain form
40573 15240338 15074784 14617718 13860585 12801245 11458529 9878370 8126681 6275538
40565 6275538 4395046 2557029 842803 -660270 -1879566 -2782433 -3384165 -3729134 -3857615
40556 -3857615 -3781434 -3483359 -2939129 -2150473 -1174535 -135752 789278 1412464 1585399
40547 1585399 1239581 399618 -833644 -2320735 -3925459 -5544580 -7116462 -8612090
40539 -8612090 -10019919 -11333637 -12543375 -13627233 -14544907 -15240293 -15656027 -15752693 -15520348
40530 -15520348 -14975770 -14149202 -13070138 -11759770 -10232930 -8508522 -6624808 -4653182
40522 -4653182 -2702252 -906617 597925 1702827 2345904 2512720 2221010 1497775 362529
40513 362529 -1173061 -3088757 -5332872 -7806946 -10366302 -12835939 -15036553 -16815069
$$ packed form
40573A5240338j65554m57066p57133j059340j342716j580159j751689j851143
40565F275538j880492j838017j714226j503073j219296r02867o01732l44969j28481
40556c857615P6181K98075N44230P88656R75938J038783R25030O23186J72935
40547A585399l45818q39963j233262j487091j604724j619121j571882j495628
40539h612090j407829j313718j209738j083858r17674o95386m15734r6666K32345
40530a5520348N44578Q26568J079064J310368J526840J724408J883714J971626
40522d653182J950930J795635J504542J104902O43077J66816k91710p23235j135246
40513C62529j535590j915696k244115k474074k559356k469637k200614j778516
$$ plain form
40505 -16815069 -18072473 -18778742 -18966333 -18704002 -18064943 -17106445 -15868911 -14388158 -12708260
40496 -12708260 -10886953 -8995266 -7116983 -5349189 -3798956 -2570975 -1746314 -1358475
40488 -1358475 -1376204 -1702697 -2195996 -2705137 -3107371 -3332666 -3371469 -3269303 -3111210 -2997403
40478 -2997403 -3016159 -3224878 -3645050 -4265051 -5040655 -5892259 -6707714 -7357966 -7722319 -7713588
40468 -7713588 -7295800 -6492411 -5385067 -4102087 -2796301 -1615333 -672492 -29766 298716
40459 298716 325317 64488 -477648 -1295102 -2367005 -3652017 -5097291 -6652821 -8278809
40450 -8278809 -9941754 -11603911 -13212960 -14695896 -15958277 -16889199 -17373131 -17310514 -16646651
40441 -16646651 -15401286 -13684245 -11684988 -9637813 -7778106 -6305638 -5360219 -5007301
$$ packed form
40505a6815069j257404p06269j87591K62331O39059R58498J237534J480753J679898
40496a2708260J821307J891687J878283J767794J550233J227981Q24661L87839
40488a358475j7729l26493m93299n09141m02234k25295l8803J02166J58093J13807
40478b997403j8756k08719m20172o20001p75604q51604q15455o50252l64353Q731
40468g713588M17788Q03389J107344J282980J305786J180968R42841O42726L28482
40459B98716K6601k60829n42136q17454j071903j285012j445274j555530j625988
40450h278809j662945j662157j609049j482936j262381r30922m83932O2617O63863
40441a6646651J245365J717041J999257K047175J859707J472468R45419L52918
$$ plain form
40433 -5007301 -5233530 -5956512 -7048470 -8363775 -9758553 -11099797 -12270208 -13173167 -13735558
40424 -13735558 -13906207 -13654159 -12972011 -11881432 -10431777 -8688431 -6718785 -4586468
40416 -4586468 -2356924 -108921 2056510 4019042 5661606 6910614 7775226 8358313
40408 8358313 8823527 9328912 9957813 10679685 11359210 11810949 11876942 11493745 10719643 9711543
40398 9711543 8665236 7749954 7069259 6663744 6544677 6728693 7245797 8114835 9304801
40389 9304801 10709386 12152572 13424606 14332641 14745380 14615759 13975744 12907695 11504518
40380 11504518 9834792 7927384 5781715 3397077 804420 -1916395 -4641380 -7224170
40372 -7224170 -9522809 -11421252 -12841736 -13749208 -14150261 -14088527 -13638512 -12900107 -11994883
$$ packed form
40433e007301k26229p22982j091958j315305j394778j341244j170411r02959n62391
40424a3735558j70649K52048O82148J090579J449655J743346J969646K132317
40416d586468K229544K248003K165431J962532J642564J249008Q64612N83087
40408H358313M65214N05385O28901P21872O79525M51739O5993l83197p74102j008100
40398I711543j046307r15282o80695m05515j19067J84016N17104Q69038J189966
40389I304801J404585J443186J272034R08035M12739j29621o40015j068049j403177
40380A1504518j669726j907408k145669k384638k592657k720815k724985k582790
40372g224170k298639j898443j420484r07472m01053O1734M50015P38405R05224
$$ plain form
40363 -11994883 -11062353 -10251017 -9698294 -9499004 -9672771 -10148336 -10777782 -11377617 -11779846
40354 -11779846 -11874921 -11636683 -11126530 -10476879 -9856576 -9425868 -9292798 -9483370 -9934218
40345 -9934218 -10510178 -11041384 -11369445 -11391564 -11092398 -10552525 -9924557 -9380176 -9049126 -8978755
40335 -8978755 -9131071 -9412760 -9718556 -9966433 -10111276 -10136668 -10036917 -9805784 -9439812 -8949167
40325 -8949167 -8361144 -7708272 -7007979 -6251063 -5412719 -4483783 -3502510 -2562982 -1790517
40316 -1790517 -1296541 -1137390 -1295968 -1690086 -2199260 -2697172 -3077490 -3265135 -3213702 -2898743
40306 -2898743 -2317862 -1499126 -507350 563931 1615906 2570505 3382887 4034656 4517228
40297 4517228 4821925 4946537 4913062 4780416 4638262 4581302 4676307 4938084 5325568 5759646
$$ packed form
40363a1994883R32530Q11336N52723J99290j73767m75565o29446n99835m02229
40354a1779846r5075K38238N10153O49651O20303M30708J33070j90572m50848
40345i934218n75960n31206l28061k2119K99166N39873O27968N44381L31050P0371
40335h978755j52316k81689l05796k47877j44843k5392R9751K31133L65972M90645
40325h949167N88023O52872P00293P56916Q38344R28936R81273R39528P72465
40316a790517M93976J59151j58578l94118n09174m97912l80318j87645N1433L14959
40306b898743N80881Q18736R91776J071281J051975R54599Q12382O51769M82572
40297D517228L04697J24612l3475j32646j42154n6960R5005K61777L87484M34078
$$ plain form
40287 5759646 6153338 6437309 6566682 6510804 6243340 5748722 5041852 4180796 3255461 2355153
40277 2355153 1535056 802226 128101 -521435 -1155617 -1741983 -2207267 -2452520 -2378576 -1919048
40267 -1919048 -1072956 78418 1383475 2658333 3732582 4483787 4853685 4848460 4525705
40258 4525705 3970498 3269784 2499704 1731849 1046574 534921 284522 362893 812227 1654457
40248 1654457 2895086 4520382 6493785 8758710 11247060 13886755 16602092 19304367
40240 19304367 21875626 24156387 25952617 27069161 27358577 26761801 25322409 23173140
40232 23173140 20505791 17536318 14472024 11485651 8702336 6203936 4047553 2286052
40224 2286052 976694 173184 -91284 181620 949409 2130571 3613327 5271886 6986924
$$ packed form
40287E759646L93692K83971J29373n5878k67464m94618p06870q61056r25335r00308
40277B355153q20097p32830o74125o49536o34182n86366m65284k45253P3944M59528
40267a919048Q46092J151374J305057J274858J074249P51205L69898n225l22755
40258D525705n55207p00714p70080p67855o85275n11653k50399P8371M49334Q42230
40248A654457J240629J625296J973403K264925K488350K639695K715337K702275
40240A9304367K571259K280761J796230J116544K89416n96776j439392k149269
40232B3173140k667349k969473l064294k986373k783315k498400k156383j761501
40224B286052j309358q03510k64468K72904P67789J181162J482756J658559J715038
$$ plain form
40215 6986924 8661814 10229217 11652074 12925639 14077815 15157562 16209742 17251480
40207 17251480 18268140 19229621 20109234 20888222 21546019 22049342 22351167 22400691 22158402
40198 22158402 21609012 20766523 19670076 18375780 16952706 15485495 14075763 12830912
40190 12830912 11837516 11130071 10672752 10365688 10072660 9655244 8998401 8023979 6699982
40181 6699982 5052550 3175257 1221271 -629467 -2218321 -3449878 -4309916 -4854264
40173 -4854264 -5174571 -5354425 -5434719 -5405878 -5230097 -4875854 -4338914 -3638203 -2797322 -1831246
40163 -1831246 -748595 433484 1670816 2879272 3936000 4700293 5051332 4930154 4368293
40154 4368293 3488196 2470007 1493934 681376 61111 -425903 -889273 -1437948 -2133772
$$ packed form
40215F986924J674890J567403J422857J273565J152176J079747J052180J041738
40207A7251480J016660R61481Q79613P78988O57797N03323L01825M9524k42289
40198B2158402n49390q42489j096447j294296j423074j467211j409732j244851
40190A2830912r93396p07445m57319l07064k93028m17416o56843r74422j323997
40181F699982j647432j877293j953986j850738j588854j231557q60038n44348
40173d854264l20307j79854q0294K8841J75781L54243N36940P00711Q40881R66076
40163a831246J082651J182079J237332J208456J056728P64293L51039j21178n61861
40154D368293q80097j018189r76073q12558o20265m87014m63370n48675o95824
$$ plain form
40145 -2133772 -2963168 -3835537 -4610678 -5147409 -5354624 -5221953 -4814794 -4236454 -3579248
40136 -3579248 -2893141 -2187313 -1456010 -705485 35292 720624 1300641 1731627 1980953
40127 1980953 2026947 1856394 1464641 861548 79520 -825493 -1784863 -2734003 -3622799 -4412354
40117 -4412354 -5061322 -5513050 -5695496 -5539222 -5006806 -4116552 -2943651 -1595451 -174026
40108 -174026 1254136 2667490 4074879 5484344 6871055 8163287 9256596 10048210
40100 10048210 10471319 10513894 10220842 9685100 9028954 8374246 7807849 7358526 6999736
40091 6999736 6678961 6358773 6048687 5812155 5746243 5945900 6471740 7334934 8499825
40082 8499825 9895328 11426411 12983529 14452719 15728481 16727117 17394350 17702617 17641581
$$ packed form
40145b133772q29396q72369p75141n36731k07215J32671M07159N78340O57206
40136c579248O86107P05828P31303P50525P40777O85332N80017M30986K49326
40127A980953M5994j70553l91753o03093p82028r05013r59370r49140q88796p89555
40117d412354o48968m51728j82446J56274N32416Q90254J172901J348200J421425
40108a74026J428162J413354J407389J409465J386711J292232J093309P91614
40100A0048210M23109M2575k93052n35742o56146o54708n66397m49323l58790
40091F999736l20775l20188l10086k36532o5912J99657N25840Q63194J164891
40082H499825J395503J531083J557118J469190J275762R98636O67233L08267o1036
$$ plain form
40073 17641581 17213228 16440123 15381354 14139390 12846422 11635596 10613324 9844194
40065 9844194 9349082 9111207 9084599 9200560 9371120 9495559 9479243 9264952 8861041 8344639
40055 8344639 7830233 7415623 7132434 6927277 6682790 6265191 5571976 4558991 3242711
40046 3242711 1685136 -29971 -1821421 -3624982 -5389555 -7059115 -8556946 -9787751
40038 -9787751 -10659693 -11115503 -11158113 -10859564 -10348387 -9779316 -9297481 -9011804 -8986742 -9251006
40028 -9251006 -9812496 -10665727 -11784797 -13107954 -14528630 -15904074 -17080322 -17923226 -18344833
40019 -18344833 -18318205 -17876779 -17098418 -16080620 -14918038 -13691360 -12468764 -11313452 -10288288
40010 -10288288 -9451965 -8847625 -8489955 -8357776 -8396816 -8533524 -8695524 -8828782 -8901345 -8893017
$$ packed form
40073A7641581m28353p73105j058769j241964j292968j210826j022272p69130
40065I844194m95112k37875k6608J15961J70560J24439j6316k14291m03911n16402
40055H344639n14406m14610k83189k05157k44487m17599o93215j012985j316280
40046C242711j557575j715107j791450j803561j764573j669560j497831j230805
40038i787751q71942m55810m2610K98549N11177N69071M81835K85677K5062k64264
40028i251006n61490q53231j119070j323157j420676j375444j176248q42904m21607
40019a8344833K6628M41426P78361J017798J162582J226678J222596J155312J025164
40010a0288288Q36323O04340L57670J32179l9040j36708j62000j33258p2563Q328
$$ plain form
40000 -8893017 -8783076 -8550159 -8185568 -7706343 -7153700 -6575848 -6006770 -5452821 -4890504
39991 -4890504 -4272645 -3540300 -2638925 -1535063 -227038 1254763 2855860 4507095 6129855
39982 6129855 7636432 8930140 9912627 10503053 10663603 10414860 9825944 8981783 7948318
39973 7948318 6757301 5415430 3926202 2310176 616212 -1078706 -2682171 -4109828
39965 -4109828 -5311178 -6284596 -7072459 -7739438 -8348194 -8946684 -9569284 -10241918 -10981326
39956 -10981326 -11789313 -12650945 -13542156 -14441301 -15332195 -16190489 -16959291 -17533877 -17775489
39947 -17775489 -17555701 -16808768 -15561349 -13924739 -12058953 -10130175 -8278403 -6600610
39939 -6600610 -5146767 -3923643 -2901781 -2022249 -1201819 -339357 669288 1902785 3380251
$$ packed form
40000h893017J09941K32917L64591M79225N52643N77852N69078N53949N62317
39991d890504O17859P32345R01375J103862J308025J481801J601097J651235J622760
39982F129855J506577J293708R82487N90426J60550k48743n88916q44161j033465
39973G948318j191017j341871j489228j616026j693964j694918j603465j427657
39965d109828j201350r73418p87863o66979o08756n98490o22600o72634p39408
39956a0981326q07987q61632q91211q99145q90894q58294p68802n74586k41612
39947a7775489K19788P46933J247419J636610J865786J928778J851772J677793
39939f600610J453843J223124J021862Q79532Q20430Q62462J008645J233497J477466
$$ plain form
39930 3380251 5044305 6781521 8476650 10071092 11592134 13138945 14835678 16775314
39922 16775314 18978308 21381539 23858229 26254392 28422180 30238745 31612071 32481322
39914 32481322 32817041 32622452 31935091 30826649 29397139 27760213 26022283 24265203
39906 24265203 22542631 20890724 19342131 17930074 16679397 15593533 14649191 13803658
39898 13803658 13011312 12241496 11489268 10772961 10119405 9545793 9049334 8609142 8196256
39889 8196256 7785196 7363382 6936784 6529526 6176313 5911214 5759762 5738261 5857466 6124518
39879 6124518 6540454 7096297 7772752 8545281 9391282 10293586 11237110 12201652 13158191
39870 13158191 14073608 14920691 15684505 16358744 16934058 17386612 17674820 17747081 17557096
$$ packed form
39930C380251J664054J737216J695129J594442J521042J546811J696733J939636
39922A6775314K202994K403231K476690K396163K167788J816565J373326Q69251
39914C2481322L35719j94589o87361j108442j429510j636926j737930j757080
39906B4265203j722572j651907j548593j412057j250677j085864r44342q45533
39898A3803658p92346p69816p52228p16307o53556n73612m96459m40192m12886
39889H196256m11060m21814m26598m07258l53213k65099j51452k1501J19205K67052
39879F124518M15936N55843O76455P72529Q46001R02304R43524R64542R56539
39870A3158191R15417Q47083P63814O74239N75314M52554K88208P2261j89985
$$ plain form
39861 17557096 17079441 16319183 15315085 14140283 12901164 11728423 10754172 10079081 9743764
39852 9743764 9718211 9913817 10213573 10511607 10749751 10935473 11128336 11396290 11762475 12173267
39842 12173267 12507635 12621720 12400318 11786912 10783535 9431822 7791483 5925627 3895956
39833 3895956 1767754 -380541 -2454769 -4359078 -6022404 -7419124 -8566056 -9494096
39825 -9494096 -10211218 -10680352 -10826852 -10572643 -9878578 -8771968 -7345013 -5726786 -4045724
39816 -4045724 -2402005 -858787 552380 1822029 2954341 3959124 4844576 5615517
39808 5615517 6279736 6856322 7375759 7869855 8362049 8870028 9419502 10054527 10830887
39799 10830887 11793365 12950275 14258846 15627172 16932009 18048836 18886745 19415739
$$ packed form
39861A7557096m77655p60258j004098j174802j239119j172741r74251o75091l35317
39852I743764k5553J95606K99756K98034K38144J85722J92863K67954L66185M10792
39842A2173267L34368J14085k21402o13406j003377j351713j640339j865856k029671
39833C895956k128202k148295k074228j904309j663326j396720j146932r28040
39825i494096p17122m69134j46500K54209O94065J106610J426955J618227J681062
39816d045724J643719J543218J411167J269649J132312J004783Q85452P70941
39808E615517O64219N76586N19437M94096M92194N07979N49474O35025P76360
39799A0830887R62478J156910J308571J368326J304837J116827Q37909N28994
$$ plain form
39791 19415739 19673934 19750264 19749821 19757185 19813976 19919691 20051438 20186465 20312110 20421021
39781 20421021 20502438 20540502 20520351 20434499 20282991 20067998 19789883 19451637 19070886 18689490
39771 18689490 18370054 18178465 18161402 18327672 18636999 18999729 19294095 19402313 19251838
39762 19251838 18838791 18219386 17475610 16675954 15851392 14994744 14078723 13081562 12009651
39753 12009651 10909557 9864756 8978167 8350422 8066942 8197103 8794921 9889788 11469891
39744 11469891 13471924 15785717 18269929 20770536 23138634 25247602 27007753 28374133
39736 28374133 29344366 29946947 30224204 30216588 29953333 29449479 28706279 27714946 26466620
39727 26466620 24967495 23250968 21378599 19429678 17485819 15616698 13869964 12267669
$$ packed form
39791A9415739K58195P6330m43P364N6791J05715J31747J35027J25645J08911
39781B0421021Q1417L8064k0151q5852j51508k14993k78115l38246l80751l81396
39771A8689490l19436j91589j7063J66270L09327L62730K94366J08218j50475
39762A9251838m13047o19405p43776p99656q24562q56648r16021r97161j071911
39753A2009651j100094j044801q86589o27745k83480J30161N97818J094867J580103
39744A1469891K002033K313793K484212K500607K368098K108968J760151J366380
39736B8374133R70233O02581K77257p616k63255n03854p43200r91333j248326
39727B6466620j499125j716527j872369j948921j943859j869121j746734j602295
$$ plain form
39719 12267669 10811228 9493591 8313260 7284187 6438295 5819750 5471367 5415510 5635978
39710 5635978 6070824 6623729 7191983 7698108 8109386 8437943 8725457 9021449 9362426
39701 9362426 9757166 10182808 10593249 10935147 11163385 11250558 11190242 10996134 10698866 10341559
39691 10341559 9974453 9647825 9402332 9257575 9201961 9188605 9142755 8983619 8655020 8149559
39681 8149559 7510846 6812293 6127624 5511647 4997709 4604264 4340086 4205631 4196292 4313411
39671 4313411 4580679 5054672 5817831 6952998 8512210 10496147 12851086 15477447 18240977
39662 18240977 20984841 23547460 25787606 27608430 28967105 29863162 30312142 30321219 29882291
39653 29882291 28986428 27650100 25937782 23970216 21916109 19969040 18311215 17069522
$$ packed form
39719A2267669j456441j317637j180331j029073q45892o18545l48383n5857K20468
39710E635978M34846N52905N68254N06125M11278L28557K87514K95992L40977
39701I362426L94740M25642M10441L41898K28238Q7173o0316j94108k97268l57307
39691A0341559l67106l26628k45493j44757n5614j3356m5850j59136l28599n05461
39681H149559o38713o98553o84669o15977n13938l93445k64178j34455r339J17119
39671D313411K67268M73993P63159J135167J559212J983937K354939K626361K763530
39662A8240977K743864K562619K240146J820824J358675Q96057M48980R077m38928
39653B9882291q95863j336328j712318j967566k054107j947069j657825j241693
$$ plain form
39645 17069522 16279435 15877751 15733531 15702857 15677980 15608659 15494553 15362529 15243477 15156822
39635 15156822 15106079 15085194 15090127 15126078 15203708 15326993 15483138 15644123 15780497 15877952
39625 15877952 15944055 15999556 16060935 16127938 16184999 16212981 16199335 16137630 16017562 15814388 15486974
39614 15486974 14987934 14282381 13367299 12283120 11112050 9962265 8942028 8132411 7569808
39605 7569808 7245909 7123247 7155894 7304834 7544771 7864494 8262323 8737361 9281195 9878216
39595 9878216 10517024 11203104 11958088 12801480 13727707 14697570 15652284 16540030 17335438
39586 17335438 18038681 18656393 19179130 19571176 19779667 19758345 19492790 19011788 18375128
39577 18375128 17641082 16830731 15910806 14806664 13439546 11770345 9831598 7735611
$$ packed form
39645A7069522p90087m01684j44220l0674k4877o9321j14106j32024j19052q6655
39635A5156822n0743k0885M933L5951P7630J23285J56145J60985J36374R7455
39625A5877952O6103N5501O1379O7003N7061K7982j3646o1705j20068k03174l27414
39614A5486974m99040p05553r15082j084179j171070j149785j020237q09617n62603
39605G569808l23899j22662L2647J48940K39937L19723L97829M75038N43834N97021
39595I878216O38808O86080P54984Q43392R26227R69863R54714Q87746P95408
39586A7335438P03243O17712N22737L92046K08491k1322k65555m81002o36660
39577A8375128p34046q10351r19925j104142j367118j669201j938747k095987
$$ plain form
39569 7735611 5654084 3773144 2239002 1117383 385317 -44096 -281606 -428014 -556649
39560 -556649 -708126 -889970 -1079678 -1234467 -1307855 -1267445 -1107118 -850559 -546618 -258574
39550 -258574 -51334 17827 -97649 -432260 -1001193 -1786149 -2723214 -3704036 -4593806 -5260237
39540 -5260237 -5604641 -5587932 -5246199 -4690815 -4089145 -3626220 -3455876 -3658410 -4223165 -5063108
39530 -5063108 -6050620 -7054688 -7967109 -8718581 -9289193 -9710308 -10050099 -10383180 -10759143
39521 -10759143 -11189676 -11662047 -12167148 -12719351 -13352203 -14092268 -14928459 -15796134 -16585497
39512 -16585497 -17170159 -17440646 -17324551 -16784083 -15799319 -14357597 -12463275 -10161316 -7551822
39503 -7551822 -4776252 -1976958 746628 3356884 5860752 8272513 10587137 12783122
$$ packed form
39569G735611k081527j880940j534142j121619p32066m29413k37510j46408j28635
39560e56649j51477j81844j89708j54789p3388M0410J60327K56559L03941K88044
39550b58574K07240O9161j15476l34611n68933p84956r37065r80822q89770o66431
39540e260237l44404J6709L41733N55384O01670M62925J70344k02534n64755q39943
39530e063108r87512j004068r12421p51472n70612m21115l39791l33081l75963
39521a0759143m30533m72371n05101n52203o32852p40065q36191q67675p89363
39512a6585497n84662k70487J16095N40468R84764J441722J894322K301959K609494
39503g551822K775570K799294K723586K610256K503868K411761K314624K195985
$$ plain form
39495 12783122 14846683 16792735 18664677 20513438 22369200 24221482 26018843 27689612
39487 27689612 29171669 30432256 31467417 32288940 32916066 33380824 33739479 34074788 34479707
39478 34479707 35026849 35738798 36575292 37443159 38221674 38791339 39060751 38993240 38630411
39469 38630411 38097710 37575433 37236847 37180554 37393153 37761043 38121001 38320819 38263490 37923383
39459 37923383 37337143 36579364 35734078 34870425 34026618 33202877 32363008 31444889 30379694
39450 30379694 29116822 27647298 26015718 24312809 22648128 21112060 19742237 18508666
39442 18508666 17325366 16086904 14717523 13212666 11653206 10184220 8966570 8120760
39434 8120760 7683880 7593754 7703796 7821261 7754968 7358997 6563462 5386455 3922444
$$ packed form
39495A2783122K063561J946052J871942J848761J855762J852282J797361J670769
39487B7689612J482057J260587J035161Q21523O27126M64758L58655L35309M04919
39478C4479707N47142P11949Q36494Q67867P78515N69665K69412o7511l62829
39469C8630411n32701n22277l38586n6293K12599L67890L59958J99818n7329l40107
39459C7923383n86240p57779q45286q63653q43807q23741q39869r18119j065195
39450C0379694j262872j469524j631580j702909j664681j536068j369823j233571
39442A8508666j183300j238462j369381j504857j559460j468986j217650q45810
39434H120760m36880r0126J10042J17465o6293l95971p95535j177007j464011
$$ plain form
39425 3922444 2308155 679494 -857585 -2225782 -3349506 -4126172 -4420211 -4087239 -3016549
39416 -3016549 -1172020 1384223 4491672 7912357 11365158 14565171 17262742 19278496
39408 19278496 20527907 21026331 20870476 20204515 19187318 17973253 16706984 15523406
39400 15523406 14543052 13858975 13518989 13512670 13771838 14186110 14627683 14977131 15143594 15074254
39390 15074254 14750894 14178187 13374799 12375502 11240781 10061972 8953387 8033194 7401024
39381 7401024 7119755 7206794 7638771 8370113 9358613 10585011 12054507 13777005 15733841
39372 15733841 17845624 19956233 21843824 23261759 24000217 23945674 23110507 21617920 19653044
39363 19653044 17410054 15061502 12754476 10619148 8773338 7317863 6327324 5842210
$$ packed form
39425C922444j614289j628661j537079j368197j123724p76666k94039L32972J070690
39416c016549J844529K556243L107449L420685L452801L200013K697571K015754
39408A9278496J249411M98424j55855o65961j017197j214065j266269j183578
39400A5523406r80354o84077l39986o319K59168M14272M41573L49448J66463o9340
39390A5074254l23360n72707q03388r99297j134721j178809j108585r20193o32170
39381G401024k81269Q7039M31977P31342R88500J226398J469496J722498J956836
39372A5733841K111783K110609J887591J417935P38458n4543q35167j492587j964876
39363A9653044k242990k348552k307026k135328j845810j455475r90539m85114
$$ plain form
39355 5842210 5865065 6362373 7274385 8532373 10076819 11866995 13877073 16083212 18452200
39346 18452200 20940451 23504336 26114455 28763222 31459044 34208541 36994693 39760280
39338 39760280 42404463 44797909 46816104 48379836 49482732 50188637 50598476 50804858
39330 50804858 50858699 50761970 50483582 49984271 49237149 48239778 47021511 45649852 44234073
39321 44234073 42920927 41879487 41276933 41250064 41878447 43166106 45038420 47356813 49946103
39312 49946103 52623300 55217928 57582581 59601061 61201282 62370642 63162783 63685854
39304 63685854 64072950 64446358 64891130 65449129 66133730 66953471 67929279 69098508 70510797
39295 70510797 72222024 74284752 76732014 79561382 82733202 86186473 89858766 93694494
$$ packed form
39355E842210K2855M97308R12012J257988J544446J790176K010078K206139K368988
39346A8452200K488251K563885K610119K648767K695822K749497K786152K765587
39338C9760280K644183K393446K018195J563732J102896P05905M09839K06382
39330E0804858N3841r6729k78388m99311p47122r97371j218267j371659j415779
39321D4234073j313146j041440o02554k6869O28383J287659J872314K318393K589290
39312D9946103K677197K594628K364653K018480J600221J169360P92141N23071
39304F3685854L87096L73408M44772N57999O84601Q19741R75808J169229J412289
39295G0510797J711227K062728K447262K829368L171820L453271L672293L835728
$$ plain form
39287 93694494 97641594 101650437 105685199 109743744 113873095 118169471 122759960 127771792
39279 127771792 133301294 139393887 146038582 153172617 160691748 168466457 176365141 184279892
39271 184279892 192147171 199959692 207771548 215697577 223903109 232580905 241919858 252074912
39263 252074912 263143914 275152287 288049147 301722999 316038590 330880446 346180528
39256 346180528 361918167 378098458 394722249 411755145 429098081 446565739 463883750
39249 463883750 480710940 496680289 511442410 524696763 536207074 545809008 553419462
39242 553419462 559047123 562793606 564835945 565393113 564688544 562918608 560229286 556700892
39234 556700892 552344401 547114062 540934737 533734410 525471180 516150561 505835087 494647643
$$ packed form
39287I3694494L947100M008843M034762M058545M129351M296376M590489N011832
39279A27771792N529502O092593O644695P134035P519131P774709P898684P914751
39271A84279892P867279P812521P811856P926029Q205532Q677796R338953J0155054
39263B52074912J1069002J2008373J2896860J3673852J4315591J4841856J5300082
39256C46180528J5737639J6180291J6623791J7032896J7342936J7467658J7318011
39249D63883750J6827190J5969349J4762121J3254353J1510311R601934P610454
39242E53419462N627661L746483K042339N57168p04569j769936k689322l528394
39234E56700892m356491n230339o179325p200327q263230r320619j0315474j1187444
$$ plain form
39226 494647643 482765155 470398152 457757930 445021417 432306651 419667238 407105983
39219 407105983 394599815 382123307 369660362 357204526 344759745 332352836 320054640
39212 320054640 307993031 296342442 285289662 274990054 265531994 256922339 249097050
39205 249097050 241951284 235375397 229282254 223618106 218358212 213493644 209017200 204915442
39197 204915442 201169307 197758698 194664094 191864593 189339046 187073532 185067450 183326958
39189 183326958 181845910 180588391 179487590 178462785 177443304 176385989 175279369 174136622
39181 174136622 172984298 171852583 170767897 169745779 168784355 167861634 166937980 165961205
39173 165961205 164872387 163614614 162145779 160449249 158532693 156412772 154094515 151557537
$$ packed form
39226D94647643j1882488j2367003j2640222j2736513j2714766j2639413j2561255
39219D07105983j2506168j2476508j2462945j2455836j2444781j2406909j2298196
39212C20054640j2061609j1650589j1052780j0299608r458060q609655p825289
39205B49097050p145766o575887o093143n664148n259894m864568m476444m101758
39197B04915442l746135l410609l094604k799501k525547k265514k006082j740492
39189A83326958j481048j257519j100801j024805j019481j057315j106620j142747
39181A74136622j152324j131715j084686j022118r61424r22721r23654r76775
39173A65961205j088818j257773j468835j696530j916556k119921k318257k536978
$$ plain form
39165 151557537 148755489 145628308 142123256 138218538 133941045 129370035 124622870 119825526
39157 119825526 115077225 110423384 105850877 101311344 96764242 92219731 87759758 83525425
39149 83525425 79675563 76336195 73564182 71338008 69572671 68146443 66929271 65809124
39141 65809124 64714975 63631005 62592410 61656797 60859194 60174415 59511701 58747141 57773592
39132 57773592 56539220 55060222 53413069 51717478 50114344 48737985 47686123 46997127
39124 46997127 46643733 46546064 46599462 46706984 46803627 46861363 46872844 46823668 46670389 46337703
39114 46337703 45735422 44784114 43436778 41691058 39592283 37226744 34703227 32126473
39106 32126473 29574574 27091563 24694835 22387285 20166838 18035447 16011431 14140379
$$ packed form
39165A51557537k802048l127181l505052l904718m277493m571010m747165m797344
39157A19825526m748301m653841m572507m539533m547102m544511m459973m234333
39149H3525425l849862l339368k772013k226174j765337j426228j217172j120147
39141F5809124j094149j083970j038595r35613p97603o84779o62714p64560r73549
39132E7773592j234372j478998j647153j695591j603134j376359j051862o88996
39124D6997127l53394r7669N3398J07522R6643N7736J1481m9176j53279l32686
39114D6337703o02281r51308j347336j745720k098775k365539k523517k576754
39106C2126473k551899k483011k396728k307550k220447k131391k024016j871052
$$ plain form
39098 14140379 12493686 11150459 10172396 9586854 9385384 9533487 9983937 10690138 11617885
39089 11617885 12750608 14082232 15599466 17265006 19013339 20760933 22423630 23933748
39081 23933748 25252933 26377088 27328994 28138818 28820895 29357798 29696675 29755550 29435914
39072 29435914 28640410 27294762 25370487 22902757 19997219 16820236 13570640 10439577
39064 10439577 7573640 5056687 2915508 1142054 -280999 -1363052 -2103106 -2501466
39056 -2501466 -2577443 -2381055 -1990530 -1496481 -980338 -495618 -58608 347670 756965 1197865
39046 1197865 1676176 2166915 2615127 2944319 3074515 2949402 2562826 1969820 1274997
39037 1274997 604495 73788 -239126 -308972 -161582 144915 545982 988150 1431230 1842908
$$ packed form
39098A4140379j646693j343227r78063n85542k01470J48103M50450P06201R27747
39089A1617885J132723J331624J517234J665540J748333J747594J662697J510118
39081B3933748J319185J124155R51906Q09824O82077N36903L38877N8875l19636
39072B9435914p95504j345648j924275k467730k905538l176983l249596l131063
39064A0439577k865937k516953k141179j773454j423053j082053p40054l98360
39056b501466p5977J96388L90525M94049N16143M84720M37010M06278M09295M40900
39046A197865M78311M90739M48212L29192J30196j25113l86576n93006o94823
39037A274997o70502n30707l12914o9846J47390L06497M01067M42168M43080M11678
$$ plain form
39027 1842908 2198409 2489634 2737730 2999977 3365215 3936738 4805584 6020417 7561469
39018 7561469 9325958 11132362 12748656 13941413 14531492 14437841 13697163 12455964 10936038
39009 10936038 9379487 7990131 6896074 6149011 5752153 5691163 5946859 6487856 7256766
39000 7256766 8164664 9099719 9946459 10607866 11023378 11179240 11109797 10888418 10607007 10346431
38990 10346431 10146593 9989818 9809009 9520456 9066055 8442751 7704756 6941220 6244834
38981 6244834 5687239 5308075 5114997 5088366 5187011 5355927 5537162 5680525 5747116 5702698
38971 5702698 5507155 5110862 4463514 3531342 2313542 851148 -772275 -2434374 -3979894
38962 -3979894 -5232492 -6019222 -6206826 -5735118 -4627705 -2972943 -888959 1502852 4080147
$$ packed form
39027A842908L55501K91225K48096K62247L65238N71523Q68846J214833J541052
39018G561469J764489J806404J616294J192757N90079r3651p40678j241199j519926
39009A0936038j556551j389356j094057p47063l96858o0990K55696N40997P68910
39000G256766R07898R35055Q46740O61407M15512J55862o9443k21379k81411k60576
38990A0346431j99838j56775j80809k88553m54401o23304p37995p63536o96386
38981F244834n57595l79164j93078k6631R8645J68916J81235J43363O6591m4418
38971E702698j95543l96293o47348r32172j217800j462394j623423j662099j545520
38962c979894j252598p86730j87604M71708J107413J654762K083984K391811K577295
$$ plain form
38953 4080147 6702756 9199109 11378768 13073930 14186533 14709115 14707150 14279896 13526890
38944 13526890 12532489 11362607 10065338 8675361 7224476 5754515 4324898 3011034
38936 3011034 1895043 1050514 521876 302761 324290 464304 578558 542558 288165 -176661
38926 -176661 -770611 -1365577 -1831703 -2084648 -2113172 -1974631 -1765513 -1586297 -1515414 -1595483
38916 -1595483 -1828989 -2181594 -2592412 -2989915 -3311756 -3524875 -3637058 -3688590 -3722113 -3746802
38906 -3746802 -3722303 -3576824 -3250540 -2738784 -2110165 -1489267 -1011892 -773256 -791181 -997901
38896 -997901 -1261430 -1426495 -1358935 -977756 -266294 735411 1948314 3274007 4612024
38887 4612024 5872646 6984733 7901685 8609747 9136808 9551773 9945791 10399121 10949463
$$ packed form
38953D080147K622609K496353K179659J695162J112603N22582j965m27254p53006
38944A3526890r94401j169882j297269j389977j450885j469961j429617j313864
38936C011034j115991q44529n28638k19115K1529J40014J14254l6000k54393m64826
38926a76661n93950n94966m66126k52945k8524J38541K09118J79216P0883q0069
38916a595483k33506l52605m10818l97503l21841k13119j12183n1532l3523k4689
38906c746802K4499J45479L26284N11756O28619O20898M77375K38636j7925k06720
38896i97901k63529j65065O7560L81179P11462J001705J212903J325693J338017
38887D612024J260622J112087R16952P08062N27061M14965L94018M53330N50342
$$ plain form
38878 10949463 11578103 12220327 12794083 13231812 13498689 13589436 13511501 13271273 12872433 12320336
38868 12320336 11621740 10780462 9801113 8708557 7572977 6517949 5696226 5240126 5212244
38859 5212244 5582005 6236049 7012309 7743085 8297709 8616386 8720698 8687684 8593962 8460516
38849 8460516 8231923 7800457 7057444 5945146 4491153 2816945 1115686 -399281 -1558436
38840 -1558436 -2283041 -2591488 -2565335 -2297939 -1852996 -1248172 -464208 528742 1740117
38831 1740117 3138676 4655227 6207449 7730042 9190217 10582251 11911629 13182246
38823 13182246 14390097 15519196 16538367 17402875 18062499 18471357 18594097 18408743 17909390
38814 17909390 17108708 16037082 14737321 13258054 11649431 9962283 8249999 6571599
$$ packed form
38878A0949463O28640O42224N73756M37729K66877R0747p7935k40228l98840n52097
38868A2320336o98596q41278r79349j092556j135580j055028q21723m56100k7882
38859E212244L69761O54044P76260P30776N54624L18677J04312l3014r3722j33446
38849H460516k28593m31466p43013j112298j453993j674208j701259j514967j159155
38840a558436p24605l08447K6153K67396M44943O04824P83964R92950J211375
38831A740117J398559J516551J552222J522593J460175J392034J329378J270617
38823A3182246J207851J129099J019171Q64508O59624M08858J22740j85354m99353
38814A7909390q00682j071626j299761j479267j608623j687148j712284j678400
$$ plain form
38806 6571599 4993280 3585223 2412947 1526823 955320 704884 764962 1114373 1726092
38797 1726092 2568921 3604744 4780439 6017894 7211939 8246082 9024638 9505250 9712702
38788 9712702 9727099 9655187 9600201 9642436 9835521 10215292 10811399 11651765 12757576 14133500
38778 14133500 15756633 17564156 19443948 21240723 22787198 23951891 24678758 24996188
38770 24996188 24991956 24770112 24412921 23964461 23438414 22839847 22186438 21518811 20896361 20380020
38760 20380020 20008333 19778417 19643466 19529694 19363881 19097472 18716648 18235409 17676798
38751 17676798 17053993 16363525 15594001 14741453 13818158 12849091 11860514 10868986 9876224
38742 9876224 8870778 7833897 6745069 5584282 4333330 2982022 1541132 55244
$$ packed form
38806F571599j578319j408057j172276q86124n71503k50436O0078L49411O11719
38797A726092Q42829J035823J175695J237455J194045J034143P78556M80612K07452
38788I712702J4397p1912n4986M2235J93085L79771N96107Q40366J105811J375924
38778A4133500J623133J807523J879792J796775J546475J164693P26867L17430
38770B4996188m232k21844l57191m48460n26047n98567o53409o67627o22450n16341
38760B0380020l71687k29916j34951j13772j65813k66409l80824m81239n58611
38751A7676798o22805o90468p69524q52548r23295r69067r88577r91528r92762
38742I876224j005446j036881j088828j160787j250952j351308j440890j485888
$$ plain form
38734 55244 -1395282 -2708338 -3785386 -4557330 -5000787 -5139769 -5035364 -4772010 -4447654
38725 -4447654 -4165972 -4022142 -4079914 -4351788 -4798252 -5348821 -5931163 -6492316 -7006746 -7475363
38715 -7475363 -7920637 -8380966 -8905863 -9549779 -10358572 -11347275 -12480650 -13673688 -14817235
38706 -14817235 -15815129 -16612708 -17205918 -17631812 -17945979 -18194396 -18391412 -18516897 -18536544
38697 -18536544 -18433722 -18231946 -17992783 -17790475 -17679079 -17670659 -17734043 -17810724 -17835840 -17751880
38687 -17751880 -17510345 -17067028 -16381454 -15424720 -14188688 -12686150 -10940905 -8977560 -6820319
38678 -6820319 -4499568 -2057756 451276 2968206 5434284 7794019 9994654 11985129
38670 11985129 13717020 15147721 16245625 16998763 17427801 17597599 17615362 17608140 17687286
$$ packed form
38734E5244j450526j313056j077048p71944m43457j38982J04405K63354L24356
38725d447654K81682J43830n7772k71874m46464n50569n82342n61153n14430m68617
38715g475363m45274m60329n24897o43916q08793r88703j133375j193038j143547
38706a4817235r97894p97579n93210m25894l14167k48417j97016j25485j9647
38697a8536544J02822K01776K39163K02308J11396Q420o3384p6681k5116Q3960
38687a7751880K41535M43317O85574R56734J236032J502538J745245J963345K157241
38678f820319K320751K441812K509032K516930K466078K359735K200635J990475
38670A1985129J731891J430701J097904P53138M29038J69798J7763p222P9146
$$ plain form
38661 17687286 17917713 18305058 18799695 19307558 19700485 19827197 19530989 18677491 17188110
38652 17188110 15067656 12413243 9396955 6225435 3091059 135063 -2563183 -4972315
38644 -4972315 -7084824 -8896604 -10395229 -11556402 -12348103 -12740253 -12712991 -12258119 -11377985
38635 -11377985 -10091545 -8448835 -6542060 -4500889 -2471956 -593820 1021204 2293939
38627 2293939 3176141 3644409 3694529 3337217 2594576 1499212 99720 -1529661 -3286408
38618 -3286408 -5054010 -6728696 -8240719 -9555310 -10655237 -11521606 -12130346 -12469859 -12569452
38609 -12569452 -12518900 -12463151 -12571769 -12999005 -13854259 -15191235 -17008252 -19247347 -21790010
38600 -21790010 -24461068 -27052904 -29367048 -31253989 -32631605 -33478351 -33813813 -33682810
$$ packed form
38661A7687286K30427L87345M94637N07863L92927J26712k96208q53498j489381
38652A7188110k120454k654413l016288l171520l134376k955996k698246k409132
38644d972315k112509j811780j498625j161173p91701l92150K7262M54872Q80134
38635a1377985J286440J642710J906775K041171K028933J878136J615024J272735
38627B293939Q82202M68268N0120l57312p42641j095364j399492j629381j756747
38618c286408j767602j674686j512023j314591j099927q66369o08740l39513r9593
38609a2569452N0552N5749j08618m27236q55254j336976j817017k239095k542663
38600b1790010k671058k591836k314144j886941j377616q46746l35462J31003
$$ plain form
38592 -33682810 -33150707 -32306550 -31264943 -30159488 -29127427 -28290991 -27740380 -27518257 -27604453
38583 -27604453 -27905924 -28263215 -28480882 -28376340 -27830092 -26818477 -25417767 -23780187 -22092554
38574 -22092554 -20532391 -19233199 -18264300 -17626243 -17261379 -17077292 -16977311 -16889272 -16783270
38565 -16783270 -16671632 -16590392 -16570335 -16612040 -16677059 -16697366 -16595854 -16308134 -15798001 -15061575
38555 -15061575 -14119306 -13002519 -11747177 -10403705 -9057245 -7839332 -6913176 -6432537
38547 -6432537 -6494270 -7109560 -8204501 -9641823 -11249303 -12848186 -14282241 -15444901 -16294714
38538 -16294714 -16850458 -17168079 -17311907 -17334099 -17269796 -17146585 -16999909 -16884072 -16871989 -17042746
38528 -17042746 -17460623 -18152130 -19090254 -20194675 -21348801 -22423021 -23290502 -23833110 -23949528
$$ packed form
38592c3682810N32103Q44157J041607J105455J032061Q36436N50611K22123q6196
38583b7604453l01471l57291k17667J04542N46248J011615J400710J637580J687633
38574b2092554J560163J299192R68899O38057L64864J84087R9981Q8039J06002
38565a6783270J11638Q1240K0057m1705o5019k0307J01512K87720N10133P36426
38555a5061575R42269J116787J255342J343472J346460J217913R26156M80639
38547f432537o1733o15290j094941j437322j607480j598883j434055j162660q49813
38538a6294714n55744l17621j43828k2192O4303J23211J46676J15837J2083j70757
38528a7042746m17877o91507r38124j104421j154126j074220q67481n42608j16418
$$ plain form
38519 -23949528 -23577949 -22728937 -21506666 -20097813 -18727479 -17602443 -16866307 -16579322 -16722086
38510 -16722086 -17217157 -17962291 -18866226 -19873967 -20970666 -22162993 -23447813 -24783399
38502 -24783399 -26077286 -27197935 -28006783 -28397801 -28329250 -27836821 -27023782 -26029987 -24989550
38493 -24989550 -23993900 -23074781 -22208939 -21334443 -20368522 -19224644 -17829645 -16137224 -14130806
38484 -14130806 -11813876 -9195459 -6283414 -3093814 326780 3880223 7412765 10734690
38476 10734690 13656710 16028528 17765742 18856736 19348598 19319796 18853511 18023376 16893265
38467 16893265 15523667 13976290 12313996 10597834 8883279 7215713 5624315 4115972
38459 4115972 2674884 1274059 -102400 -1438327 -2681943 -3766490 -4645526 -5323531
$$ packed form
38519b3949528L71579Q49012J222271J408853J370334J125036P36136K86985j42764
38510a6722086m95071p45134r03935j007741j096699j192327j284820j335586
38502b4783399j293887j120649q08848l91018O8551M92429Q13039R93795J040437
38493b4989550R95650R19119Q65842Q74496R65921J143878J394999J692421K006418
38484a4130806K316930K618417K912045L189600L420594L553443L532542L321925
38476A0734690K922020K371818J737214J090994M91862k8802m66285q30135j130111
38467A6893265j369598j547377j662294j716162j714555j667566j591398j508343
38459D115972j441088j400825j376459j335927j243616j084547q79036o78005
$$ plain form
38451 -5323531 -5865888 -6383967 -7001870 -7817283 -8871343 -10141854 -11566310 -13084766 -14677321
38442 -14677321 -16371190 -18211351 -20211820 -22315120 -24381757 -26216801 -27623286 -28457638
38434 -28457638 -28660682 -28254865 -27321440 -25977782 -24360478 -22605574 -20822152 -19070454
38426 -19070454 -17359348 -15665021 -13958666 -12228404 -10487463 -8768856 -7113070 -5557579
38418 -5557579 -4133741 -2869856 -1795908 -947770 -370653 -118830 -246144 -786628 -1734439
38409 -1734439 -3036397 -4602627 -6327681 -8108295 -9849784 -11464192 -12868703 -13989431
38401 -13989431 -14769864 -15181885 -15238879 -15008789 -14619426 -14245761 -14075903 -14265339 -14897754
38392 -14897754 -15967129 -17383038 -18989854 -20590061 -21969109 -22923984 -23293893 -22985178
$$ packed form
38451e323531n42357n18079o17903q15413j054060j270511j424456j518456j592555
38442a4677321j693869j840161k000469k103300k066637j835044j406485q34352
38434b8457638k03044M05817R33425J343658J617304J754904J783422J751698
38426a9070454J711106J694327J706355J730262J740941J718607J655786J555491
38418e557579J423838J263885J073948Q48138N77117K51823j27314n40484r47811
38409a734439j301958j566230j725054j780614j741489j614408j404511j120728
38401a3989431p80433m12021n6994K30090L89363L73665J69858j89436o32415
38392a4897754j069375j415909j606816j600207j379048r54875l69909L08715
$$ plain form
38384 -22985178 -21982052 -20340743 -18170497 -15607107 -12785574 -9819510 -6793575 -3769730
38376 -3769730 -801259 2055190 4737680 7188701 9369895 11271008 12906725 14304701
38368 14304701 15494024 16500770 17350497 18072946 18703905 19281729 19840512 20406062 20999584
38359 20999584 21646045 22377556 23225223 24203711 25299364 26468113 27640099 28724130 29609947
38350 29609947 30173587 30293388 29878448 28901374 27420451 25578871 23578837 21638759 19947087
38341 19947087 18626904 17722545 17211673 17033979 17119361 17402491 17823825 18326027 18851980
38332 18851980 19343663 19740669 19982070 20015880 19813492 19380166 18754490 17997454 17177272
38323 17177272 16356120 15581685 14883367 14271144 13735269 13246874 12761477 12227315 11598621
$$ packed form
38384b2985178J003126J641309K170246K563390K821533K966064L025935L023845
38376c769730K968471K856449K682490K451021K181194J901113J635717J397976
38368A4304701J189323J006746Q49727P22449O30959N77824N58783N65550N93522
38359B0999584O46461P31511Q47667R78488J095653J168749J171986J084031Q85817
38350B9609947N63640J19801m14940r77074j480923j841580k000034j940078j691672
38341A9947087j320183r04359n10872j77694Q5382K83130M21334N02202N25953
38332A8851980M91683L97006K41401L3810k02388m33326o25676p57036q20182
38323A7177272q21152p74435o98318o12223n35875m88395m85397n34162o28694
$$ plain form
38314 11598621 10851854 10000661 9102994 8253655 7560576 7112039 6948386 7050289 7347707
38305 7347707 7744736 8149829 8499168 8763492 8935414 9003582 8927373 8626608 7994043 6927553
38295 6927553 5369590 3338145 937303 -1656267 -4226815 -6564777 -8513821 -10007396
38287 -10007396 -11080770 -11849110 -12455995 -13013257 -13559312 -14052591 -14396762 -14479891 -14209437
38278 -14209437 -13534184 -12452311 -11005999 -9262828 -7289296 -5129601 -2802552 -316497
38270 -316497 2312029 5050490 7854206 10671125 13439286 16080142 18497356 20587217
38262 20587217 22259394 23461013 24194340 24519269 24537841 24366935 24110781 23843128 23602726
38253 23602726 23400030 23230030 23085241 22963449 22866660 22790466 22707119 22550312 22212148 21559154
$$ packed form
38314A1598621p46767q51193q97667q49339o93079m48537j63653J01903K97418
38305G347707L97029M05093L49339K64324J71922O8168p6209l00765o32565j066490
38295F927553j557963k031445k400842k593570k570548k337962j949044j493575
38287a0007396j073374p68340o06885n57262n46055m93279l44171q3129K70454
38278a4209437O75253J081873J446312J743171J973532K159695K327049K486055
38270c16497K628526K738461K803716K816919K768161K640856K417214K089861
38262B0587217J672177J201619P33327L24929J8572j70906k56154k67653k40402
38253B3602726k02696j70000j44789j21792r6789p6194q3347j56807l38164o52994
$$ plain form
38243 21559154 20465155 18849994 16710502 14134417 11294806 8426717 5788744 3613514
38235 3613514 2057149 1164883 868805 1019434 1435146 1947324 2427876 2798586 3028201
38226 3028201 3123812 3122420 3085763 3095159 3238858 3589334 4178852 4986268 5941183 6940932
38216 6940932 7871670 8627354 9123774 9306428 9152975 8673926 7914975 6959732 5926926
38207 5926926 4957245 4190995 3742954 3681939 4021220 4723304 5717511 6921716 8256685
38198 8256685 9647168 11014234 12269571 13320722 14088613 14529289 14644896 14472499 14055881
38189 14055881 13422152 12582574 11554183 10378979 9121792 7849134 6605394 5398682
38181 5398682 4198117 2940507 1546347 -55717 -1902699 -3981930 -6237684 -8599364
$$ packed form
38243B1559154j093999j615161k139492k576085k839611k868089k637973k175230
38235C613514j556365q92266k96078J50629M15712N12178M80552L70710K29615
38226C028201R5611j392l6657R396J43699L50476N89518Q07416R54915R99749
38216F940932R30738P55684M96420J82654j53453m79049p58951r55243j032806
38207E926926r69681p66250m48041o1015L39281P02084R94207J204205J334969
38198H256685J390483J367066J255337J051151P67891M40676J15607j72397m16618
38189A4055881o33729q39578j028391j175204j257187j272658j243740j206712
38181E398682j200565j257610j394160j602064j846982k079231k255754k361680
$$ plain form
38173 -8599364 -11015211 -13469076 -15968480 -18512156 -21057470 -23506361 -25719320 -27556072
38165 -27556072 -28927633 -29832009 -30349672 -30599633 -30683033 -30645161 -30469079 -30095478 -29456570
38156 -29456570 -28510855 -27264036 -25764980 -24079875 -22263311 -20346263 -18345833 -16284095
38148 -16284095 -14198970 -12140475 -10159985 -8305628 -6629596 -5200128 -4103190 -3423180
38140 -3423180 -3206654 -3429013 -3988061 -4732898 -5510916 -6203007 -6731135 -7048763 -7134871 -6997920
38130 -6997920 -6677974 -6235106 -5727086 -5189779 -4630710 -4037148 -3393660 -2701060 -1987272
38121 -1987272 -1302535 -697949 -195514 235338 679860 1253326 2058804 3146236 4489822
38112 4489822 5991322 7508446 8900931 10078724 11030726 11818894 12541263 13283954 14083736
$$ packed form
38173h599364k415847k453865k499404k543676k545314k448891k212959j836752
38165b7556072j371561r04376n17663k49961q3400L7872J76082L73601O38908
38156b9456570R45715J246819J499056J685105J816564J917048K000430K061738
38148a6284095K085125K058495J980490J854357J676032J429468J096938O80010
38140c423180K16526k22359n59048p44837p78018o92091n28128l17628q6108J36951
38130f997920L19946M42868N08020N37307N59069N93562O43488O92600P13788
38121a987272O84737O04586N02435M30852M44522N73466Q05478J087432J343586
38112D489822J501500J517124J392485J177793R52002P88168P22369P42691P99782
$$ plain form
38103 14083736 14912569 15685689 16289310 16618919 16613690 16272451 15644769 14802805 13808478 12691926
38093 12691926 11450356 10063954 8515679 6802161 4933202 2927238 810705 -1377719
38085 -1377719 -3582836 -5732715 -7742408 -9519395 -10970230 -12010652 -12581376 -12667725 -12315498
38076 -12315498 -11632848 -10772236 -9895762 -9135155 -8559940 -8165443 -7888099 -7646172 -7388452
38067 -7388452 -7122527 -6903055 -6788235 -6795641 -6885297 -6973516 -6960761 -6755576 -6287908 -5515153
38057 -5515153 -4427478 -3055830 -1477944 189077 1816598 3303621 4605970 5739762
38049 5739762 6761719 7741219 8736550 9778946 10864017 11951910 12978287 13874122 14586488
38040 14586488 15090899 15391156 15510868 15484344 15350604 15149120 14916152 14684345 14487639
$$ packed form
38103A4083736Q28833P73120O03621L29609n229l41239o27682q41964r94327j116552
38093A2691926j241570j386402j548275j713518j868959k005964k116533k188424
38085a377719k205117k149879k009693j776987j450835j040422n70724q6349L52227
38076a2315498O82650Q60612Q76474P60607N75215L94497K77344K41927K57720
38067g388452K65925K19472J14820p406q9656q8219J2755K05185M67668P72755
38057e515153J087675J371648J577886J667021J627521J487023J302349J133792
38049E739762J021957R79500R95331J042396J085071J087893J026377Q95835P12366
38040A4586488N04411L00257J19712k6524j33740k01484k32968k31807j96706
$$ plain form
38031 14487639 14367118 14369253 14533169 14874050 15374330 15987138 16644906 17263311 17740886 17966244
38021 17966244 17841994 17316955 16404953 15175926 13727382 12159010 10565813 9044072
38013 9044072 7690534 6581931 5742924 5125874 4619817 4084050 3385775 2425615 1149813
38004 1149813 -445578 -2318391 -4394530 -6587907 -8814109 -10990581 -13028877 -14831495
37996 -14831495 -16300677 -17356045 -17951511 -18083321 -17788040 -17135425 -16221662 -15163703 -14090830
37987 -14090830 -13129162 -12378521 -11886815 -11632569 -11526835 -11437954 -11230582 -10804336 -10120802
37978 -10120802 -9213485 -8177313 -7136731 -6200581 -5422896 -4789880 -4240624 -3710725 -3175240
37969 -3175240 -2667519 -2264382 -2048624 -2071984 -2336154 -2793303 -3358238 -3927322 -4404137 -4728619
$$ packed form
38031A4487639j20521K135J63916L40881N00280O12808O57768O18405M77575K25358
38021A7966244j24250n25039r12002j229027j448544j568372j593197j521741
38013I044072j353538j108603q39007o17050n06057n35767o98275r60160j275802
38004A149813j595391j872813k076139k193377k226202k176472k038296j802618
37996a4831495j469182j055368n95466j31810K95281O52615R13763J057959J072873
37987a4090830R61668P50641M91706K54246J05734Q8881K07372M26246O83534
37978a0120802R07317J036172J040582R36150P77685O33016N49256N29899N35485
37969c175240N07721M03137K15758k3360k64170m57149n64935n69084m76815l24482
$$ plain form
37959 -4728619 -4899388 -4978648 -5076190 -5316863 -5800817 -6569189 -7588861 -8763003 -9960632
37950 -9960632 -11048722 -11913428 -12468683 -12658085 -12454339 -11855846 -10881162 -9567037 -7975813
37941 -7975813 -6209201 -4415371 -2776309 -1475044 -657488 -407457 -741876 -1617863 -2939956
37932 -2939956 -4566487 -6323956 -8033380 -9538636 -10722400 -11507174 -11852539 -11758718 -11273561
37923 -11273561 -10491894 -9541132 -8556961 -7656950 -6918393 -6365969 -5975599 -5697126 -5487776
37914 -5487776 -5338639 -5278110 -5349749 -5576807 -5931990 -6328220 -6638730 -6743177 -6581328 -6185810
37904 -6185810 -5673279 -5198136 -4895836 -4845505 -5064319 -5525473 -6182127 -6983709 -7881810 -8830982
37894 -8830982 -9789401 -10718868 -11582260 -12342226 -12968033 -13449926 -13809378 -14093862 -14357062
$$ packed form
37959d728619j70769p9260r7542k40673m83954p68372j019672j174142j197629
37950i960632j088090q64706n55255j89402K03746N98493R74684J314125J591224
37941g975813J766612J793830J639062J301265Q17556K50031l34419q75987j322093
37932b939956j626531j757469j709424j505256j183764p84774l45365R3821M85157
37923a1273561P81667R50762R84171R00011P38557N52424L90370K78473K09350
37914e487776J49137O0529p1639k27058l55183l96230l10510j04447J61849L95518
37904f185810N12531M75143L02300N0331k18814m61154o56654q01582q98101r49172
37894h830982r58419r29467q63392p59966o25807m81893l59452k84484k63200
$$ plain form
37885 -14357062 -14635954 -14935542 -15226023 -15453523 -15562721 -15523547 -15348978 -15093274 -14828946
37876 -14828946 -14609973 -14435314 -14230525 -13861683 -13180722 -12081166 -10534859 -8593448 -6363651
37867 -6363651 -3981117 -1600327 604776 2450388 3776189 4492054 4611240 4250046 3595860
37858 3595860 2861386 2242154 1885535 1873959 2224205 2902275 3847612 4995901 6291067
37849 6291067 7684052 9124309 10554717 11918117 13175160 14324225 15411072 16519707
37841 16519707 17743930 19147749 20729554 22405592 24021013 25385120 26319372 26704563
37833 26704563 26514269 25823415 24787285 23598703 22441524 21457623 20734735 20313177 20205632
37824 20205632 20421547 20985021 21936742 23318851 25150449 27404749 29997658 32794334
$$ packed form
37885a4357062k78892k99588k90481k27500j09198L9174J74569K55704K64328
37876a4828946K18973J74659K04789L68842O80961J099556J546307J941411K229797
37867f363651K382534K380790K205103J845612J325801P15865J19186l61194o54186
37858C595860p34474o19232l56619j1576L50246O78070R45337J148289J295166
37849F291067J392985J440257J430408J363400J257043J149065J086847J108635
37841A6519707J224223J403819J581805J676038J615421J364107R34252L85191
37833B6704563j90294o90854j036130j188582j157179r83901p22888m21558j07545
37824B0205632K15915N63474R51721J382109J831598K254300K592909K796676
$$ plain form
37816 32794334 35633031 38354996 40824404 42931220 44584871 45712229 46265618 46236612
37808 46236612 45668377 44660124 43357168 41923226 40501928 39184449 37997639 36913486
37800 36913486 35870773 34801592 33660639 32452324 31242995 30146815 29288505 28761519
37792 28761519 28601575 28783907 29240603 29889108 30661314 31521761 32467694 33514570 34679647
37783 34679647 35973407 37397275 38939607 40567222 42219454 43814534 45271492 46540501
37775 46540501 47628159 48605005 49589628 50712844 52073259 53700192 55540024 57474750
37767 57474750 59367214 61114085 62683984 64125867 65545532 67060775 68755403 70654137
37759 70654137 72728956 74928067 77206814 79544709 81946693 84435669 87043938 89808896
$$ packed form
37816C2794334K838697K721965K469408K106816J653651J127358N53389k9006
37808D6236612n68235j008253j302956j433942j421298j317479j186810j084153
37800C6913486j042713j069181j140953j208315j209329j096180q58310n26986
37792B8761519j59944J82332M56696O48505P72206Q60447R45933J046876J165077
37783C4679647J293760J423868J542332J627615J652232J595080J456958J269009
37775D6540501J087658R76846R84623J123216J360415J626933J839832J934726
37767E7474750J892464J746871J569899J441883J419665J515243J694628J898734
37759G0654137K074819K199111K278747K337895K401984K488976K608269K764958
$$ plain form
37751 89808896 92775497 96002011 99558876 103511926 107894151 112683907 117807803 123170347
37743 123170347 128692761 134336718 140101077 146000540 152047676 158254671 164654119 171322709
37735 171322709 178387693 186005018 194314304 203389971 213210731 223659229 234548020 245658414
37727 245658414 256778554 267731254 278385851 288652772 298466241 307765966 316487403
37720 316487403 324563756 331937104 338573920 344478516 349695557 354294408 358337871 361850023
37712 361850023 364801174 367118430 368715949 369529526 369539125 368768821 367265260 365069205 362199893
37703 362199893 358661761 354464745 349639730 344238015 338318425 331933906 325126604 317932752
37695 317932752 310393162 302563858 294522634 286368131 278208187 270137152 262210113 254429259
$$ packed form
37751H9808896K966601L226514L556865L953050M382225M789756N123896N362544
37743A23170347N522414N643957N764359N899463O047136O206995O399448O668590
37735A71322709P064984P617325Q309286R075667R820760J0448498J0888791J1110394
37727B45658414J1120140J0952700J0654597J0266921R813469R299725Q721437
37720C16487403Q076353P373348O636816N904596N217041M598851M043463L512152
37712C61850023K951151K317256J597519Q13577R599p70304j503561k196055k869312
37703C62199893l538132m197016m825015n401715n919590o384519o807302p193852
37695C17932752p539590p829304q041224q154503q159944q071035p927039p780854
$$ plain form
37687 254429259 246753174 239123505 231490461 223822875 216105028 208332796 200517278 192692778
37679 192692778 184920374 177281338 169861139 162729996 155927714 149458680 143298591 137409980
37671 137409980 131760696 126338374 121155435 116243571 111641440 107380720 103473722 99904915
37663 99904915 96630449 93589191 90722200 87989900 85376920 82884597 80520153 78290607
37655 78290607 76201624 74257437 72461344 70819453 69347114 68071538 67024666 66228683
37647 66228683 65684634 65373741 65270901 65357352 65615337 65998727 66395350 66610781 66394112
37638 66394112 65499352 63754945 61113658 57668973 53636730 49308536 44990477 40946168
37630 40946168 37360794 34332538 31886707 30000954 28627884 27705967 27160460 26904525
$$ packed form
37687B54429259p676085p629669p633044p667586p717847p772232p815518p824500
37679A92692778p772404p639036p420199p131143o802282o469034o160089n888611
37671A37409980n649284n422322n182939m911864m602131m260720l906998l568807
37663I9904915l274466l041258k866991k732300k612980k492323k364444k229546
37655G8290607k088983j944187j796093j641891j472339j275576j046872p95983
37647F6228683n44049l10893j02840Q6451K57985L83390L96623K15431k16669
37638F6394112q94760j744407k641287l444685m032243m328194m318059m044309
37630D0946168l585374l028256k445831j885753j373070r21917n45507k55935
$$ plain form
37622 26904525 26847396 26905622 27009726 27105421 27153397 27127355 27006618 26766782 26379318 25823733
37612 25823733 25100237 24228709 23236425 22151339 21010153 19870104 18805499 17883935 17136933
37603 17136933 16545363 16048361 15568267 15036512 14408653 13665259 12802749 11822234 10724881
37594 10724881 9518715 8233620 6932546 5705782 4645620 3813757 3219601 2819195
37586 2819195 2531195 2260573 1923796 1472048 906959 281117 -319736 -806189 -1112509
37577 -1112509 -1209354 -1098665 -799213 -336113 259232 944875 1670569 2388703 3065043 3680552
37567 3680552 4225950 4697599 5099598 5449021 5778287 6131563 6556561 7096055 7783139
37558 7783139 8639886 9673652 10865519 12153386 13421371 14508372 15239907 15474094 15142536
$$ packed form
37622B6904525n7129N8226J04104R5695M7976k6042j20737k39836l87464n55585
37612B5823733p23496q71528r92284j085086j141186j140049j064605r21564p47002
37603A7136933n91570m97002m80094n31755o27859p43394q62510r80515j097353
37594A0724881j206166j285095j301074j226764j060162q31863n94156m00406
37586B819195k88000k70622l36777m51748n65089o25842o00853m86453l06320
37577a112509r6845J10689K99452M63100N95345O85643P25694P18134O76340O15509
37567C680552N45398M71649M01999L49423L29266L53276M24998N39494O87084
37558G783139Q56747J033766J191867J287867J267985J087001P31535K34187l31558
$$ plain form
37549 15142536 14266643 12942162 11302592 9482290 7593772 5719066 3906688 2170254
37541 2170254 492956 -1156593 -2798870 -4417807 -5946453 -7271151 -8255548 -8780403
37533 -8780403 -8789192 -8322559 -7522826 -6600202 -5772311 -5204095 -4972908 -5066515 -5404590 -5869240
37523 -5869240 -6335574 -6699281 -6897913 -6919314 -6793288 -6573203 -6322316 -6112802 -6028087 -6151728
37513 -6151728 -6540155 -7197352 -8071748 -9076312 -10114535 -11095939 -11938454 -12563597 -12890247
37504 -12890247 -12832472 -12309143 -11269358 -9724606 -7767412 -5560273 -3296866 -1154416
37496 -1154416 741172 2326660 3592987 4568671 5305293 5867899 6327166 6750381 7192715
37487 7192715 7692393 8270658 8933965 9676282 10481416 11324130 12166295 12947548 13579234
$$ packed form
37549A5142536q75893j324481j639570j820302j888518j874706j812378j736434
37541B170254j677298j649549j642277j618937j528646j324698r84397n24855
37533h780403q789M66633P99733R22624Q27891N68216K31187r3607l38075m64650
37523e869240m66334l63707j98632k1401J26026K20085K50887K09514Q4715j23641
37513f151728l88427o57197q74396j004564j038223r81404q42515o25143l26650
37504a2890247N7775N23329J039785J544752J957194K207139K263407K142450
37496a154416J895588J585488J266327R75684P36622N62606M59267M23215M42334
37487G192715M99678N78265O63307P42317Q05134Q42714Q42165P81253O31686
$$ plain form
37478 13579234 13954698 13979466 13608345 12869258 11862318 10737292 9660311 8779614 8196977
37469 8196977 7950121 8009284 8286401 8651856 8955467 9052425 8833808 8253336 7336038 6161079
37459 6161079 4827556 3423698 2014714 647708 -639701 -1817422 -2866113 -3776950
37451 -3776950 -4543605 -5152717 -5584751 -5830335 -5912428 -5895228 -5867508 -5907414 -6051467 -6288328
37441 -6288328 -6579128 -6886198 -7187806 -7471202 -7716253 -7888603 -7949430 -7872258 -7653066 -7309495
37431 -7309495 -6874076 -6386091 -5882235 -5386976 -4908079 -4442656 -3992141 -3577268 -3243082
37422 -3243082 -3049639 -3052523 -3283715 -3742879 -4401511 -5214310 -6130780 -7104651 -8101441 -9102459
37412 -9102459 -10101707 -11095168 -12066480 -12974045 -13743090 -14266880 -14423475 -14111421 -13296020
$$ packed form
37478A3579234L75464K4768l71121p39087j006940j125026j076981q80697n82637
37469H196977k46856N9163K77117L65455L03611R6958k18617n80472r17298j174959
37459F161079j333523j403858j408984j367006j287409j177721j048691r10837
37451c776950p66655o09112m32034k45584q2093J7200K7720l9906j44053k36861
37441f288328k90800l07070l01608k83396k45051j72350o0827P7172K19192L43571
37431g309495M35419M87985N03856M95259M78897M65423M50515M14873L34186
37422c243082J93443k884k31192m59164o58632q12799r16470r73871r96790j001018
37412i102459r99248r93461r71312r07565p69045n23790j56595L12054Q15401
$$ plain form
37403 -13296020 -12043922 -10521276 -8947456 -7524509 -6380306 -5553514 -5017506 -4715018
37395 -4715018 -4577853 -4529211 -4484088 -4359693 -4092515 -3650905 -3037617 -2285858 -1454797 -625939
37385 -625939 103128 631783 875812 786319 358465 -373698 -1349588 -2490501 -3700600
37376 -3700600 -4868476 -5878869 -6633075 -7065843 -7148892 -6883947 -6296879 -5439794 -4395829
37367 -4395829 -3275249 -2197594 -1266565 -550384 -75292 170365 229416 171223 86920 78624
37357 78624 239406 628439 1253639 2074633 3026847 4050317 5102250 6148543 7150164
37348 7150164 8061625 8840285 9451833 9865626 10049730 9976159 9632555 9028518 8192641 7167129
37338 7167129 6006263 4777721 3563322 2458966 1574070 1026894 930457 1368309 2366571
$$ packed form
37403a3296020J252098J522646J573820J422947J144203Q26792N36008L02488
37395d715018J37165M8642M5123J24395K67178M41610O13288P51759Q31061Q28858
37385f25939P29067N28655K44029q9493m27854p32163r75890j140913j210099
37376c700600j167876j010393p54206m32768q3049K64945N87068Q57085J043965
37367d395829J120580J077655R31029P16181M75092K45657N9051n8193q4303q296
37357G8624J60782L89033O25200Q20994R52214J023470J051933J046293J001621
37348G150164R11461P78660O11548M13793J84104p3571l43604o04037q35877j025512
37338G167129j160866j228542j214399j104356q84896n47176r6437M37852R98262
$$ plain form
37329 2366571 3873089 5754676 7819016 9858714 11703593 13260060 14519217 15529365
37321 15529365 16347195 16993937 17439036 17615874 17455044 16914499 15994561 14738518 13225108
37312 13225108 11556156 9838261 8159558 6570259 5080288 3680498 2378365 1227581
37304 1227581 333602 -169420 -161688 415094 1524394 3030110 4724186 6374650 7772856
37295 7772856 8763515 9255270 9220682 8694520 7770324 6586566 5294969 4016537 2805199
37286 2805199 1639537 446354 -860151 -2346041 -4044668 -5961348 -8085744 -10400856
37278 -10400856 -12881175 -15480018 -18114903 -20663377 -22975824 -24900603 -26309093 -27109449
37270 -27109449 -27246247 -26692701 -25446330 -23534088 -21022568 -18022088 -14677359 -11148916
$$ packed form
37329B366571J506518J881587K064340K039698J844879J556467J259157J010148
37321A5529365Q17830O46742M45099J76838j60830n40545r19938j256043j513410
37312A3225108j668952j717895j678703j589299j489971j399790j302133j150784
37304A227581q93979n03022P732N76782J109300J505716J694076J650464J398206
37295G772856R90659M91755l4588n26162r24196j183758j291597j278432j211338
37286B805199j165662j193183j306505j485890j698627j916680k124396k315112
37278a0400856k480319k598843k634885k548474k312447j924779j408490q00356
37270b7109449j36798N53546J246371J912242K511520L000480L344729L528443
$$ plain form
37262 -11148916 -7596935 -4174767 -1027690 1714486 3956895 5663850 6872341 7683673
37254 7683673 8235542 8667921 9096894 9602479 10227209 10978216 11828093 12715699 13552660
37245 13552660 14240429 14695883 14875707 14788437 14490012 14067487 13618133 13227712 12950060
37236 12950060 12793471 12721468 12669708 12571086 12377547 12071939 11668755 11203750 10713896 10215608
37226 10215608 9694911 9119080 8465764 7754025 7060258 6509191 6240433 6360869 6900082
37217 6900082 7786424 8854100 9880344 10641384 10968900 10786730 10113930 9035407 7658022
37208 7658022 6076693 4365839 2593072 837560 -805232 -2238761 -3392222 -4243160
37200 -4243160 -4822243 -5195644 -5432188 -5572653 -5619622 -5552986 -5356774 -5035835 -4613916 -4122547
$$ packed form
37262a1148916L551981L422168L147077K742176K242409J706955J208491Q11332
37254G683673N51869M32379M28973N05585O24730P51007Q49877Q87606Q36961
37245A3552660O87769M55454J79824q7270k98425m22525m49354l90421k77652
37236A2950060j56589p2003n1760r8622j93539l05608m03184m65005m89854m98288
37226A0215608n20697n75831o53316p11739o93767n51067k68758J20436N39213
37217F900082Q86342J067676J026244P61040L27516j82170o72800j078523j377385
37208G658022j581329j710854j772767j755512j642792j433529j153461q50938
37200d243160n79083l73401k36544j40465m6969O6636J96212L20939M21919M91369
$$ plain form
37190 -4122547 -3592136 -3044117 -2477223 -1852376 -1093523 -115437 1132133 2629134 4277681
37181 4277681 5923691 7395934 8547797 9289687 9603938 9539359 9189000 8660115 8047189
37172 8047189 7416181 6802687 6221710 5684072 5213237 4855280 4675432 4739868 5088561 5709264
37162 5709264 6522461 7385629 8121953 8569291 8631029 8303766 7667072 6841425 5935869 5008886
37152 5008886 4058202 3042347 1920793 688273 -616087 -1924111 -3161408 -4263403
37144 -4263403 -5183379 -5895764 -6391153 -6658107 -6659204 -6321050 -5552493 -4285078 -2513950
37135 -2513950 -318285 2146928 4682513 7086837 9192622 10888020 12119154 12878710
37127 12878710 13188741 13085487 12611188 11813602 10750415 9495087 8141891 6807085 5620572
$$ packed form
37190d122547N30411N48019N66894O24847P58853R78086J247570J497001J648547
37181D277681J646010J472243J151863P41890L14251o4579l50359n28885o12926
37172H047189o31008o13494n80977n37638m70835l57957j79848O4436L48693O20703
37162E709264Q13197Q63168P36324M47338O1738l27263o36694q25647r05556r26983
37152E008886r50684j015855j121554j232520j304360j308024j237297j101995
37144d263403r19976p12385m95389k66954j097L38154P68557J267415J771128
37135b513950K195665K465213K535585K404324K105785J695398J231134P59556
37127A2878710L10031j03254m74299p97586j063187j255328j353196j334806j186513
$$ plain form
37118 5620572 4703306 4133781 3916971 3972261 4149628 4270045 4174748 3765194 3023081 2011176
37108 2011176 860281 -256916 -1167535 -1750043 -1977221 -1930236 -1776480 -1719577 -1938893
37099 -1938893 -2539457 -3532679 -4856880 -6423899 -8160755 -10021647 -11970322 -13952618
37091 -13952618 -15879370 -17628144 -19062147 -20060126 -20548479 -20524752 -20062530 -19292944 -18367105
37082 -18367105 -17413406 -16507818 -15669518 -14881268 -14122012 -13394551 -12734558 -12197170 -11830633
37073 -11830633 -11654643 -11656208 -11801418 -12050782 -12367608 -12718177 -13069178 -13388611 -13653090 -13858778
37063 -13858778 -14027571 -14200769 -14421559 -14717245 -15091670 -15527714 -15990879 -16426852 -16756388
37054 -16756388 -16878619 -16690043 -16112828 -15115485 -13713233 -11951602 -9887936 -7580476 -5082040
$$ packed form
37118E620572r17266n69525k16810N5290J77367J20417r5297m09554p42113j011905
37108B011176j150895j117197r10619n82508k27178M6985J53756N6903k19316
37099a938893o00564r93222j324201j567019j736856j860892j948675j982296
37091a3952618j926752j748774j434003r97979m88353K3727M62222P69586R25839
37082a8367105R53699R05588Q38300P88250P59256P27461O59993N37388L66537
37073a1830633J75990j565j45210k49364l16826l50569l51001l19433k64479k05688
37063a3858778j68793j73198k20790k95686l74425m36044m63165m35973l29536
37054a6756388j22231J88576N77215R97343J402252J761631K063666K307460K498436
$$ plain form
37045 -5082040 -2431643 353955 3278648 6348540 9541951 12782896 15933716 18814511
37037 18814511 21244836 23092609 24310634 24944763 25108743 24936327 24533707 23955027 23208686
37028 23208686 22283384 21175563 19906762 18529775 17126189 15795647 14636123 13718454
37020 13718454 13064477 12640345 12370392 12164562 11943933 11652393 11255107 10733386 10083833
37011 10083833 9321209 8478642 7599839 6724659 5876651 5062629 4286457 3567527 2949866
37002 2949866 2494966 2262586 2289447 2574069 3071631 3698576 4343961 4884529 5203314 5212912
36992 5212912 4881061 4249940 3438656 2623309 1998557 1732964 1932849 2623953 3751011
36983 3751011 5190055 6770085 8304260 9628762 10640486 11319662 11725491 11962367 12128371
$$ packed form
37045e082040K650397K785598K924693L069892L193411L240945L150820K880795
37037A8814511K430325J847773J218025O34129J63980j72416m02620n78680p46341
37028B3208686r25302j107821j268801j376987j403586j330542j159524r17669
37020A3718454o53977m24132k69953k05830k20629k91540l97286n21721o49553
37011A0083833p62624q42567q78803q75180q48008q14022p76172p18930o17661
37002B949866m54900k32380K6861K84622M97562O26945O45385N40568L18785R598
36992E212912l31851o31121q11284q15347o24752k65593J99885O91104J127058
36983C751011J439044J580030J534175J324502J011724O79176M05829K36876J66004
$$ plain form
36974 12128371 12269705 12364451 12342275 12123960 11654523 10914061 9910373 8668999 7231772
36965 7231772 5661259 4038843 2448087 949699 -433684 -1708955 -2885299 -3950050
36957 -3950050 -4867291 -5599590 -6134907 -6499584 -6753516 -6978605 -7271524 -7738388 -8479219
36948 -8479219 -9557268 -10965909 -12614224 -14341879 -15955631 -17271035 -18146501 -18502676
36940 -18502676 -18322809 -17634848 -16486451 -14930480 -13030518 -10878620 -8607125 -6381538
36932 -6381538 -4375038 -2735566 -1559539 -882967 -691425 -938159 -1554687 -2447994 -3495172
36923 -3495172 -4552116 -5480233 -6177336 -6594361 -6732011 -6626340 -6335749 -5933436 -5500400
36914 -5500400 -5113758 -4831580 -4680332 -4649719 -4696065 -4754419 -4759119 -4667856 -4477266 -4218814
$$ packed form
36974A2128371J41334R4746k2176k18315m69437p40462j003688j241374j437227
36965G231772j570513j622416j590756j498388j383383j275271j176344j064751
36957c950050r17241p32299n35317l64677k53932k25089k92919m66864p40831
36948h479219j078049j408641j648315j727655j613752j315404q75466l56175
36940a8502676J79867O87961J148397J555971J899962K151898K271495K225587
36932f381538K006500J639472J176027O76572J91542k46734o16528q93307j047178
36923c495172j056944r28117o97103m17025j37650J05671K90591M02313M33036
36914e500400L86642K82178J51248L0613m6346n8354m700R1263J90590K58452
$$ plain form
36904 -4218814 -3935991 -3658208 -3389071 -3115032 -2824918 -2523887 -2230225 -1956048 -1685137
36895 -1685137 -1364150 -914473 -257726 659340 1850448 3286817 4902665 6608097 8308584
36886 8308584 9925978 11412355 12750743 13943825 14996285 15897017 16607962 17067223 17209808
36877 17209808 16997976 16443989 15612281 14602469 13524857 12478231 11533018 10721019 10034526
36868 10034526 9436297 8877202 8316187 7737963 7163979 6651252 6276632 6111224 6194848
36859 6194848 6519017 7022227 7598363 8117135 8452336 8510235 8249989 7690734 6904007 5994629
36849 5994629 5077849 4262022 3641226 3293915 3280120 3634244 4357373 5414332 6736501
36840 6736501 8228209 9776088 11263127 12587703 13683079 14529442 15151251 15597873 15914313
$$ packed form
36904d218814K82823K77783K69137K74039K90114L01031K93662K74177K70911
36895a685137L20987M49677O56747R17066J191108J436369J615848J705432J700487
36886H308584J617394J486377J338388J193082J052460R00732P10945M59261J42585
36877A7209808k11832n53987q31708j009812j077612j046626r45213q11999o86493
36868A0034526n98229n59095n61015n78224n73984n12727l74620j65408Q3624
36859F194848L24169N03210N76136N18772L35201N7899k60246n59255p86727r09378
36849E994629r16780q15827o20796l47311j3795L54124P23129J056959J322169
36840F736501J491708J547879J487039J324576J095376Q46363O21809M46622L16440
$$ plain form
36831 15914313 16117428 16192941 16115505 15876628 15500154 15037184 14548431 14086476 13683944 13348197
36821 13348197 13063556 12802273 12540622 12271513 12006003 11762474 11549231 11350310 11123614
36812 11123614 10814034 10375167 9788244 9069309 8261718 7416193 6564835 5699606 4765923
36803 4765923 3674578 2325312 631956 -1456354 -3939297 -6758531 -9806690 -12953463
36795 -12953463 -16077109 -19082250 -21892975 -24428941 -26584695 -28228491 -29221892 -29449563
36787 -29449563 -28847078 -27418684 -25240470 -22447182 -19206773 -15693913 -12074829 -8507055
36779 -8507055 -5144835 -2135611 399092 2390793 3843468 4833406 5487749 5947552 6325012
36770 6325012 6668058 6947274 7073495 6939423 6466014 5634311 4493574 3147153 1724071
$$ packed form
36831A5914313K03115P5513p7436k38877l76474m62970m88753m61955m02532l35747
36821A3348197k84641k61283k61651k69109k65510k43529k13243j98921k26696
36812A1123614l09580m38867n86923p18935q07591q45525q51358q65229r33683
36803D765923j091345j349266j693356k088310k482943k819234l048159l146773
36795a2953463l123646l005141k810725k535966k155754j643796r93401k27671
36787b9449563O02485J428394K178214K793288L240409L512860L619084L567774
36779h507055L362220L009224K534703J991701J452675R89938O54343M59803L77460
36770F325012L43046K79216J26221j34072m73409q31703j140737j346421j423082
$$ plain form
36761 1724071 347732 -886237 -1915688 -2701743 -3208717 -3382577 -3139385 -2377210 -1016666
36752 -1016666 945224 3399954 6137603 8901342 11459308 13660750 15456949 16886342
36744 16886342 18036812 19003224 19855182 20620270 21278918 21766323 21983258 21820349 21192875
36735 21192875 20072829 18503939 16595521 14502238 12400355 10467229 8865103 7726537
36727 7726537 7138629 7127250 7647902 8590936 9802399 11112350 12358299 13396848 14107315
36718 14107315 14398335 14224633 13607900 12644676 11487419 10301983 9220912 8313833 7584502
36709 7584502 6989336 6463346 5939030 5351892 4638692 3740691 2616786 1257882 -309533
36700 -309533 -2031673 -3837607 -5644099 -7359489 -8895224 -10185101 -11201436 -11956526
$$ packed form
36761A724071j376339j233969j029451p86055n06974j73860K43192P62175J360544
36752a016666J961890K454730K737649K763739K557966K201442J796199J429393
36744A6886342J150470R66412Q51958P65088O58648M87405K16935j62909o27474
36735B1192875j120046j568890j908418k093283k101883j933126j602126j138566
36727G726537n87908j1379N20652R43034J211463J309951J245949J038549P10467
36718A4107315K91020j73702o16733r63224j157257j185436j081071r07079p29331
36709G584502n95166n25990n24316n87138p13200q98001j123905j358904j567415
36700c09533j722140j805934j806492j715390j535735j289877j016335p55090
$$ [...]
##END NTUPLES=NMR SPECTRUM
##END=
