##TITLE=31Pdec_LR-776-BK
 CDCl3
  24 sc
 20.11.2023
##JCAMPDX= 6.0         $$ Bruker NMR JCAMP-DX V2.0
##DATA TYPE= NMR SPECTRUM
##DATA CLASS= NTUPLES
##ORIGIN= UXNMR, Bruker Analytische Messtechnik GmbH
##OWNER= root
$$ XWIN-NMR		Version 3.5
$$ Mon Nov 20 16:06:04 2023 Russian Standard Time (UT+4h)  she@DPX200
##.OBSERVE FREQUENCY= 81.013821
##.OBSERVE NUCLEUS= ^31P
##.ACQUISITION MODE= SIMULTANEOUS
##.ACQUISITION SCHEME= undefined
##.AVERAGES= 24
##.DIGITISER RES= 16
##SPECTROMETER/DATA SYSTEM= spect
##.PULSE SEQUENCE= zgpg30
##.SOLVENT NAME= CDCl3
##.SHIFT REFERENCE= (INTERNAL, CDCl3, 0, 248.564)
##AUDIT TRAIL= $$ (NUMBER, WHEN, WHO, WHERE, WHAT)
$$ ##TITLE= Audit trail, XWIN-NMR		Version 3.5
$$ ##JCAMPDX= 5.01
$$ ##ORIGIN= Bruker BioSpin GmbH
$$ ##OWNER= she
$$ F:/spectra/data/she/nmr/P31/1/pdata/1/auditp.txt
$$ ##AUDIT TRAIL=  $$ (NUMBER, WHEN, WHO, WHERE, WHAT)
(   1,<2023-11-20 16:04:58.93 +0400>,<she>,<DPX200>,
      <created by zg, POWCHK disabled, PULCHK disabled
       configuration hash MD5:
       00 E9 B6 7A A2 85 ED C7 34 08 36 98 17 FE 4E 26
       data hash MD5: 32K
       66 69 50 DC 95 38 96 E0 61 E8 3D F4 FB 16 97 F4>)
(   2,<2023-11-20 16:05:04.50 +0400>,<she>,<DPX200>,
      <Start of raw data processing
       efp BC_mod = 2 LB = 5 FT_mod = 6 PKNL = 1 PHC0 = -10300.24 PHC1 = -1082.109 SI = 64K 
       data hash MD5: 64K
       7C 99 F4 3C D4 9A 45 56 02 6B B5 EE 71 A6 09 D3>)
(   3,<2023-11-20 16:05:32.39 +0400>,<she>,<DPX200>,
      <pk PHC0 = 172.8087 PHC1 = -215.6 
       data hash MD5: 64K
       8F C6 1C 78 A6 06 50 B9 21 67 A3 31 3A EA 1E 1E>)
(   4,<2023-11-20 16:05:36.89 +0400>,<she>,<DPX200>,
      <abs ABSG = 5 
       data hash MD5: 64K
       17 94 6B B5 58 A4 3C F7 20 A7 D9 F3 A3 E0 B8 84>)
$$ ##END=
$$ 
$$ hash MD5
$$ 5B EF 7A 02 29 8C 23 85 E7 6A 81 9B 91 D1 7E F7
##$RELAX= 
##$RELAX= 
##$RELAX= 
##$RELAX= 
##$RELAX= 
##$RELAX= 
##$RELAX= 
##$RELAX= 
##$RELAX= 
$$ Bruker specific parameters
$$ --------------------------
##$DU= <F:/spectra>
##$EXPNO= 1
##$NAME= <P31>
##$PROCNO= 1
##$TYPE= <nmr>
##$USER= <she>
##$AMP= (0..31)
100 100 100 100 100 100 100 100 100 100 100 100 100 100 100 100 100 100 
100 100 100 100 100 100 100 100 100 100 100 100 100 100 
##$AQSEQ= 0
##$AQ_mod= 1
##$AUNM= <au_zg>
##$AUTOPOS= <>
##$BF1= 81.014009
##$BF2= 200.13
##$BF3= 200.13
##$BF4= 200.13
##$BF5= 200.13
##$BF6= 200.13
##$BF7= 200.13
##$BF8= 200.13
##$BYTORDA= 1
##$CFDGTYP= 0
##$CFRGTYP= 5
##$CHEMSTR= <none>
##$CNST= (0..31)
1 1 145 1 1 1 1 1 1 1 1 1 1 1 1 1 1 1 1 1 1 1 1 1 1 1 1 1 1 1 1 1 
##$CPDPRG= <waltz16>
##$CPDPRG1= <>
##$CPDPRG2= <waltz16>
##$CPDPRG3= <>
##$CPDPRG4= <mlev>
##$CPDPRG5= <mlev>
##$CPDPRG6= <mlev>
##$CPDPRG7= <mlev>
##$CPDPRG8= <mlev>
##$CPDPRGB= <>
##$CPDPRGT= <>
##$D= (0..31)
0 1 0 0 0 0 0 0 0 0 0 0.03 2e-05 3e-06 0 0 0 0 0 0 0 0 0 0 0 0 0 0 0 0 
0 0 
##$DATE= 1700481898
##$DBL= (0..7)
120 120 120 11 120 120 24 19 
##$DBP= (0..7)
150 150 150 150 150 150 150 150 
##$DBP07= 0
##$DBPNAM0= <>
##$DBPNAM1= <>
$$ [...]
##$SUBNAM3= <"">
##$SUBNAM4= <"">
##$SUBNAM5= <"">
##$SUBNAM6= <"">
##$SUBNAM7= <"">
##$SUBNAM8= <"">
##$SUBNAM9= <"">
##$SW= 501.771253377433
##$SWIBOX= (0..15)
0 1 3 0 0 0 0 0 0 0 0 0 0 0 0 0 
##$SW_h= 40650.406504065
##$TD= 32768
##$TD0= 1
##$TE= 0
##$TE2= 300
##$TE3= 300
##$TEG= 300
##$TL= (0..7)
0 120 53 12 22 120 120 120 
##$TP= (0..7)
150 150 150 150 150 150 150 150 
##$TP07= 0
##$TPNAME0= <>
##$TPNAME1= <>
##$TPNAME2= <>
##$TPNAME3= <>
##$TPNAME4= <>
##$TPNAME5= <>
##$TPNAME6= <>
##$TPNAME7= <>
##$TPOAL= (0..7)
0.5 0.5 0.5 0.5 0.5 0.5 0.5 0.5 
##$TPOFFS= (0..7)
0 0 0 0 0 0 0 0 
##$TUNHIN= 0
##$TUNHOUT= 0
##$TUNXOUT= 0
##$USERA1= <user>
##$USERA2= <user>
##$USERA3= <user>
##$USERA4= <user>
##$USERA5= <user>
##$V9= 5
##$VALIST= <valist>
##$VCLIST= <CCCCCCCCCCCCCCC>
##$VD= 0
##$VDLIST= <DDDDDDDDDDDDDDD>
##$VPLIST= <PPPPPPPPPPPPPPP>
##$VTLIST= <TTTTTTTTTTTTTTT>
##$WBST= 1024
##$WBSW= 4
##$XGAIN= (0..3)
0 0 0 0 
##$XL= 0
##$YL= 0
##$YMAX_a= 1251
##$YMIN_a= -1177
##$ZGOPTNS= <>
##$ZL1= 120
##$ZL2= 120
##$ZL3= 120
##$ZL4= 120
##$ABSF1= 248.5645
##$ABSF2= -253.2056
##$ABSG= 5
##$ABSL= 3
##$ALPHA= 0
##$AQORDER= 0
##$ASSFAC= 0
##$ASSFACI= 0
##$ASSFACX= 0
##$ASSWID= 0
##$AUNMP= <proc_1d>
##$AZFE= 0.1
##$AZFW= 0.5
##$BCFW= 0
##$BC_mod= 2
##$BYTORDP= 0
##$COROFFS= 0
##$CY= -3
##$DATMOD= 1
##$DC= 0
##$DFILT= <>
##$DTYPP= 0
##$F1P= 0
##$F2P= 0
##$FCOR= 1
##$FTSIZE= 65536
##$FT_mod= 6
##$GAMMA= 0
##$GB= 0
##$INTBC= 1
##$INTSCL= 6.047779e-11
##$ISEN= 30
##$LB= 5
##$LEV0= 0
##$LPBIN= 0
##$MAXI= 10000
##$MC2= 0
##$MEAN= 0
##$ME_mod= 0
##$MI= 50
##$NCOEF= 0
##$NC_proc= -10
##$NLEV= 6
##$NOISF1= 182.463
##$NOISF2= 159.3651
##$NSP= 0
##$NTH_PI= 0
##$NZP= 0
##$OFFSET= 248.5645
##$PC= 4
##$PHC0= -10127.43
##$PHC1= -1297.709
##$PH_mod= 1
##$PKNL= yes
##$PPARMOD= 0
##$PSCAL= 0
##$PSIGN= 0
##$REVERSE= no
##$SF= 81.0140089999694
##$SI= 65536
##$SIGF1= 159.3651
##$SIGF2= -187.1042
##$SINO= 113.3802
##$SIOLD= 16384
##$SREGLST= <1H.CDCl3>
##$SSB= 0
##$STSI= 65536
##$STSR= 0
##$SW_p= 40650.406504065
##$SYMM= 0
##$S_DEV= 0
##$TDeff= 32768
##$TDoff= 0
##$TI= <>
##$TILT= no
##$TM1= 0
##$TM2= 0
##$TOPLEV= 0
##$USERP1= <user>
##$USERP2= <user>
##$USERP3= <user>
##$USERP4= <user>
##$USERP5= <user>
##$WDW= 1
##$XDIM= 65536
##$YMAX_p= 374971140
##$YMIN_p= -121618562
$$ End of Bruker specific parameters
$$ ---------------------------------
##NTUPLES= NMR SPECTRUM
##VAR_NAME=  FREQUENCY,     SPECTRUM/REAL,   SPECTRUM/IMAG
##SYMBOL=    X,             R,               I
##VAR_TYPE=  INDEPENDENT,   DEPENDENT,       DEPENDENT
##VAR_FORM=  AFFN,          ASDF,            ASDF
##VAR_DIM=   65536,         65536,           65536
##UNITS=     HZ,            ARBITRARY UNITS, ARBITRARY UNITS
##FACTOR=    0.620285442955139, 1,           1
##FIRST=     20137.2065510682, 0,            0
##LAST=      -20513.1999529968, 0,           0
##MIN=       -20513.1999529968, -121618562,  0
##MAX=       20137.2065510682, 374971140,    0
$$ Real data points
##PAGE= N=1
##DATA TABLE= (X++(R..R)), XYDATA
$$ [...]
43499D592577K718340J817963N78612n16947q62468l80684L77860P95765O86382
43490I807400K55404k23252o11175r02107j118341j228219j192597j094629j120006
43481B572478j334053j582017j720656j830994k022100k116337j792846j060863
43473a0887388l28384J12630M47453R90855J623844J840961J360122M67079l23183
43464d696011p67500r15323p84363l01578L96351Q80173Q62584N86862N39019
43455d199786Q17341J046119R36069O40512M26042K60642k7344l64548n11425
43446i76378m53893m22820n24421o31538p01581r32014j448712k022495k260913
43437a0374765j974310j239572k47147P42433J402143J535580J280752R46707
$$ y = [4592577, 7310917, 9128880, 9707492, 9190545, 8328077, 7947393, 8325253, 9121018, 9807400, 10062804, 9839552, 9228377, 8326270, 7207929, 5979710, 4787113, 3692484, 2572478, 1238425, -343592, -2064248, -3895242, -5917342, -8033679, -9826525, -10887388, -11215772, -11103142, -10655689, -9664834, -8040990, -6200029, -4839907, -4372828, -4696011, -5463511, -6378834, -7163197, -7464775, -7068424, -6188251, -5325667, -4738805, -4199786, -3382445, -2336326, -1400257, -759745, -333703, -73061, -100405, -464953, -976378, -1430271, -1853091, -2377512, -3009050, -3710631, -4642645, -6091357, -8113852, -10374765, -12349075, -13588647, -13835794, -13093361, -11691218, -10155638, -8874886, -7928179]
43429g928179O24125J25945o20782j294636j457580j054421m70931p4668J65929
43420a1985198N36119J161437J864685K380097K557107K350698J792038J072689
43412A729672N22328L29768L31100K42462J02960L01439J072718K100908K772304
43403I505659K780428K348705J863850J452221J008841N09758Q1557k46775o27012
43394A8677232j067272j193568o22672M33296J214797J172047M57320m54011j367345
43385A7249824k337744l226960l655986l397170k548215j322619M7645J167006
43377A975781J566640J135513K86783m53931q88183j079867j066038q45372n45305
43368H6021l87872m90227p86117j086599j156022q59609l74809j61210n52045
$$ y = [-7928179, -7304054, -7178109, -7798891, -9093527, -10551107, -11605528, -12076459, -12151127, -11985198, -11449079, -10287642, -8422957, -6042860, -3485753, -1135055, 656983, 1729672, 2252000, 2581768, 2912868, 3155330, 3258290, 3559729, 4632447, 6733355, 9505659, 12286087, 14634792, 16498642, 17950863, 18959704, 19469462, 19551019, 19304244, 18677232, 17609960, 16416392, 15793720, 16227016, 17441813, 18613860, 19071180, 18617169, 17249824, 14912080, 11685120, 8029134, 4631964, 2083749, 761130, 808775, 1975781, 3542421, 4677934, 4964717, 4510786, 3622603, 2542736, 1476698, 631326, 86021, -301851, -792078, -1578195, -2664794, -3820816, -4680425, -5055234, -5216444, -5768489]
43359e768489j385473k121574k287872j791647r43221k71427j68367n67796j063829
43350a6369695j416843j748371k124068k246500j856467j202550p19994l89408
43342b8073896J52019R47397J662127K193674K794190L441952L642708L174858
43334a0064971K576671K459828K653804K498167J782880R24261L07091q2836l73517
43325B681378n92281q36612j292066j887038k156930j652553m17692R91291J882615
43316c279888J869402J124576K39321k93566m55468m82447m23289j75206J41794
43307a734771K30000R0037R6891M57455Q91391J021979Q02999L54253l37559j246390
43297F26285k034297k303764k060164j651512j300212r49436n31759j14689K43761
$$ y = [-5768489, -7153962, -9275536, -11563408, -13355055, -14298276, -14569703, -14738070, -15305866, -16369695, -17786538, -19534909, -21658977, -23905477, -25761944, -26964494, -27684488, -28073896, -27921877, -26974480, -25312353, -23118679, -20324489, -16882537, -13239829, -10064971, -7488300, -5028472, -2374668, 123499, 1906379, 2830640, 3137731, 3054895, 2681378, 2089097, 1252485, -39581, -1926619, -4083549, -5736102, -6153794, -5162503, -3279888, -1410486, -285910, -46589, -340155, -795623, -1278070, -1701359, -1876565, -1734771, -1504771, -1414734, -1317843, -860388, 31003, 1052982, 1855981, 2210234, 1872675, 626285, -1408012, -3711776, -5771940, -7423452, -8723664, -9673100, -10204859, -10319548, -10075787]
43288a0075787N45139P01676N43118O6260m49110o41909l23636M31907J305232
43279g897110J852127J801592J309165Q11139O08007P01034R96946J431776J803858
43270C418534J715119R16275l20626j325151j568445j074021l47237O2499j0979
43261A465968k83107l59759j34435J64246K46379q716n18447j014046j106360
43252a548277n67730L41087R82685R14837K67420n05054j079010j359289j336327
43243c889658j108056r49681j067842j258933j059165l28082N00139Q57526N94211
43234g709541j0532o22752j047380j141767p99079j04087O35384J122434J290768
43225h386552J253816J131690J017375J021631J174184J260280R14060p170j177695
$$ y = [-10075787, -9530648, -8828972, -8285854, -8219594, -8668704, -9310613, -9634249, -9202342, -7897110, -6044983, -4243391, -2934226, -2123087, -1515080, -814046, 182900, 1614676, 3418534, 5133653, 6049928, 5729302, 4404151, 2835706, 1761685, 1414448, 1476947, 1465968, 1182861, 823102, 688667, 852913, 1099292, 1090576, 572129, -441917, -1548277, -2116007, -1774920, -792235, 122602, 390022, -115032, -1194042, -2553331, -3889658, -4997714, -5947395, -7015237, -8274170, -9333335, -9661417, -9161278, -8303752, -7709541, -7720073, -8342825, -9390205, -10531972, -11331051, -11435138, -10799754, -9677320, -8386552, -7132736, -6001046, -4983671, -3962040, -2787856, -1527576, -613516, -620686, -1798381]
43216a798381j991969j988061j122462K11044J331858J592268Q13716m99599j482847
43207d934433j557234q28580N0846L63109j79839j193209j868897j666356q34760
43198a2649353j43631q3116m74468q60589j022912r91349p94883m66929j87825
43189a7675055j47604k50793j47225L91601J225121J966287K252174J936783J182864
43180i265847L98989l5066l8107K13404N42607Q61717J043946R19837M91739J0121
43170d856660k67131k75386Q32P10339J907766L131364L485072K393357K72972
43161F502525j691152k504639k079035j062999j61313K79244K06442k83372r30057
43152a724356j342711j231721n99243L30276J272992J935653K075475J692605
$$ y = [-1798381, -3790350, -5778411, -6900873, -6689829, -5357971, -3765703, -2951987, -3451586, -4934433, -6491667, -7320247, -7269401, -6906292, -7086131, -8279340, -10148237, -11814593, -12649353, -12792984, -12876100, -13350568, -14211157, -15234069, -16225418, -17020301, -17487230, -17675055, -17822659, -18073452, -18220677, -17829076, -16603955, -14637668, -12385494, -10448711, -9265847, -8866858, -8901924, -8940031, -8726627, -8184020, -7322303, -6278357, -5358520, -4866781, -4856660, -5123791, -5399177, -5398345, -4688006, -2780240, 351124, 3836196, 6229553, 6502525, 4811373, 2306734, 227699, -835300, -996613, -717369, -510927, -794299, -1724356, -3067067, -4298788, -4898031, -4567755, -3294763, -1359110, 716365, 2408970]
43144B408970J097059O07686J98628m04688j283052k134140k554035k371386j669560
43135f104518o38681M85358J435628K007497K141059J866647J208182K06828r76943
43126A631057k061830k799964l145309l247367l233533k996977k288341j092360
43118a9234624J56335Q71737Q51516M28829Q6650K5808J39542K82044M48285P36648
43108a5207230J234370J929779K651057L081154K943054K287341J583876J384586
43100A887987J785650K293234K354596J965587J548807J243391O42428n64893
43092A3156787j943896k646621k320115j392718m94373R6139M11929N61729O86714
43083F115575Q91138J033065P87456J05789n65768p45851m74662k01871k10273
$$ y = [2408970, 3506029, 4113715, 4312343, 3907655, 2624603, 490463, -2063572, -4434958, -6104518, -6743199, -6257841, -4822213, -2814716, -673657, 1192990, 2401172, 2608000, 1631057, -430773, -3230737, -6376046, -9623413, -12856946, -15853923, -18142264, -19234624, -19078289, -18206552, -17355036, -16926207, -16839557, -16813749, -16674207, -16392163, -15943878, -15207230, -13972860, -12043081, -9392024, -6310870, -3367816, -1080475, 503401, 1887987, 3673637, 5966871, 8321467, 10287054, 11835861, 13079252, 13721680, 13156787, 11212891, 8566270, 6246155, 4853437, 4359064, 4455203, 4867132, 5428861, 6115575, 7006713, 8039778, 8827234, 8933023, 8367255, 7621404, 7146742, 6944871, 6734598]
43074F734598l63773l72476r4375M19577R94038J411549J554483J486474J316898
43065A3086993J041774O53191L42828L77508P27807R96720Q06369J40661p60808
43056A7413043j703907k581968l177897l125082k205846o95997O70329J185494
43048E778169O83294m12302j504249k200330k306811j690606l98715J106271K075637
43039A130358K018579J116041M9641n72381o25327l79498j00371J83065M94846
43030C314953O20464K08300p77797j888073k615286k868456k857310k657226k190143
43021a1710574j610544j349234j584471j871420j523021l07681J354234K819912
43013a5782799L725295M106049M159929L945350L322378K217672Q93876j96012
$$ y = [6734598, 6370825, 5998349, 5903974, 6323551, 7317589, 8729138, 10283621, 11770095, 13086993, 14128767, 14781958, 15124786, 15502294, 16230101, 17226821, 18033190, 18173851, 17413043, 15709136, 13127168, 9949271, 6824189, 4618343, 3922346, 4592675, 5778169, 6461463, 6049161, 4544912, 2344582, 37771, -1652835, -2051550, -945279, 1130358, 3148937, 4264978, 4314619, 3742238, 3116911, 2737413, 2637042, 2820107, 3314953, 3935417, 4143717, 3365920, 1477847, -1137439, -4005895, -6863205, -9520431, -11710574, -13321118, -14670352, -16254823, -18126243, -19649264, -19956945, -18602711, -15782799, -12057504, -7951455, -3791526, 153824, 3476202, 5693874, 6587750, 6391738]
43005F391738q56560j291802j728589k096234k245318k300709k512593k814587
42997i454654k826209k350501j634370j037804o32658k42063K85229R70248J728388
42988a5194394K343259K536739K255210J821195J614364J633074J551525J195932
42980b43096P65528N49920O11544P99038Q81856N89479k52747j424050k292262
42971a4790k351797j746538j059440o13873k11215M21491J182628J727793J871501
42962g94240J688158J316874Q35850K91479k83304q69010j388717j675953j615639
42953b494502j279676q10128k17658N31238J228271J457168J064313M64401K78700
42944B22127O87692J300458J671813J767623J827804J930638J892084J549487
$$ y = [6391738, 5535178, 4243376, 2514787, 418553, -1826765, -4127474, -6640067, -9454654, -12280863, -14631364, -16265734, -17303538, -17936196, -18178259, -17893030, -16922782, -15194394, -12851135, -10314396, -8059186, -6237991, -4623627, -2990553, -1439028, -243096, 522432, 1072352, 1683896, 2482934, 3364790, 3954269, 3701522, 2277472, -14790, -2366587, -4113125, -5172565, -5786438, -5997653, -5576162, -4393534, -2665741, -794240, 893918, 2210792, 3046642, 3338121, 3054817, 2185807, 797090, -878863, -2494502, -3774178, -4584306, -4801964, -4270726, -3042455, -1585287, -520974, -56573, 222127, 909819, 2210277, 3882090, 5649713, 7477517, 9408155, 11300239, 12849726]
42936A2849726R30211R8315r41744k024740k671726k441817j467174m30784Q5605
42927C985872J16127J23562M52305J071361J708270K042491J824488J024890n7874
42918A2291492r53792j381417j441086j437630j551276j706514j738716j646744
42910D34317j626886j809089k002824j840198j222218m92241n2728Q4720K07225
42901h319922M33558N62168M14643J27871r649J12232L88356P28343J196662J904476
42891b461262K802753L587644L830181L285586K141724R37508J77828j1049R6220
42882A4387133Q5838k65212p97678j085666q53132l22188m5150l24429q92554
42873I886962j245899j196398r75715q74461r46906j070478j146817j183058j247946
$$ y = [12849726, 13779937, 13878252, 12936508, 10911768, 8240042, 5798225, 4331051, 3900267, 3985872, 4101999, 4225561, 4677866, 5749227, 7457497, 9499988, 11324476, 12349366, 12291492, 11337700, 9956283, 8515197, 7077567, 5526291, 3819777, 2081061, 434317, -1192569, -3001658, -5004482, -6844680, -8066898, -8559139, -8611867, -8527147, -8319922, -7886364, -7324196, -6909553, -6781682, -6791331, -6679099, -6290743, -5562400, -4365738, -2461262, 341491, 3929135, 7759316, 11044902, 13186626, 14124134, 14301962, 14290913, 14387133, 14472971, 14207759, 13410081, 12324415, 11471283, 11149095, 11103945, 10779516, 9886962, 8641063, 7444665, 6468950, 5594489, 4647583, 3577105, 2430288, 1247230, -716]
42864g16j380250j485425j331093p53452R0600P77339J006222Q86153P63600Q13542
42854f13480Q86406P29293K46968m77692j318091k172803k928677l428023l504143
42845a2580242l065055k185103j132895k38764L64325Q73405J601420K579089
42837a3783820L423086L671041L237100K483248J846136J452938J114862O18634
42829D063225n4336p67280j374598j778260j921547j840121j704860j687851j740457
42820h806085j618623j216390p67243n64645n45596l47947K05007Q69101J293090
42811a1499331J387262J270433J030165P33299N73122P68611J295494J871033
42803b569912K235767K340586K248680J980232J508366Q50683J51499l01538k32687
$$ y = [-716, -1380966, -2866391, -4197484, -4950936, -4860336, -4082997, -3076775, -2190622, -1427022, -613480, 272926, 1002219, 1249187, 771495, -546596, -2719399, -5648076, -9076099, -12580242, -15645297, -17830400, -18963295, -19202059, -18837734, -17964329, -16362909, -13783820, -10360734, -6689693, -3452593, -969345, 876791, 2329729, 3444591, 4063225, 4008889, 3241609, 1867011, 88751, -1832796, -3672917, -5377777, -7065628, -8806085, -10424708, -11641098, -12408341, -12972986, -13518582, -13866529, -13661522, -12792421, -11499331, -10112069, -8841636, -7811471, -7078172, -6505050, -5736439, -4440945, -2569912, -334145, 2006441, 4255121, 6235353, 7743719, 8594402, 8745901, 8444363, 8211676]
42794H211676L15293Q81682R75956N75804P9337k32745m63028p67608j026811
42785H549556j045618r03066q27934p78700m25371L55690J137096J249139M35375
42776G746167q52835j838451k100284j858701j565310j292857p14381K71059J133902
42767a071691J188911M07851n02403q76699p29067n28040n63924p47435q97065
42758d319562r34960p81749l33772K92543O69835M62190j00188l63077N9843Q79022
42748d469875J495947J633203J447945J131309O58473J0504n43429n71501J08313
42739I00889J206940K155594K505353K195525J509860Q00885K50012j32694l54381
42730A1037983l77900k10646L5762K07648J65762k33863j086526k239745l197447
$$ y = [8211676, 8526969, 9408651, 10384607, 10960411, 11039748, 10807003, 10343975, 9576367, 8549556, 7503938, 6600872, 5772938, 4994238, 4568867, 4924557, 6061653, 7310792, 7746167, 6893332, 5054881, 2954597, 1095896, -469414, -1762271, -2476652, -2205593, -1071691, 117220, 525071, 22668, -854031, -1583098, -2111138, -2675062, -3422497, -4319562, -5254522, -6036271, -6370043, -6077500, -5407665, -4945475, -5045663, -5408740, -5348897, -4469875, -2973928, -1340725, 107220, 1238529, 1897002, 1907506, 1364077, 792576, 900889, 2107829, 4263423, 6768776, 8964301, 10474161, 11275046, 11525058, 11392364, 11037983, 10660083, 10449437, 10485199, 10692847, 10858609, 10624746, 9538220, 7298475, 4101028]
42721D101028l397843k696985j546155o09157j79961j4937K53355O29986P92311
42712b668358N62152J48010j68083m04883p43673j110065j156370p05986j6557
42703f263813M83629N71251K69407l00834r45588j385162j423661j162896r50799
42694a1108466j076796j521739j970315k048702j603856p85582J68816J189478
42686a8757162K298496L293239L701212L178247J873058L27117r03153j508548
42678f497494j514295j249290j083269j020305o50465L28348J625252K564125
42670g497393K709575K127783J126505j4368j052794j753561j943047j530516
42662g827816n29851P94686J878107K203538J764700J024231L95242m9564l36901
$$ y = [4101028, 703185, -1993800, -3539955, -4149112, -4329073, -4344010, -4090655, -3460669, -2668358, -2106206, -1958196, -2126279, -2531162, -3274835, -4384900, -5541270, -6247256, -6263813, -5780184, -5208933, -4939526, -5240360, -6185948, -7571110, -8994771, -10157667, -11108466, -12185262, -13707001, -15677316, -17726018, -19329874, -20115456, -19946640, -18757162, -16458666, -13165427, -9464215, -6285968, -4412910, -4085793, -4988946, -6497494, -8011789, -9261079, -10344348, -11364653, -12015118, -11686770, -10061518, -7497393, -4787818, -2660035, -1533530, -1547898, -2600692, -4354253, -6297300, -7827816, -8357667, -7562981, -5684874, -3481336, -1716636, -692405, -297163, -346727, -683628]
42653f83628l32702J00855Q31819J522031J918560J977997J758366J306007O61708
42644I061013o4585o44070q12293n07491l8356R4917l81322j293893k205407k756791
42634D51722k864899k700648k499160k327532k053723j598060j117333p91539
42626a5501172n25578j11054L34555L81825j61346r30934j330423r85198J50462
42617a8678863J803867L315994L881585L217349J904674Q43382M71172O85483
42609b555357J267086J977772K361702J955011Q33688l71163j146229j523404
42601B799106j725476j722012j420430j081879j164469j732467k278259k232929
42593a0558815j536409o45927p9298k3062l28045p69518j223959j580469j592169
$$ y = [-683628, -1016330, -915475, -83656, 1438375, 3356935, 5334932, 7093298, 8399305, 9061013, 8996428, 8352358, 7540065, 7032574, 6994218, 7089135, 6707813, 5413920, 3208513, 451722, -2413177, -5113825, -7612985, -9940517, -11994240, -13592300, -14709633, -15501172, -16026750, -16137804, -15803249, -15421424, -15582770, -16513704, -17844127, -18829325, -18678863, -16874996, -13559002, -9677417, -6460068, -4555394, -3712012, -3240840, -2555357, -1288271, 689501, 3051203, 5006214, 5839902, 5468739, 4322510, 2799106, 1073630, -648382, -2068812, -3150691, -4315160, -6047627, -8325886, -10558815, -12095224, -12741151, -12820449, -12843511, -13171556, -13941074, -15165033, -16745502, -18337671]
42584a8337671j010664M5704R98728J288046R58013O25442Q15872J453665K070024
42575a1092841K361373K383054K295178K160715K016974J910610J729551J161407
42567D926021O22j556633l030550l991116m193263l568753k329443r88762N942
42558a4725935O73657J307355J912701K150055J880701J422469J107637Q95180
42550c376180O20795L20141J6063n33280j468855k365399k560598j935381j022692
42541a2305386l50293j7072Q5472N8253J48139P44806J939406L249204L975176
42532b472295L741243K641303J114315j65159n48845Q0566J081230J534306R99159
42523H005823k23959j436662k043968j903762j415156j201483j512393j957032
$$ y = [-18337671, -19348335, -19302631, -18303903, -17015857, -16057844, -15432402, -14616530, -13162865, -11092841, -8731468, -6348414, -4053236, -1892521, 124453, 2035063, 3764614, 4926021, 4926643, 3370010, 339460, -3651656, -7844919, -11413672, -13743115, -14731877, -14725935, -14052278, -12744923, -10832222, -8682167, -6801466, -5378997, -4271360, -3376180, -2755385, -2435244, -2419181, -2952461, -4421316, -6786715, -9347313, -11282694, -12305386, -12655679, -12672751, -12587279, -12529026, -12380887, -11636081, -9696675, -6447471, -2472295, 1268948, 3910251, 5024566, 4859407, 4310562, 4391128, 5472358, 7006664, 8005823, 7781864, 6345202, 4301234, 2397472, 982316, -219167, -1731560, -3688592]
42515c688592j955751j389657o56097j63990K9739J31609L80280R05997J617671
42506d788791K197296K378932K251504K097633J923331J417009M93069l82189
42498G587794o38042k25213M24462R29625J178107J114372P03822K09356J46338
42489A1430621O81264J258665J128428J83492r85595j825328k290482k528383
42481G052682k455252j919699j103411m50159k22798l48096o71111j116239j544352
42472b778435j669711j263538l72698O97524J521658J698310J089097N2515p08239
42463a733517p22994j74071L29138L41234r4087n81424p08813l27517L47128R12260
42453b412663J131425J089726R66554P78698M78450J97213J68755L99282O01074
$$ y = [-3688592, -5644343, -7034000, -7690097, -7854087, -7824348, -7692739, -7312459, -6406462, -4788791, -2591495, -212563, 2038941, 4136574, 6059905, 7476914, 7969983, 7587794, 6949752, 6724539, 7149001, 8078626, 9256733, 10371105, 11074927, 11284283, 11430621, 12111885, 13370550, 14498978, 14682470, 13696875, 11871547, 9581065, 7052682, 4597430, 2677731, 1574320, 1124161, 901363, 553267, -117844, -1234083, -2778435, -4448146, -5711684, -6084382, -5386858, -3865200, -2166890, -1077793, -1025278, -1733517, -2456511, -2630582, -2301444, -1960210, -2054297, -2635721, -3344534, -3672051, -3324923, -2412663, -1281238, -191512, 775042, 1553740, 2032190, 2229403, 2398158, 2797440, 3398514]
42444C398514N28912K65862J05037K32195N86521R57197J130316R73460M72581
42435H650595k57425j005122j561689j856764k000661k129092k202826k061465
42427d424449j702105j350032j138504q65717k77692M82942R69969J007480R30707
42418f367401J129299J518900J636829J188457L53228m24885q31271q62742p23581
42409c383167o06563n58769n13581m03132k13597L4825L11048N94984R26210J392327
42399b419415J972334K400247K312150J600871N68241l24939q17238r25652p47020
42390C619579l00915L81733J071721J381233J117362N70356K70431L64569L81970
42381H858039k23684j399844k540759l121109l070141k593315j932019j341592
$$ y = [3398514, 3927426, 4193288, 4298325, 4530520, 5117041, 6074238, 7204554, 8178014, 8650595, 8393170, 7388048, 5826359, 3969595, 1968934, -160158, -2362984, -4424449, -6126554, -7476586, -8615090, -9480807, -9758499, -9275557, -8305588, -7298108, -6367401, -5238102, -3719202, -2082373, -893916, -540688, -965573, -1796844, -2659586, -3383167, -3989730, -4548499, -5062080, -5465212, -5678809, -5643984, -5332936, -4737952, -3811742, -2419415, -447081, 1953166, 4265316, 5866187, 6434428, 6109489, 5292251, 4366599, 3619579, 3318664, 3700397, 4772118, 6153351, 7270713, 7841069, 8111500, 8476069, 8858039, 8634355, 7234511, 4693752, 1572643, -1497498, -4090813, -6022832, -7364424]
42373g364424j005121q27317n30455p5085K50351L17909M84774J163397K219220
42364e366751L067051L283617K892096K137905J275302N54669J18722j76018o23682
42355G162911j260767j752660j778140j399695r59326p01107n94798m99006m35611
42346b218199o73231j474930k705205l759725m014505l350255k171660r72021
42338b1339731Q718P64308J346236J737086J805907J420242P08708J38095J48696
42329a3261735P23281J444656J899389J850978J174618K921j064650j331209p77216
42320i338967j67582j78587o64107r84768p92780k22490M47199R58085J053264
42311i890733O89458K44658J80395M80504P19312P06445P35884J080162J522350
$$ y = [-7364424, -8369545, -9196862, -9727317, -9802402, -9552051, -9234142, -8749368, -7585971, -5366751, -2299700, 983917, 3876013, 6013918, 7289220, 7843889, 7962611, 7786593, 7162911, 5902144, 4149484, 2371344, 971649, 12323, -688784, -1283582, -1782588, -2218199, -2891430, -4366360, -7071565, -10831290, -14845795, -18196050, -20367710, -21339731, -21331013, -20566705, -19220469, -17483383, -15677476, -14257234, -13548526, -13410431, -13261735, -12538454, -11093798, -9194409, -7343431, -6168813, -6165892, -7230542, -8561751, -9338967, -9506549, -9685136, -10349243, -11334011, -12126791, -12349281, -11902082, -10943997, -9890733, -9201275, -8956617, -8776222, -8295718, -7576406, -6869961, -6134077, -5053915, -3531565]
42302c531565J597152J149495M86470O1156J22254N93969J174460J560746J626089
42293D840226J377180P94317j54661j317702k301449k695318k333431j367507
42285c158345j85350P57855J181114J124706Q10971L96286l2116l07261k93357
42276B94503j71693l27994q12284j142212q35919K6784R45499J508687J548408
42267A033779J010040L7864q81650j243767j054709p49729n38062j66872N17114
42258b035992J103498J020248K46868o48812j116679j040551o12288o1047M38738
42249b706017P86772R88285J083459J020731P02474J70904l77553q00957j112464
42240b44366j325786j342848j100188p26405m35762l29926m04684o64282j066420
$$ y = [-3531565, -1934413, -784918, -298448, -237292, -115038, 478931, 1653391, 3214137, 4840226, 6217406, 7011723, 6857062, 5539360, 3237911, 542593, -1790838, -3158345, -3343695, -2585840, -1404726, -280020, 530951, 927237, 895121, 587860, 294503, 122810, -205184, -1017468, -2159680, -2995599, -2968815, -2023316, -514629, 1033779, 2043819, 2081683, 1200033, -43734, -1098443, -1848172, -2386234, -2553106, -2035992, -932494, 87754, 334622, -314190, -1430869, -2471420, -3083708, -3144755, -2706017, -1919245, -930960, 152499, 1173230, 1875704, 2046608, 1669055, 868098, -244366, -1570152, -2913000, -4013188, -4739593, -5175355, -5505281, -5909965, -6574247, -7640667]
42231g640667j384924j311241p58555L0284P15359J119722J258778J262595J346176
42222e362473J709973K296269K691828K459903J631658P58497L89683N42941P54585
42213G872864O09396J32120l33759n19403m43067l28539m40910r58670j818524
42204C771508k619384k852810k390435j648440j102210p34387k08404M59962P63840
42195f560760L84546k85364n69011k91204J38570L21267K35740L1774k30814n53433
42185g378689r44731j481542k197736k796420k701384j604378J40288J800639
42177a7163953K836264L103018K736570K101289J707358J814154K074488J848035
42169A057223R59692p3974o83047q99670j196444j802940k392803k423947j636792
$$ y = [-7640667, -9025591, -10336832, -11095387, -11065103, -10349744, -9230022, -7971244, -6708649, -5362473, -3652500, -1356231, 1335597, 3795500, 5427158, 6185655, 6575338, 7118279, 7872864, 8482260, 8614380, 8280621, 7761218, 7318151, 6989612, 6548702, 5590032, 3771508, 1152124, -1700686, -4091121, -5739561, -6841771, -7576158, -7784562, -7324600, -6560760, -6176214, -6461578, -7030589, -7321793, -7183223, -6861956, -6626216, -6594442, -6825256, -7378689, -8323420, -9804962, -12002698, -14799118, -17500502, -19104880, -18964592, -17163953, -14327689, -11224671, -8488101, -6386812, -4679454, -2865300, -790812, 1057223, 2016915, 1942941, 1259894, 360224, -836220, -2639160, -5031963, -7455910, -9092702]
42160i092702k27046J312952K459865K883391K557512J718186P06065j93661q21437
42151A303125j109809j017991n46812J53398P57905R80242Q47291O67213O56718
42142B691280O68091L63703l83723j335757k088626k356404k110354j551335r39654
42133g042779l64550L10853J193006K069167K489204K144176J074272m43502j998727
42124e68880l010065k902046j623540Q7141J228067J380196Q94470K78854l40038
42115d575841j052771j717196j937020j464172m69375N81672J223030J224209
42107h187464P34697K61730L47536J090204J962346K197699J455148J65658p65706
42098g38152o78756K92488J330013J644135J145516M22349P0678J27848K09175
$$ y = [-9092702, -9319748, -8006796, -5546931, -2663540, -106028, 1612158, 2318223, 2124562, 1303125, 193316, -824675, -1371487, -1218089, -460184, 520058, 1367349, 2034562, 2691280, 3359371, 3723074, 3339351, 2003594, -85032, -2441436, -4551790, -6103125, -7042779, -7407329, -7096476, -5903470, -3834303, -1345099, 799077, 1873349, 1429847, -568880, -3578945, -6480991, -8104531, -8017390, -6789323, -5409127, -4514657, -4235803, -4575841, -5628612, -7345808, -9282828, -10747000, -11216375, -10634703, -9411673, -8187464, -7452767, -7191037, -6843501, -5753297, -3790951, -1593252, -138104, 27554, -738152, -1416908, -1124420, 205593, 1849728, 2995244, 3417593, 3488271, 3616119, 3825294]
42089C825294Q6568n3575N1624L31141M58863K66219r5735m04236n98031o92301
42079C175831o26905l67236p7873J028j37123k50629k07027k07813n33301j138954
42069c70002j628464j611220j019213j24932O45906R51460P40271K98534K7236
42060b090424J05875L93057O73444R40417J362219J976959K497858K495167J806322
42051A0160894P62813j9257j15500L92393J026681J307724J071021M81035j87116
42042A4880688p53076j153506j344802j284054j033527p94467p48308r06354j191347
42033E671247j581922k015135k202515j808137r07632o4012K09353p0606n19008
42024c288367q16518p76702k00432R53172K268041L085430L106440K548587J679246
$$ y = [3825294, 3911862, 3858287, 3909911, 4241052, 4699915, 4966134, 4870399, 4466163, 3868132, 3175831, 2548926, 2181690, 2103817, 2104845, 1967722, 1717093, 1510066, 1302253, 768952, -370002, -1998466, -3609686, -4628899, -4753831, -4107925, -3156465, -2416194, -2117660, -2090424, -1984549, -1591492, -918048, 22369, 1384588, 3361547, 5859405, 8354572, 10160894, 10923707, 10904450, 10788950, 11181343, 12208024, 13515748, 14586769, 15067804, 14880688, 14127612, 12974106, 11629304, 10345250, 9311723, 8517256, 7768948, 6862594, 5671247, 4089325, 2074190, -128325, -1936462, -2844094, -2908106, -2698753, -2769359, -3288367, -4104885, -4881587, -5082019, -4128847, -1860806, 1224624, 4331064, 6879651, 8558897]
42015H558897N25888q04877j855603k192394j922633j571672j508295j707344
42007b478033j991893k213005k161998j595066n32226N76024J139175R12638K03502
41998h140882l48801k16648O43330J747987K446381K401759J761564R02340Q7259
41989A284289o12210j160470j437962j297418p11194J35279Q89271J222428J069819
41980f18168P22324O36031J064184J821855K406111K367099J607347M05413p77222
41971I634974j554881j840849j904720k125741k585267k955546k885673k410279
41963h627982j808843j133572j64751J085961K119494K451558K229434K053065
41955a795636K184539K204080J569494L42291q22324j361107j327271j199260
$$ y = [8558897, 9084785, 8279908, 6424305, 4231911, 2309278, 737606, -770689, -2478033, -4469926, -6682931, -8844929, -10439995, -10972221, -10396197, -9257022, -8344384, -8140882, -8489683, -8706331, -8063001, -6315014, -3868633, -1466874, 294690, 1197030, 1284289, 672079, -488391, -1926353, -3223771, -3934965, -3799686, -2910415, -1687987, -618168, 104156, 740187, 1804371, 3626226, 6032337, 8399436, 10006783, 10412196, 9634974, 8080093, 6239244, 4334524, 2208783, -376484, -3332030, -6217703, -8627982, -10436825, -11570397, -11735148, -10649187, -8529693, -6078135, -3848701, -1795636, 388903, 2592983, 4162477, 4504768, 3682444, 2321337, 994066, -205194]
41947b05194j278549j398994j241285q09384m52745m22893n61297n16546j69471
41938g056358K84284O14796P59801P36712N18515J12570l01820m46211k06117
41929d983828K05153L82687N4336p06879j565326k193837k471523k468272k294767
41920a6042256j979604j477378q02412j38164K80255M60337P26849J344207K106847
41911a5521319K499623K278014J683260J047278M65390J9773L7222P69586J904793
41902d816380K730352K823542K351408J681579R79590K96207k03511l30109j17693
41893E394985J63344K30878j429l56956n00196k25468K90019O33172O26186N12022
41883F766557N51946N87204K16013o47235j608495k200458k252369j820945j008776
$$ y = [-205194, -1483743, -2882737, -4124022, -4933406, -5386151, -5809044, -6370341, -6886887, -7056358, -6772074, -6157278, -5397477, -4660765, -4142250, -4029680, -4331500, -4777711, -4983828, -4778675, -4395988, -4341652, -5048531, -6613857, -8807694, -11279217, -13747489, -16042256, -18021860, -19499238, -20301650, -20439814, -20159559, -19699222, -18972373, -17628166, -15521319, -13021696, -10743682, -9060422, -8013144, -7547754, -7527981, -7490759, -6721173, -4816380, -2086028, 737514, 3088922, 4770501, 5750091, 6046298, 5842787, 5512678, 5394985, 5558329, 5789207, 5787778, 5430822, 4930626, 4705158, 4995177, 5628349, 6254535, 6766557, 7318503, 7905707, 8121720, 7474485, 5865990, 3665532, 1413163, -407782, -1416558]
41874a416558l5584O85180Q31758N39496K54594J72804M2550l63397q07626q50754
41864i47537m20707J53646O17855R91650J265421J224322P26406r2281j054882
41855B463893k138598l214811l840694l641849k780918j747258q05842K05M32499
41846a5273373J71302n41960q48253j54406J189558K334807K815531K736342K323373
41837e247079J665360Q41575P31p12268j129708j027498l68572M30499P43922
41828d803038L37070m44996j131360j565630j808282j824214j488385q27177n8875
41819a3614887O13702J118680J415429J433380J209576J003503J125782J606849
41811d087986K097344K147238J573795N61844n21105j349828j749352j714589
$$ y = [-1416558, -1452142, -766962, 64796, 604292, 858886, 1031690, 1074240, 710843, -96783, -947537, -1368244, -1214598, -596743, 394907, 1660328, 2884650, 3611056, 3518775, 2463893, 325295, -2889516, -6730210, -10372059, -13152977, -14900235, -15706077, -15705872, -15273373, -15102071, -15644031, -16492284, -16646690, -15457132, -13122325, -10306794, -7570452, -5247079, -3581719, -2740144, -2739413, -3451681, -4581389, -5608887, -5977459, -5546960, -4803038, -4465968, -4910964, -6042324, -7607954, -9416236, -11240450, -12728835, -13556012, -13614887, -13001185, -11882505, -10467076, -9033696, -7824120, -6820617, -5694835, -4087986, -1990642, 156596, 1730391, 2292235, 1771130, 421302, -1328050, -3042639]
41803c042639j384398r64188o35828n13212o13693q09324q57678n99219j51631
41794i571810J59234Q3099l74799j016425j592160j894636j853363j593170j301988
41785a8956018r86362m53411L91778J315158J922054K027887J791048J500225
41777a1447641J298242J122890Q75676O03294M68303N29456O18658N02236J14172
41768e314714m46804j075314j673978k060249k050613j665742j100554m74266
41760a5862234K20937R03783J355781J484913J459343J473520J540505J604496
41752e818956J661420J634421J328257O84797q8389q22353j608218k446849k863594
41743h339464k272329p32282R80296K135092K649658K878212L072592L225297
$$ y = [-3042639, -4427037, -5391225, -6027053, -6540265, -7153958, -7963282, -8820960, -9420179, -9571810, -9412576, -9329477, -9704276, -10720701, -12312861, -14207497, -16060860, -17654030, -18956018, -19942380, -20395791, -20004013, -18688855, -16766801, -14738914, -12947866, -11447641, -10149399, -9026509, -8150833, -7547539, -7079236, -6549780, -5931122, -5428886, -5314714, -5761518, -6836832, -8510810, -10571059, -12621672, -14287414, -15387968, -15862234, -15641297, -14737514, -13381733, -11896820, -10437477, -8963957, -7423452, -5818956, -4157536, -2523115, -1194858, -510061, -598450, -1420803, -3029021, -5475870, -8339464, -10611793, -11344075, -10363779, -8228687, -5579029, -2700817, 371775, 3597072]
41735C597072L282155L285020L276293L144154K629158J558339J14484j208303
41727A9678372k015505k328461k407339k356211k063883j485002p97030k63742
41719E961199o2411k18475n67933q05975p29698m39208j82628m9448K5639J9684
41709B950746j82295n41851q49393r98633j060719j017452o54117J34087J083631
41700a135996J756231J895772J501627O77002m44480j661207k693680l228653
41692c333384l013531k030396o14356P07792J568695J931137J957791J820507
41684a005745J601930J245967O38345j08800n30297k41558M78310Q20386K68771
41675C167309r16297k074476k709157k594922j726900m72084M81644O89563L84828
$$ y = [3597072, 6879227, 10164247, 13440540, 16584694, 19213852, 20772191, 20886675, 19678372, 17662867, 15334406, 12927067, 10570856, 8506973, 7021971, 6224941, 5961199, 5898788, 5680313, 5112380, 4306405, 3576707, 3137499, 2954871, 2905423, 2931062, 2950746, 2768451, 2226600, 1377207, 378574, -682145, -1699597, -2353714, -2219627, -1135996, 620235, 2516007, 4017634, 4694636, 4250156, 2588949, -104731, -3333384, -6346915, -8377311, -8991667, -8283875, -6715180, -4784043, -2826252, -1005745, 596185, 1842152, 2480497, 2371697, 1841400, 1599842, 2078152, 2898538, 3167309, 2251012, 176536, -2532621, -5127543, -6854443, -7326527, -6844883, -6155320, -5770492]
41666e770492J25400J39562K60133L46022M26529M67285L12947p2285m99103p17318
41656d981320n65128l1303O45230J024331Q65222M52369K81337M29731M81170
41647a398361P2376p43244j693060k547177l091109l122617k663981k013322j441814
41638a8642309r71986n43945k07186Q275K49329O68913J178728J535956J623165
41629a5101060J511339J300226J026596O99517L24731p2203l70274l71047m191
41620a1056366N33215R51454J136538J134242R34482M59220k09678p61805r26609
41611g805307p35136m23847j26211K31320P13503J160646J299782J078801P83884
41602c822565P27073Q61050Q37344M66732k1121k67121k17699j28519j97365l69431
$$ y = [-5770492, -5645092, -5505530, -5245397, -4899375, -4472846, -4005561, -3692614, -3764899, -4264002, -4981320, -5546448, -5577751, -4932521, -3908190, -3042968, -2590599, -2309262, -1879531, -1398361, -1325985, -2069229, -3762289, -6309466, -9400575, -12523192, -15187173, -17200495, -18642309, -19614295, -20158240, -20365426, -20357151, -20107822, -19438909, -18260181, -16724225, -15101060, -13589721, -12289495, -11262899, -10563382, -10238651, -10310854, -10681128, -11052175, -11056366, -10523151, -9571697, -8435159, -7300917, -6366435, -5907215, -6116893, -6878698, -7805307, -8540443, -8964290, -9090501, -8859181, -8145678, -6985032, -5685250, -4606449, -3822565, -3095492, -2234442, -1397098, -930366, -951487, -1218608, -1436307, -1564826, -1762191, -2131622]
41592b131622n13465o08827o70865o37493m86534l99059o22821j135015j566873
41583h772574j540304j017562k73927L80845P53652P21752K31061n75754j319733
41574a1412544j585421j190476k75031Q14146J699551K103419J908330J162216
41566f775810Q5780q98000j257736p08530M14841J275843J218517L53355o04838
41557f896578j040797q92379m81689j02083J53406K88680K72498K1338n11893
41548i189497j210713j759297j813217j278997m20638L40095P34603P87714P29991
41539a3079956Q31181J275764K076197L016166L717833L898863L628992L242661
41531H607701K912395K424777J558567N92042J17516K76496M89865J51714o58952
$$ y = [-2131622, -2645087, -3253914, -3924779, -4562272, -5048806, -5447865, -6070686, -7205701, -8772574, -10312878, -11330440, -11604367, -11223522, -10469870, -9748118, -9517057, -10092811, -11412544, -12997965, -14188441, -14463472, -13649326, -11949775, -9846356, -7938026, -6775810, -6690030, -7588030, -8845766, -9554296, -9139455, -7863612, -6645095, -6291740, -6896578, -7937375, -8829754, -9311443, -9413526, -9260120, -8971440, -8698942, -8677604, -9189497, -10400210, -12159507, -13972724, -15251721, -15672359, -15332264, -14597661, -13809947, -13079956, -12248775, -10973011, -8896814, -5880648, -2162815, 1736048, 5365040, 8607701, 11520096, 13944873, 15503440, 16095482, 16212998, 16489494, 16979359, 17131073, 16472121]
41522A6472121j431583j972840k512018l134274l524105l357890k646907j603353
41514c710849m49135N41296J098535J218411J137812R35973M44119k90598q02804
41505A22760p83865n84914p44263j183900j327669r65931n31194m18014m44551
41496f861541k15180K68366O37270O66564N22857N18737P38717R08819O22974
41487b192417k32505j277299j958947k063025j766367j238832m86578L18316O85148
41478a0212506K92966m98496r28082o29099M4949M75847L78061m9848l64332k11325
41468a1701865M11908J132350J516665J449291J132696P62681L90838J20818J73834
41459d610784N79312R75160R56470N53947J45340p1169k68523o32458j081621
$$ y = [16472121, 15040538, 13067698, 10555680, 7421406, 3897301, 539411, -2107496, -3710849, -4159984, -3618688, -2520153, -1301742, -163930, 772043, 1216162, 925564, 122760, -661105, -1246019, -1990282, -3174182, -4501851, -5467782, -5998976, -6416990, -6861541, -7076721, -6808355, -6171085, -5504521, -4981664, -4462927, -3724210, -2815391, -2192417, -2424922, -3702221, -5661168, -7724193, -9490560, -10729392, -11215970, -10897654, -10212506, -9919540, -10418036, -11346118, -11975217, -11930268, -11454421, -11076360, -11126208, -11490540, -11701865, -11289957, -10157607, -8640942, -7191651, -6058955, -5296274, -4905436, -4784618, -4610784, -4031472, -3056312, -2099842, -1545895, -1400555, -1471724, -1740247, -2372705, -3454326]
41450c454326j481604j914298k496435l033981l113232k556943j615328o67089
41442b0333236J30817Q62112J662438K574112L465286M006444L821207K772839
41434a037981J098571p35381k233657k969224k725864j703857m45771O21410J480255
41425h651499K203612K504815J954012O83061m45029n79325L26586J576365K429757
41416B002355K580316K083670J110677j24346j324200k158761k434638k240027
41408e04954j882818j595789j279043o21152M66260J599860K174921J830745O67792
41399H55822q52478k110721k565759k042110q69224L61211J237113J702858J851022
41390b432266J696013J222042N41370j25208o09951q54262q13943m25686K52049
$$ y = [-3454326, -4935930, -6850228, -9346663, -12380644, -15493876, -18050819, -19666147, -20333236, -20202419, -19340307, -17677869, -15103757, -11638471, -7632027, -3810820, -1037981, 60590, -674791, -2908448, -5877672, -8603536, -10307393, -10753164, -10131754, -8651499, -6447887, -3943072, -1989060, -1305999, -1751028, -2330353, -2003767, -427402, 2002355, 4582671, 6666341, 7777018, 7652672, 6328472, 4169711, 1735073, -504954, -2387772, -3983561, -5262604, -5883756, -5417496, -3817636, -1642715, 188030, 855822, 3344, -2107377, -4673136, -6715246, -7584470, -7223259, -5986146, -4283288, -2432266, -736253, 485789, 1027159, 901951, 292000, -562262, -1376205, -1801891, -1549842]
41381a549842R25360J228898J061796O92216M70303N12971P59080J218365J923530
41372G242677K609177K705214J855274L37927j193989k316690l027396l441952
41364D770242l556138l329489k796876k020531j073114j21745O17254J074294
41356f436103J337177J399003J080189L66794l06367l63581K81542J058973J291177
41347b91196Q51499K28073j4024K47897P11019J060601J206581J103025N71510
41338E674985m49038j544450k009207j491510k92645J016630K038454K506026
41330E449245K132491Q70050p64363j955231k246194j775382r19223J9590P42153
41321A553136Q98145L37913o70417j612777k085290j968035j398314o81130j35842
$$ y = [-1549842, -624482, 604416, 1666212, 2358428, 2828731, 3341702, 4100782, 5319147, 7242677, 9851854, 12557068, 14412342, 14750269, 13556280, 11239590, 8212194, 4770242, 1214104, -2115385, -4912261, -6932792, -8005906, -8127651, -7510397, -6436103, -5098926, -3699923, -2619734, -2252940, -2559307, -2922888, -2641346, -1582373, -291196, 560303, 788376, 774352, 1022249, 1733268, 2793869, 4000450, 5103475, 5674985, 5225947, 3681497, 1672290, 180780, -111865, 904765, 2943219, 5449245, 7581736, 8451786, 7687423, 5732192, 3485998, 1710616, 791393, 810983, 1553136, 2451281, 2789194, 2118777, 506000, -1579290, -3547325, -4945639, -5626769, -5762611]
41312e762611P5860m8987n03909j266152k082075k448457j995183q41699N23836
41303a4349377J645413K305882K493133K362799K172397K049031J817196J212710
41295A709184K76362o01395j029865q84481k63043O05767J358005J620188J305296
41286D096018O87712O8569n37253j259051k018168k508586k527640k175925j694835
41277g869159j233803q53674o62426p98142j233029j670139j746031j389026r27577
41268a8383006p56681q95477r63927o25836M6589P18998J193164J499282J627507
41259a6539387J387406O73959k13794o90402l85361N07151J394092J764940J507992
41250a0593404Q39947M8708o56761j147735j370629j362687j181391p85508q1159
$$ y = [-5762611, -5686751, -5735738, -6239647, -7505799, -9587874, -12036331, -14031514, -14873213, -14349377, -12703964, -10398082, -7904949, -5542150, -3369753, -1320722, 496474, 1709184, 1985546, 1384151, 354286, -530195, -793238, -187471, 1170534, 2790722, 4096018, 4783730, 4852299, 4315046, 3055995, 1037827, -1470759, -3998399, -6174324, -7869159, -9102962, -9956636, -10619062, -11417204, -12650233, -14320372, -16066403, -17455429, -18383006, -19139687, -20035164, -20999091, -21624927, -21578338, -20859340, -19666176, -18166894, -16539387, -15151981, -14478022, -14691816, -15382218, -15767579, -15260428, -13866336, -12101396, -10593404, -9753457, -9704749, -10361510, -11509245, -12879874, -14242561, -15423952, -16209460, -16290619]
41241a6290619Q53015J691314K138088K229590K229667K269385K276515K276925
41233c26120K522134L139785L789127L885412L156990J830812L04240j146826
41225A7155554k291155k845116k703023k181836j777835j616206j317403n20370
41217A902610N82118J374548J423975Q04347j46549j174375k116980k749631k847254
41208b947191k392990j574042n61979N59069J622707K322750K458489K143796
41200A630609J640781J044872K75847o40587j435241j794566j627286j112846
41192b018417n53504j86927m9109M0169L16331Q39921J404589J638742J192210
41183B624005m7563j741156l107060l374026k399193p99715O03420J426021J791053
$$ y = [-16290619, -15437604, -13746290, -11608202, -9378612, -7148945, -4879560, -2603045, -326120, 2196014, 5335799, 9124926, 13010338, 16167328, 17998140, 18302380, 17155554, 14864399, 12019283, 9316260, 7134424, 5356589, 3740383, 2422980, 1902610, 2484728, 3859276, 5283251, 6087598, 5941049, 4766674, 2649694, -99937, -2947191, -5340181, -6914223, -7476202, -6917133, -5294426, -2971676, -513187, 1630609, 3271390, 4316262, 4592109, 3951522, 2516281, 721715, -905571, -2018417, -2571921, -2758848, -2807957, -2767788, -2451457, -1611536, -206947, 1431795, 2624005, 2576442, 835286, -2271774, -5645800, -8044993, -8844708, -8241288, -6815267, -5024214]
41174e024214J929210J894469J639750J194365O89495K60380n0496l14686o16440
41165A601833q91971r28447o07374r8104L17835O06187J019641J719497K456893
41156E195990K719041K171576R38800m86259j555735j946983j643735q34437K05096
41147D763354J139158J628917J542246J119998P78782O57902M43627k76718j546267
41138A0250999k987503m134227m700873m582094l776950k418272q17255O23110
41130a2543065J584268J943645J757740J181098L96199m38474j232817j955726
41122i307132k531128k745361k354098j354856r1564J010090J776465K256180
41114a3341404K417705K078070J190745K9082j045877j891807k537840k946017
$$ y = [-5024214, -3095004, -1200535, 439215, 1633580, 2323075, 2583455, 2532959, 2218273, 1601833, 709862, -218585, -825959, -924063, -606228, -41, 1019600, 2739097, 5195990, 7915031, 10086607, 11025407, 10539148, 8983413, 7036430, 5392695, 4558258, 4763354, 5902512, 7531429, 9073675, 10193673, 10972455, 11630357, 12073984, 11797266, 10250999, 7263496, 3129269, -1571604, -6153698, -9930648, -12348920, -13166175, -12543065, -10958797, -9015152, -7257412, -6076314, -5680115, -6118589, -7351406, -9307132, -11838260, -14583621, -16937719, -18292575, -18384139, -17374049, -15597584, -13341404, -10923699, -8845629, -7654884, -7625802, -8671679, -10563486, -13101326, -16047343]
41106a6047343l004854k713965k182475j434890m05550Q11756J877501K494456
41098b0605364K684387K658323K491009K082058J432382Q08660N56435P98377
41090g093733J341281J817218J892486J444880O64848j8997k28867N8527M92681
41081C70324O54564L85404j63373p36808j173504j413814j394877j032827l66853
41072d871764L07934N74108K70099k93631o14030n01652j89453P8288L74366Q76205
41062c989530J488280J905190J989209J847728J544159J006454L25838r5141R1820
41053F114007P62217J432121J733554J646489J330800R14398M73919R4598j29429
41044A4372674j41362K9004K55931M15324N30392P48762J113456J436513J487175
$$ y = [-16047343, -19052197, -21766162, -23948637, -25383527, -25789077, -24977321, -23099820, -20605364, -17920977, -15262654, -12771645, -10689587, -9257205, -8448545, -7892110, -7093733, -5752452, -3935234, -2042748, -597868, 66980, 47983, -180884, -122357, 370324, 1024888, 1410292, 1246919, 510111, -663393, -2077207, -3472084, -4504911, -4871764, -4563830, -3989722, -3719623, -4013254, -4627284, -5128936, -5318389, -5240101, -4865735, -3989530, -2501250, -596060, 1393149, 3240877, 4785036, 5791490, 6117328, 6022187, 6114007, 6876224, 8308345, 10041899, 11688388, 13019188, 13933586, 14407505, 14502103, 14372674, 14231312, 14260316, 14516247, 14931571, 15461963, 16210725, 17324181, 18760694, 20247869]
41035B0247869J225713P42005O0235q04595j624888k025479j871299j458609j209096
41026A3281856j245124j360815j356066j269126j232769j159919o78285N19564
41018E499316K229139L720124M286753L841305K926174K157544J717581J368708
41010B7746644Q48717J78948l81262o18138n66024m18970k77845p2977K29612
41001B6668705M51813L59500k3695l64372l02900K56344J106381J903642K386489
40992C2441907K532172K539327K621858K821420L045297L234299L424433L694055
40984E6354768M141307M865925N851806O880927P678619Q162057Q490386Q914382
40976A11340177R647558J0781417J2169878J3467701J4464135J5310370J6192407
$$ y = [20247869, 21473582, 22215587, 22275822, 21471227, 19846339, 17820860, 15949561, 14490952, 13281856, 12036732, 10675917, 9319851, 8050725, 6817956, 5658037, 4979752, 5499316, 7728455, 11448579, 15735332, 19576637, 22502811, 24660355, 26377936, 27746644, 28595361, 28774309, 28393047, 27774909, 27208885, 26789915, 26512070, 26439093, 26668705, 27120518, 27480018, 27456323, 27091951, 26789051, 27045395, 28151776, 30055418, 32441907, 34974079, 37513406, 40135264, 42956684, 46001981, 49236280, 52660713, 56354768, 60496075, 65362000, 71213806, 78094733, 85773352, 93935409, 102425795, 111340177, 120987735, 131769152, 143939030, 157406731, 171870866, 187181236, 203373643]
40969B03373643J6835669J6623855J5209048J2692306R201097M766430j38147
40962B78563901m357495o818995p415821o830745n660174m079231k214240l14093
40954B40873107J564624L659999O109011Q697546J1134280J3313900J5133654
40947C00486121J6278037J6410790J5415006J3203722R431621L745843l569848
40940C71401292j1352470j8057638k2511731k4331281k3909109k2150079k0070938
40933B29018046j8362679j7134996j6027652j4603324j2710022j0560581q546517
40926A31072275p004331o101451n821410n967419o208373o223621n867548n207624
40918H2670498m434876l766458l364187l214542l071762k658206k015877j568953
$$ y = [203373643, 220209312, 236833167, 252042215, 264734521, 273935618, 278702048, 278563901, 274206406, 267387411, 259971590, 253140845, 247480671, 243401440, 241187200, 240873107, 242437731, 246097730, 252206741, 260904287, 272038567, 285352467, 300486121, 316764158, 333174948, 348589954, 361793676, 371225297, 374971140, 371401292, 360048822, 341991184, 319479453, 295148172, 271239063, 249088984, 229018046, 210655367, 193520371, 177492719, 162889395, 150179373, 139618792, 131072275, 124067944, 117966493, 112145083, 106177664, 99969291, 93745670, 87878122, 82670498, 78235622, 74469164, 71104977, 67890435, 64818673, 62160467, 60144590, 58575637]
40910E8575637j703540k304035k817301k781399k195894j377163o07102j4602
40902D4774601L35357M37905M34276N30498P55680R17246Q89341Q44409J050372
40893E0969685J469827J716726J462034Q06306K32899K66309J152485K699761
40885F0776032M333972N441532N847051N973129O442312P513274Q953264J0403524
40877A15684090J1729227J2981781J4147424J5058366J5553615J5666609J5621485
40870B16442597J5631902J5663490J5328561J3980205J0985401O110243j54592
40863B93987807o626842j1975808j5436338j7065965j7353386j6713149j5446404
40856A93369915j4023094j3075678j2947933j3334509j3491823j2821201j1253866
$$ y = [58575637, 56872097, 54568062, 51750761, 48969362, 46773468, 45396305, 44789203, 44774601, 45109958, 45547863, 45982139, 46512637, 47268317, 48185563, 49074904, 49919313, 50969685, 52439512, 54156238, 55618272, 56424578, 56657477, 56923786, 58076271, 60776032, 65110004, 70551536, 76398587, 82371716, 88814028, 96327302, 105280566, 115684090, 127413317, 140395098, 154542522, 169600888, 185154503, 200821112, 216442597, 232074499, 247737989, 263066550, 277046755, 288032156, 294142399, 293987807, 287360965, 275385157, 259948819, 242882854, 225529468, 208816319, 193369915, 179346821, 166271143, 153323210, 139988701, 126496878, 113675677, 102421811]
40849A02421811r180003p124972n458892m252840l310755k398433j546897j122524
40841F8026495j491280k568226l774566m507736m616825m382134m117333l886159
40833C8682236l534003k863548j834201p58401k59935p72799j966341k852290
40825B3840718k629551j359548K38314J477901K072009K038796J556978R01063
40817B8136680K93921k36267p66061j295741j786041k290882k848358l274921
40809A5932330l304447k969582k638968k605310k794714k919028k721657k028079
40801f049455q24977N25620J356732J261965N59473R689Q8749O67286J315308
40792a089610J676183J523676P48332m66824j550613j894545j416437o68886k76267
$$ y = [102421811, 93241808, 86116836, 80657944, 76405104, 73094349, 70695916, 69149019, 68026495, 66535215, 63966989, 60192423, 55684687, 51067862, 46685728, 42568395, 38682236, 35148233, 32284685, 30450484, 29692083, 29432148, 28659349, 26693008, 23840718, 21211167, 19851619, 20089933, 21567834, 23639843, 25678639, 27235617, 28136680, 28430601, 28194334, 27428273, 26132532, 24346491, 22055609, 19207251, 15932330, 12627883, 9658301, 7019333, 4414023, 1619309, -1299719, -4021376, -6049455, -6874432, -6348812, -4992080, -3730115, -3170642, -3160953, -3072204, -2404918, -1089610, 586573, 2110249, 2858581, 2391757, 841144, -1053401, -2469838, -3138724, -3414991]
40783c414991l17644l70969j02979L71515P30840Q26188P12008N09657M38955
40774f17420Q00636J617612K364935K390277J631908O30020j90020q70486j455194
40765F302268j637844j242993p58479r12309j789821k747224l159574k876238
40757h822214j953764m42249J315896K545187K619043J734105P49514L60546N94629
40748a299307J063381J451029J656870J640306J340386P76274J17742m32511q22594
40739E491576j157883j493334j669754j438815p64079O3744O47882P93649N90662
40730A063648K64123J8095j7144J78972M43421M53962r959p33253j073279m85606
40720A02980Q69294K130588K473913J859732R96106N72688O08084N60178j9253
$$ y = [-3414991, -3732635, -4103604, -4206583, -3835068, -3104228, -2278040, -1566032, -1056375, -617420, 183216, 1800828, 4165763, 6556040, 8187948, 8817968, 8627948, 7757462, 6302268, 4664424, 3421431, 2662952, 1750643, -39178, -2786402, -5945976, -8822214, -10775978, -11218227, -9902331, -7357144, -4738101, -3003996, -2254482, -1893936, -1299307, -235926, 1215103, 2871973, 4512279, 5852665, 6628939, 6746681, 6314170, 5491576, 4333693, 2840359, 1170605, -268210, -1032289, -968545, -320663, 472986, 1063648, 1327771, 1345866, 1328722, 1507694, 1951115, 2405077, 2395118, 1661865, 588586, 102980, 972274, 3102862, 5576775, 7436507, 8432613, 9005301, 9613385, 10173563, 10154310]
40711A0154310j021212j931854k355997k350388k266463k315801k335087j992556
40703f415048j189804k02771N84300J030508J285932J541398J829841K088423
40695E52779K293914K414123K276964J671828O64639l03813p60345n98435n0046
40686H161608O54264J425402K141908K563444K535355K151956J590882Q73316
40678B2098135o7630j119900j948903k265979k064882j562063r71927m00007P3650
40669A1770494K98971J26981m11117j060696j531228j683572j483630q74851J27314
40660E278666J223963J918205J914721J333981M90233l79378j080455j375380
40652I324556j184044q19729q08228j414315k406928l241037l394922k660281
$$ y = [10154310, 9133098, 7201244, 4845247, 2494859, 228396, -2087405, -4422492, -6415048, -7604852, -7807623, -7223323, -6192815, -4906883, -3365485, -1535644, 552779, 2846693, 5260816, 7537780, 9209608, 9874247, 9570434, 8810089, 8211654, 8161608, 8815872, 10241274, 12383182, 14946626, 17481981, 19633937, 21224819, 22098135, 22030505, 20910605, 18961702, 16695723, 14630841, 13068778, 12096851, 11696844, 11770494, 12069465, 12196446, 11785329, 10724633, 9193405, 7509833, 6026203, 5151352, 5278666, 6502629, 8420834, 10335555, 11669536, 12159769, 11780391, 10699936, 9324556, 8140512, 7320783, 6512555, 5098240, 2691312, -549725, -3944647, -6604928]
40644f604928j314858N424P81855R89689R23494P54723M65714J34029m5033p9980
40634c989871k24803n52996p52715n64935k22320j73523m79741p73580p87962
40625h522446o40798n41008m74964l35512j76846j26218j12271J05997O10628
40616a0213438J191062J617699J905191K149631K199100J746208Q25609k768j77398
40607A240896K41309O61437O25081J83276l55480p60780q64246m80166M01896
40598H93223J434168K125299K229286J830294J150696M52271M4679J24675N28247
40589A0812838Q04801O38107J24665l88505o38343n91286l85391k05955j34469
40580A0036462n4168K24305O93488J086561J133996P89598J58464o40471j411313
$$ y = [-6604928, -7919786, -7914362, -7132507, -6142818, -5219324, -4464601, -3998887, -3864858, -3909891, -3989871, -4214674, -4767670, -5520385, -6085320, -6307640, -6481163, -6960904, -7734484, -8522446, -9163244, -9704252, -10179216, -10514728, -10691574, -10817792, -10930063, -10824066, -10213438, -9022376, -7404677, -5499486, -3349855, -1150755, 595453, 1421062, 1418294, 1240896, 1482205, 2143642, 2768723, 2951999, 2596519, 1835739, 971493, 491327, 893223, 2327391, 4452690, 6681976, 8512270, 9662966, 10115237, 10159916, 10284591, 10812838, 11617639, 12255746, 12380411, 11991906, 11353563, 10762277, 10376886, 10170931, 10036462, 9982294, 10206599, 10900087, 11986648, 13120644, 13910242, 14068706, 13428235, 12016922]
40571A2016922j846025j809025j612374j729031k166345k371132j900416r87036
40563b404462k35495J05361L16332P16242J271424J742269J985424J996647J831179
40554G324921J632593J620390J872825K154670K082348J451159L53289r22662
40546A7569533j981957k418600k068599j245172n82603n32400j018193j570814
40538F151195j735805j379968p35455j94992J9620L2371J09528K94306L54141
40529B914941J07478l36336p35676r98766j209872j468951j827254k320448k923266
40520h798150l466853l703584l487902k861310j983998j040697j82467N33931
40512b4991030J172250J825725K474722K966062L147258L003316K664352K298922
$$ y = [12016922, 10170897, 8361872, 6749498, 5020467, 2854122, 482990, -1417426, -2404462, -2639957, -2534596, -2218264, -1502022, -230598, 1511671, 3497095, 5493742, 7324921, 8957514, 10577904, 12450729, 14605399, 16687747, 18138906, 18492195, 17569533, 15587576, 13168976, 11100377, 9855205, 9272602, 8740202, 7722009, 6151195, 4415390, 3035422, 2299967, 2104975, 2124595, 2156966, 2266494, 2560800, 2914941, 3022419, 2686083, 1950407, 951641, -258231, -1727182, -3554436, -5874884, -8798150, -12265003, -15968587, -19456489, -22317799, -24301797, -25342494, -25524961, -24991030, -23818780, -21993055, -19518333, -16552271, -13405013, -10401697, -7737345, -5438423]
40504e438423J986921J663086J182784M70264l77109j119416j510924j456322
40496d599139j102237p73970p42625j005642j317727j431827j252826p77543k3527
40487a3027063R09355J806363K463632K787836K713391K153176J200764L12184
40479A319638M3999N09184J209454J512084J251490P99610N88516O52935O66065
40470H552975L72038r4296l51182j83941K54250O22179O60828L01299l00573p29042
40460I104535m84937N62667J901337K696452K409320J069439q95356k863018m134693
40451I365746m209833l137151j486879R0289J175757J518282R96293j61225j336235
40442B815044j971560j994819j643986j030707j50722P52363J192014R34687K83149
$$ y = [-5438423, -3451502, -1788416, -605632, -135368, -512477, -1631893, -3142817, -4599139, -5701376, -6475346, -7217971, -8223613, -9541340, -10973167, -12225993, -13003536, -13027063, -12117708, -10311345, -7847713, -5059877, -2346486, -193310, 1007454, 1319638, 1363637, 1872821, 3082275, 4594359, 5845849, 6645459, 7233975, 7886910, 8552975, 8925013, 8830717, 8479535, 8295594, 8549844, 9172023, 9832851, 10134150, 9833577, 9104535, 8619598, 9182265, 11083602, 13780054, 16189374, 17258813, 16363457, 13500439, 9365746, 5155913, 2018762, 531883, 622172, 1797929, 3316211, 4312504, 4151279, 2815044, 843484, -1151335, -2795321, -3826028, -3976750, -3224387, -2032373, -1097686, -814537]
40433h14537k70840n38478o55945p37508o85035l41081K73538R06857J239469
40424a623560J121247O69835J13407m55043j084621j701752j970833j582128o78018
40415g191466J48250L69299J0517m14063m17053M0518N83959P93201N39659N8235
40405e478944k37979n9954N17379J050457J013729J96884j115543k346080l015034
40396i475085k973876k359816j449173n77867n7876K1554n6326J63580Q25254
40387a5939631J533785J744787J376209R05884Q48292J284524J954333K594450
40379c697367K982048K784822J702707j41464k138137l631735m331018m261010
40371a0731154l521292k258293p48757O96197J891625K727161L037866K720770
$$ y = [-814537, -1085377, -1623855, -2279800, -3017308, -3702343, -4043424, -3769886, -2863029, -1623560, -502313, 167522, 280929, -174114, -1258735, -2960487, -4931320, -6513448, -7191466, -7043216, -6673917, -6663400, -7077463, -7494516, -7453998, -6870039, -6076838, -5537179, -5478944, -5716923, -5776877, -5259498, -4209041, -3195312, -2998428, -4113971, -6460051, -9475085, -12448961, -14808777, -16257950, -16835817, -16893693, -16872139, -16928465, -16764885, -15939631, -14405846, -12661059, -11284850, -10378966, -9530674, -8246150, -6291817, -3697367, -715319, 2069503, 3772210, 3630746, 1492609, -2139126, -6470144, -10731154, -14252446, -16510739, -17259496, -16563299, -14671674, -11944513, -8906647, -6185877]
40363f185877J964967J163199N37282m94n65672j052432j272183j206392r87716
40354g605318p32959n50735o30662j099704j759087k157885k042158j622303j283672
40345a9484483j120216r01912m63028O4208M60815P08659R29730J128957J190784
40336a7486486J147700J261168J700826K237945K421500K051514J340032N80250
40328d745551j84506j045442j890715k386512k342001j960114j625465j500867
40320a7681173j415235j094396l96233O30610J742065K521474K616715K120831
40312a0955342J595908J506900J668134J464363O39282l56078q96181q84809p89025
40303g006848j079863j746538k251925j873550k75552K024140L839567M228004
$$ y = [-6185877, -4220910, -3057711, -2520429, -2520923, -3086595, -4139027, -5411210, -6617602, -7605318, -8338277, -8889012, -9519674, -10619378, -12378465, -14536350, -16578508, -18200811, -19484483, -20604699, -21506611, -21969639, -21905431, -21444616, -20735957, -19806227, -18677270, -17486486, -16338786, -15077618, -13376792, -11138847, -8717347, -6665833, -5325801, -4745551, -4930057, -5975499, -7866214, -10252726, -12594727, -14554841, -16180306, -17681173, -19096408, -20190804, -20587037, -19956427, -18214362, -15692888, -13076173, -10955342, -9359434, -7852534, -6184400, -4720037, -4080755, -4436833, -5333014, -6217823, -7006848, -8086711, -9833249, -12085174, -13958724, -14234276, -12210136, -8370569, -4142565]
40295d142565L266875J823513O49034r1980n10666o32307n00794l47311l91602
40286h77803n91243p70510q96916j056038j232587j298932j195212r85693p62701
40277i667635o03137n69223o21712n61961j84431N18275J373221K181901K750614
40268e384088K860993K406985J570733P26120J56690n1302P0270L59783M74263
40259C190447J00649p05311j557953k170312k576593k887250l034283k864530
40251a2505136k307253j347288l8377J303766K138097K186170J780986J499807
40243g289228J524998J590809J479466J274179J103246R14678O14474K36793j32192
40234A317223m59726p18965q79206j014100j253717j517928j450897p79841L40375
$$ y = [-4142565, -875690, 947823, 1596857, 1504877, 994211, 361904, -138890, -486201, -877803, -1469046, -2239556, -3136472, -4192510, -5425097, -6724029, -7919241, -8904934, -9667635, -10270772, -10839995, -11461707, -12023668, -12208099, -11689824, -10316603, -8134702, -5384088, -2523095, -116110, 1454623, 2180743, 2337433, 2286131, 2356401, 2716184, 3190447, 3291096, 2585785, 1027832, -1142480, -3719073, -6606323, -9640606, -12505136, -14812389, -16159677, -16198054, -14894288, -12756191, -10570021, -8789035, -7289228, -5764230, -4173421, -2693955, -1419776, -316530, 598148, 1212622, 1449415, 1317223, 857497, 138532, -740674, -1754774, -3008491, -4526419, -5977316, -6757157, -6416782]
40225f416782J448407K141048K215941J618691M84439q11678j859471k492422
40217c671827k730286k498268j640530k62231J165934K181649K681333K803242
40209a970984K634195K223059J782409J619145J794914J979424J703980P15192
40201A2481334q88898k727853m285967n114156n037359m214930l007625j801834
40193a4597288r02073m31243k33760M1016O20193J363032J917970K126286K179864
40184g916003K351400K657678K854937K707832K182826J414605N92222r7738n07073
40175F240686n80587l55267J16691P73242J396732J546101Q44355n58978j925613
40166G497362k496433k139546j355250o68214j56482L89748J020152J503536J607992
$$ y = [-6416782, -4968375, -2827327, -611386, 1007305, 1491744, 680066, -1179405, -3671827, -6402113, -8900381, -10540911, -10803142, -9637208, -7455559, -4774226, -1970984, 663211, 2886270, 4668679, 6287824, 8082738, 10062162, 11766142, 12481334, 11592436, 8864583, 4578616, -535540, -5572899, -9787829, -12795454, -14597288, -15499361, -15930604, -16164364, -16123348, -15503155, -14140123, -12222153, -10095867, -7916003, -5564603, -2906925, -51988, 2655844, 4838670, 6253275, 6845497, 6747759, 6240686, 5660099, 5304832, 5421523, 6194765, 7591497, 9137598, 9981953, 9422975, 7497362, 5000929, 2861383, 1506133, 837919, 681437, 1071185, 2091337, 3594873, 5202865]
40157E202865J344117Q91667L89243j24508n95461q57533p00190n7426Q64079
40148F356853J667262K002202J740464R69496q6144j112687j802468k040684j977908
40139E716386j820428j580420j154955o21675k59343j92996j69239J81078R34652
40130A033060J836897K578920K960873K843909K167083J099743M7612o13101p85622
40121A3169374o08896k49097J80309N52219P27949O81553N41394M22300K48124
40112A5665229j55221p69889j304274j504098j480312j574339j886418k095349
40104D895329j826324j069635j21953P59607J449622J771156J508072P29142p1069
40095H023947l48248j227O17468J140958J497228J767609J898333J701824J130990
$$ y = [5202865, 6546982, 7438649, 7827892, 7703384, 7107923, 6250390, 5550200, 5492774, 6356853, 8024115, 10026317, 11766781, 12736277, 12650133, 11537446, 9734978, 7694294, 5716386, 3895958, 2315538, 1160583, 538908, 279565, 86569, -82670, 98408, 1033060, 2869957, 5448877, 8409750, 11253659, 13420742, 14520485, 14568097, 13954996, 13169374, 12560478, 12311381, 12491690, 13043909, 13771858, 14453411, 14994805, 15417105, 15665229, 15510008, 14740119, 13435845, 11931747, 10451435, 8877096, 6990678, 4895329, 3069005, 1999370, 1877417, 2637024, 4086646, 5857802, 7365874, 8095016, 8023947, 7675699, 7674472, 8291940, 9432898, 10930126, 12697735, 14596068, 16297892, 17428882]
40086A7428882M30738n7960k15494k20969l48384p53050j426172k224638k882364
40077I730589l098359k740872j955879j025063j81838L65861L70662k70636j279687
40068h5222k163203k671053k888381k807445k094923n48118J363626K732369L020085
40059f142265K452022J621856R31760M49878N1429m62926j218825k048834k514641
40050f880546k329125j722561j242124j190985j358721j264190n58442P38808
40042a5807886K215471L280713L592395L334451K944136K560468J952223J051830
40034E123801K73550N5768K58761L22000m2563o19540j147353j653674k188457
40025C82293k512615k318279j635414q13766j96157J8239k61348q90932j371738
$$ y = [17428882, 17859620, 17801660, 17586166, 17365197, 17016813, 16263763, 14837591, 12612953, 9730589, 6632230, 3891358, 1935479, 910416, 728578, 1094439, 1465101, 1194465, -85222, -2248425, -4919478, -7807859, -10615304, -12710227, -13258345, -11894719, -9162350, -6142265, -3690243, -2068387, -1136627, -686749, -635320, -1098246, -2317071, -4365905, -6880546, -9209671, -10932232, -12174356, -13365341, -14724062, -15988252, -16546694, -15807886, -13592415, -10311702, -6719307, -3384856, -440720, 2119748, 4071971, 5123801, 5397351, 5453119, 5711880, 6033880, 5991317, 5371777, 4224424, 2570750, 382293, -2130322, -4448601, -6084015, -6897781, -7093938, -7075699, -7337047, -8227979, -9599717]
40016i599717j187749l79920M23912O61920L57653q5006l79771m90546m75677
40007a1154901m59086o42187j051699j298576q91628J22265J083253J430667J287463
39998a1574429J151855J211479J288069J390009J887070K908549L825806L706143
39990E794551K314993M34260r11696j386636j378803j263157r09894j7724J264714
39981C940608K324728K756335K848281L183686L790385L954915L032845J274678
39973B7106461l89088j323658j704198k060876k609602l162407l435538l212364
39965I208730k400628j250868m24024m57541j085378j408266r13868q3217K51730
39956A436670k8126k38704J47235P77563Q47837R4136q85364j314400j034424
$$ y = [-9599717, -10787466, -11167386, -10743474, -10081554, -9723901, -9808907, -10188678, -10679224, -11154901, -11613987, -12256174, -13307873, -14606449, -15498077, -15375812, -14292559, -12861892, -11574429, -10422574, -9211095, -7923026, -6533017, -4645947, -1737398, 2088408, 5794551, 8109544, 8543804, 7632108, 6245472, 4866669, 3603512, 2693618, 2675894, 3940608, 6265336, 9021671, 11869952, 15053638, 18844023, 22798938, 25831783, 27106461, 26717373, 25393715, 23689517, 21628641, 19019039, 15856632, 12421094, 9208730, 6808102, 5557234, 5133210, 4675669, 3590291, 2182025, 1268157, 1184940, 1436670, 1408544, 1169840, 1317075, 2094638, 2942475, 3036611, 2151247, 836847, -197577]
39947a97577m69656O8928P47678J770781K807729L146004K416125R68914n05903
39938A0753023j568437k178991k444443k390107j964362j185248k61072M75980
39930g63657Q46083J021416J329084J839939K284670K398749K183597J770288
39922A2910169J219407N82005q824m77498r22236j431889j890662k129794k170558
39913E680120k129156j975232j615126j165775q89350q25309p07128l19724K22733
39904c723947O25404P01621M46535m7125o41380j173239j490891j481563j117941
39895g902526n46898p0690Q3036m4847k60059m33430m63877j54777N82735J406122
39885g805211J722089J305501N39526l4494j83434P9232P14900J570314K246121
$$ y = [-197577, -667233, -598305, 149373, 1920154, 4727883, 7873887, 10290012, 11258926, 10753023, 9184586, 7005595, 4561152, 2171045, 206683, -978565, -1239637, -763657, 82426, 1103842, 2432926, 4272865, 6557535, 8956284, 11139881, 12910169, 14129576, 14711581, 14702757, 14225259, 13303023, 11871134, 9980472, 7850678, 5680120, 3550964, 1575732, -39394, -1205169, -2094519, -2919828, -3626956, -3946680, -3723947, -3098543, -2396922, -1950387, -1997512, -2638892, -3812131, -5303022, -6784585, -7902526, -8449424, -8520114, -8437078, -8481925, -8741984, -9175414, -9639291, -9794068, -9211333, -7805211, -6083122, -4777621, -4238095, -4272589, -4456023, -4376791, -3661891, -2091577, 154544]
39876A54544K343444J832441J048611L94606J34128L03123O17568N96782L9155
39867G464402o63535r15558o03860j67148L1353J48772N78154J402759K265916
39858I541255K673386K322943J254770j55683j372718k017656k105247j968712
39850H172338j934100k045454k066857j721851r42988O8156R82449J541576J675454
39841C728723J489723J131099O23044j27050j070107j805765j810208r62660K55381
39832A452180J163496J399799R97560J35255r86563k083277k816915k967423k534797
39823f240685j712260q27097k20588k8757p9020r4139L8621K89413O68486J174095
39813g031931J569497J443465O09012o49595j774324k304553k086266j300001
$$ y = [154544, 2497988, 4330429, 5379040, 5773646, 5907774, 6210897, 6828465, 7425247, 7464402, 6800867, 5885309, 5281449, 5114301, 5145654, 5294426, 5872580, 7275339, 9541255, 12214641, 14537584, 15792354, 15636671, 14263953, 12246297, 10141050, 8172338, 6238238, 4192784, 2125927, 404076, -538912, -470756, 511693, 2053269, 3728723, 5218446, 6349545, 6972589, 6845539, 5775432, 3969667, 2159459, 1196799, 1452180, 2615676, 4015475, 5013035, 5148290, 4161727, 2078450, -738465, -3705888, -6240685, -7952945, -8780042, -9000630, -9029387, -9108407, -9202546, -9163925, -8874512, -8206026, -7031931, -5462434, -4018969, -3409957, -4059552, -5833876, -8138429, -10224695, -11524696]
39805a1524696l55052L78041Q23622J128490J336986J300698R72283O02363M83610
39796d853655O01220O96993O18968M46573K89796J27167j06088l70728n39434
39787c089188n31578l86051j89323N7573M59482J055897J634188J810558J377024
39778B198582N43121k27978o28603p35609q52442j147832j445520j378894p83821
39769d458996P7924P46853J017461J092098J282034J663905K086605K405018K571020
39760H483922K520646K114610J273734J48454q99710j520598j606005j324428
39752I190625r60918p59459q89514j417133k178036k749888k741594k158515j361577
39743f026009o35137O1437Q55886J649896K191689K357262K189382J708602Q83348
$$ y = [-11524696, -11879748, -11501707, -10678085, -9549595, -8212609, -6911911, -5939628, -5337265, -4853655, -4252435, -3555442, -2936474, -2489901, -2200105, -2072938, -2179026, -2549754, -3089188, -3620766, -4006817, -4196140, -4138567, -3679085, -2623188, -989000, 821558, 2198582, 2741703, 2513725, 1885122, 1149513, 297071, -850761, -2296281, -3675175, -4458996, -4381072, -3634219, -2616758, -1524660, -242626, 1421279, 3507884, 5912902, 8483922, 11004568, 13119178, 14392912, 14541366, 13641656, 12121058, 10515053, 9190625, 8229707, 7470248, 6580734, 5163601, 2985565, 235677, -2505917, -4664432, -6026009, -6661146, -6599709, -5743823, -4093927, -1902238, 455024, 2644406, 4353008, 5236356]
39734E236356j59340j039087j378124j157012p38379m78396l45927l8808M84600
39725C85883P63865L41984n49868j108164q63525k49612j04791p60223j778673
39716c923124k446371k330001j472677k85133P73864J562258K253385K874324
39708b993475L048513K478748J542803R93080J017156R63992J51737j332787k798842
39699C070925l657264l767519l319471k654720k107278j784751j525078j179016
39691a6924172q16809m99565m37R64300K238022L197378L296597K520553J294221
39682d729912R2505q24645j427831j766809j796723j387384n61439L52521R41688
39673a1108029J060485Q37912L88410k75575j013296j466562j361217q00767j30238
$$ y = [5236356, 5077016, 4037929, 2659805, 1502793, 764414, 286018, -59909, -98717, 385883, 1149748, 1491732, 941864, -166300, -1029825, -1279437, -1384228, -2144451, -3923124, -6369495, -8699496, -10172173, -10457306, -9683442, -8121184, -5867799, -2993475, 55038, 2533786, 4076589, 5069669, 6086825, 7050817, 7202554, 5869767, 3070925, -586339, -4353858, -7673329, -10328049, -12435327, -14220078, -15745156, -16924172, -17740981, -18240546, -18240983, -17276683, -15038661, -11841283, -8544686, -6024133, -4729912, -4637407, -5462052, -6889883, -8656692, -10453415, -11840799, -12402238, -12049717, -11108029, -10047544, -9209632, -8821222, -9096797, -10110093, -11576655, -12937872, -13738639, -13868877]
39664a3868877M38464R60129J550241K148064K511475K433692J984725J529011
39656c13076J425208J668333J884883J711584J117763L49853l03198o05113l90200
39647F546037K87510J019168J248465P35769k22032j070417j450294j370800j046635
39638D676771o76986l70945j90536j94029m21765q44123j330671j689776j766745
39629b808805j521671j011117k90612O35237J700311K589008K763694J865128
39621C921173J75879j401762j964193j254987K62313J845753K893788L076807
39613G554771K371301J114958j18910r03921j245099j427145j623793j744669
39605C977493j636640j324298j024006r70689j216860j538528j575851j183406
$$ y = [-13868877, -13430413, -12470284, -10920043, -8771979, -6260504, -3826812, -1842087, -313076, 1112132, 2780465, 4665348, 6376932, 7494695, 7844548, 7541350, 6936237, 6546037, 6833547, 7852715, 9101180, 9836949, 9614917, 8544500, 7094206, 5723406, 4676771, 3999785, 3628840, 3438304, 3244275, 2822510, 1978387, 647716, -1042060, -2808805, -4330476, -5341593, -5632205, -4996968, -3296657, -707649, 2056045, 3921173, 4097052, 2695290, 731097, -523890, -261577, 1584176, 4477964, 7554771, 9926072, 11041030, 10922120, 10018199, 8773100, 7345955, 5722162, 3977493, 2340853, 1016555, -7451, -978140, -2195000, -3733528, -5309379, -6492785]
39597f492785o41428l83888m72022m68512Q5475J181895K415984L386192L849545
39588B460456L623119K663616J316702K22232k23317k06545j79165l20263m62686
39579H894149m41034k98060j70877j69431l81250q05000j224124j324898j039210
39570C040265o35961l88390l16157l86321p63997j568232k436649k669965j951881
39561h077288p48256J37419K81326j73434q43010j372377j459544r23522J03057
39552a3075629J183402J933862K348575K677800L009814L098371K666798J803935
39544E646928R28965L35902j13912p35501j511236j998218j784411r05022K62729
39535A26224J359260K132775K300299J625263K31877j332903k475318k915829
$$ y = [-6492785, -7134213, -7518101, -7990123, -8458635, -8373160, -7191265, -4775281, -1389089, 2460456, 6083575, 8747191, 10063893, 10286125, 10062808, 9856263, 9677098, 9356835, 8894149, 8453115, 8155055, 7984178, 7814747, 7433497, 6628497, 5404373, 4079475, 3040265, 2404304, 2015914, 1699757, 1313436, 549439, -1018793, -3455442, -6125407, -8077288, -8825544, -8688125, -8406799, -8580233, -9423243, -10795620, -12255164, -13178686, -13075629, -11892227, -9958365, -7609790, -4931990, -1922176, 1176195, 3842993, 5646928, 6575893, 6911795, 6797883, 6062382, 4551146, 2552928, 768517, -136505, 126224, 1485484, 3618259, 5918558, 7543821, 7775698, 6442795, 3967477, 1051648]
39527A051648k658377j820919o86614K19619M13914r5707p76256j048697p22431
39518f123820K0548Q75964J558277J866856J811948J632831J528944J377636Q69824
39509E419008m1304r65145j419773j252049o41849J83677J077386J868540K337616
39500F566107K370673K029761J408278N28330n17560j415823j791140j543286
39492G635340r36620l33809R0924L66393N52651O36827N90909M85758M98151P39147
39482A0325671J047952J041315M85203l89537j042366j111894o84689j05055L49984
39473I916584N81833O03485M64847J91678k44870q41030j453496j915379k275445
39464E028207k715648l116119k914429j653793L77696K251659L155627K970449
$$ y = [1051648, -1606729, -3427648, -4114262, -3894643, -3480729, -3576436, -4352692, -5401389, -6123820, -6103272, -5227308, -3669031, -1802175, 9773, 1642604, 3171548, 4549184, 5419008, 5377704, 4412559, 2992786, 1740737, 1098888, 1282565, 2359951, 4228491, 6566107, 8936780, 10966541, 12374819, 12903149, 12385589, 10969766, 9178626, 7635340, 6698720, 6364911, 6455835, 6822228, 7374879, 8011706, 8602615, 9088373, 9586524, 10325671, 11373623, 12414938, 12900141, 12510604, 11468238, 10356344, 9671655, 9566600, 9916584, 10498417, 11101902, 11566749, 11758427, 11513557, 10672527, 9219031, 7303652, 5028207, 2312559, -803560, -3717989, -5371782, -4994086, -2742427, 413200, 3383649]
39456C383649K208097J547389J349403J416550J231429N68596k04582o02507o54896
39447A0243128p59490r80534r18064l73792K55630M95339M17730M63605Q09355
39438I652907J165224J081981K62573j250724k916816l846430l460303k050140
39430a361728n06235M87443Q32347P41363M43104J83868J72493L30849K84973
39421A608477k14289r43105j389459j241424o54381j09775l0242m27250q73148
39412d274596q82776l39502M99069J330086J962414K187756J787101Q28516j99710
39403B898358p48211o77491k93140K1120J18846J14510K24631N92512J185928
39394C437063J815294K243778K293932J908624J174764K74217o26865j399647
$$ y = [3383649, 5591746, 7139135, 8488538, 9905088, 11136517, 11705113, 11500531, 10898024, 10243128, 9483638, 8503104, 7585040, 7211248, 7466878, 7962217, 8379947, 8843552, 9652907, 10818131, 11900112, 12162685, 10911961, 7995145, 4148715, 688412, -1361728, -1867963, -1380520, -548173, 193190, 636294, 820162, 992655, 1323504, 1608477, 1394188, 451083, -938376, -2179800, -2834181, -2943956, -2974198, -3401448, -4274596, -5157372, -5496874, -4997805, -3667719, -1705305, 482451, 2269552, 3098068, 2898358, 2150147, 1472656, 1179516, 1200636, 1319482, 1433992, 1658623, 2251135, 3437063, 5252357, 7496135, 9790067, 11698691, 12873455, 13147672, 12520807, 11121160]
39386A1121160j853005j784251j301801r63805j298768k168637k854197k818297
39378c921601k150446j221101k19421P91966J635283K099853K139398J801027
39370I54958J101199J64081o69184j114308j250236j354813j519481j615528j536950
39361f840262j254986p25817M32O29598Q37163O26957K84801M3431K5576M03286
39351e969821J228101K077412K269928J613825O75978J45946J62465M14764O41993
39342C260591P82210Q02721O67954M45654K72574K22538K65519K61574m2636q09154
39332F129545j768366k286691j983902j135298k48369N91505J646045K887902
39324C832371L809125L935086L257023K059998N77740r97855k318245k920899
$$ y = [11121160, 9268155, 7483904, 6182103, 5218298, 3919530, 1750893, -1103304, -3921601, -6072047, -7293148, -7512569, -6720603, -5085320, -2985467, -846069, 954958, 2056157, 2220238, 1551054, 436746, -813490, -2168303, -3687784, -5303312, -6840262, -8095248, -8821065, -8820633, -8191035, -7353872, -6726915, -6442114, -6398683, -6373107, -5969821, -4741720, -2664308, -394380, 1219445, 1895423, 2041369, 2203834, 2618598, 3260591, 4042801, 4845522, 5513476, 5959130, 6231704, 6454242, 6719761, 6981335, 6938699, 6129545, 4361179, 2074488, 90586, -1044712, -1293081, -701576, 944469, 3832371, 7641496, 11576582, 14833605, 16893603, 17471343, 16473488, 14155243, 11234344]
39316A1234344k531408j324855P4739R13761Q08145R504q94332j541187j935083
39307D813628k071665j732614q51505J17473N11374J43330n39174j008985j169225
39298a787363j225747j240819j013748l74275N50822J395398J811458J678348
39290b05926J162081O21384L80406M89308O89049O60611L40663j2838o3921L05037
39280D365854R03920J355264J267490L95971j170420k879354l884552l582895
39272c228722k124859l44917R14276J416019J461927J343137J051347N28980l9949
39263I77239l72152m23486m08680n05539o81689q07643p95086n96291k12259K10151
39253c615435L75733M8795p11639j525993j907322j581201p05070K41466Q78448
$$ y = [11234344, 8702936, 7378081, 7452820, 8366581, 9174726, 9184230, 8289898, 6748711, 4813628, 2741963, 1009349, 157844, 275317, 786691, 930021, 390847, -618138, -1787363, -3013110, -4253929, -5267677, -5641952, -5091130, -3695732, -1884274, -205926, 956155, 1577539, 1957945, 2447253, 3136302, 3796913, 4137576, 4124738, 4060817, 4365854, 5269774, 6625038, 7892528, 8288499, 7118079, 4238725, 354173, -3228722, -5353581, -5698498, -4784222, -3368203, -1906276, -563139, 488208, 1017188, 977239, 605087, 181601, -227079, -732618, -1414307, -2221950, -3017036, -3613327, -3825586, -3615435, -3239702, -3190907, -3902546, -5428539, -7335861, -8917062, -9622132, -9380666, -8502218]
39244h502218J215688J421865J393440Q17413k80246j326332j748553j582530
39236h591473j327988j304795j363826j166745n22015N30661J713022K521501
39228i511658K479029J552776K64636o98744r64894o04393M5251N98830Q02279
39219f036888O52345L37536J9418k60849m14956j99705N14533J382583J717193
39210b288790J124096q2287j215280j900149k270538k516552k478855j845363
39202a3473718o20947Q00531J995437K752218K971779K595643J786943J013415
39194a78699P23015R36518J261769J275657Q13720k3244r74119j722757k036400
39185G5460j869692j326880n71931J82956P14219R57841J092076J304005J514248
$$ y = [-8502218, -7286530, -5864665, -4471225, -3653812, -3934058, -5260390, -7008943, -8591473, -9919461, -11224256, -12588082, -13754827, -14276842, -13746181, -12033159, -9511658, -7032629, -5479853, -5215217, -5913961, -6878855, -7483248, -7437997, -6839167, -6036888, -5384543, -5047007, -5027589, -5288438, -5703394, -5903099, -5388566, -4005983, -2288790, -1164694, -1246981, -2462261, -4362410, -6632948, -9149500, -11628355, -13473718, -14094665, -13294134, -11298697, -8546479, -5574700, -2979057, -1192114, -178699, 544316, 1480834, 2742603, 4018260, 4831980, 4808736, 3834617, 2111860, 75460, -1794232, -3121112, -3693043, -3510087, -2795868, -1838027, -745951, 558054, 2072302]
39176B072302J503067J290996J186274J393425J743102J899482J701464J200322
39168A3990434M87168l52470j132305j548216j366050o83130j6145k6182r86491
39159H366613k460337l572077l648690k630271r97560N39095J364953J274973
39151a763301O14252L797j53852J41476P08859J359040J833904J868878J477914
39142F090967R73844N48525M5051o52628j241911j354908j165447j225238j628580
39133C89675j706085p85395R20110K417809K894673K421127J714321J356141J331507
39124A0953883J254098Q67171K29901m65515j047026j323851j120908m90428K33672
39115I090997P10730Q17298N18485k74023j486902k658204l215641k986628k244971
$$ y = [2072302, 3575369, 4866365, 6052639, 7446064, 9189166, 11088648, 12790112, 13990434, 14477602, 14125132, 12992827, 11444611, 10078561, 9395431, 9379286, 9353104, 8366613, 5906276, 2334199, -1314491, -3944762, -4942322, -4403227, -3038274, -1763301, -1149049, -1145252, -1299104, -1157628, -448769, 910271, 2744175, 4613053, 6090967, 7064811, 7613336, 7658387, 7005759, 5763848, 4408940, 3243493, 2018255, 389675, -1316410, -2101805, -1181695, 1236114, 4130787, 6551914, 8266235, 9622376, 10953883, 12207981, 13075152, 13305053, 12839538, 11792512, 10468661, 9347753, 8857325, 9090997, 9801727, 10619025, 11137510, 10863487, 9376585, 6718381, 3502740, 516112, -1728859]
39106a728859j313933l83094L14206N05348K23943q4966o546M08244P66994P68591
39096e30072M03474j22846n00298m60953j1933N07598P48418P18347P23095R74169
39086B448999J368817J631807J548984J062850K74726n78620j209104j399330
39078E149129j067937k88652O60163J292750J132801Q7805j372513k487340k741222
39069C64984k200032j368198p43752m98557n11604n88892n88662m20133p5307
39060f630153K95014M36114K06547k75466p30981r31301p93535l43795L24159
39051h443397J063747J727084K236486K580197K724105K558389J970379R82301
39043G399291j94001j250011j934270k145275j946077j541458j187340j005809
$$ y = [-1728859, -3042792, -3425886, -3111680, -2606332, -2382389, -2467355, -2473901, -2065657, -1298663, -530072, -126598, -249444, -749742, -1210695, -1222628, -715030, 33388, 751735, 1474830, 2448999, 3817816, 5449623, 6998607, 8061457, 8336183, 7757563, 6548459, 5149129, 4081192, 3792540, 4452703, 5745453, 6878254, 6966059, 5593546, 3106206, 364984, -1835048, -3203246, -3946998, -4445555, -4957159, -5546051, -6134713, -6554846, -6630153, -6335139, -5899025, -5692478, -5967944, -6698925, -7630226, -8423761, -8767556, -8443397, -7379650, -5652566, -3416080, -835883, 1888222, 4446611, 6416990, 7399291, 7205290, 5955279, 4021009, 1875734, -70343, -1611801, -2799141, -3804950]
39035c804950q61228m96935J85829J060888J958315K723611L055505K579041J352385
39026G752461J39591j86332M55891J306575J629269J340833P47614N1600o27747
39017A2609755j032591r62330o28629m98930p50323j105202j260822j279158j431896
39008C659874j770460j985262j710135r49374j92902m3961o49137j502550j882911
38999g026818j507124p42614k09732k09764n01346n82950k10009L46339N91452
38990a0052566L55952m0237j89985j2521L22169O95084J037135J115919O23520
38981f145530m20558j516735k049414j748280p87563M13975J398524J812699J549389
38972g493493Q04301o4457p69636j203744j378317j341896j177338r95813q23066
$$ y = [-3804950, -4666178, -5163113, -4977284, -3916396, -1958081, 765530, 3821035, 6400076, 7752461, 7892052, 7705720, 8161611, 9468186, 11097455, 12438288, 13185902, 13237502, 12609755, 11577164, 10614834, 9986205, 9487275, 8736952, 7631750, 6370928, 5091770, 3659874, 1889414, -95848, -1805983, -2755357, -2948259, -2992220, -3641357, -5143907, -7026818, -8533942, -9276556, -9486288, -9696052, -10197398, -10780348, -10990357, -10644018, -10052566, -9696614, -9736851, -9926836, -9939357, -9617188, -8922104, -7884969, -6769050, -6145530, -6566088, -8082823, -10132237, -11880517, -12668080, -12254105, -10855581, -9042882, -7493493, -6689192, -6753649, -7523285, -8727029, -10105346, -11447242, -12624580, -13620393, -14443459]
38963a4443459m85489K62474J393116K471393L031694L073582K996609L002499
38955A302419K771684J870001L23756j380588k768755l676305m146548m231694
38947i936030l926318l215983k213666j274848q18679q80919r66707n44536L87238
38938b3390448J389981K104826K439543K366829J895843J246487P17701L21391
38930a0907847j58645o92423r21871o56546j08409N20204J309342K222194K784261
38921f609740K568863J820250J198925R92204R25766O93155K93122j81017p16334
38912I85194j204251j357833r95283k83002M08218P88508P57820M08168K7484
38903d64977l6350L25745Q48162J140816J069682Q60487Q52585J161392J543561
$$ y = [-14443459, -14928948, -14666474, -13273358, -10801965, -7770271, -4696689, -1700080, 1302419, 4074103, 5944104, 6267860, 4887272, 2118517, -1557788, -5704336, -9936030, -13862348, -17078331, -19291997, -20566845, -21385524, -22266443, -23233150, -23777686, -23390448, -22000467, -19895641, -17456098, -15089269, -13193426, -11946939, -11229238, -10907847, -11066492, -11758915, -12680786, -13337332, -13445741, -12925537, -11616195, -9394001, -6609740, -4040877, -2220627, -1021702, -29498, 896268, 1589423, 1882545, 1701528, 985194, -219057, -1576890, -2572173, -2855175, -2446957, -1658449, -900629, -492461, -464977, -501327, -175582, 672580, 1813396, 2883078, 3743565, 4596150, 5757542, 7301103]
38894G301103J588773J084395J90506p64340j594817k281119k741459k745720
38886C7322k113167r29124M52689J574918K090034J949312J423561Q60153L99461
38877E745159p406l34197l81943r506O14708J045615Q38641j30645j488334k527117
38867C364975k733853k223987j543852j033205n66457K4107N30284N98927K41952
38858c341109j44970k44594p8245J95592M98766P51014P67026M26041j11551m94753
38848a776783m78834n9621O14294J299635J633377J277359K82094p55181j108251
38839I28089o00342J98105N06195K4987r17678j787099k268058k310465j935963
38830h162229j141016K211J218413K082727K277367J837154J130516N85318M40075
$$ y = [7301103, 8889876, 9974271, 10164777, 9400437, 7805620, 5524501, 2783042, 37322, -2075845, -3004969, -2552280, -977362, 1112672, 3061984, 4485545, 5345698, 5745159, 5737753, 5403556, 5021613, 5012107, 5626815, 6672430, 7511071, 7380426, 5892092, 3364975, 631122, -1592865, -3136717, -4169922, -4736379, -4712272, -4181988, -3583061, -3341109, -3486079, -3730673, -3808918, -3613326, -3114560, -2363546, -1596520, -1170479, -1282030, -1776783, -2255617, -2315238, -1700944, -401309, 1232068, 2509427, 2791521, 2036340, 928089, 327747, 525852, 1032047, 1057034, 139356, -1647743, -3915801, -6226266, -8162229, -9303245, -9301034, -8082621, -5999894, -3722527, -1885373, -754857, -169539, 270536]
38821B70536P04603J210206J622384J550814Q52022j74290j031888j486913j664676
38812A852798j707794j542127j076108m60737K7568K98549M91382P38522J033001
38803c44946J333858J654124J970538K127363J910840J211101J13559j102010
38795H874427k043890k418468k278044k008702j946619k022729j915137j537923
38787g297085j180778j090655j129566j029818q10073o54193m78420M369P38668
38778a2927551J215986J092345O18643K25007m8282l96552p64298r23371r11232
38769a2819305r31571q20660r3923J303664K663849L176128K695670J680978O23130
38760b522040k31104p99150j101161j218725j147599p82436j68734L92320O57474
$$ y = [270536, 975139, 2185345, 3807729, 5358543, 6210565, 6036275, 5004387, 3517474, 1852798, 145004, -1397123, -2473231, -2933968, -2906400, -2607851, -2116469, -1377947, -344946, 988912, 2643036, 4613574, 6740937, 8651777, 9862878, 9976437, 8874427, 6830537, 4412069, 2134025, 125323, -1821296, -3844025, -5759162, -7297085, -8477863, -9568518, -10698084, -11727902, -12537975, -13192168, -13670588, -13666219, -12927551, -11711565, -10619220, -10000577, -9775570, -9823852, -10220404, -10984702, -11908073, -12819305, -13750876, -14571536, -14665459, -13361795, -10697946, -7521818, -4826148, -3145170, -2522040, -2753144, -3552294, -4653455, -5872180, -7019779, -7802215, -7970949, -7578629, -6921155]
38751f921155O93577O32334L84223j13461n23966l61005M10796J336327K016145
38742b446185K368524K342514J782902P78911j44059m53816j23715M36468Q40285
38733E381829R88177J013017J116709J353423J446596R59752j74603j409711k070808
38724H604381k009948j571965j004017k22454P81583J627584J865460J469887
38716I540511Q25461L05591L0605n3294r2846l18234q66000j517787j812479j562508
38706D479020j106774q73235q17911n46553M9957N67364N77940J29500l70364
38697B088944n87950m22610J01371Q44772J485019J678984J395402R80709Q09507
38688H374148Q98649Q97159M39738m88860j512490k173260k267208j862569j089741
$$ y = [-6921155, -6227578, -5595244, -5211021, -5324482, -5848448, -6209453, -5798657, -4462330, -2446185, -77661, 2264853, 4047755, 4826666, 4682607, 4228791, 4105076, 4541544, 5381829, 6370006, 7383023, 8499732, 9853155, 11299751, 12259503, 12084900, 10675189, 8604381, 6594433, 5022468, 4018451, 3795997, 4577580, 6205164, 8070624, 9540511, 10365972, 10671563, 10702168, 10648874, 10556028, 10237794, 9371794, 7854007, 6041528, 4479020, 3372246, 2499011, 1681100, 1134547, 1184504, 1751868, 2329808, 2459308, 2088944, 1500994, 1078384, 1179755, 2024527, 3509546, 5188530, 6583932, 7564641, 8374148, 9272797, 10169956, 10609694, 10120834, 8608344, 6435084, 4167876, 2305307, 1215566]
38679A215566j04187P37779R54858M26420l34856o59833m39740j43881j47946
38670A504180l11794k85537K0928M30598P91832J093017J353404J533700J525160
38661G655488J163192L41039p70277j666155j826676j167394j64547M82624L54775
38652D402069m23109j343424j951691k163127k181423k171405k080866j750827
38644i663803j099837j95120P67179J546490K019912K266842K387568K253827
38636B83058J624821N77729l69118p28239n34407j99559M8568L72037R38314J517282
38626C530486J621809J043435J46509m59709n57579n57386j019223j977724k856638
38617a086020l055099k492582j550892o44725L6379M87358P77093R84897J144876
$$ y = [1215566, 1111379, 1849158, 2804016, 3230436, 2895580, 2235747, 1796007, 1652126, 1504180, 1192386, 906849, 927777, 1358375, 2150207, 3243224, 4596628, 6130328, 7655488, 8818680, 9159719, 8389442, 6723287, 4896611, 3729217, 3564670, 4047294, 4402069, 3978960, 2635536, 683845, -1479282, -3660705, -5832110, -7912976, -9663803, -10763640, -10958760, -10191581, -8645091, -6625179, -4358337, -1970769, 283058, 1907879, 2485608, 2116490, 1388251, 853844, 654285, 702853, 1074890, 2013204, 3530486, 5152295, 6195730, 6342239, 5882530, 5324951, 4767565, 3748342, 1770618, -1086020, -4141119, -6633701, -8184593, -8829318, -8792939, -8305581, -7528488, -6543591, -5398715]
38608e398715J227645J200534J075106Q76676O34086M27071L35832K72343j4034
38599F36544o17607j232802j402640j019981m52741j43156j85033l32573l26880
38590e076869j23496J77041N22764R36857J331430J413254R47737J26959n13696
38581b58019o65346o10810q75365j588532k343922k647715k351162j660280q95906
38572a3897057k98085O9382L36564P28935J382997K207086K879437L004327K391234
38563a195180J258326Q3896q17913j488561k029599k289782k054192j444216q53419
38554a0830640m68979j08416L84400Q09622Q52965N42418K92368N00373J172552
38545f853337J925073K311744K182102J762171J402959J297191J448131J749117
$$ y = [-5398715, -4171070, -2970536, -1895430, -1018754, -384668, 42403, 378235, 650578, 636544, 18937, -1213865, -2616505, -3636486, -4089227, -4232383, -4417416, -4749989, -5076869, -5200365, -5023324, -4500560, -3563703, -2232273, -819019, 128718, 255677, -258019, -923365, -1534175, -2409540, -3998072, -6341994, -8989709, -11340871, -13001151, -13897057, -14195142, -14125760, -13789196, -13060261, -11677264, -9470178, -6590741, -3586414, -1195180, 63146, 147042, -670871, -2159432, -4189031, -6478813, -8533005, -9977221, -10830640, -11299619, -11408035, -11023635, -10214013, -9361048, -8818630, -8526262, -8025889, -6853337, -4928264, -2616520, -434418, 1327753, 2730712, 4027903, 5476034, 7225151]
38537G225151J917654J496166K79933j193809j941393j561976p58704n64012j181979
38528C717031j883699j960625j436394q00883l89302k28973k82886n55592r65549
38519d786872j295875j339352j044163n20692L5605M29725N44804L83865M9530
38510g543425l02611n05646m54707k02273O0134J94594K78031M95052Q81981J276784
38500e822086J524792J587192J376676O60170o57148k182209l183829l191137
38492i887579k372332j302934m63380J4445K51213L90056M36483L05806O3258
38483a2564964K5764M20389R53957J020630M76164o5742N4112P46432J379984
38474g553274J595188J527953J320403Q82323K35553l08265n16982m97925m02533
$$ y = [7225151, 9142805, 10638971, 10918904, 9725095, 7783702, 6221726, 5463022, 4899010, 3717031, 1833332, -127293, -1563687, -2364570, -2753872, -2982845, -3265731, -3821323, -4786872, -6082747, -7422099, -8466262, -8986954, -8951349, -8521624, -7976820, -7592955, -7543425, -7846036, -8351682, -8806389, -9008662, -8948528, -8753934, -8475903, -7980851, -7098870, -5822086, -4297294, -2710102, -1333426, -673256, -1330404, -3512613, -6696442, -9887579, -12259911, -13562845, -14026225, -14011780, -13760567, -13370511, -12934028, -12628222, -12564964, -12539200, -12118811, -11164854, -10144224, -9668060, -9733802, -9679690, -8933258, -7553274, -5958086, -4430133, -3109730, -2227407, -1991854, -2300119, -2817101, -3315026, -3717559]
38465c717559j56195K78199O34382O76547O34398R32611J538819J948321J873894
38456D643417J626377J660734J993070K280162K314761K174642J905924J315728
38448A9914815K16893j223524k519882l250620l335429k959764k349491j669204
38440B823794j035214n12733j20271J01500P1131k12491n87584q56519r38671
38431a267058q16768m55228N6197L97066L32640J00154J56538M91327N46636k389
38421d60885p02160q38353l00473L56918N82553K80830k96848q02351r49302o92481
38411c822552k95680n3596L6417J60271L23384L54043K42062J83491K37652K11720
38401b422788r874k62322l72335m37936o58025j001672j207295j052814n33876
$$ y = [-3717559, -3873754, -3595555, -2961173, -2284626, -1650228, -717617, 821202, 2769523, 4643417, 6269794, 7930528, 9923598, 12203760, 14518521, 16693163, 18599087, 19914815, 20131708, 18908184, 16388302, 13137682, 9802253, 6842489, 4492998, 2823794, 1788580, 1275847, 1155576, 1257076, 1328207, 1115716, 528132, -328387, -1267058, -2083826, -2539054, -2482857, -2085791, -1753151, -1652997, -1496459, -1005132, -458496, -460885, -1163045, -2001398, -2301871, -1944953, -1362400, -1081570, -1378418, -2180769, -3130071, -3822552, -4118232, -4171828, -4135411, -3975140, -3651756, -3297713, -3055651, -2872160, -2634508, -2422788, -2432662, -2694984, -3067319, -3505255, -4163280, -5164952, -6372247, -7425061, -7958937]
38392g958937J50829P11692R42248Q52191N75622J61965l88210q71437r20829
38383f744866m47579J64590N24398P42106J211310J963087K531191K486792J866293
$$ y = [-7958937, -7808108, -7096416, -6154168, -5301977, -4726355, -4564390, -4952600, -5824037, -6744866, -7192445, -7027855, -6503457, -5761351, -4550041, -2586954, -55763, 2431029, 4297322]
$$ [...]
##END NTUPLES=NMR SPECTRUM
##END=
