##TITLE=31Pdec_LR-775-RM1
 
  24 sc
 31.10.2023
##JCAMPDX= 6.0         $$ Bruker NMR JCAMP-DX V2.0
##DATA TYPE= NMR SPECTRUM
##DATA CLASS= NTUPLES
##ORIGIN= UXNMR, Bruker Analytische Messtechnik GmbH
##OWNER= root
$$ XWIN-NMR		Version 3.5
$$ Tue Oct 31 13:53:06 2023 Russian Standard Time (UT+4h)  she@DPX200
##.OBSERVE FREQUENCY= 81.013821
##.OBSERVE NUCLEUS= ^31P
##.ACQUISITION MODE= SIMULTANEOUS
##.ACQUISITION SCHEME= undefined
##.AVERAGES= 24
##.DIGITISER RES= 16
##SPECTROMETER/DATA SYSTEM= spect
##.PULSE SEQUENCE= zgpg30
##.SOLVENT NAME= CDCl3
##.SHIFT REFERENCE= (INTERNAL, CDCl3, 0, 248.564)
##AUDIT TRAIL= $$ (NUMBER, WHEN, WHO, WHERE, WHAT)
$$ ##TITLE= Audit trail, XWIN-NMR		Version 3.5
$$ ##JCAMPDX= 5.01
$$ ##ORIGIN= Bruker BioSpin GmbH
$$ ##OWNER= she
$$ F:/spectra/data/she/nmr/P31/1/pdata/1/auditp.txt
$$ ##AUDIT TRAIL=  $$ (NUMBER, WHEN, WHO, WHERE, WHAT)
(   1,<2023-10-31 13:51:52.06 +0400>,<she>,<DPX200>,
      <created by zg, POWCHK disabled, PULCHK disabled
       configuration hash MD5:
       00 E9 B6 7A A2 85 ED C7 34 08 36 98 17 FE 4E 26
       data hash MD5: 32K
       77 58 FF 39 D1 E2 DF 24 72 75 C7 7A C6 3D 84 DB>)
(   2,<2023-10-31 13:52:07.37 +0400>,<she>,<DPX200>,
      <Start of raw data processing
       efp BC_mod = 2 LB = 5 FT_mod = 6 PKNL = 1 PHC0 = -10703.09 PHC1 = 206.89 SI = 64K 
       data hash MD5: 64K
       06 73 CB C0 6D AA 4A E1 10 7A 9A 0F 54 9D C2 53>)
(   3,<2023-10-31 13:52:17.82 +0400>,<she>,<DPX200>,
      <pk PHC0 = -15.6246 PHC1 = 0 
       data hash MD5: 64K
       45 F0 91 74 3E E6 80 7D 81 BB 79 C1 57 82 75 6F>)
(   4,<2023-10-31 13:52:20.76 +0400>,<she>,<DPX200>,
      <abs ABSG = 5 
       data hash MD5: 64K
       76 6D C5 8E F5 BA 9D D9 C4 62 6C 91 61 AB 06 08>)
(   5,<2023-10-31 13:52:32.64 +0400>,<she>,<DPX200>,
      <pk PHC0 = 3.400141 PHC1 = 0 
       data hash MD5: 64K
       9A 90 1E 35 44 D0 B7 6B C7 36 60 10 44 08 A9 C0>)
$$ ##END=
$$ 
$$ hash MD5
$$ 01 35 90 C2 FB AD C9 F4 1C AE B7 FB 82 E0 C5 75
##$RELAX= 
##$RELAX= 
##$RELAX= 
##$RELAX= 
##$RELAX= 
##$RELAX= 
##$RELAX= 
##$RELAX= 
##$RELAX= 
$$ Bruker specific parameters
$$ --------------------------
##$DU= <F:/spectra>
##$EXPNO= 1
##$NAME= <P31>
##$PROCNO= 1
##$TYPE= <nmr>
##$USER= <she>
##$AMP= (0..31)
100 100 100 100 100 100 100 100 100 100 100 100 100 100 100 100 100 100 
100 100 100 100 100 100 100 100 100 100 100 100 100 100 
##$AQSEQ= 0
##$AQ_mod= 1
##$AUNM= <au_zg>
##$AUTOPOS= <>
##$BF1= 81.014009
##$BF2= 200.13
##$BF3= 200.13
##$BF4= 200.13
##$BF5= 200.13
##$BF6= 200.13
##$BF7= 200.13
##$BF8= 200.13
##$BYTORDA= 1
##$CFDGTYP= 0
##$CFRGTYP= 5
##$CHEMSTR= <none>
##$CNST= (0..31)
1 1 145 1 1 1 1 1 1 1 1 1 1 1 1 1 1 1 1 1 1 1 1 1 1 1 1 1 1 1 1 1 
##$CPDPRG= <waltz16>
##$CPDPRG1= <>
##$CPDPRG2= <waltz16>
##$CPDPRG3= <>
##$CPDPRG4= <mlev>
##$CPDPRG5= <mlev>
##$CPDPRG6= <mlev>
##$CPDPRG7= <mlev>
##$CPDPRG8= <mlev>
##$CPDPRGB= <>
##$CPDPRGT= <>
##$D= (0..31)
0 1 0 0 0 0 0 0 0 0 0 0.03 2e-05 3e-06 0 0 0 0 0 0 0 0 0 0 0 0 0 0 0 0 
$$ [...]
##$SUBNAM3= <"">
##$SUBNAM4= <"">
##$SUBNAM5= <"">
##$SUBNAM6= <"">
##$SUBNAM7= <"">
##$SUBNAM8= <"">
##$SUBNAM9= <"">
##$SW= 501.771253377433
##$SWIBOX= (0..15)
0 1 3 0 0 0 0 0 0 0 0 0 0 0 0 0 
##$SW_h= 40650.406504065
##$TD= 32768
##$TD0= 1
##$TE= 0
##$TE2= 300
##$TE3= 300
##$TEG= 300
##$TL= (0..7)
0 120 53 12 22 120 120 120 
##$TP= (0..7)
150 150 150 150 150 150 150 150 
##$TP07= 0
##$TPNAME0= <>
##$TPNAME1= <>
##$TPNAME2= <>
##$TPNAME3= <>
##$TPNAME4= <>
##$TPNAME5= <>
##$TPNAME6= <>
##$TPNAME7= <>
##$TPOAL= (0..7)
0.5 0.5 0.5 0.5 0.5 0.5 0.5 0.5 
##$TPOFFS= (0..7)
0 0 0 0 0 0 0 0 
##$TUNHIN= 0
##$TUNHOUT= 0
##$TUNXOUT= 0
##$USERA1= <user>
##$USERA2= <user>
##$USERA3= <user>
##$USERA4= <user>
##$USERA5= <user>
##$V9= 5
##$VALIST= <valist>
##$VCLIST= <CCCCCCCCCCCCCCC>
##$VD= 0
##$VDLIST= <DDDDDDDDDDDDDDD>
##$VPLIST= <PPPPPPPPPPPPPPP>
##$VTLIST= <TTTTTTTTTTTTTTT>
##$WBST= 1024
##$WBSW= 4
##$XGAIN= (0..3)
0 0 0 0 
##$XL= 0
##$YL= 0
##$YMAX_a= 18760
##$YMIN_a= -20831
##$ZGOPTNS= <>
##$ZL1= 120
##$ZL2= 120
##$ZL3= 120
##$ZL4= 120
##$ABSF1= 248.5645
##$ABSF2= -253.2056
##$ABSG= 5
##$ABSL= 3
##$ALPHA= 0
##$AQORDER= 0
##$ASSFAC= 0
##$ASSFACI= 0
##$ASSFACX= 0
##$ASSWID= 0
##$AUNMP= <proc_1d>
##$AZFE= 0.1
##$AZFW= 0.5
##$BCFW= 0
##$BC_mod= 2
##$BYTORDP= 0
##$COROFFS= 0
##$CY= -3
##$DATMOD= 1
##$DC= 0
##$DFILT= <>
##$DTYPP= 0
##$F1P= 0
##$F2P= 0
##$FCOR= 1
##$FTSIZE= 65536
##$FT_mod= 6
##$GAMMA= 0
##$GB= 0
##$INTBC= 1
##$INTSCL= 6.047779e-11
##$ISEN= 30
##$LB= 5
##$LEV0= 0
##$LPBIN= 0
##$MAXI= 10000
##$MC2= 0
##$MEAN= 0
##$ME_mod= 0
##$MI= 50
##$NCOEF= 0
##$NC_proc= -6
##$NLEV= 6
##$NOISF1= 182.463
##$NOISF2= 159.3651
##$NSP= 0
##$NTH_PI= 0
##$NZP= 0
##$OFFSET= 248.5645
##$PC= 4
##$PHC0= -10715.31
##$PHC1= 206.89
##$PH_mod= 1
##$PKNL= yes
##$PPARMOD= 0
##$PSCAL= 0
##$PSIGN= 0
##$REVERSE= no
##$SF= 81.0140089999694
##$SI= 65536
##$SIGF1= 159.3651
##$SIGF2= -187.1042
##$SINO= 113.3802
##$SIOLD= 16384
##$SREGLST= <1H.CDCl3>
##$SSB= 0
##$STSI= 65536
##$STSR= 0
##$SW_p= 40650.406504065
##$SYMM= 0
##$S_DEV= 0
##$TDeff= 32768
##$TDoff= 0
##$TI= <>
##$TILT= no
##$TM1= 0
##$TM2= 0
##$TOPLEV= 0
##$USERP1= <user>
##$USERP2= <user>
##$USERP3= <user>
##$USERP4= <user>
##$USERP5= <user>
##$WDW= 1
##$XDIM= 65536
##$YMAX_p= 537457811
##$YMIN_p= -15883140
$$ End of Bruker specific parameters
$$ ---------------------------------
##NTUPLES= NMR SPECTRUM
##VAR_NAME=  FREQUENCY,     SPECTRUM/REAL,   SPECTRUM/IMAG
##SYMBOL=    X,             R,               I
##VAR_TYPE=  INDEPENDENT,   DEPENDENT,       DEPENDENT
##VAR_FORM=  AFFN,          ASDF,            ASDF
##VAR_DIM=   65536,         65536,           65536
##UNITS=     HZ,            ARBITRARY UNITS, ARBITRARY UNITS
##FACTOR=    0.620285442955139, 1,           1
##FIRST=     20137.2065510682, 0,            0
##LAST=      -20513.1999529968, 0,           0
##MIN=       -20513.1999529968, -15883140,   0
##MAX=       20137.2065510682, 537457811,    0
$$ Real data points
##PAGE= N=1
##DATA TABLE= (X++(R..R)), XYDATA
$$ [...]
$$ plain form
43421 682695 709105 695254 638340 529262 363075 144295 -116641 -399248 -662428 -853217
43411 -853217 -941427 -945575 -916307 -891413 -869597 -827224 -753755 -663997 -575410 -481357 -357460
43400 -357460 -197608 -34765 84960 148126 184278 229571 291646 355536 408695 441667 430419
43389 430419 345132 190835 25557 -80606 -104609 -81201 -61183 -71921 -114203 -176483 -242160
43378 -242160 -295549 -333918 -369280 -409497 -441765 -443496 -406793 -345322 -282538 -243235 -249238 -300419
43366 -300419 -350272 -317783 -148624 126547 400728 564979 581648 496177 389545 320364
43356 320364 300134 307657 319057 327167 340683 370648 417128 464141 484681 454625 370743 261601
43344 261601 178080 162532 217440 301778 360622 361309 305501 215292 115623 27696 -32052 -55707
$$ packed form
43421F82695K6410j3851n6914j09078j66187k18780k60936k82607k63180j90789
43411h53217q8210m148K9268K4894K1816M2373P3469Q9758Q8587R4053J23897
43400c57460J59852J62843J19725O3166L6152M5293O2075O3890N3159L2972j1248
43389D30419q5287j54297j65278j06163k4003K3408K0018j0738m2282o2280o5677
43378b42160n3389l8369l5362m0217l2268j731L6703O1471O2784L9303o003n1181
43366c00419m9853L2489J69159K75171K74181J64251J6669q5471j06632o9181
43356C20364k0230P523J1400Q110J3516K9965M6480M7013K0540l0056q3882j09142
43344B61601q3521j5548N4908Q4338N8844O87n5808r0209r9669q7927n9748k3655
$$ plain form
43332 -55707 -48094 -26612 -17155 -46339 -128840 -256555 -401598 -532919 -631443 -693615 -727940
43321 -727940 -749661 -771972 -798511 -828417 -869509 -937622 -1036836 -1146636 -1235779 -1285595 -1296174
43310 -1296174 -1278404 -1248805 -1223591 -1201847 -1155111 -1048589 -878748 -682745 -508663 -384105
43300 -384105 -313165 -288256 -293635 -305031 -299680 -270332 -227105 -187647 -167823 -176796 -213349 -265515
43288 -265515 -316494 -351880 -362895 -348569 -318491 -288736 -268396 -250668 -221401 -175471 -121174
43277 -121174 -71557 -39096 -38429 -82524 -166496 -259797 -326397 -356452 -370934 -391340 -413269 -418264
43265 -418264 -404190 -388179 -379183 -365625 -340166 -321605 -332655 -359941 -355783 -285634 -162104 -28347
43253 -28347 78138 137068 137369 81391 1035 -45938 -10507 111854 278117 428471 524133
$$ packed form
43332e5707P613K1482R457k9184q2501j27715j45043j31321r8524o2172l4325
43321g27940k1721k2311k6539k9906m1092o8113r9214j09800q9143m9816j0579
43310a296174J7770K9599K5214K1744M6736J06522J69841J96003J74082J24558
43300c84105P0940K4909n379j1396N351K9348M3227L9458J9824q973l6553n2166
43288b65515n0979l5386j1015J4326L0078K9755K0340J7728K9267M5930N4297
43277a21174M9617L2461O67m4095q3972r3301o6600l0055j4482k0406k1929m995
43265d18264J4074J6011Q996J3558K5459J8561j1050k7286M158P0149J23530J33757
43253b8347J06485N8930L01n5978q0356m6973L5431J22361J66263J50354R5662
$$ plain form
43242 524133 566145 587179 625289 696319 780987 835060 817364 716200 553245 364079 178233
43231 178233 18393 -90726 -127442 -92143 -14045 67795 128110 157685 149583 94858 -4901
43220 -4901 -127541 -239179 -313448 -341665 -328869 -287052 -233703 -190410 -175475 -197210 -257263
43209 -257263 -357732 -497483 -660691 -817503 -940760 -1016749 -1038629 -1003918 -931159 -867642
43199 -867642 -856872 -893532 -926082 -910126 -847449 -769775 -704074 -667575 -678536 -743709 -834133
43188 -834133 -893748 -880194 -788651 -637452 -449388 -255791 -101151 -21853 -18949 -61691 -117699
43177 -117699 -172865 -226186 -279737 -338866 -412294 -502184 -594935 -664804 -684188 -630259 -491513
43166 -491513 -278895 -29703 208756 404299 549339 651303 722852 780616 841097 909399
$$ packed form
43242E24133M2012K1034L8110P1030Q4668N4073j7696j01164j62955j89166j85846
43231A78233j59840j09119l6716L5299P8098Q1840O0315K9575q102n4725r9759
43220d901j22640j11638p4269k8217J2796M1817N3349M3293J4935k1735o0053
43209b57263j00469j39751j63208j56812j23257p5989k1880L4711P2759O3517
43199h67642J0770l6660l2550J5956O2677P7674O5701L6499j0961o5173r0424
43188h34133n9615J3554R1543J51199J88064J93597J54640P9298K904m2742n6008
43177a17699n5166n3321n3551n9129p3428q9890r2751o9869j9384N3929J38746
43166d91513K12618K49192K38459J95543J45040J01964P1549N7764O0481O8302
$$ plain form
43156 909399 975185 1022839 1039841 1012271 923123 769254 580390 411329 309403 287715 323375
43145 323375 374019 400411 387197 349325 314803 297781 289669 274675 248581 222752 215641 239505
43133 239505 286710 326544 323458 263376 158113 24089 -131934 -298908 -443275 -520126 -505859
43122 -505859 -413357 -272574 -101509 98082 315869 509144 613976 590443 459833 294150
43112 294150 168102 120999 154048 245386 362159 473482 566813 648986 724484 779108 794209
43101 794209 771464 732621 697045 667836 635740 586721 512143 428276 383914 426024 545242
43090 545242 667309 712147 658944 549982 443036 371783 341302 338702 341548 329364 297439
43079 297439 256296 214325 166380 104439 35549 -16434 -26910 12559 89146 176900 253720
$$ packed form
43156I09399O5786M7654J7002k7570q9148j53869j88864j69061j01926k1688L5660
43145C23375N0644K6392j3214l7872l4522j7022q112j4994k6094k5829p111K3864
43133B39505M7205L9834l086o0082j05263j34024j56023j66974j44367p6851J4267
43122e05859R2502J40783J71065J99591K17787J93275J04832k3533j30610j65683
43112B94150j26048m7103L3049R1338J16773J11323R3331Q2173P5498N4624J5101
43101G94209k2745l8843l5576k9209l2096m9019p4578q3867m4362M2110J19218
43090E45242J22067M4838n3203j08962j06946p1253l0481k600K846j2184l1925
43079B97439m1143m1971m7945o1941o8890n1983j0476L9469P6587Q7754P6820
$$ plain form
43068 253720 316240 378477 454184 543273 637570 732153 820352 880344 882284 817353 711803
43057 711803 602548 501681 392032 254839 94404 -62314 -182701 -247893 -268226 -284297
43047 -284297 -342802 -459906 -605869 -726788 -781276 -760161 -681394 -573666 -462010 -360894
43037 -360894 -274978 -202599 -136846 -67888 7629 79234 133084 173268 224466 305616 403754
43026 403754 479400 496125 442740 333895 198687 67757 -37421 -108003 -141977 -138812 -103298
43015 -103298 -49664 7147 65178 133463 212867 282494 308585 266811 156966 213 -174578
43004 -174578 -342248 -483428 -583371 -638127 -664783 -698027 -767038 -873767 -995912 -1108153
42994 -1108153 -1195565 -1249002 -1256922 -1208076 -1103313 -965535 -836805 -756483 -730909 -723168 -680008
$$ packed form
43068B53720O2520O2237P5707Q9089R4297R4583Q8199N9992J940o4931j05550
43057G11803j09255j00867j09649j37193j60435j56718j20387o5192k0333j6071
43047b84297n8505j17104j45963j20919n4488K1115P8767J07728J11656J01116
43037c60894Q5916P2379O5753O8958P5517P1605N3850M0184N1198Q1150R8138
43026D03754P5646J6725n3385j08845j35208j30930j05178p0582l3974L165L5514
43015a03298N3634N6811N8031O8285P9404O9627K6091m1774j09845j56753j74791
43004a74578j67670j41180r9943n4756k6656l3244o9011j06729j22145j12241
42994a108153q7412n3437p920M8846J04763J37778J28730Q0322K5574P741M3160
$$ plain form
42983 -680008 -572927 -412932 -231806 -60502 74914 153260 167943 132862 70311 -3788
42973 -3788 -76236 -125657 -131610 -98902 -62208 -59195 -104219 -192297 -318734 -481674 -667417 -847309
42961 -847309 -995956 -1106379 -1182726 -1224784 -1227249 -1190990 -1127253 -1050864 -974367 -907185 -854015
42950 -854015 -814802 -793894 -808780 -877818 -991691 -1104305 -1163348 -1151794 -1095992 -1035165 -987917
42939 -987917 -945950 -891799 -819436 -742718 -688243 -677588 -711299 -768084 -820407 -851923 -861214 -852530
42927 -852530 -828189 -791098 -747614 -698978 -631009 -523537 -376387 -218795 -86496 2751 42694
42916 42694 21352 -66237 -188698 -287773 -330626 -336846 -340469 -342191 -321073 -283336 -270387 -311683
42904 -311683 -388558 -454493 -478105 -455258 -388321 -269590 -89883 139927 378380 567340
$$ packed form
42983f80008J07081J59995J81126J71304J35416P8346J4683l5081o2551p4099
42973c788p2448m9421n953L2708L6694L013m5024q8078j26437j62940j85743j79892
42961h47309j48647j10423p6347m2058k465L6259O3737P6389P6497O7182N3170
42950h54015L9213K0908j4886o9038j13873j12614n9043J1554N5802O0827M7248
42939i87917M1967N4151P2363P6718N4475J0655l3711n6785n2323l1516r291Q684
42927h52530K4341L7091M3484M8636O7969J07472J47150J57592J32299Q9247L9943
42916D2694k1342q7589j22461r9075m2853o220l623j722K1118L7737J2949m1296
42904c11683p6875o5935k3612K2847O6937J18731J79707K29810K38453J88960
$$ plain form
42894 567340 662970 659195 584848 482129 387331 319886 273912 218898 122044 -21235 -181633
42883 -181633 -321085 -416058 -456060 -435898 -365087 -279628 -226383 -227149 -262924 -296579 -305431 -288201
42871 -288201 -248894 -187724 -112112 -48550 -34275 -94443 -225443 -392444 -537122 -597165 -538760
42860 -538760 -381038 -183616 -4793 124656 189753 174495 76063 -69553 -197081 -258024
42850 -258024 -254391 -226469 -213025 -223346 -239995 -243395 -233947 -229772 -243174 -265717 -281028 -284651
42838 -284651 -281715 -270559 -241796 -193019 -133478 -74600 -26802 -4354 -18814 -64541 -124358 -194942
42826 -194942 -293461 -429639 -579247 -693822 -733832 -692840 -600775 -508139 -453861 -437036 -424267
42815 -424267 -388952 -336544 -290805 -270989 -289423 -352527 -446138 -530134 -565926 -544945 -478040
$$ packed form
42894E67340R5630l775p4347j02719r4798o7445m5974n5014r6854j43279j60398
42883a81633j39452r4973m0002K0162P0811Q5459N3245p66l5775l3655q852J7230
42871b88201L9307O1170P5612O3562J4275o0168j31000j67001j44678o0043N8405
42860e38760J57722J97422J78823J29449O5097j5258r8432j45616j27528o0943
42850b58024L633K7922J3444j0321j6649l400R448M175j3402k2543j5311l623
42838b84651K936J1156K8763M8777N9541N8878M7798K2448j4460m5727n9817p0584
42826a94942r8519j36178j49608j14575m0010M0992R2065R2636N4278J6825J2769
42815d24267L5315N2408M5739J9816j8434o3104r3611q3996l5792K0981O6905
$$ plain form
42804 -478040 -368693 -218709 -53715 86177 189137 284341 399995 522093 606413 623079
42794 623079 581234 519268 480446 488925 533157 569172 548014 447991 287548 114075 -21129
42783 -21129 -89492 -98466 -79670 -62959 -64454 -95741 -169676 -287412 -428058 -563884 -684867
42772 -684867 -799479 -911493 -1003904 -1047185 -1018774 -916432 -762003 -596083 -462514 -390219
42762 -390219 -386431 -442825 -541142 -652210 -739540 -775084 -753636 -688342 -592418 -469963 -326065
42751 -326065 -180451 -64022 1175 18003 9941 1782 4735 18182 41411 78808 130766 180731
42739 180731 196564 152117 52743 -60351 -135272 -144338 -98502 -31074 29281 69392 82648
42728 82648 60809 1372 -81475 -163850 -234590 -305355 -392072 -487752 -559486 -573857 -522823 -426258
$$ packed form
42804d78040J09347J49984J64994J39892J02960R5204J15654J22098Q4320J6666
42794F23079m1845o1966l8822Q479M4232L6015k1158j00023j60443j73473j35204
42783b1129o8363q974J8796J6711j495l1287p3935j17736j40646j35826j20983
42772f84867j14612j12014r2411m3281K8411J02342J54429J65920J33569P2295
42762c90219L788n6394r8317j11068q7330l5544K1448O5294R5924J22455J43898
42751c26065J45614J16429O5197J6828q062q159K953J3447K3229L7397N1958M9965
42739A80731J5833m4447r9374j13094p4921r066M5836O7428O0355M0111J3256
42728H2648k1839n9437q2847q2375p0740p0765q6717r5680p1734j4371N1034R6565
$$ plain form
42716 -426258 -316140 -221294 -160643 -141110 -158830 -205589 -275651 -363470 -453253 -515138 -517979
42705 -517979 -448574 -318621 -156044 5870 134523 208336 233828 248468 292171 371031 456584
42694 456584 521578 562415 578662 547285 440506 268498 84003 -63463 -164794 -234324
42684 -234324 -267985 -232831 -96387 140904 437945 728946 952613 1081226 1128676 1126804
42674 1126804 1092176 1018302 897425 741839 582199 451120 369482 338736 337266 327194 274976
42663 274976 171115 29564 -130693 -298216 -462059 -600098 -685557 -708684 -685963 -642376
42653 -642376 -587050 -511054 -406839 -283811 -165168 -74349 -22599 -1493 12985 39016 66565
42642 66565 64424 16133 -58501 -126817 -182757 -251603 -357437 -498502 -656984 -820098 -981494
$$ packed form
42716d26258J10118R4846O0651J9533j7720m6759p0062q7819q9783o1885k841
42705e17979O9405J29953J62577J61914J28653P3813K5492J4640M3703P8860Q5553
42694D56584O4994M0837J6247l1377j06779j72008j84495j47466j01331o9530
42684b34324l3661L5154J36444K37291K97041K91001K23667J28613M7450j872
42674A126804l4628p3874j20877j55586j59640j31079q1638l0746j470j0072n2218
42663B74976j03861j41551j60257j67523j63843j38039q5459k3127K2721M3587
42653f42376N5326P5996J04215J23028J18643R0819N1750K1106J4478K6031K7549
42642F6565k141m8291p4634o8316n5940o8846j05834j41065j58482j63114j61396
$$ plain form
42631 -981494 -1127365 -1232531 -1274629 -1251227 -1184029 -1107813 -1051886 -1024092 -1005488 -959411 -853777
42620 -853777 -688160 -506751 -376863 -337510 -359440 -360460 -269579 -81232 149621 358493
42610 358493 514393 623002 704788 775852 838227 874599 853975 757188 605993 461805 386919
42599 386919 405394 501415 645443 808680 954303 1033780 1007369 867371 636162 347464
42589 347464 39811 -235921 -423567 -495354 -480905 -452134 -469082 -536884 -614016 -656969 -652054
42578 -652054 -610068 -546361 -474701 -410235 -362905 -327666 -291619 -251602 -215456 -186771 -162950
42567 -162950 -153506 -184937 -272979 -394965 -500763 -549720 -532242 -464798 -379111 -315763 -313039
42556 -313039 -390472 -539863 -727509 -902001 -1010152 -1023814 -959276 -865069 -785267 -732561 -689916
$$ packed form
42631i81494j45871j05166m2098K3402O7198P6216N5927K7794J8604M6077J05634
42620h53777J65617J81409J29888L9353k1930j020R0881J88347K30853K08872
42610C58493J55900J08609Q1786P1064O2375L6372k0624r6787j51195j44188p4886
42599C86919J8475R6021J44028J63237J45623P9477k6411j39998k31209k88698
42589C47464l07653k75732j87646p1787J4449K8771j6948o7802p7132m2953M915
42578f52054M1986O3707P1660O4466M7330L5239L6047M0017L6146K8685K3821
42567a62950R444l1431q8042j21986j05798m8957J7478O7444Q5687O3348K724
42556c13039p7433j49391j87646j74492j08151j3662O4538R4207P9802N2706M2645
$$ plain form
42545 -689916 -628978 -529127 -391627 -242179 -114849 -28564 21057 51073 79849 123168 188107
42534 188107 264377 329073 366131 376705 366664 330023 251152 120586 -55376 -256977 -457400
42523 -457400 -628625 -746337 -792620 -759362 -657632 -525281 -414336 -359123 -355981 -378458 -410485
42512 -410485 -460330 -545072 -668747 -816017 -961189 -1081250 -1164752 -1211142 -1219182 -1174377 -1052000
42501 -1052000 -838560 -551379 -233478 72075 339484 552560 692020 746162 735615 711942
42491 711942 719194 760940 811957 853588 884569 904132 905843 892823 880459 871793 842800 768417
42479 768417 659162 557813 498534 478979 473821 465386 454657 448176 444091 434949 421113 416679
42467 416679 442189 517679 666039 913668 1272898 1721743 2211418 2695158 3135429 3478317
$$ packed form
42545f89916O0938R9851J37500J49448J27330Q6285M9621L0016K8776M3319O4939
42534A88107P6270O4696L7058J0574j0041l6641p8871j30566j75962k01601k00423
42523d57400j71225j17712m6283L3258J01730J32351J10945N5213L142k2477l2027
42512d10485m9845q4742j23675j47270j45172j20061q3502m6390q040M4805J22377
42501a052000K13440K87181L17901L05553K67409K13076J39460N4142j0547k3673
42491G11942P252M1746N1017M1631L0981J9563J711j3020j2364q666k8993p4383
42479G68417j09255j01349n9279j9555n158q435j0729o481m085r142j3836m434
42467D16679K5510P5490J48360K47629L59230M48845M89675M83740M40271L42888
$$ plain form
42457 3478317 3644271 3573319 3283554 2870189 2441688 2062268 1748467 1495626 1292896 1126634
42447 1126634 991414 899894 867830 882950 897493 860852 758099 610949 444809 266980
42437 266980 81362 -89133 -213018 -283969 -328342 -370312 -400937 -395401 -354430 -309856 -284558
42426 -284558 -261153 -201653 -92270 41144 158750 235740 263663 236684 152868 30761 -89961
42415 -89961 -178794 -244000 -320751 -427793 -546576 -647323 -722067 -779674 -818487 -823344 -789376
42404 -789376 -730395 -657450 -563918 -442385 -305374 -175186 -57319 62791 195792 331570
42394 331570 450226 542996 616498 678445 724281 740787 722752 683481 645757 622908 612005
42383 612005 604048 592846 570489 522193 435426 313594 174021 30994 -115892 -276162 -452660
$$ packed form
42457C478317J65954p0952k89765m13365m28501l79420l13801k52841k02730j66262
42447A126634j35220r1520l2064J5120J4543l6641j02753j47150j66140j77829
42437B66980j85618j70495j23885p0951m4373m1970l0625N536M0971M4574K5298
42426b84558K3405N9500J09383J33414J17606P6990K7923k6979q3816j22107j20722
42415h9961q8833o5206p6751j07042j18783j00747p4744n7607l8813m857L3968
42404g89376N8981P2945R3532J21533J37011J30188J17867J20110J33001J35778
42394C31570J18656R2770P3502O1947M5836J6506j8035l9271l7724k2849j0903
42383F12005p957j1202k2357m8296q6767j21832j39573j43027j46886j60270j76498
$$ plain form
42372 -452660 -629277 -773192 -855549 -876487 -866937 -860079 -864557 -871077 -875948 -881236 -872414 -815560
42360 -815560 -688098 -503604 -299375 -109851 39879 129208 151339 126466 89461 59907
42350 59907 32527 -3171 -45415 -85098 -117470 -144332 -173250 -218381 -291216 -382018 -458306 -493223
42338 -493223 -494357 -498041 -536551 -613791 -705131 -770004 -768323 -681337 -527846 -358806 -231392
42327 -231392 -184358 -229524 -354373 -528242 -713357 -878395 -1003855 -1077334 -1092297 -1057069
42317 -1057069 -998342 -944111 -900134 -849083 -774571 -678302 -567720 -434537 -260392 -48300
42307 -48300 162360 323308 417795 466158 494369 510151 514992 527675 580717 690271 834158
42296 834158 960314 1014996 968278 824956 619906 401964 214606 83060 12129 -7419
$$ packed form
42372d52660j76617j43915q2357k0938R550O858m478o520m871n288Q822N6854
42360h15560J27462J84494K04229J89524J49730Q9329K2131k4873l7005k9554
42350E9907k7380l5698m2244l9683l2372k6862k8918m5131p2835r0802p6288l4917
42338d93223j134l684l8510p7240r1340o4873J681Q6986J53491J69040J27414
42327b31392M7034m5166j24849j73869j85115j65038j25460p3479j4963L5228
42317a057069N8727N4231M3977N1051P4512R6269J10582J33183J74145K12092
42307d8300K10660J60948R4487M8363K8211J5782M841J2683N3042J09554J43887
42296H34158J26156N4682m6718j43322k05050k17942j87358j31546p0931j9548
$$ plain form
42286 -7419 11645 61483 139096 238034 342343 431815 494460 533965 565931 606466 660595 717793
42274 717793 758216 764034 724984 636509 500392 331665 160431 20690 -63092 -78806 -24455
42263 -24455 87352 224080 342179 407759 409939 358530 275604 188905 124294 96771 107728
42252 107728 151019 219247 302792 385508 446146 468092 450029 406249 354019 300906 246100
42241 246100 189780 133066 70804 -2081 -72277 -109903 -100237 -65056 -41057 -45679 -77678 -140643
42229 -140643 -241962 -368351 -485694 -572337 -637298 -697438 -750139 -777135 -763036 -701400 -595284
42218 -595284 -463614 -337300 -236617 -158577 -95617 -57359 -61326 -109698 -189473 -289920 -403059
42207 -403059 -507886 -572060 -577816 -538704 -484432 -431491 -370268 -279557 -154169 -17068 103192
$$ packed form
42286g419J9064M9838P7613R8938J04309Q9472O2645L9505L1966M0535N4129N7198
42274G17793M0423N818l9050q8475j36117j68727j71234j39741q3782j5714N4351
42263b4455J11807J36728J18099O5580K180n1409q2926q6699o4611k7523J0957
42252A07728M3291O8228Q3545Q2716O0638K1946j8063m3780n2230n3113n4806
42241B46100n6320n6714o2262p2885p0196l7626R666L5181K3999m622l1999o2965
42229a40643j01319j26389j17343q6643o4961o0140n2701k6996J4099O1636J06116
42218e95284J31670J26314J00683P8040O2960L8258l967m8372p9775j00447j13139
42207d03059j04827o4174n756L9112N4272N2941O1223R0711J25388J37101J20260
$$ plain form
42196 103192 208922 333742 494268 650635 734105 714855 628339 533397 459504 400528 344924
42185 344924 297386 272988 277771 295522 292915 243275 151139 53539 -4736 101 57885 129595
42173 129595 166518 137683 49122 -62902 -158406 -213742 -223012 -192455 -135972 -65263 23365
42162 23365 146528 309721 486858 629622 699707 693343 638271 569336 504630 441105 369318
42151 369318 287214 197370 97746 -14888 -132711 -236773 -312078 -358608 -389180 -424369 -488077
42140 -488077 -594431 -731506 -864565 -960240 -1002282 -983819 -899838 -759827 -599243 -462045
42130 -462045 -368499 -304992 -242136 -155859 -35766 113475 273789 422247 542669 630253
42120 630253 689196 728340 751802 745290 677482 528982 322407 114610 -43151 -130975 -151235
$$ packed form
42196A03192J05730J24820J60526J56367Q3470j9250q6516r4942p3893n8976n5604
42185C44924m7538k4398M783J7751k607m9640r2136r7600n8275M837N7784P1710
42173A29595L6923k8835q8561j12024r5504n5336r270L0557N6483P0709Q8628
42162B3365J23163J63193J77137J42764P0085o364n5072o8935o4706o3525p1787
42151C69318q2104q9844r9624j12634j17823j04062p5305m6530l0572l5189o3708
42140d88077j06354j37075j33059r5675m2042J8463Q3981J40011J60584J37198
42130d62045R3546O3507O2856Q6277J20093J49241J60314J48458J20422Q7584
42120F30253N8943L9144K3462o512o7808j48500k06575k07797j57761q7824k0260
$$ plain form
42109 -151235 -113139 -35556 49359 112723 147813 163974 167953 164926 174867 227939 332211 453366
42097 453366 535075 536809 450303 291339 88752 -123356 -319446 -495192 -658957 -806825
42087 -806825 -913836 -956650 -941121 -902139 -877582 -882401 -899490 -888615 -811110 -659692 -468635
42076 -468635 -289039 -149700 -40765 68977 203169 359913 510447 613849 642804 600870
42066 600870 511599 391262 240251 62858 -115880 -262535 -360476 -415551 -438756 -429071 -372951
42055 -372951 -258368 -92389 92159 251966 360695 420473 446278 446961 425712 387594 333618
42044 333618 254212 145517 31206 -50360 -86412 -100637 -113226 -105146 -41505 74206 188790
42033 188790 247195 240014 198899 157247 126335 104131 93075 102101 133352 170780 184722 151094
$$ packed form
42109a51235L8096P7583Q4915O3364L5090J6161L979l027R941N3072J04272J21155
42097D53366Q1709J734q6506j58964k02587k12108j96090j75746j63765j47868
42087h06825j07011m2814J5529L8982K4557m819j7089J0875P7505J51418J91057
42076d68635J79596J39339J08935J09742J34192J56744J50534J03402K8955m1934
42066F00870q9271j20337j51011j77393j78738j46655r7941n5075k3205R685N6120
42055c72951J14583J65979J84548J59807J08729N9778K5805O83k1249l8118n3976
42044C33618p9406j08695j14311q1566l6052j4225j2589Q080O3641J15711J14584
42033A88790N8405p181m1115m1652l0912k2204j1056R026L1251L7428J3942l3628
$$ plain form
42021 151094 68246 -45976 -173968 -311961 -462106 -615338 -748287 -837747 -874760 -864648
42011 -864648 -818092 -744942 -654165 -555557 -458816 -369121 -283811 -197291 -112451 -43472 -473
42000 -473 27341 64261 119785 173049 188758 144317 40764 -102360 -255009 -388731 -495716
41989 -495716 -596113 -715386 -850974 -967567 -1025910 -1009665 -925772 -792054 -631783 -471538
41979 -471538 -332895 -225091 -148940 -105962 -100471 -134207 -200196 -279665 -346374 -381595 -388218
41968 -388218 -383568 -373140 -336529 -245439 -92788 99669 297235 469965 601426 692577 759135
41957 759135 816552 861862 873058 832128 753951 695699 734123 922494 1260987 1707924 2217417
41946 2217417 2759331 3306947 3827039 4296972 4717201 5083346 5348403 5436113 5301565 4968739
$$ packed form
42021A51094q2848j14222j27992j37993j50145j53232j32949q9460l7013J0112
42011h64648M6556P3150R0777R8608R6741Q9695Q5310Q6520Q4840O8979M2999
42000d73K7814L6920N5524N3264J5709m4441j03553j43124j52649j33722j06985
41989d95716j00397j19273j35588j16593n8343J6245Q3893J33718J60271J60245
41979d71538J38643J07804P6151M2978N491l3736o5989p9469o6709l5221o623
41968c88218M650J0428L6611R1090J52651J92457J97566J72730J31461R1151O6558
41957G59135N7417M5310J1196m0930p8177n8252L8424J88371L38493M46937N09493
41946B217417N41914N47616N20092M69933M20229L66145K65057Q7710j34548l32826
$$ plain form
41936 4968739 4506910 3985267 3454107 2948537 2489217 2080444 1715546 1381426 1057545
41927 1057545 725933 395419 107662 -94018 -197183 -213776 -155154 -35275 106118 210310
41917 210310 240290 201283 115697 -4773 -150856 -296153 -407475 -473492 -510167 -538517 -567379
41906 -567379 -595348 -614655 -608417 -556412 -454740 -327643 -213674 -139530 -107318 -100610 -94907
41895 -94907 -62936 19760 161463 338048 490103 545452 458657 239756 -50459 -332624
41885 -332624 -541614 -643238 -639804 -570104 -494289 -459230 -468626 -489615 -490213 -464066 -417322 -346098
41873 -346098 -245175 -137848 -77061 -102346 -199955 -314064 -393069 -418123 -396447 -347668 -301423
41862 -301423 -290155 -327211 -393768 -455282 -488765 -489790 -460941 -406191 -336233 -268652 -218872 -194678
$$ packed form
41936D968739m61829n21643n31160n05570m59320m08773l64898l34120l23881
41927A057545l31612l30514k87757k01680j03165j6593N8622J19879J41393J04192
41917B10310K9980l9007q5586j20470j46083j45297j11322o6017l6675k8350k8862
41906e67379k7969j9307O238N2005J01672J27097J13969P4144L2212O708N703
41895i4907L1971Q2696J41703J76585J52055N5349q6795k18901k90215k82165
41885c32624k08990j01624L434O9700P5815L5059r396k0989n98K6147M6744P1224
41873c46098J00923J07327O0787k5285r7609j14109p9005k5054K1676M8779M6245
41862c01423J1268l7056o6557o1514l3483j025K8849N4750O9958O7581M9780K4194
$$ plain form
41850 -194678 -197127 -218696 -242307 -254920 -266525 -304496 -379417 -460971 -495192 -444255 -307275
41839 -307275 -110251 113788 334966 525378 654574 693492 634710 514366 402387 353228
41829 353228 361338 371266 333217 245662 149044 89201 86251 124183 162095 163511 124894 74822
41817 74822 41632 25071 2486 -43572 -111359 -190375 -277418 -380360 -508997 -661333 -814960
41806 -814960 -932938 -984384 -964470 -895737 -809279 -721202 -621887 -487110 -305561 -100439 79812
41795 79812 199045 263211 311791 382859 488878 618416 747840 848990 897838 887788 835025
41784 835025 766262 700670 644307 596995 556831 517441 469890 417446 389064 427501 550848
41773 550848 722412 866971 925984 898193 825701 747899 677610 615558 567827 538411 515555
$$ packed form
41850a94678k449k1569k3611j2613j1605l7971p4921q1554l4221N0937J36980
41839c07275J97024K24039K21178J90412J29196L8918n8782j20344j11979m9159
41829C53228Q110R928l8049q7555r6618n9843k950L7932L7912J416l8617n0072
41817G4822l3190j6561k2585m6058o7787p9016q7043j02942j28637j52336j53627
41806h14960j17978n1446J9914O8733Q6458Q8077R9315J34777J81549K05122J80251
41795G9812J19233O4166M8580P1068J06019J29538J29424J01150M8848j0050n2763
41784H35025o8763o5592n6363m7312m0164l9390m7551n2444k8382L8437J23347
41773E50848J71564J44559N9013k7791p2492p7802p0289o2052m7731k9416k2856
$$ plain form
41762 515555 480853 431533 383901 354583 346975 355763 372463 381252 361213 305326 233867 178611
41750 178611 154577 155062 170263 195518 218591 216811 181207 134510 109353 112536 127754 154380
41738 154380 224821 373133 596779 856905 1104478 1295468 1394827 1389614 1300097 1161103
41728 1161103 988135 776057 536213 317779 176680 128129 140130 169427 193733 212772
41718 212772 232202 252502 268425 276011 282031 304223 355297 424919 482902 503922 488412 460323
41706 460323 447813 464566 503024 542620 568332 584596 610175 657978 718926 761935 747786
41695 747786 651251 482899 290736 128285 13134 -77607 -166624 -240127 -261393 -214164 -119562
41684 -119562 -9440 105752 236928 389897 544835 663023 716147 713597 700684 723889
$$ packed form
41762E15555l4702m9320m7632k9318p608Q788J6700Q789k0039n5887p1459n5256
41750A78611k4034M85J5201K5255K3073j780l5604m6697k5157L183J5218K6626
41738A54380P0441J48312K23646K60126K47573J90990R9359n213q9517j38994
41728A161103j72968k12078k39844k18434j41099m8551J2001K9297K4306J9039
41718B12772J9430K0300J5923P586O020K2192N1074O9622N7983K1020j5510k8089
41706D60323j2510J6753L8458L9596K5712J6264K5579M7803O0948M3009j4149
41695G47786r6535j68352j92163j62451j15151r0741q9017p3503k1266M7229R4602
41684a19562J10122J15192J31176J52969J54938J18188N3124k550j2913K3205
$$ plain form
41674 723889 793835 881979 949640 973629 946798 870655 761496 658166 604677 613274 648796
41663 648796 659187 623736 566887 524029 501318 476034 432121 384645 366542 398952 478416
41652 478416 585165 696226 795676 881753 963454 1044203 1111725 1152005 1170635 1189780 1222923
41641 1222923 1261067 1282903 1266458 1190584 1045615 858824 699735 638893 691790 804190
41631 804190 890678 887446 780145 597003 378480 147603 -90154 -314917 -469560 -486477
41621 -486477 -343995 -88982 200811 471810 712396 929019 1116949 1254687 1321943 1322234
41611 1322234 1287751 1257000 1242558 1221531 1160977 1053692 930919 844324 835133 910529 1037710
41600 1037710 1158509 1218151 1190514 1083167 922404 734825 540716 359300 213358 122946
$$ packed form
41674G23889O9946Q8144O7661K3989k6831p6143j09159j03330n3489Q597L5522
41663F48796J0391l5451n6849m2858k2711k5284m3913m7476j8103L2410P9464
41652D78416J06749J11061R9450Q6077Q1701Q0749O7522M0280J8630J9145L3143
41641A222923L8144K1836j6445p5874j44969j86791j59089o0842N2897J12400
41631H04190Q6488l232j07301j83142k18523k30877k37757k24763j54643j6917
41621d86477J42482K55013K89793K70999K40586K16623J87930J37738O7256K91
41611A322234l4483l0751j4442k1027o0554j07285j22773q6595r191P5396J27181
41600A037710J20799N9642k7637j07347j60763j87579j94109j81416j45942r0412
$$ plain form
41590 122946 92773 108690 149845 203172 263148 319616 352040 338077 266043 141615 -9707
41579 -9707 -145048 -219311 -208714 -119477 29779 228253 467044 718350 937616 1094432
41569 1094432 1192559 1251933 1280290 1275342 1248807 1228941 1234052 1258457 1294339 1355194 1462893
41558 1462893 1618451 1802747 2004421 2227634 2464583 2674610 2802788 2814329 2706509 2499605
41548 2499605 2229318 1939684 1663696 1405929 1153455 905548 682609 502132 355496
41539 355496 216797 72131 -64334 -161202 -193360 -157209 -68481 50435 179515 301267
41529 301267 400613 470735 517104 552261 589051 639835 711971 792529 841865 817133 706882
41518 706882 536863 344345 158404 4740 -88252 -100427 -30555 109284 299726 505933
$$ packed form
41590A22946l0173J5917M1155N3327N9976N6468L2424j3963p2034j24428j51322
41579i707j35341p4263J0597Q9237J49256J98474K38791K51306K19266J56816
41569A094432R8127N9374K8357m948k6535j9866N111K4405L5882O0855J07699
41558A462893J55558J84296K01674K23213K36949K10027J28178J1541j07820k06904
41548B499605k70287k89634k75988k57767k52474k47907k22939j80477j46636
41539C55496j38699j44666j36465r6868l2158L6151Q8728J18916J29080J21752
41529C01267R9346P0122M6369L5157L6790N0784P2136Q0558M9336k4732j10251
41518G06882j70019j92518j85941j53664r2992j2175O9872J39839J90442K06207
$$ plain form
41508 505933 675542 764522 769003 723011 663239 602020 532633 448837 352138 245483 128915
41497 128915 5221 -111648 -198809 -242162 -255762 -279961 -353487 -483778 -643164 -791042
41487 -791042 -898633 -957372 -970213 -937068 -848614 -697086 -496314 -289704 -134300 -72263
41477 -72263 -108832 -205715 -294075 -310493 -240000 -127321 -37737 -5543 -25477 -87287 -198638
41466 -198638 -365061 -560556 -733519 -840148 -864216 -811033 -698896 -559352 -429866 -333007
41456 -333007 -267168 -226118 -222590 -280713 -404529 -563025 -707800 -798446 -813785 -757069 -661995
41445 -661995 -580805 -545469 -537372 -506842 -426350 -317204 -222837 -165117 -130637 -92058 -37493
41434 -37493 16374 36786 5397 -60719 -124031 -164856 -196862 -239827 -287113 -312316 -304762 -285582
$$ packed form
41508E05933J69609Q8980M481m5992n9772o1219o9387q3796r6699j06655j16568
41497A28915j23694j16869q7161m3353j3600k4199p3526j30291j59386j47878
41487g91042j07591n8739j2841L3145Q8454J51528K00772K06610J55404O2037
41477g2263l6569r6883q8360j6418P0493J12679Q9584L2194j9934o1810j11351
41466a98638j66423j95495j72963j06629k4068N3183J12137J39544J29486R6859
41456c33007O5839M1050L528n8123j23816j58496j44775r0646j5339N6716R5074
41445f61995Q1190L5336Q097L0530Q0492J09146R4367N7720L4480L8579N4565
41434c7493N3867K0412l1389o6116o3312m0825l2006m2965m7286k5203P554J9180
$$ plain form
41422 -285582 -285701 -316813 -369199 -430836 -497311 -559953 -593500 -570080 -492141 -403195 -352747 -349245
41410 -349245 -356674 -338301 -291570 -234852 -173606 -93556 18570 161501 324935 495312 653452
41399 653452 777329 852868 876334 844302 752041 611342 464057 363245 333494 353643 383121
41388 383121 402445 422496 456432 492371 499130 453681 358586 240127 138833 94699 122845
41377 122845 197632 273052 327088 378055 451054 539227 610819 649239 672235 709874 772245
41366 772245 840893 886340 892734 869947 843606 832737 839580 862227 909888 996532 1119308 1248870
41354 1248870 1343065 1370969 1329576 1242950 1143083 1046598 949740 845156 736746 634814 544606
41343 544606 466543 402150 353459 322674 318276 351179 412835 465579 472006 433071 383010 346807
$$ packed form
41422b85582j19l1112n2386o1637o6475o2642l3547K3420P7939Q8946N0448L502
41410c49245p429J8373M6731N6718O1246Q0050J12126J42931J63434J70377J58140
41399F53452J23877P5539K3466l2032r2261j40699j47285j00812k9751K0149K9478
41388C83121J9324K0051L3936L5939O759m5449r5095j18459j01294m4134K8146
41377A22845P4787P5420N4036N0967P2999Q8173P1592L8420K2996L7639O2371
41366G72245O8648M5447O394k2787k6341j0869O843K2647M7661Q6644J22776J29562
41354A248870R4195K7904m1393q6626r9867r6485r6858j04584j08410j01932r0208
41343E44606p8063o4393m8691l0785m398L2903O1656N2744O427l8935n0061l6203
$$ plain form
41331 346807 316851 273047 211556 149530 114032 130808 210124 332864 456634 543273 579225
41320 579225 571461 535111 488541 447384 413039 373231 321694 272504 249092 264108 314317 387157
41308 387157 464704 528793 574031 614682 670747 747469 833063 912911 978273 1022385 1036860
41297 1036860 1016675 967808 909044 863419 840178 820724 769208 666877 536392 426519 372033
41286 372033 370975 397073 426439 452389 483593 534039 611361 708089 801992 868308 898078 910213
41274 910213 945064 1037997 1190117 1361843 1497306 1558127 1538118 1453934 1329852 1192102
41264 1192102 1069440 988281 960099 972225 994184 997450 972222 928459 886472 869964 901858
41253 901858 994099 1135885 1298461 1458952 1617952 1789629 1978913 2177193 2379246 2591113
$$ packed form
41331C46807k9956m3804o1491o2026l5498J6776P9316J22740J23770Q6639L5952
41320E79225p764l6350m6570m1157l4345l9808n1537m9190k3412J5016N0209P2840
41308C87157P7547O4089M5238M0651N6065P6722Q5594P9848O5362M4112J4475
41297A036860k0185m8867n8764m5625k3241j9454n1516j02331j30485j09873n4486
41286C72033j058K6098K9366K5950L1204N0446P7322R6728R3903O6316K9770J2135
41274I10213L4851R2933J52120J71726J35463O0821k0009q4184j24082j37750
41264A192102j22662q1159k8182J2126K1959L266k5228m3763m1987j6508L1894
41253I01858R2241J41786J62576J60491J59000J71677J89284J98280K02053K11867
$$ plain form
41243 2591113 2811302 3010218 3143115 3189768 3174032 3135988 3087696 3004473 2858799 2653256
41233 2653256 2417262 2180436 1956319 1746457 1551167 1376416 1235207 1140648 1092001 1068513
41223 1068513 1043549 1008091 980289 993809 1077040 1236847 1455783 1707695 1981046 2283229
41213 2283229 2617075 2960285 3278789 3556020 3795445 3995135 4135778 4199841 4191266 4129262
41203 4129262 4031590 3911155 3780637 3649875 3521027 3393658 3274370 3177840 3119104 3104759
41193 3104759 3126437 3161074 3184298 3189193 3189920 3206032 3247927 3316194 3402788 3486408 3537855 3542444
41181 3542444 3513402 3474889 3438910 3412165 3419718 3498438 3655295 3844998 4005504 4114657 4200787
41170 4200787 4296960 4396134 4456184 4438971 4335078 4159030 3939000 3715158 3531687 3415333
$$ packed form
41243B591113K20189J98916J32897M6653j5736l8044m8292q3223j45674k05543
41233B653256k35994k36826k24117k09862j95290j74751j41209r4559m8647k3488
41223A068513k4964l5458k7802J3520Q3231J59807K18936K51912K73351L02183
41213B283229L33846L43210L18504K77231K39425J99690J40643O4063q575o2004
41203D129262r7672j20435j30518j30762j28848j27369j19288r6530n8736j4345
41193C104759K1678L4637K3224M895P27J6112M1895O8267Q6594Q3620N1447M589
41181C542444k9042l8513l5979k6745P553P8720J56857J89703J60506J09153Q6130
41170D200787R6173R9174O0050j7213j03893j76048k20030k23842j83471j16354
$$ plain form
41160 3415333 3363065 3355260 3374099 3403195 3421616 3416523 3401242 3406820 3452583 3533277 3632631 3734951
41148 3734951 3820411 3862810 3840700 3746665 3587361 3386450 3187633 3036973 2952248 2919937
41138 2919937 2928447 2990774 3124584 3322796 3557102 3800773 4033715 4233193 4377440 4458450
41128 4458450 4480825 4452366 4389051 4325935 4305646 4349650 4446961 4568304 4678540 4736160 4701786
41117 4701786 4564727 4358820 4142435 3961147 3831345 3753158 3726251 3746646 3795815 3848509
41107 3848509 3900299 3980852 4126164 4332410 4542393 4680727 4701437 4608808 4449410 4290694
41097 4290694 4192451 4179967 4239988 4344425 4474093 4618081 4760077 4874035 4929220 4896622
41087 4896622 4762113 4543765 4287758 4034328 3791681 3552375 3326745 3144519 3026879
$$ packed form
41160C415333n2268p805J8839K9096J8421n093j5281N578M5763Q0694R9354J02320
41148C734951Q5460M2399k2110r4035j59304k00911j98817j50660q4725l2311
41138B919937Q510O2327J33810J98212K34306K43671K32942J99478J44247Q1010
41128D458450K2375k8459o3315o3116k0289M4004R7311J21343J10236N7620l4374
41117D701786j37059k05907k16385j81288j29802p8187k6907K0395M9169N2694
41107C848509N1790Q0553J45312K06246K09983J38334K0710r2629j59398j58716
41097D290694r8243j2484O0021J04437J29668J43988J41996J13958N5185l2598
41087D896622j34509k18348k56007k53430k42647k39306k25630j82226j17640
$$ plain form
41078 3026879 2972052 2967153 2998607 3049488 3103675 3162575 3250355 3394239 3598134 3831699 4040498
41067 4040498 4174522 4222118 4219212 4217073 4240491 4283438 4337528 4405607 4485979 4563896 4630334
41056 4630334 4697467 4784393 4894764 5016045 5131269 5220482 5258269 5226374 5133080 5013231
41046 5013231 4905075 4827334 4776431 4741261 4718499 4713286 4725863 4741461 4737381 4697925 4618982
41035 4618982 4504640 4371500 4255384 4198145 4217496 4293633 4388463 4471924 4529657 4560235 4576559
41024 4576559 4600813 4641890 4677445 4670581 4609732 4527264 4475835 4489457 4567972 4692468 4847036
41013 4847036 5022727 5205844 5372095 5497316 5571005 5596775 5585626 5555927 5535374 5551703
41003 5551703 5619287 5739062 5904700 6093982 6255607 6326881 6281546 6157808 6035402 5990925
$$ packed form
41078C026879n4827m899L1454N0881N4187N8900Q7780J43884K03895K33565K08799
41067D040498J34024M7596k906k139K3418M2947N4090O8079Q0372P7917O6438
41056D630334O7133Q6926J10371J21281J15224Q9213L7787l1895r3294j19849
41046E013231j08156p7741n0903l5170k2762n213J2577J5598m080l9456p8943
41035D618982j14342j33140j16116n7239J9351P6137R4830Q3461N7733L0578J6324
41024D576559K4254M1077L5555o864o0849q2468n1429J3622P8515J24496J54568
41013D847036J75691J83117J66251J25221P3689K5770j1149k9699k0553J6329
41003E551703O7584J19775J65638J89282J61625P1274m5335j23738j22406m4477
$$ plain form
40993 5990925 6071221 6283479 6588766 6913670 7189978 7386749 7498139 7513227 7421867 7249970
40983 7249970 7063291 6920438 6830055 6760917 6682817 6587159 6476641 6351221 6208301 6051063
40973 6051063 5893983 5759974 5668208 5621027 5604408 5603245 5613572 5638945 5680480 5734350 5794075
40962 5794075 5849646 5887963 5900262 5886603 5846954 5771640 5652099 5504242 5371150 5292149 5268177
40951 5268177 5261242 5228471 5156419 5066202 4991380 4952430 4948633 4969434 5009872 5072767 5156703 5247107
40939 5247107 5325007 5384243 5433402 5477071 5500932 5483977 5425623 5353642 5303450 5296016 5337789
40928 5337789 5430500 5568237 5727471 5872371 5974310 6022329 6018479 5975873 5923438 5895854 5903015
40917 5903015 5911598 5866958 5735674 5526567 5279118 5041662 4856778 4752655 4738405 4807013
$$ packed form
40993E990925Q0296K12258L05287L24904K76308J96771J11390J5088r1360j71897
40983G249970j86679j42853r0383o9138p8100r5658j10518j25420j42920j57238
40973F051063j57080j34009r1766m7181j6619j163J0327K5373M1535N3870N9725
40962E794075N5571L8317J2299j3659l9649p5314j19541j47857j33092p9001k3972
40951E268177o935l2771p2052r0217p4822l8950l797K0801M0438O2895Q3936R0404
40939E247107P7900N9236M9159M3669K3861j6955n8354p1981n0192p434M1773
40928E337789R2711J37737J59234J44900J01939M8019l850m2606n2435k7584P161
40917E903015Q583m4640j31284k09107k47449k37456j84884j04123j4250O8608
$$ plain form
40907 4807013 4945000 5143058 5402339 5728815 6112991 6515611 6887681 7211788 7513078
40898 7513078 7826456 8173751 8584970 9115322 9810391 10666109 11652157 12768110 14053529
40889 14053529 15562417 17369731 19593066 22358659 25739888 29744121 34274632 38937520
40881 38937520 42852315 44868818 44246533 41215716 36818511 32183491 27963335 24341379
40873 24341379 21320257 18868121 16900964 15301498 13989282 12916728 12007851 11167416
40865 11167416 10356744 9609700 8962042 8400416 7887675 7405113 6958794 6567956 6253623
40856 6253623 6016352 5818165 5605341 5356723 5097865 4867887 4688274 4563543 4491449 4463374
40846 4463374 4466123 4490984 4537646 4612280 4730295 4915191 5178443 5496494 5816160 6085813
$$ packed form
40907D807013J37987J98058K59281L26476L84176M02620L72070L24107L01290
40898G513078L13378L47295M11219N30352O95069Q55718R86048J115953J285419
40889A4053529J508888J807314K223335K765593L381229M004233M530511M662888
40881C8937520L914795K016503o22285l030817m397205m635020m220156l621956
40873B4341379l021122k452136j967157j599466j312216j072554r08877q40435
40865A1167416q10672p47044o47658n61626n12741m82562m46319l90838l14333
40856F253623k37271j98187k12824k48618k58858k29978j79613j24731p2094k8075
40846D463374K749K4861M6662P4634J18015J84896K63252L18051L19666K69653
$$ plain form
40836 6085813 6280650 6406970 6492980 6571068 6658509 6756338 6869301 7014795 7202364 7415921
40826 7415921 7628698 7824571 7991391 8108141 8160134 8157749 8117626 8031107 7873679 7642330
40816 7642330 7361532 7054293 6730075 6402706 6099194 5846661 5665216 5569559 5554016 5573800
40806 5573800 5565387 5496060 5380838 5250240 5120501 4997514 4886392 4786829 4696646 4629250
40796 4629250 4610703 4647513 4709202 4752893 4756597 4723779 4668499 4605320 4545158 4493137 4453758
40785 4453758 4436238 4444841 4466712 4484486 4502379 4547266 4646251 4818536 5082581 5442660 5862851
40774 5862851 6281038 6660770 7008661 7331579 7603217 7791681 7898453 7945948 7940226 7870350
40764 7870350 7739140 7576303 7426353 7339707 7370437 7563695 7939301 8488212 9173433 9925518
$$ packed form
40836F085813J94837J26320Q6010P8088Q7441R7829J12963J45494J87569K13557
40826G415921K12777J95873J66820J16750N1993k385m0123q6519j57428k31349
40816G642330k80798l07239l24218l27369l03512k52533j81445r5657j5543J9784
40806E573800q413o9327j15222j30598j29739j22987j11122r9563r0183o7396
40796D629250j8547L6810O1689M3691L704l2818n5280o3179o0162n2021l9379
40785D453758j7520Q603K1871J7774J7893M4887R8985J72285K64045L60079M20191
40774E862851M18187L79732L47891L22918K71638J88464J06772M7495n722o9876
40764G870350j31210j62837j49950q6646L0730J93258L75606N48911O85221P52085
$$ plain form
40754 9925518 10655113 11299442 11864394 12409184 12982661 13573685 14114044 14518959 14733202
40745 14733202 14761304 14667925 14547688 14485798 14534166 14706543 14984938 15338153 15751566 16248697
40735 16248697 16883195 17706027 18735065 19950617 21320408 22834212 24513292 26373992
40727 26373992 28366925 30338916 32044722 33202536 33577266 33068896 31761695 29894334
40719 29894334 27766854 25648454 23728759 22104414 20783432 19709132 18800421 17986835
40711 17986835 17225445 16505890 15844549 15263211 14767867 14351124 14008342 13737905 13530870
40702 13530870 13380501 13303133 13328000 13457517 13651680 13857151 14039508 14190595 14333245 14531441
40692 14531441 14870110 15399167 16102769 16934753 17875033 18946047 20197220 21695579 23514915
$$ packed form
40754I925518P29595O44329N64952N44790N73477N91024N40359M04915K14243
40745A4733202K8102r3379j20237o1890M8368J72377K78395L53215M13413M97131
40735A6248697O34498Q22832J029038J215552J369791J513804J679080J860700
40727B6373992J992933J971991J705806J157814L74730n08370j307201j867361
40719B9894334k127480k118400j919695j624345j320982j074300r08711q13586
40711A7986835p61390p19555o61341n81338m95344m16743l42782k70437k07035
40702A3530870j50369p7368K4867J29517J94163K05471J82357J51087J42650J98196
40692A4531441L38669N29057P03602Q31984R40280J071014J251173J498359J819336
$$ plain form
40683 23514915 25692840 28168500 30747812 33122499 34941166 35920105 35956519 35177323 33879827
40674 33879827 32391439 30924412 29500783 27992169 26256644 24274296 22172562 20138938
40666 20138938 18324600 16813354 15629551 14742383 14081921 13582220 13209711 12944623 12756717
40657 12756717 12620189 12535167 12505402 12498877 12454294 12330058 12136934 11929749 11780625 11747392
40647 11747392 11837935 11994349 12123786 12155380 12073862 11913277 11732062 11585870 11501430 11462521
40637 11462521 11420408 11323128 11147365 10918348 10700144 10551452 10483617 10468226 10479204 10504621
40627 10504621 10516334 10460202 10296608 10033566 9705038 9335012 8939537 8545356 8183699 7874551
40617 7874551 7630292 7458776 7345447 7248630 7135031 7012082 6911736 6857105 6860247 6932421
$$ packed form
40683B3514915K177925K475660K579312K374687J818667R78939L6414p79196j297496
40674C3879827j488388j467027j423629j508614j735525j982348k101734k033624
40666B0138938j814338j511246j183803q87168o60462m99701l72509k65088j87906
40657A2756717j36528q5022k9765o525m4583j24236j93124k07185j49124l3233
40647A1747392R0543J56414J29437L1594q1518j60585j81215j46192q4440l8909
40637A1462521m2113r7280j75763k29017k18204j48692o7835j5391J0978K5417
40627A0504621J1713n6132j63594k63042l28528l70026l95475l94181l61657l09148
40617G874551k44259j71516j13329r6817j13599j22949j00346n4631L142P2174
$$ plain form
40607 6932421 7070829 7246449 7426537 7598820 7756802 7879805 7952728 7990992 8020620 8048990
40597 8048990 8084063 8167535 8354014 8664300 9090741 9640768 10339395 11189831 12162387 13216585
40587 13216585 14295400 15297427 16103777 16662786 17034535 17342406 17692088 18124641 18601146
40578 18601146 19010470 19224424 19186517 18956806 18669438 18455217 18398774 18531649 18825406 19182539
40568 19182539 19454461 19499072 19250002 18745628 18089428 17381448 16696778 16120648 15761291
40559 15761291 15696420 15923838 16386239 17014128 17700883 18259730 18481290 18270417 17706671
40550 17706671 16963465 16193453 15486536 14879319 14362358 13899316 13474561 13118884 12873186
40541 12873186 12740122 12692291 12720001 12848884 13108462 13498624 13994255 14574813 15233761 15945316
$$ packed form
40607F932421J38408J75620J80088J72283J57982J23003P2923L8264K9628K8370
40597H048990L5073Q3472J86479L10286M26441N50027O98627Q50436R72556J054198
40587A3216585J078815J002027Q06350N59009L71749L07871L49682M32553M76505
40578A8601146M09324K13954l7907k29711k87368k14221n6443J32875K93757L57133
40568A9182539K71922M4611k49070n04374o56200p07980o84670n76130l59357
40559A5761291o4871K27418M62401O27889O86755N58847K21560k10873n63746
40550A7706671p43206p70012p06917o07217n16961m63042m24755l55677k45698
40541A2873186j33064m7831K7710J28883K59578L90162M95631N80558O58948P11555
$$ plain form
40531 15945316 16625194 17151534 17453545 17583179 17688951 17920692 18360346 19015292 19835691
40522 19835691 20730897 21598596 22358951 22959193 23352601 23496695 23380647 23040383 22537585
40513 22537585 21927682 21245121 20509491 19747546 19014985 18383951 17892597 17517051 17212945
40504 17212945 16974972 16831143 16786569 16806415 16861411 16967526 17174768 17535089 18082139 18815784
40494 18815784 19688578 20613397 21494395 22263527 22914466 23516734 24165349 24867245 25471019
40485 25471019 25742354 25530814 24867463 23920338 22879128 21864570 20900748 19954604 19016180
40476 19016180 18145378 17435087 16945691 16696296 16697644 16952197 17425199 18050142 18761564 19493015
40466 19493015 20152156 20642271 20919200 21002242 20931394 20742652 20477671 20177217 19860083 19538203
$$ packed form
40531A5945316O79878N26340L02011J29634J05772K31741M39654O54946Q20399
40522A9835691Q95206Q67699P60355O00242L93408J44094j16048l40264n02798
40513B2537585o09903o82561p35630p61945p32561o31034m91354l75546l04106
40504A7212945k37973j43829m4574J9846N4996J06115K07242L60321N47050P33645
40494A8815784Q72794R24819Q80998P69132O50939O02268O48615P01896O03774
40485B5471019K71335k11540o63351r47125j041210j014558r63822r46144r38424
40476A9016180q70802p10291m89396k49395J348K54553M73002O24943P11422P31451
40466A9493015O59141M90115K76929Q3042p0848j88742k64981l00454l17134l21880
$$ plain form
40456 19538203 19249977 19046119 18946933 18946735 19048276 19246080 19481406 19669586 19786573 19893715
40446 19893715 20078003 20408574 20942699 21710001 22672642 23750361 24907738 26186017 27642712
40437 27642712 29290574 31083374 32909553 34611129 36086610 37402353 38756262 40317117
40429 40317117 42132209 44168974 46369279 48663530 51020595 53513617 56278713 59404275
40421 59404275 62930975 66952225 71613120 77001091 83153376 90208647 98451496 108182193
40413 108182193 119660285 133215790 149303681 168430648 191181526 218350583 250854915
40406 250854915 289415624 334328679 385059076 438880311 489087836 525287078 537457811
40399 537457811 521583699 482144008 429287952 373384577 321301239 276026025 238087846
$$ packed form
40456A9538203k88226k03858r9186j98J01541J97804K35326J88180J16987J07142
40446A9893715J84288L30571N34125P67302R62641J077719J157377J278279J456695
40437B7642712J647862J792800J826179J701576J475481J315743J353909J560855
40429D0317117J815092K036765K200305K294251K357065K493022K765096L125562
40421E9404275L526700M021250M660895N387971O152285P055271Q242849R730697
40413A08182193J1478092J3555505J6087891J9126967K2750878K7169057L2504332
40406B50854915L8560709M4913055N0730397N3821235N0207525L6199242J2170733
40399E37457811j5874112l9439691n2856056n5903375n2083338m5275214l7938179
$$ plain form
40392 238087846 206865360 181296194 160284371 142912379 128441047 116257489 105903785
40385 105903785 97103029 89696308 83555256 78528833 74398519 70869528 67670940 64692011
40377 64692011 61974418 59552837 57346029 55212174 53052490 50836005 48580096 46355169
40369 46355169 44279574 42464648 40966977 39806459 39006925 38595203 38574291 38907653 39498512
40360 39498512 40161497 40654279 40795533 40556943 40014078 39224624 38202773 37006132 35777417
40351 35777417 34660095 33707453 32908077 32266217 31810161 31543897 31448969 31535867 31840946
40342 31840946 32351449 32967164 33558876 34046441 34410621 34659255 34810629 34901789 34992699 35155424
40332 35155424 35452785 35916922 36555184 37393304 38500794 39933969 41628812 43349390 44741634
$$ packed form
40392B38087846l1222486k5569166k1011823j7371992j4471332j2183558j0353704
40385A05903785q800756p406721o141052n026423m130314l528991l198588k978929
40377F4692011k717593k421581k206808k133855k159684k216485k255909k224927
40369D6355169k075595j814926j497671j160518p99534m11722k0912L33362N90859
40360C9498512O62985M92782J41254k38590n42865p89454j021851j196641j228715
40351C5777417j117322r52642p99376o41860m56056k66264r4928Q6898L05079
40342C1840946N10503O15715N91712M87565L64180K48634J51374R1160R0910J62725
40332C5155424K97361M64137O38262Q38120J107490J433175J694843J720578J392244
$$ plain form
40323 44741634 45452389 45260771 44176353 42436791 40381505 38303569 36403690 34824315
40315 34824315 33654100 32896322 32481568 32319449 32315541 32372492 32445120 32595138 32938821 33545584
40305 33545584 34433053 35631414 37177928 39069696 41307953 43976134 47186819 50967593
40297 50967593 55294931 60223455 65882202 72378664 79839011 88525296 98791098 110975236
40289 110975236 125495215 142964500 163996182 188913341 217663075 249339557 280778612
40282 280778612 305690339 316768184 310301701 289067635 260323626 230995808 204786320
40275 204786320 182771549 165081138 151529109 141649028 135033913 131563447 131097217 133283030
40267 133283030 137892065 145029506 154878176 167652045 183983969 204904436 231185881
$$ packed form
40323D4741634P10755j91618j084418j739562k055286k077936j899879j579375
40315C4824315j170215p57778m14754j62119l908N6951P2628J50018L43683O06763
40305C3545584Q87469J198361J546514J891768K238257K668181L210685L780774
40297E0967593M327338M928524N658747O496462P460347Q686285J0265802J2184138
40289A10975236J4519979J7469285K1031682K4917159K8749734L1676482L1439055
40282B80778612K4911727J1077845o466483k1234066k8744009k9327818k6209488
40275B04786320k2014771j7690411j3552029r880081o615115l470466m66230K185813
40267A33283030M609035P137441R848670J2773869J6331924K0920467K6281445
$$ plain form
40260 231185881 262989460 299809040 339267979 375070569 397506237 398466190 377200958
40253 377200958 340902463 299501504 260105906 225618705 196559179 172679788 153307415
40246 153307415 137520719 124607384 114185502 105918116 99425414 94477383 91001931
40239 91001931 88875825 87892208 87908169 88819525 90362326 92056820 93322455 93552392 92186922
40230 92186922 88948132 84056168 78113242 71759910 65479315 59614056 54370620 49778284
40222 49778284 45762105 42287101 39367291 36957366 34935416 33196820 31691461 30379437
40214 30379437 29228462 28247099 27446312 26777155 26179350 25682553 25386417 25345595 25542680
40205 25542680 25965263 26633080 27546641 28680221 30034686 31638427 33499204 35630206
$$ packed form
40260B31185881L1803579L6819580L9458939L5802590K2435668R59953k1265232
40253C77200958l6298495m1400959l9395598l4487201k9059526k3879391j9372373
40246A53307415j5786696j2913335j0421882q267386o492702m948031l475452
40239I1001931k126106r83617J5961R11356J542801J694494J265635K29937j365470
40230I2186922l238790m891964n942926o353332o280595n865259n243436m592336
40222D9778284m016179l475004k919810k409925k021950j738596j505359j312024
40214C0379437j150975r81363q00787o69157n97805m96797k96136m0822J97085
40205B5542680M22583O67817R13561J133580J354465J603741J860777K131002
$$ plain form
40197 35630206 38139546 41226100 45058128 49698499 55137496 61272531 67735099 73753376
40189 73753376 78324074 80693033 80810407 79378615 77403439 75557786 73832185 71704635
40181 71704635 68630476 64445385 59438716 54147218 49071754 44499230 40499488 37028734
40173 37028734 34009553 31343863 28928462 26710390 24711195 22971749 21490655 20230586
40165 20230586 19148971 18191505 17289037 16406606 15581227 14874676 14300548 13826461 13427038
40156 13427038 13095501 12817349 12574134 12366889 12198857 12040014 11845327 11607971 11363170
40147 11363170 11140864 10945933 10784921 10677248 10626571 10599969 10544885 10419745 10214835 9959398
40137 9959398 9703798 9479015 9276109 9072565 8864373 8659926 8463235 8285900 8158323
$$ packed form
40197C5630206K509340L086554L832028M640371N438997O135035O462568O018277
40189G3753376M570698K368959J17374j431792j975176j845653j725601k127550
40181G1704635l074159m185091n006669n291498n075464m572524l999742l470754
40173C7028734l019181k665690k415401k218072j999195j739446j481094j260069
40165B0230586j081615r57466r02468q82431q25379p06551n74128m74087l99423
40156A3427038l31537k78152k43215k07245j68032j58843j94687k37356k44801
40147A1363170k22306j94931j61012j07673n0677k6602n5084j25140k04910k55437
40137I959398k55600k24783k02906k03544k08192k04447j96691j77335j27577
$$ plain form
40128 8158323 8100747 8092562 8093788 8086138 8069902 8035265 7967543 7872398 7765458 7642054 7487173
40117 7487173 7313970 7163996 7065118 7009275 6972052 6936487 6900438 6877124 6881022 6893040 6848963
40106 6848963 6690996 6433950 6162852 5965189 5875439 5869315 5882757 5840023 5694637 5458608
40096 5458608 5188415 4947023 4782045 4717138 4740202 4812005 4908336 5041176 5218768 5407912
40086 5407912 5570892 5723797 5916494 6162654 6434792 6729136 7085556 7522081 7981138
40077 7981138 8361965 8589838 8648754 8575669 8439819 8306893 8202085 8108990 8000434 7854582
40067 7854582 7649153 7374626 7065217 6791515 6606014 6508535 6468012 6454051 6438694 6397700
40057 6397700 6337437 6310266 6383169 6591560 6926719 7352825 7821805 8279387 8671410 8948979
$$ packed form
40128H158323n7576q185J226p650j6236l4637o7722r5145j06940j23404j54881
40117G487173j73203j49974r8878n5843l7223l5565l6049k3314L898J2018m4077
40106F848963j57967k57046k71098j97663q9750o124J3442m2734j45386k36029
40096E458608k70193k41392j64978o4907K3064P1803R6331J32840J77592J89144
40086E407912J62980J52905J92697K46160K72138K94344L56420M36525M59057
40077G981138L80827K27873N8916p3085j35850j32926j04808r3095j08556j45852
40067G854582k05429k74527l09409k73702j85501r7479m0523j3961j5357m0994
40057F397700o0263k7171P2903K08391L35159M26106M68980M57582L92023K77569
$$ plain form
40047 8948979 9073673 9032403 8852525 8592616 8313837 8064930 7885217 7796182 7782184 7800303
40037 7800303 7823273 7860088 7924520 7999989 8053391 8075041 8087159 8114317 8158343 8203362 8236509
40026 8236509 8261286 8295354 8356541 8447684 8552696 8647788 8720125 8781292 8861966 8981793 9114873
40015 9114873 9191782 9149932 8985901 8755788 8528971 8345253 8203585 8073327 7917164 7719873
40005 7719873 7502631 7305823 7159586 7074109 7046696 7062914 7097940 7137276 7197223 7307329
39995 7307329 7467504 7634032 7749904 7779310 7718170 7593899 7462420 7386023 7395539 7474154
39985 7474154 7581129 7685760 7776742 7847551 7879869 7842053 7708536 7488275 7231543 6999772
39975 6999772 6827471 6714579 6644324 6595960 6549092 6494953 6443914 6408936 6383377 6347356 6290907
$$ packed form
40047H948979J24694m1270j79878k59909k78779k48907j79713q9035j3998J8119
40037G800303K2970L6815O4432P5469N3402K1650J2118K7158M4026M5019L3147
40026H236509K4777L4068O1187R1143J05012R5092P2337O1167Q0674J19827J33080
40015I114873P6909m1850j64031k30113k26817j83718j41668j30258j56163j97291
40005G719873k17242j96808j46237q5477k7413J6218L5026L9336N9947J10106
39995G307329J60175J66528J15872K9406o1140j24271j31479p6397R516P8615
39985G474154J06975J04631R0982P0809L2318l7816j33517k20261k56732k31771
39975F999772j72301j12892p0255m8364m6868n4139n1039l4978k5559l6021n6449
$$ plain form
39964 6290907 6215718 6121079 6011222 5917110 5887666 5949752 6087256 6258846 6421327 6539465
39954 6539465 6597149 6605840 6586216 6540356 6461267 6368922 6308555 6303334 6331337 6358579 6370285 6357532
39942 6357532 6302541 6204696 6106878 6070251 6125262 6257471 6426912 6582233 6667055 6639885 6497593
39931 6497593 6275491 6027720 5809422 5662749 5603312 5621181 5700885 5834365 6011480 6212103
39921 6212103 6419201 6632443 6863639 7131202 7464870 7897644 8440298 9078843 9808422
39912 9808422 10651060 11627332 12735807 13975861 15340109 16714261 17793160 18186200 17682336
39903 17682336 16422623 14802715 13213206 11861374 10776933 9912444 9219799 8671800
39895 8671800 8254788 7953242 7736806 7562617 7395387 7225523 7062902 6911444 6755349
$$ packed form
39964F290907p5189r4639j09857r4112k9444O2086J37504J71590J62481J18138
39954F539465N7684Q691j9624m5860p9089r2345o0367n221K8003K7242J1706j2753
39942F357532n4991r7845r7818l6627N5011J32209J69441J55321Q4822k7170j42292
39931F497593k22102k47771k18298j46673n9437J7869P9704J33480J77115K00623
39921F212103K07098K13242K31196K67563L33668M32774N42654O38545P29579
39912I808422Q42638R76272J108475J240054J364248J374152J078899L93040n03864
39903A7682336j259713j619908j589509j351832j084441q64489o92645n47999
39895H671800m17012l01546k16436j74189j67230j69864j62621j51458j56095
$$ plain form
39886 6755349 6576524 6383339 6213740 6107582 6081981 6133590 6250600 6410131 6571348 6689743
39876 6689743 6748393 6777733 6849615 7051988 7452542 8067555 8865270 9804222 10848576 11914590
39866 11914590 12808069 13268411 13126014 12427788 11401783 10305910 9310815 8486529 7837552
39857 7837552 7324326 6879608 6443284 5993701 5544168 5117060 4728714 4389219 4100737
39848 4100737 3854675 3638822 3447353 3278651 3127670 2990051 2872176 2787746 2744258 2740257
39838 2740257 2774201 2847422 2961906 3128453 3375003 3727921 4178547 4684550 5214082 5774715
39828 5774715 6389933 7066525 7802397 8601500 9435180 10180225 10635801 10644997 10212786 9502840
39818 9502840 8723804 8018061 7434839 6970325 6610801 6346423 6168173 6066479 6032311 6058046
$$ packed form
39886F755349j78825j93185j69599j06158k5601N1609J17010J59531J61217J18395
39876F689743N8650K9340P1882K02373M00554O15013P97715R38952J044354J066014
39866A1914590Q93479M60342j42397o98226j026005j095873r95095q24286o48977
39857G837552n13226m44718m36324m49583m49533m27108l88346l39495k88482
39848D100737k46062k15853j91469j68702j50981j37619j17875q4430m3488m001
39838B740257L3944P3221J14484J66547K46550L52918M50626N06003N29532N60633
39828E774715O15218O76592P35872P99103Q33680P45045M55576R196m32211p09946
39818I502840p79036p05743n83222m64514l59524k64378j78250j01694l4168K5735
$$ plain form
39808 6058046 6144215 6307679 6565018 6883977 7154103 7236325 7064953 6697667 6260220 5854110
39798 5854110 5521029 5264838 5069764 4899188 4710026 4485670 4246861 4028581 3857924
39789 3857924 3751425 3711379 3714816 3721292 3704110 3667439 3627773 3588926 3541477 3475074 3380865
39778 3380865 3250021 3082548 2896857 2723677 2589389 2504715 2464034 2453629 2465818 2506272
39768 2506272 2582000 2684279 2795726 2917229 3073839 3283328 3525785 3753590 3927668 4038333
39758 4038333 4098089 4126063 4139517 4150681 4164727 4180162 4193614 4207859 4235795 4291394 4374470
39747 4374470 4473235 4588719 4743483 4946896 5157588 5305707 5358038 5339333 5280326 5169033
39737 5169033 4974789 4706015 4419654 4177295 4011114 3928036 3919016 3949942 3958909 3885557 3713113
$$ packed form
39808F058046Q6169J63464K57339L18959K70126Q2222j71372l67286m37447m06110
39798E854110l33081k56191j95074j70576j89162k24356k38809k18280j70657
39789C857924j06499m0046L437O476j7182l6671l9666l8847m7449o6403r4209
39778C380865j30844j67473j85691j73180j34288q4674m0681j0405J2189M0454
39768B506272P5728J02279J11447J21503J56610K09489K42457K27805J74078J10665
39758D038333N9756K7974J3454J1164J4046J5435J3452J4245K7936N5599Q3076
39747D374470R8765J15484J54764K03413K10692J48119N2331j8705n9007j11293
39737E169033j94244k68774k86361k42359j66181q3078r020L0926Q967p3352j72444
$$ plain form
39726 3713113 3481514 3258343 3095963 3012554 3004850 3065180 3177462 3303557 3389832 3395147 3310630
39715 3310630 3156130 2968945 2796080 2680091 2638370 2658999 2722063 2820764 2960265 3146219
39705 3146219 3381067 3663183 3981697 4318347 4661459 5012894 5375658 5739700 6081784
39696 6081784 6368706 6556731 6604911 6506467 6303521 6061041 5829972 5638538 5501723 5419669
39686 5419669 5373120 5338471 5305147 5264874 5192656 5063454 4891102 4727792 4612320 4531668
39676 4531668 4444620 4332614 4214792 4119873 4058352 4023686 4009037 4014389 4039754 4079248 4126017
39665 4126017 4178360 4232755 4271614 4270523 4226380 4170774 4143089 4151005 4166296 4159525 4131521 4111531
39653 4111531 4132564 4207324 4315546 4407283 4424550 4330516 4125881 3844761 3538725 3257098
$$ packed form
39726C713113k31599k23171j62380q3409p704O0330J12282J26095Q6275N315q4517
39715C310630j54500j87185j72865j15989m1721K0629O3064R8701J39501J85954
39705C146219K34848K82116L18514L36650L43112L51435L62764L64042L42084
39696F081784K86922J88025M8180r8444k02946k42480k31069j91434j36815q2054
39686E419669m6549l4649l3324m0273p2218j29202j72352j63310j15472q0652
39676D531668q7048j12006j17822r4919o1521l4666j4649N352K5365L9494M6769
39665D126017N2343N4395L8859j091m4143n5606k7685P916J5291o771k8004j9990
39653D111531K1033P4760J08222R1737J7267r4034k04635k81120l06036k81627
$$ plain form
39643 3257098 3028062 2852463 2719860 2631264 2600107 2630482 2704169 2795964 2896829 3014538
39633 3014538 3151937 3288888 3385868 3404785 3331946 3189217 3024537 2884684 2790017 2733971
39623 2733971 2706854 2715179 2771393 2866505 2962905 3019785 3020809 2973235 2888648 2774372 2638256
39612 2638256 2488692 2330059 2169400 2027500 1929804 1881323 1859548 1834391 1784838 1696244
39602 1696244 1560831 1393138 1233199 1121579 1077198 1104210 1202819 1355418 1513078 1618974
39592 1618974 1647144 1606583 1513631 1380090 1228856 1099906 1028634 1024213 1070716 1138544 1191830
39581 1191830 1198605 1147072 1053816 955856 895585 904575 985942 1107390 1221332 1299055 1343660
39570 1343660 1372302 1395344 1413725 1425661 1431317 1439140 1471120 1551134 1678957 1820266 1929067
$$ packed form
39643C257098k29036j75599j32603q8596l1157L0375P3687R1795J00865J17709
39633C014538J37399J36951R6980J8917p2839j42729j64680j39853r4667n6046
39623B733971k7117Q325N6214R5112R6400N6880J024m7574q4587j14276j36116
39612B638256j49564j58633j60659j41900r7696m8481k1775k5157m9553q8594
39602A696244j35413j67693j59939j11620m4381K7012R8609J52599J57660J05896
39592A618974K8170m0561r2952j33541j51234j28950p1272m421M6503O7828N3286
39581A191830O775n1533r3256r7960o0271Q990Q1367J21448J13942P7723M4605
39570A343660K8642K3042J8381J1936N656P823L1980Q0014J27823J41309J08801
$$ plain form
39559 1929067 1978489 1969357 1918066 1844367 1766241 1696918 1644399 1616031 1622058 1671937 1767584 1900296
39547 1900296 2051054 2194050 2307137 2385181 2442029 2495885 2552491 2601105 2621661 2594587 2512300
39536 2512300 2390757 2268751 2186005 2153558 2142826 2103873 1996684 1811303 1567474 1303059
39526 1303059 1063762 895499 832054 877918 999315 1136097 1230806 1257447 1232466 1200882
39516 1200882 1205172 1258128 1339393 1413886 1452058 1439548 1380653 1296556 1209321 1117852 995044
39505 995044 817849 597007 369018 162888 -14418 -161583 -266056 -309760 -285478 -203703
39495 -203703 -87865 35320 147024 243632 332365 417728 492033 538023 540945 503554 453930
39484 453930 432949 464491 536986 618477 686581 737461 772212 789796 795420 801970 816203 833360
$$ packed form
39559A929067M9422r132n1291p3699p8126o9323n2519k8368O027M9879R5647J32712
39547A900296J50758J42996J13087P8044N6848N3856N6606M8614K0556k7074q2287
39536B512300j21543j22006q2746l2447j0732l8953j07189j85381k43829k64415
39526A303059k39297j68263o3445M5864J21397J36782R4709K6641k4981l1584
39516A200882M290N2956Q1265P4493L8172j2510n8895q4097q7235r1469j22808
39505I95044j77195k20842k27989k06130j77306j47165j04473m3704K4282Q1775
39495b03703J15838J23185J11704R6608Q8733Q5363P4305M5990K922l7391m9624
39484D53930k0981L1542P2495Q1491O8104N0880L4751J7584N624O550J4233J7157
$$ plain form
39472 833360 853167 891804 965221 1061987 1143171 1172935 1145199 1078787 991744 887064 764368
39461 764368 638569 537831 481721 468928 490569 547366 644194 771359 901187 1003064
39451 1003064 1055499 1048262 986710 896579 811385 745273 681474 591170 460000 295982 121183
39440 121183 -37302 -154101 -213510 -214632 -168979 -94267 -8354 77721 164252 257376 356547
39429 356547 449037 517111 549164 547679 533067 537542 584153 666206 751893 812032 840401 849313
39417 849313 855830 876168 923826 1004086 1112362 1241675 1388127 1546001 1702765 1843785
39407 1843785 1958519 2038197 2071552 2049388 1974862 1869235 1768136 1706986 1698968 1722704 1737989
39396 1737989 1718985 1669673 1608069 1545871 1488684 1445516 1425913 1430250 1451352 1483549 1521247
$$ packed form
39472H33360J9807L8637P3417R6766Q1184K9764k7736o6412q7043j04680j22696
39461G64368j25799j00738n6110j2793K1641N6797R6828J27165J29828J01877
39451A003064N2435p237o1552r0131q5194o6112o3799r0304j31170j64018j74799
39440A21183j58485j16799n9409j122M5653P4712Q5913Q6075Q6531R3124R9171
39429C56547R2490O8074L2053j485j4612M475M6611Q2053Q5687O0139K8369Q912
39417H49313O517K0338M7658Q0260J08276J29313J46452J57874J56764J41020
39407A843785J14734P9678L3355k2164p4526j05627j01099o1150q018K3736J5285
39396A737989j9004m9312o1604o2198n7187m3168j9603M337K1102L2197L7698
$$ plain form
39385 1521247 1548300 1537388 1465614 1330585 1151776 958735 777771 626404 515903 454470
39375 454470 445692 486955 572966 696724 839907 966617 1041189 1057733 1041743 1014430 963454
39364 963454 860154 704294 543332 444717 448919 543835 678317 800763 888332 942203 962994
39353 962994 943497 887171 819852 772828 761083 785934 849374 950750 1071887 1180881 1256640
39342 1256640 1303712 1340949 1380875 1420493 1445313 1439204 1394723 1318758 1230846 1159166 1136923
39331 1136923 1190992 1320311 1483401 1615836 1667653 1628086 1520690 1381078 1237815 1106893
39321 1106893 997819 919374 873638 846345 815526 776824 750673 754867 779928 806614 839374
39310 839374 898439 974957 1016491 972783 846901 690304 555247 462591 408326 384457 389277
$$ packed form
39385A521247K7053j0912p1774j35029j78809j93041j80964j51367j10501o1433
39375D54470q778M1263Q6011J23758J43183J26710P4572J6544j5990k7313n0976
39364I63454j03300j55860j60962r8615M202R4916J34482J22446Q7569N3871K0791
39353I62994j9497n6326o7319m7024j1745K4851O3440J01376J21137J08994P5759
39342A256640M7072L7237L9926L9618K4820o109m4481p5965q7912p1680k2243
39331A136923N4069J29319J63090J32435N1817l9567j07396j39612j43263j30922
39321A106893j09074p8445m5736k7293l0819l8702k6151M194K5061K6686L2760
39310H39374N9065P6518M1534m3708j25882j56597j35057r2656n4265k3869M820
$$ plain form
39299 389277 425064 490467 574242 657181 720604 749047 724709 631381 476158 302911 169214
39288 169214 103731 91250 99892 114061 137037 170789 204321 222952 224706 226103 250801 308342
39276 308342 381694 439585 464706 466883 466156 468607 464999 447913 419795 384927 344714 304877
39264 304877 278582 275867 294344 324998 363894 416674 498702 633854 841308 1110280 1390646
39253 1390646 1620384 1765888 1834225 1853834 1853066 1850491 1848055 1829558 1778128 1700823 1628140 1586807
39241 1586807 1581109 1599143 1620715 1614216 1546541 1414995 1261164 1136092 1053201 985743 903839
39230 903839 798502 673778 537665 409431 321746 302785 359184 479469 644719 827642
39220 827642 989419 1093557 1129508 1118831 1094899 1077938 1070532 1073205 1097289 1158162 1257434
$$ packed form
39299C89277L5787O5403Q3775Q2939O3423K8443k4338r3328j55223j73247j33697
39288A69214o5483j2481Q642J4169K2976L3752L3532J8631J754J397K4698N7541
39276C08342P3352N7891K5121K177p27K451l608j7086k8118l4868m0213l9837
39264C04877k6295k715J8477L0654L8896N2780Q2028J35152K07454K68972K80366
39253A390646K29738J45504O8337J9609p68k575k436j8497n1430p7305p2683m1333
39241A586807n698J8034K1572o499o7675j31546j53831j25072q2891o7458q1904
39230I03839j05337j24724j36113j28234q7685j8961N6399J20285J65250J82923
39220H27642J61777J04138L5951j0677k3932j6961p406K673K4084O0873R9272
$$ plain form
39209 1257434 1376011 1484746 1557277 1571597 1507466 1353408 1121450 854736 618039 472427
39199 472427 444885 513432 625549 738476 841964 942238 1034595 1102492 1137808 1148146 1144725
39188 1144725 1136392 1137295 1164680 1219066 1275304 1303694 1296584 1269084 1241888 1234586 1270927 1374091
39176 1374091 1548112 1767291 1987956 2172401 2308453 2415949 2535471 2700984 2915025
39167 2915025 3149610 3370670 3558639 3709870 3832133 3945052 4071638 4213562 4339458
39158 4339458 4414904 4445900 4476227 4534324 4596031 4609591 4545136 4406901 4210665 3973800 3726729
39147 3726729 3510615 3353290 3258887 3224895 3253249 3336149 3446320 3554525 3646524 3712027
39137 3712027 3731651 3694815 3622765 3550719 3486227 3405036 3293165 3174874 3087952 3042066 3011301
$$ packed form
39209A257434J18577J08735P2531J4320o4131j54058k31958k66714k36697j45612
39199D72427k7542O8547J12117J12927J03488J00274R2357O7897L5316J0338l421
39188A144725q333R03K7385N4386N6238K8390p110k7500k7196p302L6341J03164
39176A374091J74021K19179K20665J84445J36052J07496J19522J65513K14041
39167B915025K34585K21060J87969J51231J22263J12919J26586J41924J25896
39158D339458P5446L0996L0327N8097O1707J3560o4455j38235j96236k36865k47071
39147C726729k16114j57325r4403l3992K8354Q2900J10171J08205R1999O5503
39137C712027J9624l6836p2050p2046o4492q1191j11871j18291q6922m5886l0765
$$ plain form
39126 3011301 2959912 2865744 2724522 2544697 2344040 2149953 1998669 1923292 1929110 1978730
39116 1978730 2013031 1995096 1931051 1847550 1758059 1655948 1532415 1393853 1265612 1180519
39106 1180519 1152985 1156975 1140255 1074210 986515 935169 955372 1042456 1178603 1354660 1560845
39095 1560845 1773017 1960131 2099328 2179026 2196461 2159509 2082966 1974266 1829209 1651052
39085 1651052 1467984 1318812 1221469 1165643 1136233 1131850 1155502 1198181 1242445 1278747 1308752
39074 1308752 1331898 1336591 1309949 1254725 1193385 1154717 1156384 1197812 1264444 1335062 1388854 1416531
39062 1416531 1433017 1476493 1585634 1771822 2011023 2256649 2455669 2562156 2556610 2462008
39052 2462008 2329541 2195230 2053632 1881641 1680477 1480272 1306728 1160623 1034688
$$ packed form
39126C011301n1389r4168j41222j79825k00657j94087j51284p5377N818M9620
39116A978730L4301j7935o4045q3501q9491j02111j23533j38562j28241q5093
39106A180519k7534L990j6720o6045q7695n1346K0203Q7084J36147J76057K06185
39095A560845K12172J87114J39197P9698J7435l6952p6543j08700j45057j78157
39085A651052j83068j49172r7343n5826k9410m383K3652M2679M4264L6302L0005
39074A308752K3146M693k6642n5224o1340l8668J667M1428O6632P0618N3792K7677
39062A416531J6486M3476J09141J86188K39201K45626J99020J06487n546r4602
39052B462008j32467j34311j41598j71991k01164k00205j73544j46105j25935
$$ plain form
39043 1034688 935559 878194 866264 887221 921098 945189 935442 877050 778446 669823 585003
39032 585003 545563 558228 618119 710162 812359 904607 976754 1028122 1060466 1073777 1070152
39021 1070152 1060157 1060377 1079343 1105556 1115050 1096021 1064875 1052461 1071182 1097771 1093720 1045905
39009 1045905 984936 958645 987283 1049439 1111496 1161411 1208746 1262532 1321901 1382599 1437529
38998 1437529 1473581 1486606 1502617 1563232 1676361 1793855 1852000 1825984 1733398 1597348 1428638
38987 1428638 1242431 1070140 944097 877777 863392 879258 896559 890028 852042 796906 752110
38976 752110 748191 810321 943451 1117806 1277437 1374298 1397032 1366601 1306884 1221875 1100770
38965 1100770 944133 781944 658973 599678 594678 625006 685612 771545 854143 897272 898609
$$ packed form
39043A034688r9129n7365j1930K0957L3877K4091r747n8392r8604j08623q4820
39032E85003l9440J2665N9891R2043J02197R2248P2147N1368L2344J3311l625
39021A070152r995K20J8966K6213R494j9029l1146j2414J8721K6589m051m7815
39009A045905o0969k6291K8638O2156O2057M9915M7335N3786N9369O0698N4930
38998A437529L6052J3025J6011O0615J13129J17494N8145k6016r2586j36050j68710
38987A428638j86207j72291j26043o6320j4385J5866J7301o531l7986n5136m4796
38976G52110l919O2130J33130J74355J59631R6861K2734l0431n9717q5009j21105
38965A100770j56637j62189j22971n9295n000L0328O0606Q5933Q2598M3129J337
$$ plain form
38954 898609 891672 899940 910705 906999 905784 943330 1030267 1136681 1215703 1230266 1169363 1061508
38942 1061508 971560 963035 1053845 1213482 1397283 1568505 1694070 1749514 1743642 1720759 1719825
38931 1719825 1738400 1749239 1741682 1727186 1708156 1664607 1579879 1463860 1339269 1215733 1091436
38920 1091436 974068 881732 818651 763398 691117 601080 513653 446049 404471 400008 455133
38909 455133 580386 748193 901658 992764 1008320 962238 876413 777643 703030 688223 740210
38898 740210 827360 904372 945980 952941 932670 888904 833550 794057 794902 834162 887823 934625
38886 934625 965506 969823 929735 840494 729107 639549 598015 598936 623364 661079 710557 764883
38874 764883 806162 813384 771136 671906 518128 327810 134666 -25947 -135495 -195518 -213791
$$ packed form
38954H98609o937Q268J0765l706j215L7546Q6937J06414P9022J4563o0903j07855
38942A061508q9948q525R0810J59637J83801J71222J25565N5444n872k2883r34
38931A719825J8575J0839p557j4496j9030m3549q4728j16019j24591j23536j24297
38920A091436j17368r2336o3081n5253p2281r0037q7427o7604m1578m463N5125
38909D55133J25253J67807J53465R1106J5556m6082q5825r8770p4613j4807N1987
38898G40210Q7150P7012M1608O961k0271m3766n5354l9493Q45L9260N3661M6802
38886I34625L0881M317m0088q9241j11387q9558m1534R21K4428L7715M9478N4326
38874G64883M1279P222m2248r9230j53778j90318j93144j60613j09548o0023j8273
$$ plain form
38863 -213791 -193588 -138807 -61322 25654 118805 221630 332690 446200 562727 686475
38853 686475 808214 903423 956123 975918 981505 974750 944833 896096 857722 860538 910670 987886
38841 987886 1062474 1110858 1122934 1102864 1063496 1017555 973131 935036 907190 896021 916650
38830 916650 991635 1130603 1306157 1460401 1546637 1564034 1547486 1528705 1513332 1489004 1442398
38819 1442398 1368094 1273145 1177584 1099929 1033494 943275 796943 599081 389013 206330
38809 206330 65807 -34311 -90381 -88834 -22184 96274 235795 365832 472716 562899
38799 562899 651008 742619 826591 883711 902713 887203 847287 787411 706657 611485 522261
38788 522261 460455 430666 422880 433689 474532 549495 630370 666628 624037 510097 366056
$$ packed form
38863b13791K0203N4781P7485Q6976R3151J02825J11060J13510J16527J23748
38853F86475J21739R5209N2700J9795N587o755k9917m8737l8374K816N0132P7216
38841I87886P4588M8384J2076k0070l9368m5941m4424l8095k7846j1169K0629
38830I16650P4985J38968J75554J54244Q6236J7397j6548j8781j5373k4328m6606
38819A442398p4304r4949r5561p7655o6435r0219j46332j97862k10068j82683
38809B06330j40523j00118n6070J547O6650J18458J39521J30037J06884R0183
38799E62899Q8109R1611Q3972N7120J9002j5510l9916n9876q0754r5172q9224
38788E22261o1806k9789p786J0809M0843P4963Q0875L6258m2591j13940j44041
$$ plain form
38777 366056 244898 193643 233873 340901 448152 490821 453884 375743 306577 267997 250306
38766 250306 239303 240500 278388 372054 509843 650123 751286 802078 823828 848841 898959
38755 898959 975490 1058501 1117845 1134499 1112702 1068334 1012274 954442 915172 912043 933261 943749
38743 943749 927470 908955 919193 949289 952015 885529 745254 558140 359567 175953 16919
38732 16919 -121982 -244538 -339514 -384521 -365117 -287639 -174404 -49997 69552 180308
38722 180308 285315 383206 460515 495249 466304 360505 179888 -47686 -266617 -413795
38712 -413795 -451755 -388179 -267019 -139621 -35466 48740 133056 225025 307386 355973 364925
38701 364925 350465 335738 338233 365401 410901 455648 481410 482937 459200 396744 276451 101770
$$ packed form
38777C66056j21158n1255M0230J07028J07251M2669l6937p8141o9166l8580j7691
38766B50306j1003J197L7888R3666J37789J40280J01163N0792K1750K5013N0118
38755H98959P6531Q3011N9344J6654k1797m4368n6060n7832l9270l129K1218J0488
38743I43749j6279j8515J0238L0096K726o6486j40275j87114j98573j83614j59034
38732A6919j38901j22556r4976m5007J9404P7478J13235J24407J19549J10756
38722A80308J05007R7891P7309L4734k8945j05799j80617k27574k18931j47178
38712d13795l7960O3576J21160J27398J04155Q4206Q4316R1969Q2361M8587Q952
38701C64925j4460j4727K495K7168M5500M4747K5762J527k3737o2456j20293j74681
$$ plain form
38689 101770 -88172 -237016 -298749 -255417 -129960 10665 86082 60391 -27837 -100895 -106749
38678 -106749 -50521 20931 51000 2851 -116624 -256515 -360107 -409484 -424568 -421053 -387884
38667 -387884 -312569 -210532 -113540 -37191 26897 93216 171694 271790 399497 543268 672084
38656 672084 755143 781803 762564 718235 671962 644727 649148 684214 735396 778577 786636 741056
38644 741056 644765 524941 422166 374720 404430 502494 622123 696007 678997 582120 462776
38633 462776 378934 351052 362234 386635 414808 455308 515762 584721 635339 648374 626939
38622 626939 583753 519245 423454 300086 175611 75526 -1456 -75407 -155155 -228250 -281794
38611 -281794 -319871 -350575 -363189 -333130 -253303 -150268 -59375 14911 106530 252544 450910
$$ packed form
38689A01770j89942j48844o1733M3332J25457J40625P5417k5691q8228p3058n854
38678a06749N6228P1452L0069m8149j19475j39891j03592m9377j5084L515L3169
38667c87884P5315J02037R6992P6349O4088O6319P8478J00096J27707J43771J28816
38656F72084Q3059K6660j9239m4329m6273k7235M421L5066N1182M3181Q059m5580
38644G41056r6291j19824j02775m7446K9710R8064J19629P3884j7010r6877j19344
38633D62776q3842k7882J1182K4401K8173M0500O0454O8959N0618J3035k1435
38622F26939m3186o4508r5791j23368j24475j00085p6982p3951p9748p3095n3544
38611b81794l8077l0704j2614L0059P9827J03035R0893P4286R1619J46014J98366
$$ plain form
38600 450910 651045 782639 798347 702031 546250 400334 310110 278757 279904 284558 276735
38589 276735 252891 216685 175432 135867 99999 65864 32470 3493 -12183 -3462 33603 84497
38577 84497 119285 116418 84510 54532 50440 73594 114478 167876 230801 294763 350933 400841
38565 400841 453334 509585 556476 576125 557901 500816 412291 312940 239648 229074 285102
38554 285102 365112 412244 407573 383102 378935 398419 415444 415433 410919 418642 440060 469088 502487
38541 502487 533378 548496 546732 554636 609874 727966 890465 1062749 1217117 1341535 1433683
38530 1433683 1488516 1492065 1433372 1325613 1206870 1110746 1040058 978313 924947 909659 969364
38519 969364 1113378 1308098 1490597 1601597 1615958 1546878 1422813 1266182 1096601 942710
$$ packed form
38600D50910K00135J31594J5708r6316j55781j45916r0224l1353J147M654p823
38589B76735k3844l6206m1253l9565l5868l4135l3394k8977j5676Q721L7065N0894
38577H4497L4788k867l1908k9978m092K3154M0884N3398O2925O3962N6170M9908
38565D00841N2493N6251M6891J9649j8224n7085q8525r9351p3292j0574N6028
38554B85102Q0010M7132m671k4471m167J9484J7025j1m514P723K1418K9028L3399
38541E02487L0891J5118j764P904N5238J18092J62499J72284J54368J24418R2148
38530A433683N4833L549n8693j07759j18743r6124p0688o1745n3366j5288N9705
38519I69364J44014J94720J82499J11000J4361o9080j24065j56631j69581j53891
$$ plain form
38509 942710 834874 785036 782767 812311 867249 950544 1069931 1234024 1444152 1688480 1951892
38498 1951892 2231752 2532547 2840290 3112061 3299725 3381128 3364395 3267538 3100520 2864741
38488 2864741 2564604 2219506 1865608 1542105 1272207 1058258 893945 774273 691137 628648
38478 628648 573814 531202 519172 549486 614232 692432 764291 818504 853106 875162 896783
38467 896783 925294 956901 983618 1004527 1022552 1029051 1002655 933144 840609 758417 698637 647903
38455 647903 598878 568533 574342 604824 629120 629853 611499 579694 530421 464658 400455 361645
38443 361645 359678 389481 435222 475253 489567 472307 437122 406173 394110 403598 432538 479953
38431 479953 541131 595130 599313 506207 297590 5187 -305657 -573460 -763138 -863659
$$ packed form
38509I42710j07836m9838k269K9544N4938Q3295J19387J64093K10128K44328K63412
38498A951892K79860L00795L07743K71771J87664Q1403j6733r6857j67018k35779
38488B864741l00137l45098l53898l23503k69898k13949j64313j19672q3136o2489
38478F28648n4834m2612j2030L0314O4746P8200P1859N4213L4602K2056K1621
38467H96783K8511L1607K6717K0909J8025O499k6396o9511r2535q2192n9780n0734
38455F47903m9025l0345N809L0482K4296P33j8354l1805m9273o5763o4203l8810
38443C61645j967K9803M5741M0031J4314j7260l5185l0949j2063R488K8940M7415
38431D79953O1178N3999M183r3106k08617k92403l10844k67803j89678j00521
$$ plain form
38421 -863659 -879469 -825536 -718883 -570720 -393882 -216482 -72800 26088 99839 167413
38411 167413 218637 229821 200003 155512 119046 88546 51300 9028 -18676 -12234 32100 103394
38399 103394 188702 281396 376351 460603 515466 530712 512859 476612 431425 378981 319119
38388 319119 253369 186153 129510 106840 146322 265452 457431 687711 904545 1061861
38378 1061861 1140055 1145217 1089052 976808 817414 634014 452117 281496 122334 -11803
38368 -11803 -91671 -100054 -54458 4476 44372 59424 65396 84306 131087 206258 297287 388537
38356 388537 471362 545057 609704 660552 689806 692622 671148 634647 597928 578606 589863 629067
38344 629067 672999 691348 670997 625730 578271 534737 481925 408628 322413 242827 184724
$$ packed form
38421h63659j5810N3933J06653J48163J76838J77400J43682R8888P3751O7574
38411A67413N1224J1184k9818m4491l6466l0500l7246m2272k7704O442M4334P1294
38399A03394Q5308R2694R4955Q4252N4863J5246j7853l6247m5187n2444n9862
38388C19119o5750o7216n6643k2670L9482J19130J91979K30280K16834J57316
38378A061861P8194N162n6165j12244j59394j83400j81897j70621j59162j34137
38368a1803p9868q383M5596N8934L9896J5052N972J8910M6781P5171R1029R1250
38356C88537Q2825P3695O4647N0848K9254K816k1474l6501l6719j9322J1257L9204
38344F29067M3932J8349k0351m5267m7459m3534n2812p3297q6215p9586n8103
$$ plain form
38333 184724 154412 157430 199373 275373 365126 443760 494724 508948 479226 408218 321388 255644
38321 255644 223489 195971 133956 34278 -65477 -125418 -133228 -96274 -23605 71201 160361 212951
38309 212951 217488 185491 134309 76187 24517 -1679 11629 62344 138856 236168 357010
38298 357010 492794 609795 666023 647313 581392 508856 441417 354140 216710 25614 -191160
38287 -191160 -388105 -517911 -548194 -477368 -333876 -155235 29365 196068 320512 389548
38277 389548 414233 416525 400418 345417 231291 62482 -133637 -325227 -489195 -612365
38267 -612365 -687073 -708370 -675951 -596999 -481104 -328593 -129570 117126 384693 624484
38257 624484 792626 869607 860649 787111 676978 553812 430524 316045 225283 175231 172655
$$ packed form
38333A84724l0312L018M1943P6000Q9753P8634N0964J4224k9722p1008q6830o5744
38321B55644l2155k7518o2015r9678r9755n9941p810L6954P2669R4806Q9160N2590
38309B12951M537l1997n1182n8122n1670k6196J3308N0715P6512R7312J20842
38298C57010J35784J17001N6228j8710o5921p2536o7439q7277j37430j91096k16774
38287a91160j96945j29806l0283P0826J43492J78641J84600J66703J24444O9036
38277C89548K4685K292j6107n5001j14126j68809j96119j91590j63968j23170
38267f12365p4708k1297L2419P8952J15895J52511J99023K46696K67567K39791
38257F24484J68142P6981q958p3538j10133j23166j23288j14479r0762n0052k576
$$ plain form
38246 172655 214432 300612 438184 628643 857250 1094617 1302011 1437589 1472653 1411351
38236 1411351 1290234 1154278 1035187 946340 880648 806229 680634 487522 259149 56004
38226 56004 -73208 -112187 -76185 -7427 38806 28190 -24779 -72803 -82931 -61668 -38077
38215 -38077 -38250 -78500 -164362 -281578 -396053 -476003 -513232 -517473 -497740 -460682 -420874 -393082
38203 -393082 -367785 -308639 -187836 -19499 152851 299164 420188 520617 581305 572558
38193 572558 490488 367422 246289 155358 107351 105013 133939 158376 141751 76268 -13221
38182 -13221 -94152 -148520 -173438 -173213 -158439 -146092 -150789 -173999 -203145 -219378 -204903 -147118
38170 -147118 -41411 108362 292145 494526 693120 860456 972317 1015438 988645 901732
$$ packed form
38246A72655M1777Q6180J37572J90459K28607K37367K07394J35578L5064o1302
38236A411351j21117j35956j19091q8847o5692p4419j25595j93112k28373k03145
38226E6004j29212l8979L6002O8758M6233j0616n2969m8024j0128K1263K3591
38215c8077j73m0250q5862j17216j14475p9950l7229m241J9733L7058L9808K7792
38203c93082K5297N9146J20803J68337J72350J46313J21024J00429O0688q747
38193E72558q2070j23066j21133r0931m8007k338K8926K4437j6625o5483q9489
38182a3221q0931n4368k4918K25J4774J2347m697k3210k9146j6233J4475N7785
38170a47118J05707J49773J83783K02381J98594J67336J11861M3121k6793q6913
$$ plain form
38160 901732 776446 643381 528296 436160 348652 239306 95408 -67575 -208955 -285203
38150 -285203 -278710 -208203 -109800 -9470 84147 167306 234928 288977 340056 390248 420994
38139 420994 411377 369253 332995 335640 371747 404754 404668 374896 344801 341244 366712 398887 407762
38126 407762 377121 318065 267767 272757 362749 529306 726609 898428 1011262 1064945 1074452
38115 1074452 1045862 970599 837132 644448 410155 174046 -9534 -97850 -90008 -30185
38105 -30185 25318 47237 42980 35986 42622 65885 101362 144481 195630 261494 349459 459062
38093 459062 580830 703497 817087 906134 946828 921357 837538 727761 621934 519968
38083 519968 392042 208355 -26879 -267160 -451645 -548772 -576979 -582323 -596142 -615391 -618497
$$ packed form
38160I01732j25286j33065j15085r2136q7508j09346j43898j62983j41380p6248
38150b85203O493P0507R8403J00330R3617Q3159O7622N4049N1079N0192L0746
38139D20994r617m2124l6258K645L6107L3007q6k9772l0095l557K5468L2175Q875
38126D07762l0641n9056n0298M990Q9992J66557J97303J71819J12834N3683R507
38115A074452k8590p5263j33467j92684k34293k36109j83580q8316P842N9823
38105c0185N5503K1919m257o994O636K3263L5477M3119N1149O5864Q7965J09603
38093D59062J21768J22667J13590Q9047M0694k5471q3819j09777j05827j01966
38083E19968j27926j83687k35234k40281j84485r7127k8207n344j3819j9249l106
$$ plain form
38072 -618497 -588887 -520086 -410313 -265856 -108528 31292 133062 193011 213050 191607
38062 191607 130745 46295 -37965 -107227 -162469 -210021 -249711 -278811 -307124 -360445 -459240
38051 -459240 -590136 -704336 -752036 -719898 -633280 -527043 -423422 -336944 -285276 -281278 -315299
38040 -315299 -353779 -358568 -307765 -204441 -75585 36571 94504 90225 53664 31187 50015
38029 50015 100132 147479 162311 137907 90978 50094 38608 57981 84871 91258 70435 37220
38017 37220 1693 -44076 -103125 -148987 -143466 -79126 11802 93583 156165 202401 223355 201745
38005 201745 133573 35468 -63999 -131930 -139876 -82168 13952 107567 174881 215343 233190 226825
37993 226825 197106 153205 104217 50578 -14014 -95835 -192977 -285820 -339919 -333134 -283397 -238743
$$ packed form
38072f18497K9610O8801J09773J44457J57328J39820J01770N9949K0039k1443
38062A91607o0862q4450q4260o9262n5242m7552l9690k9100k8313n3321r8795
38051d59240j30896j14200m7700L2138Q6618J06237J03621Q6478N1668L998l4021
38040c15299l8480m789N0803J03324J28856J12156N7933m279l6561k2477J8828
38029E0015N0117M7347J4832k4404m6929m0884j1486J9373K6890O387k0823l3215
38017C7220l5527m5769n9049m5862N521O4340R0928Q1781O2582M6236K0954k1610
38005B01745o8172r8105r9467o7931p946N7708R6120R3615O7314M0462J7847o365
37993B26825k9719m3901m8988n3639o4592q1821r7142r2843n4099O785M9737M4654
$$ plain form
37981 -238743 -235122 -270571 -319009 -354145 -355022 -304655 -198349 -49177 122760 302401 477406
37970 477406 633860 763860 871475 962377 1031678 1068387 1066683 1028051 961629 889758 840193
37959 840193 816743 784845 704598 577395 444867 342331 268998 205080 139751 74232 12227
37948 12227 -39383 -66098 -52172 8167 106250 221294 329839 424338 523716 651188 794458
37937 794458 900263 919418 850252 729879 592712 450091 303841 165028 59565 23235
37927 23235 85071 240986 443352 628252 755696 817796 814803 742411 608319 446194 298966
37916 298966 188126 102077 12506 -95203 -199076 -247684 -201727 -73897 80538 217147
37906 217147 338270 472258 628305 780551 888320 921568 872133 752106 582924 383999
$$ packed form
37981b38743L621l5449m8438l5136q77N0367J06306J49172J71937J79641J75005
37970D77406J56454J30000J07615R0902O9301L6709j704l8632o6422p1871m9565
37959H40193k3450l1898q0247j27203j32528j02536p3333o3918o5329o5519o2005
37948A2227n1610k6715J3926O0339R8083J15044J08545R4499R9378J27472J43270
37937G94458J05805J9155o9166j20373j37167j42621j46250j38813j05463l6330
37927B3235O1836J55915K02366J84900J27444O2100k993p2392j34092j62125j47228
37916B98966j10840q6049q9571j07709j03873m8608M5957J27830J54435J36609
37906B17147J21123J33988J56047J52246J07769L3248m9435j20027j69182j98925
$$ plain form
37896 383999 177043 1403 -93483 -89488 -27946 21448 21568 -11583 -41933 -46652 -15566 59347
37884 59347 178113 323752 468035 582896 647382 657749 637699 626090 643757 679022 710799
37873 710799 733640 752159 767472 786132 828533 901555 963366 940368 791031 543728 268856
37862 268856 26146 -158342 -282819 -354840 -382391 -370087 -323703 -259032 -199619 -162220 -150328
37851 -150328 -163544 -202543 -257526 -300825 -302598 -252371 -159885 -40983 87507 202348 275569
37840 275569 286066 226779 102983 -68506 -256753 -419761 -516100 -517869 -419675 -242302 -27051
37829 -27051 179234 336792 414858 393737 279304 116476 -23447 -79611 -32122 94041
37819 94041 243997 354311 379114 314489 201655 100296 52366 65484 123073 204733 298410
$$ packed form
37896C83999k06956j75640r4886L995O1542M9394J20l3151l0350m719L1086P4913
37884E9347J18766J45639J44283J14861O4486J0367k0050j1609J7667L5265L1777
37873G10799K2841J8519J5313J8660M2401P3022O1811k2998j49337k47303k74872
37862B68856k42710j84488j24477p2021k7551J2304M6384O4671N9413L7399J1892
37851a50328j3216l8999n4983m3299j773N0227R2486J18902J28490J14841P3221
37840B75569J0497n9287j23796j71489j88247j63008r6339j769R8194J77373K15251
37829b7051K06285J57558P8066k1121j14433j62828j39923n6164M7489J26163
37819I4041J49956J10314K4803o4625j12834j01359m7930J3118N7589Q1660R3677
$$ plain form
37808 298410 399198 502807 604697 704981 806789 902939 968314 976840 930178 864423 826462
37797 826462 847216 932481 1061925 1188222 1252991 1225907 1132288 1033227 977251 975347 1013554
37786 1013554 1069916 1115332 1118047 1066415 985115 917290 888240 889569 893385 871480 801324 669309
37774 669309 484633 291461 152837 105623 127245 156833 157161 149600 179575 255889 341471
37763 341471 402678 445831 495646 557413 619601 681010 749158 811694 833036 789068 690345
37752 690345 561019 407540 222663 15711 -174082 -296934 -322607 -256831 -137450 -14524
37742 -14524 75296 125207 156357 201779 285630 406493 535505 634786 681033 669872 601830
37731 601830 477170 309871 135025 -10605 -114483 -189801 -256152 -324532 -393558 -447602
$$ packed form
37808B98410J00788J03609J01890J00284J01808R6150O5375Q526m6662o5755l7961
37797H26462K0754Q5265J29444J26297O4769k7084r3619r9061n5976j904L8207
37786A013554N6362M5416K715n1632q1300o7825k9050J329L816k1905p0156j32015
37774F69309j84676j93172j38624m7214K1622K9588L28p561K9975P6314Q5582
37763C41471O1207M3153M9815O1767O2188O1409O8148O2536K1342m3968r8723
37752F90345j29326j53479j84877k06952j89793j22852k5673O5776J19381J22926
37742a4524Q9820M9911L1150M5422Q3851J20863J29012R9281M6247j1161o8042
37731F01830j24660j67299j74846j45630j03878p5318o6351o8380o9026n4044
$$ plain form
37721 -447602 -460009 -411007 -308630 -189253 -97484 -67131 -113504 -229308 -383228 -530974
37711 -530974 -636776 -688700 -698572 -690666 -683680 -672966 -630615 -531694 -382038 -215657 -67622
37700 -67622 43808 115256 154559 180048 208269 236996 251211 248635 245533 253174 266392 285837
37688 285837 332899 421622 524975 592346 603087 588503 598604 656997 746300 823984 852056
37677 852056 827312 789943 792410 852129 938999 1009603 1042480 1035913 986216 884688 734883
37666 734883 561981 401135 278058 197920 147217 105550 59347 7804 -40474 -73148 -79925
37655 -79925 -62255 -40369 -41888 -75717 -121650 -153419 -169677 -195271 -253237 -341659 -435649 -502782
37643 -502782 -516041 -463735 -357753 -231955 -126459 -68466 -62914 -95421 -143276 -189615 -231289
$$ packed form
37721d47602j2407M9002J02377J19377R1769L0353m6373j15804j53920j47746
37711e30974j05802n1924r872P906O986J0714M2351R8921J49656J66381J48035
37700f7622J11430P1448L9303K5489K8221K8727J4215k576l102P641J3218J9445
37688B85837M7062Q8723J03353O7371J0741j4584J0101N8393Q9303P7684K8072
37677H52056k4744l7369K467N9719Q6870P0604L2877o567m9697j01528j49805
37666G34883j72902j60846j23077q0138n0703m1667m6203n1543m8278l2674o777
37655g9925J7670K1886j519l3829m5933l1769j6258k5594n7966q8422r3990o7133
37643e02782j3259N2306J05982J25798J05496N7993N552l2507m7855m6339m1674
$$ plain form
37632 -231289 -270161 -294655 -276141 -191745 -50632 107025 235937 306232 304339 230056 101973
37621 101973 -42646 -166290 -250948 -295800 -302127 -273800 -232030 -211574 -228910 -260180 -261330
37610 -261330 -206758 -99121 52294 243284 457659 652508 776435 804272 750907 656363
37600 656363 563516 503368 487925 513911 580053 699790 884463 1108768 1306462 1417844
37590 1417844 1443372 1440582 1464658 1517852 1557658 1542811 1461246 1319793 1124920 885124 627866
37579 627866 402398 258535 220746 279786 402408 545350 667537 745245 787522 834618
37569 834618 928870 1076607 1236817 1351199 1389955 1371634 1340516 1324302 1309823 1254543 1120523
37558 1120523 903812 641397 393985 214274 118967 85938 81944 95625 141421 233300 364396
$$ packed form
37632b31289l8872k4494J8514Q4396J41113J57657J28912P0295j893p4283j28083
37621A01973j44619j23644q4658m4852o327K8327M1770K0456j7336l1270j150
37610b61330N4572J07637J51415J90990K14375J94849J23927K7837n3365r4544
37600F56363r2847o0148j5443K5986O6142J19737J84673K24305J97694J11382
37590A417844K5528k790K4076N3194L9806j4847q1565j41453j94873k39796k57258
37579F27866k25468j43863l7789N9040J22622J42942J22187P7708M2277M7096
37569H34618R4252J47737J60210J14382L8756j8321l1118j6214j4479n5280j34020
37558A120523k16711k62415k47412j79711r5307l3029l994J3681M5796R1879J31096
$$ plain form
37547 364396 516815 680738 851315 1010776 1128309 1181656 1170751 1109082 1013115 905800
37537 905800 819346 781228 796321 846255 903846 946162 960009 941992 892834 811506 702261
37526 702261 591151 525365 544903 656659 839848 1065416 1296604 1480174 1563068 1528431
37516 1528431 1404722 1233495 1037982 827830 620284 441492 309122 222663 169394 133338
37506 133338 101210 68858 44658 42132 66795 111634 165338 222514 285143 355826 431288 502782
37494 502782 560972 597093 599429 556339 471680 376681 317849 327902 408903 539842 690690
37483 690690 826257 908233 909176 831251 710178 597717 533999 526755 549630 560327 525724
37472 525724 437685 314481 191697 105096 71433 83701 128062 199902 294037 385459 439026
$$ packed form
37547C64396J52419J63923J70577J59461J17533N3347j0905o1669r5967j07315
37537I05800q6454l8118J5093M9934N7591M2316J3847j8017m9158q1328j09245
37526G02261j11110o5786J9538J11756J83189K25568K31188J83570Q2894l4637
37516A528431j23709j71227j95513k10152k07546j78792j32370q6459n3269l6056
37506A33338l2128l2352k4200k526K4663M4839N3704N7176O2629P0683P5462P1494
37494E02782N8190L6121K336m3090q4659r4999n8832J0053Q1001J30939J50848
37483F90690J35567Q1976R43p7925j21073j12461o3718p244K2875J0697l4603
37472E25724q8039j23204j22784q6601l3663J2268M4361P1840R4135R1422N3567
$$ plain form
37461 439026 443834 423011 400771 372817 321171 247585 176221 127065 99883 82892 65766 44536
37449 44536 23623 12885 14306 14260 1182 -8479 24626 124984 276073 434324 559512 626620
37437 626620 620893 539302 400788 245549 115775 35961 12292 45937 137942 278015 437757
37426 437757 589129 733736 905797 1140292 1441349 1781562 2119310 2407534 2599027 2667698
37416 2667698 2632068 2544441 2445304 2330470 2166882 1937169 1665867 1406908 1209895 1093187
37406 1093187 1038996 1008337 962489 877496 747640 582193 400371 226826 87814 4959
37396 4959 -15727 8498 46604 77986 107320 153391 226113 317463 410592 491808 555483 602709
37384 602709 635001 646741 627183 574927 508560 458585 450249 494717 586311 695625 768391
$$ packed form
37461D39026M808k0823k2240k7954n1646p3586p1364m9156k7182j6991j7126k1230
37449D4536k0913j0738J421m6j3078r661L3105J00358J51089J58251J25188O7108
37437F26620n727q1591j38514j55239j29774p9814k3669L3645R2005J40073J59742
37426D37757J51372J44607J72061K34495L01057L40213L37748K88224J91493O8671
37416B667698l5630q7627r9137j14834j63588k29713k71302k58959j97013j16708
37406A093187n4191l0659m5848q4993j29856j65447j81822j73545j39012q2855
37396D959k0686K4225L8106L1382K9334M6071P2722R1350R3129Q1216O3675M7226
37384F02709L2292J1740j9558n2256o6367m9975q336M4468R1594J09314P2766
$$ [...]
##END NTUPLES=NMR SPECTRUM
##END=
