##TITLE=31Pdec_LR-775-C1M
 CDCl3
  24 sc
 1.11.2023
##JCAMPDX= 6.0         $$ Bruker NMR JCAMP-DX V2.0
##DATA TYPE= NMR SPECTRUM
##DATA CLASS= NTUPLES
##ORIGIN= UXNMR, Bruker Analytische Messtechnik GmbH
##OWNER= root
$$ XWIN-NMR		Version 3.5
$$ Wed Nov  1 14:57:09 2023 Russian Standard Time (UT+4h)  she@DPX200
##.OBSERVE FREQUENCY= 81.013821
##.OBSERVE NUCLEUS= ^31P
##.ACQUISITION MODE= SIMULTANEOUS
##.ACQUISITION SCHEME= undefined
##.AVERAGES= 24
##.DIGITISER RES= 16
##SPECTROMETER/DATA SYSTEM= spect
##.PULSE SEQUENCE= zgpg30
##.SOLVENT NAME= CDCl3
##.SHIFT REFERENCE= (INTERNAL, CDCl3, 0, 248.564)
##AUDIT TRAIL= $$ (NUMBER, WHEN, WHO, WHERE, WHAT)
$$ ##TITLE= Audit trail, XWIN-NMR		Version 3.5
$$ ##JCAMPDX= 5.01
$$ ##ORIGIN= Bruker BioSpin GmbH
$$ ##OWNER= she
$$ F:/spectra/data/she/nmr/P31/1/pdata/1/auditp.txt
$$ ##AUDIT TRAIL=  $$ (NUMBER, WHEN, WHO, WHERE, WHAT)
(   1,<2023-11-01 14:56:06.67 +0400>,<she>,<DPX200>,
      <created by zg, POWCHK disabled, PULCHK disabled
       configuration hash MD5:
       00 E9 B6 7A A2 85 ED C7 34 08 36 98 17 FE 4E 26
       data hash MD5: 32K
       D3 C8 33 4E 89 EE 15 32 74 99 55 F9 C0 EB 85 66>)
(   2,<2023-11-01 14:56:10.96 +0400>,<she>,<DPX200>,
      <Start of raw data processing
       efp BC_mod = 2 LB = 5 FT_mod = 6 PKNL = 1 PHC0 = -10644.94 PHC1 = 36.4902 SI = 64K 
       data hash MD5: 64K
       6F 8C 8D 5B 42 01 AE B0 45 B7 28 0E 46 E4 15 01>)
(   3,<2023-11-01 14:56:30.04 +0400>,<she>,<DPX200>,
      <pk PHC0 = 12.03322 PHC1 = 0 
       data hash MD5: 64K
       1B A6 83 B0 C2 A3 F2 6E 9A 93 3C 39 DD EF E0 0D>)
(   4,<2023-11-01 14:56:44.65 +0400>,<she>,<DPX200>,
      <abs ABSG = 5 
       data hash MD5: 64K
       B0 33 9E 49 B9 B4 EA 2B 04 05 A9 AD B0 78 29 C6>)
$$ ##END=
$$ 
$$ hash MD5
$$ 22 54 8D 71 52 92 E1 B7 71 94 E9 EF 74 69 CD 2A
##$RELAX= 
##$RELAX= 
##$RELAX= 
##$RELAX= 
##$RELAX= 
##$RELAX= 
##$RELAX= 
##$RELAX= 
##$RELAX= 
$$ Bruker specific parameters
$$ --------------------------
##$DU= <F:/spectra>
##$EXPNO= 1
##$NAME= <P31>
##$PROCNO= 1
##$TYPE= <nmr>
##$USER= <she>
##$AMP= (0..31)
100 100 100 100 100 100 100 100 100 100 100 100 100 100 100 100 100 100 
100 100 100 100 100 100 100 100 100 100 100 100 100 100 
##$AQSEQ= 0
##$AQ_mod= 1
##$AUNM= <au_zg>
##$AUTOPOS= <>
##$BF1= 81.014009
##$BF2= 200.13
##$BF3= 200.13
##$BF4= 200.13
##$BF5= 200.13
##$BF6= 200.13
##$BF7= 200.13
##$BF8= 200.13
##$BYTORDA= 1
##$CFDGTYP= 0
##$CFRGTYP= 5
##$CHEMSTR= <none>
##$CNST= (0..31)
1 1 145 1 1 1 1 1 1 1 1 1 1 1 1 1 1 1 1 1 1 1 1 1 1 1 1 1 1 1 1 1 
##$CPDPRG= <waltz16>
##$CPDPRG1= <>
##$CPDPRG2= <waltz16>
##$CPDPRG3= <>
##$CPDPRG4= <mlev>
##$CPDPRG5= <mlev>
##$CPDPRG6= <mlev>
##$CPDPRG7= <mlev>
##$CPDPRG8= <mlev>
##$CPDPRGB= <>
##$CPDPRGT= <>
##$D= (0..31)
0 1 0 0 0 0 0 0 0 0 0 0.03 2e-05 3e-06 0 0 0 0 0 0 0 0 0 0 0 0 0 0 0 0 
0 0 
##$DATE= 1698836166
##$DBL= (0..7)
120 120 120 11 120 120 24 19 
##$DBP= (0..7)
150 150 150 150 150 150 150 150 
##$DBP07= 0
##$DBPNAM0= <>
##$DBPNAM1= <>
$$ [...]
##$SUBNAM3= <"">
##$SUBNAM4= <"">
##$SUBNAM5= <"">
##$SUBNAM6= <"">
##$SUBNAM7= <"">
##$SUBNAM8= <"">
##$SUBNAM9= <"">
##$SW= 501.771253377433
##$SWIBOX= (0..15)
0 1 3 0 0 0 0 0 0 0 0 0 0 0 0 0 
##$SW_h= 40650.406504065
##$TD= 32768
##$TD0= 1
##$TE= 0
##$TE2= 300
##$TE3= 300
##$TEG= 300
##$TL= (0..7)
0 120 53 12 22 120 120 120 
##$TP= (0..7)
150 150 150 150 150 150 150 150 
##$TP07= 0
##$TPNAME0= <>
##$TPNAME1= <>
##$TPNAME2= <>
##$TPNAME3= <>
##$TPNAME4= <>
##$TPNAME5= <>
##$TPNAME6= <>
##$TPNAME7= <>
##$TPOAL= (0..7)
0.5 0.5 0.5 0.5 0.5 0.5 0.5 0.5 
##$TPOFFS= (0..7)
0 0 0 0 0 0 0 0 
##$TUNHIN= 0
##$TUNHOUT= 0
##$TUNXOUT= 0
##$USERA1= <user>
##$USERA2= <user>
##$USERA3= <user>
##$USERA4= <user>
##$USERA5= <user>
##$V9= 5
##$VALIST= <valist>
##$VCLIST= <CCCCCCCCCCCCCCC>
##$VD= 0
##$VDLIST= <DDDDDDDDDDDDDDD>
##$VPLIST= <PPPPPPPPPPPPPPP>
##$VTLIST= <TTTTTTTTTTTTTTT>
##$WBST= 1024
##$WBSW= 4
##$XGAIN= (0..3)
0 0 0 0 
##$XL= 0
##$YL= 0
##$YMAX_a= 4170
##$YMIN_a= -4415
##$ZGOPTNS= <>
##$ZL1= 120
##$ZL2= 120
##$ZL3= 120
##$ZL4= 120
##$ABSF1= 248.5645
##$ABSF2= -253.2056
##$ABSG= 5
##$ABSL= 3
##$ALPHA= 0
##$AQORDER= 0
##$ASSFAC= 0
##$ASSFACI= 0
##$ASSFACX= 0
##$ASSWID= 0
##$AUNMP= <proc_1d>
##$AZFE= 0.1
##$AZFW= 0.5
##$BCFW= 0
##$BC_mod= 2
##$BYTORDP= 0
##$COROFFS= 0
##$CY= -3
##$DATMOD= 1
##$DC= 0
##$DFILT= <>
##$DTYPP= 0
##$F1P= 0
##$F2P= 0
##$FCOR= 1
##$FTSIZE= 65536
##$FT_mod= 6
##$GAMMA= 0
##$GB= 0
##$INTBC= 1
##$INTSCL= 6.047779e-11
##$ISEN= 30
##$LB= 5
##$LEV0= 0
##$LPBIN= 0
##$MAXI= 10000
##$MC2= 0
##$MEAN= 0
##$ME_mod= 0
##$MI= 50
##$NCOEF= 0
##$NC_proc= -8
##$NLEV= 6
##$NOISF1= 182.463
##$NOISF2= 159.3651
##$NSP= 0
##$NTH_PI= 0
##$NZP= 0
##$OFFSET= 248.5645
##$PC= 4
##$PHC0= -10632.91
##$PHC1= 36.4902
##$PH_mod= 1
##$PKNL= yes
##$PPARMOD= 0
##$PSCAL= 0
##$PSIGN= 0
##$REVERSE= no
##$SF= 81.0140089999694
##$SI= 65536
##$SIGF1= 159.3651
##$SIGF2= -187.1042
##$SINO= 113.3802
##$SIOLD= 16384
##$SREGLST= <1H.CDCl3>
##$SSB= 0
##$STSI= 65536
##$STSR= 0
##$SW_p= 40650.406504065
##$SYMM= 0
##$S_DEV= 0
##$TDeff= 32768
##$TDoff= 0
##$TI= <>
##$TILT= no
##$TM1= 0
##$TM2= 0
##$TOPLEV= 0
##$USERP1= <user>
##$USERP2= <user>
##$USERP3= <user>
##$USERP4= <user>
##$USERP5= <user>
##$WDW= 1
##$XDIM= 65536
##$YMAX_p= 447165334
##$YMIN_p= -20262422
$$ End of Bruker specific parameters
$$ ---------------------------------
##NTUPLES= NMR SPECTRUM
##VAR_NAME=  FREQUENCY,     SPECTRUM/REAL,   SPECTRUM/IMAG
##SYMBOL=    X,             R,               I
##VAR_TYPE=  INDEPENDENT,   DEPENDENT,       DEPENDENT
##VAR_FORM=  AFFN,          ASDF,            ASDF
##VAR_DIM=   65536,         65536,           65536
##UNITS=     HZ,            ARBITRARY UNITS, ARBITRARY UNITS
##FACTOR=    0.620285442955139, 1,           1
##FIRST=     20137.2065510682, 0,            0
##LAST=      -20513.1999529968, 0,           0
##MIN=       -20513.1999529968, -20262422,   0
##MAX=       20137.2065510682, 447165334,    0
$$ Real data points
##PAGE= N=1
##DATA TABLE= (X++(R..R)), XYDATA
$$ [...]
43074a007419M16878L84124K48177J897k62469m26564m45858l50041j65643R7543
43064a509375L65523M75736L09994n5820l93597n24956m39957k19029Q2099M18315
43054a491067O89015P83853P01959N62967M81852M73748M85363M63513L71565
43045C522768J91818m7136k69934m02948l99798k23924J23231N23779P68554P35699
43035D522109N08165K52625K6665k13979m60495o24216o71629o71848o64932n74797
43025A427668l23073K5997L03815L96083L20559J80107Q6035R7978J80459K24447
43015B920075J56290K7369l3194M5848K06806L15376K67475O8673j60766k75711
43005C538241k35743j40045j11929j67662k31557k57697k80061l36533l96338
$$ plain form
43074 -1007419 -590541 -206417 41760 43657 -218812 -645376 -1091234 -1441275 -1606918 -1509375
43064 -1509375 -1143852 -668116 -358122 -413942 -807539 -1332495 -1772452 -1991481 -1909382 -1491067
43054 -1491067 -802052 -18199 683760 1246727 1728579 2202327 2687690 3151203 3522768
43045 3522768 3714586 3667450 3397516 2994568 2594770 2370846 2494077 3017856 3786410 4522109
43035 4522109 5030274 5282899 5309564 5095585 4635090 4010874 3339245 2667397 2002465 1427668
43025 1427668 1104595 1130592 1434407 1830490 2151049 2331156 2417191 2515169 2695628 2920075
43015 2920075 3076365 3103734 3070540 3116388 3323194 3638570 3906045 3974718 3813952 3538241
43005 3538241 3302498 3162453 3050524 2882862 2651305 2393608 2113547 1777014 1380676
42996A380676l98064l41668l10983l90711n57242o61131n48206k18971J50964
42987a895336L72503M07649L51520K87741K21858J47022R9876J18847J92129K78371
42977E82180L41703L34570J89633j10197m63890p09995p64991o71540n09051l10419
42967b091997j00083L3094j8642k39864m43456m17645j27403K52136N03592N49120
42957b101148M69509L83070L36610K99285K22983R3360n9435j80011k20865j75203
42947i31845q9229l4732n0425j03750j26673r9215p3365q7410q1377M6544K94152
42936a337325N20193N79742M51685K06774r4397m15361o95278q63002q99874q38036
42926c384879p03479n14271l26077k06140j42358l9166J63888M11815N94776O43206
$$ plain form
42996 1380676 982612 640944 329961 -60750 -617992 -1279123 -1827329 -2046300 -1895336
42987 -1895336 -1522833 -1115184 -763664 -475923 -254065 -107043 -7167 111680 303809 582180
42977 582180 923883 1258453 1448086 1337889 873999 164004 -600987 -1272527 -1781578 -2091997
42967 -2091997 -2192080 -2158986 -2177628 -2417492 -2860948 -3278593 -3405996 -3153860 -2650268 -2101148
42957 -2101148 -1631639 -1248569 -911959 -612674 -389691 -296331 -355766 -535777 -756642 -931845
42947 -931845 -1021074 -1055806 -1106231 -1209981 -1336654 -1435869 -1509234 -1596644 -1678021 -1631477 -1337325
42936 -1337325 -817132 -237390 214295 421069 326672 -88689 -783967 -1646969 -2546843 -3384879
42926 -3384879 -4088358 -4602629 -4928706 -5134846 -5277204 -5316370 -5152482 -4740667 -4145891 -3502685
42916c502685N41114L08214K4709j65825j45821Q4009M28281P83163J057214J146757
42906E59130R80965O14860K20580n3933j99235l03021m21914n20235n23530m06889
42896e3222k24153n9305M0663P9705P0617O161j13523k46129l29073l34590k85627
42885a448476k22253j70396j35930j03519m0672P0106J90814K34759J29310j23123
42875a619380m36279o80921p47639o03069l09087Q244K16220K30003N7569j84596
42865d068935l31813k95281j30694M0459J71004L18072N36425P81786R37044R14797
42855a127136P28139M81267K92156J96877J22468k3379k35386m13730m84625m76221
42845i39570m62234m75991n06170n33929n32859m63624l17349j50248l4955J1506
$$ plain form
42916 -3502685 -2961571 -2653357 -2628648 -2794473 -2940294 -2856285 -2428004 -1644841 -587627 559130
42906 559130 1540095 2154955 2375535 2321602 2122367 1819346 1397432 877197 353667 -53222
42896 -53222 -277375 -336680 -296017 -216312 -145695 -139534 -253057 -499186 -828259 -1162849 -1448476
42885 -1448476 -1670729 -1841125 -1977055 -2080574 -2121246 -2051140 -1860326 -1625567 -1496257 -1619380
42875 -1619380 -2055659 -2736580 -3484219 -4087288 -4396375 -4388131 -4171911 -3941908 -3884339 -4068935
42865 -4068935 -4400748 -4696029 -4826723 -4786264 -4615260 -4297188 -3760763 -2978977 -2041933 -1127136
42855 -1127136 -398997 82270 374426 571303 693771 670392 435006 21276 -463349 -939570
42845 -939570 -1401804 -1877795 -2383965 -2917894 -3450753 -3914377 -4231726 -4381974 -4416929 -4405423
42835d405423J6422j3008r3670k10585l04244l20652k39664o0269J89610M20934
42825e020549N22620M71308L67688L28763L68542M12537L98763L25353K23478
42816a601497J33686J01782J49740K41588L12217L39732L64312M32817N52379
42807A026756O96595Q16605Q37527O95299M13057J09011j09758k37564l18238
42798C929290l37345k35817k9328J60709K29999J93292J18907M895k09905n17811
42788C306886p93426r04071q37707o95290n76987n00878m18702k80612q2758J24433
42778a659112K61468K65405J31396p8013k63720l40025k72240q3255J65809M01026
42768a471261N55264N86674M96778L31105J52695J1824o0312m5763M9136J77952
$$ plain form
42835 -4405423 -4389001 -4402009 -4495679 -4706264 -5010508 -5331160 -5570824 -5631093 -5441483 -5020549
42825 -5020549 -4497929 -4026621 -3658933 -3330170 -2961628 -2549091 -2150328 -1824975 -1601497
42816 -1601497 -1467811 -1366029 -1216289 -974701 -662484 -322752 41560 474377 1026756
42807 1026756 1723351 2539956 3377483 4072782 4485839 4594850 4485092 4247528 3929290
42798 3929290 3591945 3356128 3326800 3487509 3717508 3910800 4029707 4034602 3824697 3306886
42788 3306886 2513460 1609389 771682 76392 -500595 -1001473 -1420175 -1700787 -1783545 -1659112
42778 -1659112 -1397644 -1132239 -1000843 -1078856 -1342576 -1682601 -1954841 -2038096 -1872287 -1471261
42768 -1471261 -915997 -329323 167455 498560 651255 663079 602767 557004 606140 784092
42758G84092K74794L04940K82416K27736J26464m6914k69026m57143n32337m87583
42748B07439l87479l05731k70953k73234l06881l77372m52009m33632k37523Q9452
42738b747923L68186M44475L30439J59850K8356o9093j52371j83478j18502J2001
42728a928060J22972J59685J32630Q9141Q2624J44930K45661K98823K62150K13041
42718a76403K56055L56772L56835J90824O948K968J96027M31504N76699O08269
42708B806498N25898K98266o1941m47093p33056q69123q66905p62015o26530n52777
42698a288778n55559n30976l81856j54784J7516Q2757R3408P9928P975j08511
42688b738880j49846j7103K37241M71485O12660O89313P35034P37326O84461N91395
$$ plain form
42758 784092 1058886 1363826 1646242 1873978 2000442 1953528 1684502 1227359 695022 207439
42748 207439 -180040 -485771 -756724 -1029958 -1336839 -1714211 -2166220 -2599852 -2837375 -2747923
42738 -2747923 -2379737 -1935262 -1604823 -1444973 -1416617 -1485710 -1638081 -1821559 -1940061 -1928060
42728 -1928060 -1805088 -1645403 -1512773 -1423632 -1341008 -1196078 -950417 -651594 -389444 -176403
42718 -176403 79652 436424 793259 984083 991031 993999 1190026 1621530 2198229 2806498
42708 2806498 3332396 3630662 3568721 3121628 2388572 1519449 652544 -109471 -736001 -1288778
42698 -1288778 -1844337 -2375313 -2757169 -2911953 -2894437 -2811680 -2718272 -2638344 -2630369 -2738880
42688 -2738880 -2888726 -2905829 -2668588 -2197103 -1584443 -895130 -160096 577230 1261691 1853086
42678A853086M53539K34201n3528k87935l26692j62215N1196J43183P6112o2256
42668A918691j76470k35206k47939k27272j86478j32127m0932J16217L01574M04999
42658A495057L57077K21240J23418J06952J08326O2890k5737j17903j71715j34363
42648B025242K4767K32499L23779J97659n9152k44158k17525J1106L26040N78651
42638C198908O44926M89337J99262p8484k60201l75725m91902o00349n97574l89515
42628A738683k1621L16559M53151L98940L10680K88631K72069J62579j8989j66767
42618C733915k39985k97660l91154m92460n38118m88632l34430r8873J39176K66577
42608A258356K14293Q014k58125m75936n62517m96072l35227j76778p7122k8162
$$ plain form
42678 1853086 2306625 2540826 2487298 2199363 1872671 1710456 1761652 1904835 1980947 1918691
42668 1918691 1742221 1507015 1259076 1031804 845326 713199 672267 788484 1090058 1495057
42658 1495057 1852134 2073374 2196792 2303744 2412070 2474960 2449223 2331320 2159605 2025242
42648 2025242 2050009 2282508 2606287 2803946 2744794 2500636 2283111 2294217 2620257 3198908
42638 3198908 3843834 4333171 4532433 4453949 4193748 3818023 3326121 2725772 2128198 1738683
42628 1738683 1717062 2033621 2486772 2885712 3196392 3485023 3757092 3919671 3900682 3733915
42618 3733915 3493930 3196270 2805116 2312656 1774538 1285906 951476 852603 991779 1258356
42608 1258356 1472649 1480663 1222538 746602 184085 -311987 -647214 -823992 -901114 -929276
42598i29276l765O530J4675M0382P4840O8235j3470j28571j80457j04541O5641
42587a089777K16852K51698J81439J16125J47428K54865L46383L64790L15635
42578A105438K16023Q0673m0893p9989k6779N2173R4640R8772Q1898L5684m3795
42567A573845j24093j75929k16826k79452l59672m27676m67462m73061m26937
42558a377263l17720j68950k4870Q1626J31928J16078M6251m6494j49538k75300
42548a984252m06137m66143l87408j85436O2475K88786M49798N00585M16748K39458
42538a471526N2156r2834j91896k40158k08456q3782R3353K41682K77573J56333
42528a467555q5583l23028m11334k92194l7951K04087L13914K72965J61671P5938
$$ plain form
42598 -929276 -933041 -926511 -911836 -871454 -796614 -728379 -741849 -870420 -1050877 -1155418 -1089777
42587 -1089777 -872925 -621227 -439788 -323663 -176235 78630 425013 789803 1105438
42578 1105438 1321461 1402134 1361241 1281252 1254473 1306646 1401286 1500058 1581956 1617640 1573845
42567 1573845 1449752 1273823 1056997 777545 417873 -9803 -477265 -950326 -1377263
42558 -1377263 -1694983 -1863933 -1888803 -1807177 -1675249 -1559171 -1512920 -1559414 -1708952 -1984252
42548 -1984252 -2390389 -2856532 -3243940 -3429376 -3366901 -3078115 -2628317 -2127732 -1710984 -1471526
42538 -1471526 -1419370 -1512204 -1704100 -1944258 -2152714 -2236496 -2143143 -1901461 -1623888 -1467555
42528 -1467555 -1553138 -1876166 -2287500 -2579694 -2617645 -2413558 -2099644 -1826679 -1665008 -1589070
42518a589070L4922j2902r0605j44776j25126o4505k3825J3387J24978L35176
42508a542346N70410P24690P19266N16794J58184k01923l78094l21046j62721
42499H3214o8506q6513j62311k39970k96974l20035l06565k77532k47889j95078
42489b118159q7682O9482K44320M05278N05378M72095K78858K7308j02921j9335
42479c25378J88496L29807K68880M301l58870o78510q37349p85468n52675k25329
42469b972095R3093L15074L92472L28287J63633n3897k82535m63964n15232l84503
42459c379667j25437J14260K06731J42677J1709q9127j04118j0117J78265L83831
42449b670993M95389M53530K94257J02675n1174j35129j65652k10155l18274m16408
$$ plain form
42518 -1589070 -1554148 -1567050 -1657655 -1802431 -1927557 -1992062 -2015887 -2002500 -1877522 -1542346
42508 -1542346 -971936 -247246 472020 988814 1146998 945075 566981 245935 83214
42499 83214 14708 -71805 -234116 -474086 -771060 -1091095 -1397660 -1675192 -1923081 -2118159
42489 -2118159 -2205841 -2136359 -1892039 -1486761 -981383 -509288 -230430 -203122 -306043 -325378
42479 -325378 -136882 192925 461805 466106 107236 -571274 -1408623 -2194091 -2746766 -2972095
42469 -2972095 -2879002 -2563928 -2171456 -1843169 -1679536 -1733433 -2015968 -2479932 -2995164 -3379667
42459 -3379667 -3505104 -3390844 -3184113 -3041436 -3029727 -3118854 -3222972 -3233089 -3054824 -2670993
42449 -2670993 -2175604 -1722074 -1427817 -1325142 -1376316 -1511445 -1677097 -1887252 -2205526 -2621934
42439b621934l34061Q1M29024P03085P18400N58378L40428J22262n1610j30870
42429b66817j31736j48891k46366l88899n07351n63510n17494l18499r21K73308
42419b817176L58658K85574K03714J90754J95266J55296Q5044K4169l1319j12091
42409a462111k25949l47674m31178m21295k87816o8553J41187K55114K40509J05526
42399b502240j17738l62144n31497n52175m18782j82574R0102L36091M92290N10379
42389c238288L96557K34775J48357K07441L58092M56465L95699K03397Q422q1519
42379i10602o1069k562K1736j2308q9173j87686k95495l90913m29488l76508k57363
42368b991431j50743j17323j50832k04795k35959k02351n7891K01102M93190O99036
$$ plain form
42439 -2621934 -2955995 -2955914 -2526890 -1823805 -1105405 -547027 -206599 -84337 -135947 -266817
42429 -266817 -398553 -547444 -793810 -1182709 -1690060 -2253570 -2771064 -3089563 -3090484 -2817176
42419 -2817176 -2458518 -2172944 -1969230 -1778476 -1583210 -1427914 -1342870 -1318701 -1350020 -1462111
42409 -1462111 -1688060 -2035734 -2466912 -2888207 -3176023 -3244576 -3103389 -2848275 -2607766 -2502240
42399 -2502240 -2619978 -2982122 -3513619 -4065794 -4484576 -4667150 -4577048 -4240957 -3748667 -3238288
42389 -3238288 -2841731 -2606956 -2458599 -2251158 -1893066 -1436601 -1040902 -837505 -829083 -910602
42379 -910602 -971671 -974233 -952497 -964805 -1053978 -1241664 -1537159 -1928072 -2357560 -2734068 -2991431
42368 -2991431 -3142174 -3259497 -3410329 -3615124 -3851083 -4053434 -4111325 -3910223 -3417033 -2717997
42358b717997P58382O98877N80838M51413L47785K93995K73096K36580J65214
42349A088183R5218O1768M2852o955q1697j23348j00766n6796n9727j29033k29590
42338E00109l22157l87710m06863l57146k51486j49875j02283r7936j00374j10719
42328a786440j51823k03980k15575j83888j66224j88470j95594j25875Q636J48229
42318c061004K49311K88105K51174J72819J36333J72402J88206P1893j45030k97140
42308a972931k52342j3333L29090O61581Q61283Q31882N78659K18671r9354k63921
42298H79285k24261l5682J07616j2113m17265q74874j104939j019938p39456m36247
42288c877874k25109j46752j70038k08640j88202j01428K6284J98018M26147O70758
$$ plain form
42358 -2717997 -1959615 -1260738 -679900 -228487 119298 413293 686389 922969 1088183
42349 1088183 1183401 1245169 1288021 1281066 1199369 1076021 975255 918459 858732 729699 500109
42338 500109 177952 -209758 -616621 -973767 -1225253 -1375128 -1477411 -1575347 -1675721 -1786440
42328 -1786440 -1938263 -2142243 -2357818 -2541706 -2707930 -2896400 -3091994 -3217869 -3209233 -3061004
42318 -3061004 -2811693 -2523588 -2272414 -2099595 -1963262 -1790860 -1602654 -1530761 -1675791 -1972931
42308 -1972931 -2225273 -2238606 -1909516 -1247935 -386652 445230 1023889 1242560 1143206 879285
42298 879285 655024 619342 726958 714845 297580 -577294 -1682233 -2702171 -3441627 -3877874
42288 -3877874 -4102983 -4249735 -4419773 -4628413 -4816615 -4918043 -4891759 -4693741 -4267594 -3596836
42278c596836Q51664R23791R03269Q22864P01821N60883M25182K96668J49707
42269B039013l0359k19003l73372m72646n27150n43943m89989l16831n0187J65567
42259h18900J72687l1396k76038l89530l43677k06818k6142J76521L41714L95168
42249a006411L26987J83497r070k45310m73663o08388o22364n59350m38532k24080
42239c676684P2821L32670M33545L84858L01291K62944K47077J88430O8538n6957
42229a441467j03824m1630O0786R7589M8814O308M7671J18891R0087q9484l40560
42218a546819n49976o66552o94567o41162n00911k74941J1566L02262N23174O31655
42208c406271O61639O93237P60604Q12666P83989O78930N52531M24984K61837
$$ plain form
42278 -3596836 -2745172 -1821381 -918112 -95248 606573 1167456 1592638 1889306 2039013
42269 2039013 2008654 1789651 1416279 943633 416483 -127460 -617449 -934280 -984467 -818900
42259 -818900 -646213 -677609 -953647 -1343177 -1686854 -1893672 -1919814 -1743293 -1401579 -1006411
42249 -1006411 -679424 -495927 -504997 -750307 -1223970 -1832358 -2454722 -3014072 -3452604 -3676684
42239 -3676684 -3603863 -3271193 -2837648 -2452790 -2151499 -1888555 -1641478 -1453048 -1384510 -1441467
42229 -1441467 -1545291 -1586921 -1526135 -1428546 -1379732 -1373424 -1325753 -1206862 -1116775 -1206259 -1546819
42218 -1546819 -2096795 -2763347 -3457914 -4099076 -4599987 -4874928 -4863362 -4561100 -4037926 -3406271
42208 -3406271 -2744632 -2051395 -1290791 -478125 305864 984794 1537325 1962309 2224146
42199B224146M6456j69367l12583l61183l41873k77164j74110n9600J6479K7160
42189F18361j0508o8862j30096j60960j16751j4572L3647p1049k75449m02446
42179e98685l35014j26744Q6755K34131L30540L98210M23143L82564K75524J31474
42169A201898J9651L2163J98820M03452M38218J92629k16311n32522n86028m21913
42159G30057k17935j06568r1439j07962j15009j08073p7202j26J18148K34234
42149B58125L12486L58847L88647L81974L01813J50255k0766j55027k24749k17218
42139A534387j21449M7277K21343L07681K57115J05873o0578j89902l03061m43569
42129A355117n97251o89174o64934n43233l68689j47193J28920M10074O02164
$$ plain form
42199 2224146 2270602 2101235 1788652 1427469 1085596 808432 634322 574722 591201 618361
42189 618361 607853 538991 408895 247935 131184 116612 150259 79210 -196239 -598685
42179 -598685 -933699 -1060443 -973688 -739557 -409017 -10807 412336 794900 1070424 1201898
42169 1201898 1221549 1253712 1452532 1855984 2294202 2486831 2270520 1737998 1151970 730057
42159 730057 512122 405554 314115 206153 91144 -16929 -94131 -94257 23891 258125
42149 258125 570611 929458 1318105 1700079 2001892 2152147 2131381 1976354 1751605 1534387
42139 1534387 1412938 1460215 1681558 1989239 2246354 2352227 2291649 2101747 1798686 1355117
42129 1355117 757866 68692 -596242 -1139475 -1508164 -1655357 -1526437 -1116363 -514199
42120e14199O61918O35423N83045N06655L79567K10369L1437j55294l68271n80600
42110A390050p11388p02560n75514l91375j79580O3472L12425M82280M80184K89674
42100D57668J081k46015l62842l68861l55437l89277m48545m53493l56967j99145
42090b721833p1997l5247o9494j00696n6427R3335L16408N17685N83551M71353
42080a073362K61388Q9113J4225j8336q1520j70907k30943k35551j96072j18246
42070a760211j7145L1115o9020l03532n13991n41996l86139j81393m9996j4002
42060c806310k7361k9204L8333K03240M19740N80320O03486N03191L63817K64926
42050h85822K36966K57004K58802J69951j7655k12082k90787k23134j05574n8842
$$ plain form
42120 -514199 147719 783142 1366187 1872842 2252409 2462778 2494215 2338921 1970650 1390050
42110 1390050 678662 -23898 -599412 -990787 -1170367 -1106895 -794470 -312190 167994 457668
42100 457668 458749 212734 -150108 -518969 -874406 -1263683 -1712228 -2165721 -2522688 -2721833
42090 -2721833 -2793830 -2829077 -2898571 -2999267 -3055694 -2962359 -2645951 -2128266 -1544715 -1073362
42080 -1073362 -811974 -722861 -708636 -726972 -808492 -979399 -1210342 -1445893 -1641965 -1760211
42070 -1760211 -1777356 -1746241 -1815261 -2118793 -2632784 -3174780 -3560919 -3742312 -3792308 -3806310
42060 -3806310 -3833671 -3862875 -3824542 -3621302 -3201562 -2621242 -2017756 -1514565 -1150748 -885822
42050 -885822 -648856 -391852 -133050 36901 19246 -192836 -483623 -706757 -812331 -871173
42040h71173j02209j47342j08258Q938J33095K18331K78632L41105M05585M70297
42030F27001N61436O86056P59953O45317L06270r7112l24950k84191j14119l2898
42020B732763j21506k78137l62028l37753k69590k16030j73223j15579m6744J4952
42010H27125P8152J68634K74255L26961K60334Q3255j11727k16206j88320q1010
42000A421453M154l193r8106k27330l50640m67402n86168o81946o93951n67883
41990b251012l04168K8208L25107N05425N51643N06013M31794L67708L00405J77917
41980F39040k9548k71455m41386m79401m29083l65320k90166j50578M8469K13227
41970a556201K68082K43311K17377K05910J54244K5836j40925k59551k54304j07417
$$ plain form
42040 -871173 -973382 -1120724 -1228982 -1220044 -1086949 -868618 -589986 -248881 156704 627001
42030 627001 1188437 1874493 2634446 3279763 3586033 3488921 3163971 2879780 2765661 2732763
42020 2732763 2611257 2333120 1971092 1633339 1363749 1147719 974496 858917 812173 827125
42010 827125 905277 1073911 1348166 1675127 1935461 2018716 1906989 1690783 1502463 1421453
42000 1421453 1425607 1422414 1324308 1096978 746338 278936 -307232 -989178 -1683129 -2251012
41990 -2251012 -2555180 -2526972 -2201865 -1696440 -1144797 -638784 -206990 160718 461123 639040
41980 639040 609492 338037 -103349 -582750 -1011833 -1377153 -1667319 -1817897 -1769428 -1556201
41970 -1556201 -1288119 -1044808 -827431 -621521 -467277 -441441 -582366 -841917 -1096221 -1203638
41960a203638J16986L00018L50131K64440J02089p7490k22278k70628j97503q4092
41950i21965p4862k24413m18034m80230l47972j13795Q4998J89851K38320K86408
41940a781694L32158L21247K21482O8006q2830k19705l56724m63434m77949m05085
41930b844528l37526l35818l35163k30010k1492J85568L19664M05066M79336N20722
41920b194181M95956M29862L74775L32964K56228J17835m7870j73540k00643j06915
41910g15529O4452J99529J85470J8560j81843k92432l00200k73356k45303j78034
41900a718686l8935J41926L17245M81616O40712P47366P30720O01960M82857M88315
41890B875096N90443O29926M71638J38156k16747m56124n64123o03404o03516
$$ plain form
41960 -1203638 -1086652 -786634 -436503 -172063 -69974 -147464 -369742 -640370 -837873 -921965
41950 -921965 -996827 -1221240 -1639274 -2119504 -2467476 -2581271 -2496273 -2306422 -2068102 -1781694
41940 -1781694 -1449536 -1128289 -906807 -838801 -921631 -1141336 -1498060 -1961494 -2439443 -2844528
41930 -2844528 -3182054 -3517872 -3853035 -4083045 -4104537 -3918969 -3599305 -3194239 -2714903 -2194181
41920 -2194181 -1698225 -1268363 -893588 -560624 -304396 -186561 -234431 -407971 -608614 -715529
41910 -715529 -651077 -451548 -266078 -247518 -429361 -721793 -1021993 -1295349 -1540652 -1718686
41900 -1718686 -1757621 -1615695 -1298450 -816834 -176122 571244 1301964 1903924 2386781 2875096
41890 2875096 3465539 4095465 4567103 4705259 4488512 4032388 3468265 2864861 2261345
41881B261345n35760l95200k46266j44658n4187R2839K61328L08957J38525j91968
41871A494955n32060p63215q32749p24907m73952j96394m2196q0363k44519l93792
41861b789192m15472k82473m6500K11151M34287O05819P13458P25105O16680M06006
41851A78869J34299j68626m66687o78198p04099n16076j97356J13762L11003L61221
41841a631888K91238J47488l8981k44448m08479m35810k87614n7495R3505Q1163
41831b491321n6636k39998m05491m83322m01984j65228J22971L49850M70192M68574
41821b832393L20378N8587j76592k50116j81410j04981r0611q1250j1006J01444
41811c247950K05596K94309L84481M71401N37859N66339N13809L28195L6039k31553
$$ plain form
41881 2261345 1725585 1330385 1084119 939461 885274 978113 1239441 1548398 1686923 1494955
41871 1494955 962895 199680 -633069 -1357976 -1831928 -2028322 -2070518 -2150881 -2395400 -2789192
41861 -2789192 -3204664 -3487137 -3533637 -3322486 -2888199 -2282380 -1568922 -843817 -227137 178869
41851 178869 313168 144542 -322145 -1000343 -1704442 -2220518 -2417874 -2304112 -1993109 -1631888
41841 -1631888 -1340650 -1193162 -1232143 -1476591 -1885070 -2320880 -2608494 -2665989 -2572484 -2491321
41831 -2491321 -2547957 -2787955 -3193446 -3676768 -4078752 -4243980 -4121009 -3771159 -3300967 -2832393
41821 -2832393 -2512015 -2453428 -2630020 -2880136 -3061546 -3166527 -3257138 -3338388 -3349394 -3247950
41811 -3247950 -3042354 -2748045 -2363564 -1892163 -1354304 -787965 -274156 54039 90078 -141475
41801a41475l58412l60903l33865l10895k49414j41263n3953l7330n2479l2456
41791b072445K9298R2566J39642J80751K04358J75745R7262L0695L0634O9239
41781a022255N0683r8262l58365o27516p85628p63815n85799l57162j90274j12163
41771d850556n1092O9055K32096L50107L69051L18936K61578K32815K48054L13782
41761b506174L95005M06814K89735Q2776j14936k36972k61167j56160J00119M27740
41751a573220O42619O05593L52709M7917j65074k36350j82940n7507O1255J06939
41741c98059P6910K0920k3848n5039o3650j9888P3690J51682J47716P0249j8713
41730c8030q9409j65879k56314l07187k63288j57470j00879j71810l32816m68441
$$ plain form
41801 -141475 -499887 -860790 -1194655 -1505550 -1754964 -1896227 -1950180 -1987510 -2039989 -2072445
41791 -2072445 -2043147 -1950581 -1810939 -1630188 -1425830 -1250085 -1152823 -1122128 -1091494 -1022255
41781 -1022255 -971572 -1069834 -1428199 -2055715 -2841343 -3605158 -4190957 -4548119 -4738393 -4850556
41771 -4850556 -4901648 -4832593 -4600497 -4250390 -3881339 -3562403 -3300825 -3068010 -2819956 -2506174
41761 -2506174 -2111169 -1704355 -1414620 -1331844 -1446780 -1683752 -1944919 -2101079 -2000960 -1573220
41751 -1573220 -930601 -325008 27701 75618 -89456 -325806 -508746 -566253 -504998 -398059
41741 -398059 -321149 -300229 -324077 -379116 -442766 -462654 -388964 -237282 -89566 -19317 -38030
41730 -38030 -127439 -293318 -549632 -856819 -1120107 -1277577 -1378456 -1550266 -1883082 -2351523
41720b351523m89962l90715k18111k4570J50760K84139L76339M48404N05528N06976
41710a202735L93121J52686j43072l77649m60415l71614j59298R4115L08083M26164
41700a340614M25182L23747J88422J13566J64436L22588M90799N63501N02947
41691A754574L56568K07867J11031O7762N7260P0943J02524J16225O2557n5314
41681B851997j57971j65107q4280M381M1843L2123l281o1200j28209j62179j41769
41670B026348j09821j27184j93774k50997k59132k41922k55215l37998m89595
41661b39290o58881p49075o71207m19992q5662K16620M10459M55584L38843J17180
41651a285421n7593k8745K21010N40956P44505P50279N88592L17107j9896l63515
$$ plain form
41720 -2351523 -2841485 -3232200 -3450311 -3474881 -3324121 -3039982 -2663643 -2215239 -1709711 -1202735
41710 -1202735 -809614 -656928 -800000 -1177649 -1638064 -2009678 -2168976 -2074861 -1766778 -1340614
41700 -1340614 -915432 -591685 -403263 -289697 -125261 197327 688126 1251627 1754574
41691 1754574 2111142 2319009 2430040 2497802 2555062 2626005 2728529 2844754 2907311 2851997
41681 2851997 2694026 2528919 2444639 2449020 2490863 2522986 2519705 2458505 2330296 2168117 2026348
41670 2026348 1916527 1789343 1595569 1344572 1085440 843518 588303 250305 -239290
41661 -239290 -898171 -1647246 -2318453 -2738445 -2824107 -2607487 -2197028 -1741444 -1402601 -1285421
41651 -1285421 -1343014 -1371759 -1150749 -609793 134712 884991 1473583 1790690 1770794 1407279
41641A407279o30981p62109p54143o37691m45818k29907p7262o0623j57861k53761
41631b602877k45419j36463j5651M3973M8038N4836J11979K22232L49273M38582
41621a731497M39874L31348J37237p7589k37134k89343k30053j10355j6013o088
41611a789613m5034j5208J59477M00866N34823M83228L53498K99380L33729L39260
41601A054406K39669Q2361n0574j31734j59572j17137j9898M5878N625j02239
41591H46785j71042j65931j62851k41868l86236m97158m77529l02397m4136J71269
41581a431094K73933L23151M31242O06018P15827O37524M05583J84263J12073
41572B258520J96306L39162M35950M50523M15984L74689L29302K59048J59483
$$ plain form
41641 1407279 776298 14189 -739954 -1377645 -1823463 -2053370 -2130632 -2191255 -2349116 -2602877
41631 -2602877 -2848296 -2984759 -3000410 -2956437 -2908399 -2853563 -2741584 -2519352 -2170079 -1731497
41621 -1731497 -1291623 -960275 -823038 -900627 -1137761 -1427104 -1657157 -1767512 -1783525 -1789613
41611 -1789613 -1834647 -1849855 -1690378 -1289512 -754689 -271461 82037 381417 715146 1054406
41601 1054406 1294075 1376436 1325862 1194128 1034556 917419 897521 943399 949024 846785
41591 846785 675743 509812 346961 105093 -281143 -778301 -1255830 -1558227 -1602363 -1431094
41581 -1431094 -1157161 -834010 -402768 203250 919077 1556601 1962184 2146447 2258520
41572 2258520 2454826 2793988 3229938 3680461 4096445 4471134 4800436 5059484 5218967
41563E218967L3779j35123l47149n20555n34746l70581j55039k4944J0228K5142
41553C199979M4333J8076q8249k45251l96069m89526m85168l87752k83680k79327
41543F07366l74167m41042l66877j81072r576P5270J19931K11118L65722N10248
41533E16921N55321M79679L43929K31645J81916J66905J12196n8149l54481o68708
41523A507174q17219o87118l45243K3625K80663M07453M35806L66121J83843p6090
41513A279015l17887m42048m14462k89950j64220q9986n0028k3993m8142j65041
41503g26742l36783m68889n15664n00473m33986k92311r9599M7440Q7570P2430
41493c167007R2386J81136L37841N70504Q38532J008553R70369P77534N80712
$$ plain form
41563 5218967 5252746 5117623 4770474 4249919 3715173 3344592 3189553 3164609 3174837 3199979
41553 3199979 3244312 3262388 3174139 2928888 2532819 2043293 1558125 1170373 886693 607366
41543 607366 233199 -207843 -574720 -755792 -765368 -690098 -570167 -359049 6673 516921
41533 516921 1072242 1551921 1895850 2127495 2309411 2476316 2588512 2530363 2175882 1507174
41523 1507174 689955 2837 -342406 -318781 -38118 369335 805141 1171262 1355105 1279015
41513 1279015 961128 519080 104618 -185332 -349552 -439538 -489566 -513559 -561701 -726742
41503 -726742 -1063525 -1532414 -2048078 -2548551 -2982537 -3274848 -3374447 -3327007 -3239437 -3167007
41493 -3167007 -3074621 -2893485 -2555644 -1985140 -1146608 -138055 832314 1609848 2190560
41484B190560M30859K43810l2900l17770m97918n57807n58271n44202n23116m94301
41474f61056m48098l56630k02688p987J83010L27930L90137L57360K74646K17406
41464G4030K04682J76696Q6851k4835q5658p5647j3806R6120K33971K98199J60985
41453A131588j80124n50206p27140o12383k80983R3626L48278M02635K69180J2982
41443i2547k83566n17344n76522m22436j61400K5598N4586O043K428O3858J22629
41432a778673J39328J39775J44656J25687N3888m8805j34797j82928j96833j68312
41422a907014p7317P0914K35137L70609M51313M55314L60002J78700j7480j53130
41412c2952k25292k93403l83366m35641l73505k00411p94J41844J99838J90003
$$ plain form
41484 2190560 2621419 2865229 2832329 2514559 2016641 1458834 900563 356361 -166755 -661056
41474 -661056 -1109154 -1465784 -1668472 -1676459 -1493449 -1165519 -775382 -418022 -143376 74030
41464 74030 278712 455408 542259 517424 431766 356119 342313 438433 672404 970603 1131588
41453 1131588 951464 401258 -325882 -938265 -1219248 -1125622 -777344 -374709 -105529 -92547
41443 -92547 -376113 -893457 -1469979 -1892415 -2053815 -2028217 -1973631 -1967588 -1965160 -1901302 -1778673
41432 -1778673 -1639345 -1499570 -1354914 -1229227 -1175339 -1224144 -1358941 -1541869 -1738702 -1907014
41422 -1907014 -1984331 -1913417 -1678280 -1307671 -856358 -401044 -41042 137658 120178 -32952
41412 -32952 -258244 -551647 -935013 -1370654 -1744159 -1944570 -1945364 -1803520 -1603682 -1413679
41402a413679J49353J25336J52459K20677K86574L22867L33915L20732K71708
41393G69942K09470K05779L04580M46798N13741M41002K60593M8849j20212j84182
41383B896360j29573m3392o0363k06514l39319l05151j30910O259j2097j37512
41373A537788k57370l25211l53542l46262l03164k55994k32113j90219n0065K00622
41363e75530M59816N78966M65432J42933k47878n24056n94275n32527m81374m78225
41353a786718m22909k23782Q1443L74712N71509O47965O08391M87967L60547K81520
41343I80645K29562J51066M8976k8163q2678j90765m03433o59251q18343p70156
41333a542540n15673j79770N8419R6640l350q1320l6861J03600K62987L90506
$$ plain form
41402 -1413679 -1264326 -1138990 -986531 -765854 -479280 -156413 177502 498234 769942
41393 769942 979412 1185191 1489771 1936569 2450310 2891312 3151905 3200754 3080542 2896360
41383 2896360 2766787 2723395 2663032 2456518 2117199 1812048 1681138 1687397 1675300 1537788
41373 1537788 1280418 955207 601665 255403 -47761 -303755 -535868 -726087 -776152 -575530
41363 -575530 -115714 463252 928684 1071617 823739 299683 -294592 -827119 -1308493 -1786718
41353 -1786718 -2209627 -2433409 -2351966 -1977254 -1405745 -757780 -149389 338578 699125 980645
41343 980645 1210207 1361273 1410249 1382086 1299408 1108643 705210 45959 -772384 -1542540
41333 -1542540 -2058213 -2237983 -2179564 -2082924 -2086274 -2167594 -2204455 -2100855 -1837868 -1447362
41323a447362M47210L93484K52657J42820J76189L40244N24507O40014O58118
41314B127881N62468L51135R5723q3140j40013j55657k29389l59961m64430m74611
41304A230006l76351j91789K1033J64948J54595j2730k49124m30905m57045k96122
41294d43484k0384K28296L57081M04136M69464N83242O87502P21581O53615M42742
41284D083791P4043l37941n81446n62020m30594m22996o06464q47654r87519r64101
41274a582901p94031n39913l05419j69389r5165K1633J87908K72273J73719l4039
41264b865324j81113j72822k8296J98161M53598O64665P57190P11447N58373L21899
41254D17778K690l80747p64908j053183j139592r53191n28130j9651L94178O28190
$$ plain form
41323 -1447362 -1000152 -606668 -354011 -211191 -35002 305242 829749 1469763 2127881
41314 2127881 2690349 3041484 3137207 3054067 2914054 2758397 2529008 2169047 1704617 1230006
41304 1230006 853655 661866 682899 847847 1002442 989712 740588 309683 -147362 -443484
41294 -443484 -463868 -235572 121509 525645 995109 1578351 2265853 2987434 3641049 4083791
41284 4083791 4157834 3819893 3238447 2676427 2245833 1822837 1216373 368719 -618800 -1582901
41274 -1582901 -2376932 -2916845 -3222264 -3391653 -3486818 -3465185 -3277277 -3005004 -2831285 -2865324
41264 -2865324 -3046437 -3219259 -3247555 -3049394 -2595796 -1931131 -1173941 -462494 95879 417778
41254 417778 420468 39721 -725187 -1778370 -2917962 -3871153 -4399283 -4418934 -4024756 -3396566
41244c396566O90018O06671M16548K12737J02912R9686J15113R5897J07356K37885
41234g11743M57539O20582N97418L80346P9916j57803k51290k33310j97609j87274
41224C96772j57438o4481L7722L0589j36875l65833m65725l07021N7938M18260
41214e56092N69638M71403K39272M385j83984l33338m56082n64251o55020o64459
41204b128528m92609j33565K54541M72845M63948L28953J88199Q2279l877q7179
41194a054993j69615k28158k09997p8148J25651K96257L53366K89854J38651o2780
41184e99912k63859m02132m46404m25391l98122m02177m26199m14553l07609j05658
41174d192016J14920K81769M09826N56186P00819P43686O42412M86326L91001
$$ plain form
41244 -3396566 -2706548 -2099877 -1683329 -1470592 -1367680 -1267994 -1152881 -1056984 -949628 -711743
41234 -711743 -254204 366378 963796 1344142 1424058 1266255 1014965 781655 584046 396772
41224 396772 239334 174853 212575 243164 106289 -259544 -725269 -1032290 -974352 -556092
41214 -556092 13546 484949 724221 728606 544622 211284 -244798 -809049 -1464069 -2128528
41204 -2128528 -2621137 -2754702 -2500161 -2027316 -1563368 -1234415 -1046216 -963937 -967814 -1054993
41194 -1054993 -1224608 -1452766 -1662763 -1740911 -1615260 -1319003 -965637 -675783 -537132 -599912
41184 -599912 -863771 -1265903 -1712307 -2137698 -2535820 -2937997 -3364196 -3778749 -4086358 -4192016
41174 -4192016 -4077096 -3795327 -3385501 -2829315 -2128496 -1384810 -742398 -256072 134929
41165A34929L70657L63944L38050K99740K32351J02282o7675j99283k56425k92435
41155A026135l69433m66527n07828m66428m01662l85396m13254m04295k83084
41146b671772n0709K22302M52612N80110N70077M23736K01481O050q4514o1566
41136d12193L6456J57152K29132J77861J2899j18706m8682K14079M61253N07698
41126A216949L94511L11214L41995L70580K54513K1295j65203j96504j12685j5942
41116B420723L5876K7351n5678k02357l36630l66202k82018j67799r9473p1576
41106I02217l7467J6366O6719J00090J26961J53787J62657J19513l002j97488
41096A410353m06981n54437n97217n33575l53654l4569L77152P21323Q34770P07170
$$ plain form
41165 134929 505586 869530 1207580 1507320 1739671 1841953 1774278 1574995 1318570 1026135
41155 1026135 656702 190175 -317653 -784081 -1185743 -1571139 -1984393 -2388688 -2671772
41146 -2671772 -2722481 -2500179 -2047567 -1467457 -897380 -473644 -272163 -266113 -350627 -412193
41136 -412193 -375737 -218585 10547 188408 201307 82601 33919 247998 709251 1216949
41126 1216949 1611460 1922674 2264669 2635249 2889762 2911057 2745854 2549350 2436665 2420723
41116 2420723 2456599 2483950 2428272 2225915 1889285 1523083 1241065 1073266 973793 902217
41106 902217 864750 881116 947835 1047925 1174886 1328673 1491330 1610843 1607841 1410353
41096 1410353 1003372 448935 -148282 -681857 -1035511 -1070080 -692928 28395 863165 1570335
41086A570335M75106K62427Q5983p3071j83659k04273j61379j23004j07130o7772
41076A473563K9028J55411K51064K73132K20616J40573J02581J22753J11085m9836
41066B829970l46356o01611o48028n02041l14255j67657j440K48498N06123O11555
41056A614758M92834K31510k5288j65442j37903M2065K74532M10971L66277J87989
41046C292303j2361j72766k86956l25335k24943J8447K97744M71677M74466L33469
41036C865745J18484q5509j86719j38459k784P9080J2784j62755l26247l90281
41026B783339l47423k26192n2152J33240K58164K71874K03860J29053O7034l6865
41016C183932k01395l28382k97393j28318K1352L6597m0336j02644j19363j22038
$$ plain form
41086 1570335 2045441 2307868 2393851 2320780 2137121 1932848 1771469 1648465 1541335 1473563
41076 1473563 1502591 1658002 1909066 2182198 2402814 2543387 2645968 2768721 2879806 2829970
41066 2829970 2483614 1882003 1233975 731934 417679 250022 248582 497080 1003203 1614758
41056 1614758 2107592 2339102 2313814 2148372 2010469 2052534 2327066 2738037 3104314 3292303
41046 3292303 3279942 3107176 2820220 2494885 2269942 2288389 2586133 3057810 3532276 3865745
41036 3865745 3984229 3898720 3712001 3573542 3570758 3649838 3662622 3499867 3173620 2783339
41026 2783339 2435916 2209724 2157572 2290812 2548976 2820850 3024710 3153763 3220797 3183932
41016 3183932 2982537 2654155 2356762 2228444 2249796 2286393 2246057 2143413 2024050 1902012
41006A902012r5342L5702L05526O48120R40706J067330R54790O17725J89591j48435
40996F417725l09482l50976l74825m18168m55591m56257m06600l21567k70202
40987C054057l43797n46126p46905p97574o71075m43488j78395R7320L30474M52241
40977B06732M65452M42005M11323L27063J75625L6090k7505o9207j79308l39355
40967A448915m42234m41478l98352l72568l39769k48031j04988K9112J06440J21076
40957f41877R7202P6584J01329J77342K53842K58514J62151R307j12316j37720
40947B44358p4537O490L6870O582m6279q3516q2931k7072P5138J52749J17704
40936C25556j9250j22120p2903Q1441J83829J64445J24116K03303M12769O19060
$$ plain form
41006 1902012 1806670 1842372 2147898 2796018 3736724 4804054 5758844 6376569 6566160 6417725
40996 6417725 6108243 5757267 5382442 4964274 4508683 4052426 3645826 3324259 3054057
40987 3054057 2710260 2164134 1417229 619655 -51420 -494908 -673303 -575983 -245509 206732
40977 206732 672184 1114189 1525512 1852575 2028200 2064290 2036785 1967578 1788270 1448915
40967 1448915 1006681 565203 166851 -205717 -545486 -793517 -898505 -869393 -762953 -641877
40957 -641877 -544675 -468091 -366762 -189420 64422 322936 485087 494394 382078 244358
40947 244358 169821 176311 213181 219763 173484 89968 7037 -20035 55103 207852 325556
40936 325556 306306 184186 111283 192724 376553 540998 665114 868417 1281186 1900246
40926A900246O66209M92957J68401j51881l28418l36672k65338k11822k10310
40917A723372k75368m50034p35024r97877j047580q24804m58669j16498J39223
40908c043259L19600M14677L99225K92102J44123r469j29241j36703K1856K80071
40898a447018M91681N78212N80055N55511M99270L88418K46252J15525R055p2952
40888A944009j11389r5530n5107k7060j2136K571N096j6413l2074J439Q2591J71682
40876A857679K36213K43753J31532j44449n16696q22175r40023q74819o85499
40867a514484l90000O486M24649P27337Q35647P85881O60663N09098L59881K64023
40857B669181K58682K93335K54722R3233j14479k58829l16655l35274l30194k65554
$$ plain form
40926 1900246 2566455 3059412 3227813 3075932 2747514 2410842 2145504 1933682 1723372
40917 1723372 1448004 997970 262946 -734931 -1782511 -2607315 -3065984 -3182482 -3043259
40908 -3043259 -2723659 -2308982 -1909757 -1617655 -1473532 -1483001 -1612242 -1748945 -1727089 -1447018
40898 -1447018 -955337 -377125 202930 758441 1257711 1646129 1892381 2007906 2016961 1944009
40888 1944009 1832620 1737090 1681983 1654923 1642787 1645358 1650454 1634041 1601967 1603406 1685997 1857679
40876 1857679 2093892 2337645 2469177 2324728 1808032 985857 45834 -828985 -1514484
40867 -1514484 -1904484 -1897998 -1473349 -746012 89635 875516 1536179 2045277 2405158 2669181
40857 2669181 2927863 3221198 3475920 3569153 3454674 3195845 2879190 2543916 2213722 1948168
40847A948168j35508k245O9131P2522M1920J1310P396L3290L3535p6207l03420
40836A699892n33547o24838n24065k73120M5411L32001N00309N51732N84719O65977
40826B424471P25363O47607M35131J96288m598j88399l59206m66329m87110m51918
40816B471300l58938j63371R8430K66656K16740K092k27104l89839m86127m99105
40806I30734l86304j56631J24465M05587O60201Q35004Q68417P82043O87082O56360
40796E406958O24497M55641J02257l22756o26842o84468n18304k56380k5232J08957
40786D264328J21133Q924j76850l24671l43117k49980j46070r9080q0959j9674
40776B953984J15098K82111M01944M14461L17788J57923j4137j57937k25367j81677
$$ plain form
40847 1948168 1812660 1810415 1879546 1952068 1993988 2005298 2012694 2045984 2079519 2003312 1699892
40836 1699892 1166345 541507 17442 -255678 -210267 121734 622043 1173775 1758494 2424471
40826 2424471 3149834 3797441 4232572 4428860 4424262 4235863 3876657 3410328 2923218 2471300
40816 2471300 2112362 1948991 2047421 2314077 2530817 2532909 2305805 1915966 1429839 930734
40806 930734 544430 387799 512264 917851 1578052 2413056 3281473 4063516 4750598 5406958
40796 5406958 6031455 6487096 6589353 6266597 5639755 4955287 4436983 4180603 4155371 4264328
40786 4264328 4385461 4394385 4217535 3892864 3549747 3299767 3153697 3054617 2973658 2953984
40776 2953984 3069082 3351193 3753137 4167598 4485386 4643309 4629172 4471235 4245868 4064191
40766D064191p3249j5528m6454l1080J94150N85468Q96035R42509P80853N75093
40756G871988L87104J84226j8796j63136k85922n20415q94157j219397j278742
40747D062753j080672q41460p24952o88756o02858m29272k24489k5495J80297
40738c74904L86981N48564O36147O60259O25762N23658L89032L04729L04148L18816
40728D323192K73377J90042J35268R8217R825j21377j85859j19757l224M1069
40718D640773j328m9296o0405q1529j61944k73176l38518l06992j75083L4928
40708C227430K82817N08229O57984P26169P44950P21538O03480L36586l7392l65029
40698G406762m91341l96898k19790j30682j80171k70727k78302j87097q5697l7363
$$ plain form
40766 4064191 3990942 3975414 3928960 3897880 4092030 4677498 5573533 6516042 7296895 7871988
40756 7871988 8259092 8443318 8424522 8261386 7975464 7455049 6560892 5341495 4062753
40747 4062753 2982081 2140621 1415669 726913 124055 -305217 -529706 -555201 -374904
40738 -374904 12077 560641 1196788 1857047 2482809 3006467 3395499 3700228 4004376 4323192
40728 4323192 4596569 4786611 4921879 5020096 5029921 4908544 4722685 4602928 4599704 4640773
40718 4640773 4639445 4590149 4529744 4448215 4286271 4013095 3674577 3367585 3192502 3227430
40708 3227430 3510247 4018476 4676460 5402629 6147579 6869117 7472597 7809183 7771791 7406762
40698 7406762 6915421 6518523 6298733 6168051 5987880 5717153 5438851 5251754 5166057 5128694
40688E128694O745J38724L63270N80858P03668P47040P84580Q43793Q85007Q78851
40678A1061230Q66360R14834J020807J090239J046475R48529R48008J092572J212059
40669B0201113J069192O24810R1093k98368n14650o95554r33166j158608j220109
40660A7165753j024447o03743q6254L85537P33919R67076J133122J265607J374058
40651B1310628J466560J568058J717516J921695K066923J897468J186782J487
40643C3137117j250840k112019k413034k313439k071236j846718j681567j546575
40635A7901689j377767j136141q66213o57984n45657m93294m80094n28450o23713
40626A1192376o76304o15329m80080l69970l24777k92655k05196n7692P8393J13942
$$ plain form
40688 5128694 5135439 5274163 5637433 6218291 6921959 7668999 8453579 9297372 10182379 11061230
40678 11061230 11927590 12842424 13863231 14953470 15999945 16948474 17896482 18989054 20201113
40669 20201113 21270305 21895115 21986208 21687840 21173190 20477636 19544470 18385862 17165753
40660 17165753 16141306 15537563 15451309 15836846 16570765 17537841 18670963 19936570 21310628
40651 21310628 22777188 24345246 26062762 27984457 30051380 31948848 33135630 33137117
40643 33137117 31886277 29774258 27361224 25047785 22976549 21129831 19448264 17901689
40635 17901689 16523922 15387781 14521568 13863584 13317927 12824633 12344539 11816089 11192376
40626 11192376 10516072 9900743 9420663 9050693 8725916 8433261 8228065 8170373 8248766 8362708
40616H362708L2099p2825p4269N6048K25078L38309M03870M88647O06255O99823
40606A1065743P33310P56661Q55843J052360J284572J505597J765733K121705
40598B1141524K435122K345620J560974J87937j293061k395987k928727k968702
40590A8084700k684817k248161j811902j454274j146778q35817n36985l06622
40582G059344j59240p3743n0558r2002j40110j05068L5372K11610L40037L87272
40572G412914L61834K80738J42631q8573m43967q51607j117919j085005q00387
40563C810659m64031k16133n3686N1731O4179m5621k24448l89479m96525n09766
40553A526880l81189j39701N7150O3507p7460j81207j42735l3580J9682l0752
$$ plain form
40616 8362708 8394807 8321982 8247713 8303761 8528839 8867148 9271018 9759665 10365920 11065743
40606 11065743 11799053 12555714 13411557 14463917 15748489 17254086 19019819 21141524
40598 21141524 23576646 25922266 27483240 27671177 26378116 23982129 21053402 18084700
40590 18084700 15399883 13151722 11339820 9885546 8738768 7902951 7365966 7059344
40582 7059344 6900104 6826361 6775803 6683801 6543691 6438623 6473995 6685605 7025642 7412914
40572 7412914 7774748 8055486 8198117 8109544 7665577 6813970 5696051 4611046 3810659
40563 3810659 3346628 3130495 3076809 3128540 3192719 3147098 2922650 2533171 2036646 1526880
40553 1526880 1145691 1005990 1063140 1126647 1049187 867980 725245 691665 711347 680595
40543F80595j55966k97492l69790k89696o8954J62600K80123K77063K11290R0275
40533E20048j08338l26802m36582l79124k28416r0725r037J638r8409l13896n35842
40522b005485o02562m49878j58952J47307M18218O81073R63952J223787J343654
40513A561114J220358Q83388N09799K77166K02153J62458P4896k419L3128J73740
40503E095781K85393K38296K9567k22530l93492m56730m70921m72802m19195k64537
40493B948830o5053N3387L4169n2011r8181o5086J7872J02549J41358J00003k223
40482C115614q1986n8632P0697K35156L54027L87007L47428K84519K32589J66571
40472E052990L7032j37303k52081k21844p0227J13581K72837L98769M83750N15727
$$ plain form
40543 680595 524629 227137 -142653 -432349 -501303 -338703 -58580 218483 429773 520048
40533 520048 411710 84908 -351674 -730798 -959214 -1049939 -1058976 -1057338 -1155747 -1469643 -2005485
40522 -2005485 -2608047 -3057925 -3216877 -3069570 -2651352 -1970279 -1006327 217460 1561114
40513 1561114 2781472 3664860 4174659 4451825 4653978 4816436 4891332 4888913 4922041 5095781
40503 5095781 5381174 5619470 5649037 5426507 5033015 4576285 4105364 3632562 3213367 2948830
40493 2948830 2883777 2937164 2971333 2919322 2821141 2756055 2773927 2876476 3017834 3117837 3115614
40482 3115614 3033628 2974996 3045693 3280849 3634876 4021883 4369311 4653830 4886419 5052990
40472 5052990 5090022 4952719 4700638 4478794 4408567 4522148 4794985 5193754 5677504 6193231
40462F193231N03801M54310L26726O8876k93811o50541r04697j044573j093976
40453C559346j030792q05731m46654j03601N3346q916j54470k17602j49045k676
40443F93205J73393L54191M63283L94300J59092o9507j41063r8473q3642j20063
40433A724716r6179M8945K37054L73347M63013N53452O23543N90268M00672Q8194
40423E007025k32545m10573l52647j21248R0060J26395Q605j22219j71098j64310
40413C657445j79642k48401l26997l33004k09444J6508K36755L54825L83392M21393
40403C772830N21013O06712N54281L34245M4909j91171l26890l80231l67544k85483
40393D282671j43934K1256J70720K71920K91243K10411O0554q5886j68025j65397
$$ plain form
40462 6193231 6697032 7151342 7478068 7546944 7253133 6602592 5697895 4653322 3559346
40453 3559346 2528554 1722823 1276169 1172568 1225914 1216998 1062528 844926 695881 693205
40443 693205 866598 1220789 1684072 2078372 2237464 2167957 2026894 1928421 1844779 1724716
40433 1724716 1628537 1677482 1914536 2287883 2750896 3304348 3927891 4518159 4918831 5007025
40423 5007025 4774480 4363907 4011260 3890012 3980072 4106467 4115072 3992853 3821755 3657445
40413 3657445 3477803 3229402 2902405 2569401 2359957 2376465 2613220 2968045 3351437 3772830
40403 3772830 4293843 4900555 5454836 5789081 5833990 5642819 5315929 4935698 4568154 4282671
40393 4282671 4138737 4159993 4330713 4602633 4893876 5104287 5164841 5078955 4910930 4745533
40383D745533q2778N3790J84894K57209K98893M00757N79348P08434O53295M47177
40373H246552K59470J87994J52724K1018k12783m13140m48149l16473j29357J8663
40363G366519J45821L32521N75838P33989O52823L31095p5645m00336n70119n82333
40353H510173m49840k10505M7277K24594K90983L05594L45213M11892M27083L32511
40343A0234975J82161R4977J10698J40662R0430j2327o0082q455P5528R8633L3280
40332A0980480o8037j17419o5410L9779R2666O2885M3334J13622K11073K28137
40322A1521110J95959K44258L81628M57554L90886L09724L77166N71331P44635
40313A5194251Q42867R51156J142713J388472J633978J888820K204597K604757
$$ plain form
40383 4745533 4662755 4716545 4901439 5158648 5457541 5858298 6437646 7146080 7799375 8246552
40373 8246552 8506022 8694016 8846740 8867758 8654975 8241835 7793686 7477213 7347856 7366519
40363 7366519 7512340 7844861 8420699 9154688 9807511 10138606 10062961 9662625 9092506 8510173
40353 8510173 8060333 7849828 7897105 8121699 8412682 8718276 9063489 9475381 9902464 10234975
40343 10234975 10417136 10512113 10622811 10763473 10853903 10841576 10781494 10773039 10848567 10947200 10980480
40332 10980480 10912443 10795024 10729614 10769393 10862059 10924944 10968278 11081900 11292973 11521110
40322 11521110 11717069 11961327 12342955 12800509 13191395 13501119 13878285 14449616 15194251
40313 15194251 16037118 16988274 18130987 19519459 21153437 23042257 25246854 27851611
40305B7851611L066618L559764M089942M705927N456999O346102P346933Q465623
40297G0889519R750345J1248676J3028448J5254301J8125891K1635861K5433927
40290A85366968K8976737L1643109L2477046K9975328K2749049J0963109k867162
40283C39284184j4935344k2391957k4767839k3464714k0226076j6181690j1897408
40276B05419156p696280l710524J27136L929680P771546J1816524J6334355K1406841
40268B55398434K6699831L1596899L5275693L6337822L2669663K2561404O625588
40261D47165334j1506207k6934097l6354339l9506874l8281010l4863725l0683808
40254B29035274k6464536k2583723j9198965j6282239j3759597j1613451r813071
$$ plain form
40305 27851611 30918229 34477993 38567935 43273862 48730861 55076963 62423896 70889519
40297 70889519 80639864 91888540 104916988 120171289 138297180 159933041 185366968
40290 185366968 214343705 245986814 278463860 308439188 331188237 342151346 339284184
40283 339284184 324348840 301956883 277189044 253724330 233498254 217316564 205419156
40276 205419156 197722876 194012352 194139488 198069168 205840714 217657238 233991593 255398434
40268 255398434 282098265 313695164 348970857 385308679 417978342 440539746 447165334
40261 447165334 435659127 408725030 372370691 332863817 294582807 259719082 229035274
40254 229035274 202570738 179987015 160788050 144505811 130746214 119132763 109319692
40247A09319692q242084o801092n541579m595989l985769l587640l282492l035323
40239G0247724k815634k552994k218143j848260j436373q98455k19352M83703
40231E8742216J147126J906982K935922M231628N707248P387508R340878J1514529
40223A02914037J3804904J6060495J7587884J6791374J2082183L674659n808614
40216A77106922j3047986j6418523j6601076j5193831j3265861j1193047r190286
40209H2196312p497122o204247n242944m553452m108377l813601l540890l257444
40201D3978235l020209k845680k663312k388795j979103j434623q20334k78941
40193B8547238M9793J40993P6013p1777k80437m97950n96404m79763k17608m919
$$ plain form
40247 109319692 101077608 94276516 88734937 84138948 80153179 76565539 73283047 70247724
40239 70247724 67432090 64879096 62660953 60812693 59376320 58477865 58258513 58742216
40231 58742216 59889342 61796324 64732246 68963874 74671122 82058630 91399508 102914037
40223 102914037 116718941 132779436 150367320 167158694 179240877 182915536 177106922
40216 177106922 164058936 147640413 131039337 115845506 102579645 91386598 82196312
40209 82196312 74699190 68494943 63251999 58698547 54590170 50776569 47235679 43978235
40201 43978235 40958026 38112346 35449034 33060239 31081136 29646513 28826179 28547238
40193 28547238 28597031 28738024 28814037 28742260 28461823 27963873 27367469 26887706 26670098 26665179
40183B6665179L0475n5641j16307q5979k6187j5269k9875N5261L57155Q65367
40173B7644179J426332J867360K150826K393396K746553L306161M120099N177097
40165E0832003O363748P569044Q904262J0671199J3001377J5680840J8407094
40158A31429567K0820496K1865843J9531583J2259583J074693j0271148j7939879
40151A78770738k0748735k0157371j8114548j5598507j2943000j0516556q602264
40144G2089757p099496n790443m688355l866828l186108k467231j762736j199450
40136D2029110o92717o2797O66194J310749J796576K175534K436710K510227K434284
40127E4603870K328266K193464J896146J369687P20857J31111k53935l57491k07840
$$ plain form
40183 26665179 26695654 26640013 26523706 26437727 26411540 26396271 26366396 26421657 26778812 27644179
40173 27644179 29070511 30937871 33088697 35482093 38228646 41534807 45654906 50832003
40165 50832003 57195751 64764795 73669057 84340256 97341633 113022473 131429567
40158 131429567 152250063 174115906 193647489 205907072 206981765 196710617 178770738
40151 178770738 158022003 137864632 119750084 104151577 91208577 80692021 72089757
40144 72089757 64990261 59199818 54511463 50644635 47458527 44991296 43228560 42029110
40136 42029110 41336393 41273596 41939790 43250539 45047115 47222649 49659359 52169586 54603870
40127 54603870 56932136 59125600 61021746 62391433 63112290 63243401 62989466 62631975 62424135
40118F2424135N4091K88987M75616O43580P22260N52888M4834p49907j691358
40109F2765126k603124l303425l685802l775494l654191l362893k941759k505307
40101C6933131k168818j925748j697014j475290j312271j183756r95481p38918
40093B5435835n31686m72377n40509o61479p83391q60145q41111p23616n63684
40084A9457837m07525k60774j36050o2440j8358Q0909K77696M83736N36525L39749
40074B0291305n3185m71635p43557q10845p44964o49122n66905m94967m30937
40065A5325188l58448k25750o748K38081M24846N54082O97208Q97198J146002
40056A8691659J432137J723496J906281J822363J384079O12024m03707j492291
$$ plain form
40118 62424135 62478226 62767213 63242829 63886409 64608669 65161557 65206391 64456484 62765126
40109 62765126 60162002 56858577 53172775 49397281 45743090 42380197 39438438 36933131
40101 36933131 34764313 32838565 31141551 29666261 28353990 27170234 26174753 25435835
40093 25435835 24904149 24431772 23891263 23229784 22446393 21586248 20745137 20021521 19457837
40084 19457837 19050312 18789538 18653488 18591048 18572690 18653599 18931295 19415031 19951556 20291305
40074 20291305 20238120 19766485 19022928 18212083 17467119 16817997 16251092 15756125 15325188
40065 15325188 14966740 14740990 14734242 14972323 15397169 15951251 16648459 17545657 18691659
40056 18691659 20123796 21847292 23753573 25575936 26960015 27572039 27168332 25676041
40048B5676041k380279k812976k746129k352817j830096j275081p46414l22079
40040A1210170l5529J64191L31678M66335N72253O99388Q67174J008967J049326
40031A6333953R81237Q14429N15958Q5922l49933o19740o81980o59783o88224
40022A5731839p70244p97705o88023m81830l07024k52522k93823l55409m18390
40013A1366869n24100o87604q62092r83091r90258q17906m55147l8658K07282
40004F215295J84176J5698j19178j89327k84818m41800n83953o28924n80813n02218
39994C084138m36820l77802k96131j87410q0399J2272J28199K93774M39720M47869
39984C027410K99442J10011j1937p4053j30054j76269j85345j87271k35304l15593
$$ plain form
40048 25676041 23295762 20482786 17736657 15383840 13553744 12278663 11532249 11210170
40040 11210170 11174641 11338832 11670510 12136845 12709098 13408486 14275660 15284627 16333953
40031 16333953 17315190 18129619 18645577 18731499 18381566 17761826 17079846 16420063 15731839
40022 15731839 14961595 14163890 13475867 12994037 12687013 12434491 12140668 11785259 11366869
40013 11366869 10842769 10155165 9293073 8309982 7319724 6501818 6046671 6008013 6215295
40004 6215295 6399471 6415169 6295991 6106664 5821846 5380046 4796093 4167169 3586356 3084138
39994 3084138 2647318 2269516 1973385 1785975 1705576 1717848 1846047 2139821 2579541 3027410
39984 3027410 3326852 3436863 3424926 3350873 3220819 3044550 2859205 2671934 2436630 2121037
39974B121037l56320l10467j79751J4921K26357L66688L67559K55629J25522M8435
39964B679610M4652J17045K47953L69653L99745L24455K22062K05095L51886O62359
39954E624515J043093J362007J558085J670438J721763J621328J255462O47266
39946A6503957n0706p07177j272706j694632j873155j751978j402470r77841o07295
39937F165997l45310j84159q9229l7373k7401m2919k6576P2421K39368M21847
39927F146666N97481P62808Q73142Q65478P50487O22419N62049N75748O36159
39918A2392437P29720Q50346R87461J117788J157516R41848L54149m85591j238640
39909A6807034j616057j602298j398491j210319j127290j130762j130355j011639
$$ plain form
39974 2121037 1764717 1454250 1274499 1289420 1515777 1882465 2250024 2505653 2631175 2679610
39964 2679610 2724262 2841307 3089260 3458913 3858658 4183113 4405175 4610270 4962156 5624515
39954 5624515 6667608 8029615 9587700 11258138 12979901 14601229 15856691 16503957
39946 16503957 16453251 15746074 14473368 12778736 10905581 9153603 7751133 6773292 6165997
39937 6165997 5820687 5636528 5547299 5509926 5482525 5439606 5413030 5485451 5724819 6146666
39927 6146666 6744147 7506955 8380097 9245575 9996062 10618481 11180530 11756278 12392437
39918 12392437 13122157 13972503 14959964 16077752 17235268 18177116 18531265 18045674 16807034
39909 16807034 15190977 13588679 12190188 10979869 9852579 8721817 7591462 6579823
39901F579823p21437l27044K4975K06501J74890p577j99524k73055k20006j44042
39891E093504j35037j93760k89200m12264n23063n15466l17877k025K73856M09702
39881C388370M02929K86394J06167n9828j46806j76488k26228l21408m13061m60849
39871B379192m75376m66596m07465k71992p3193J46495L28118M01899L28648J45783
39861B035513o5533k58580m23063n18690m77726k95161n9900J30172K39918K72263
39851E79213K38727J90117K12762L32247M52727M45591K83393N3656j32033k06061
39841B450339j56355k5732J09028J97545K49633K86489K86398K19620J14643M2062
39831C773670M4830J22997K58367L87707L66736N6990n02829j059376j330937
$$ plain form
39901 6579823 5858386 5531342 5556317 5762818 5937708 5930131 5730607 5457552 5237546 5093504
39891 5093504 4958467 4764707 4475507 4063243 3540180 3024714 2706837 2704812 2978668 3388370
39881 3388370 3791299 4077693 4183860 4124032 3977226 3800738 3574510 3253102 2840041 2379192
39871 2379192 1903816 1437220 1029755 757763 684570 831065 1159183 1561082 1889730 2035513
39861 2035513 1969980 1711400 1288337 769647 291921 -3240 -63140 67032 306950 579213
39851 579213 817940 1008057 1220819 1553066 2005793 2451384 2734777 2788433 2656400 2450339
39841 2450339 2293984 2268252 2377280 2574825 2824458 3110947 3397345 3616965 3731608 3773670
39831 3773670 3818500 3941497 4199864 4587571 4954307 5011297 4508468 3449092 2118155
39822B118155j231075r07319n93690m37405m21827m08818k63901K4603L36842
39813a784435N32657N66911N00567M25628L95296M07702M29315M28040L90068
39804B291749L10369J82401J6407j40440k33150k53004k32985j81440n8087J57332
39794A859152M00798N66115O04060N52290M70799L73939K32671K9673j97875l74937
39784D516685m54417m62270m63191m88037n19983n44153n62143n44349m26911
39775E1231k05124O203O6927l8806j87877k45406j72053k2880J09226J53082J14355
39764c71122Q2388J46383L01205M67084N90901O79806P43007P63998P38115O73502
39754D815267N38912K80408p6599m03282n85472o13281n22152l22530n4770J54853
$$ plain form
39822 2118155 887080 -20239 -613929 -1051334 -1473161 -1881979 -2145880 -2121277 -1784435
39813 -1784435 -1251778 -684867 -184300 241328 636624 1044326 1473641 1901681 2291749
39804 2291749 2602118 2784519 2800926 2660486 2427336 2174332 1941347 1759907 1701820 1859152
39794 1859152 2259950 2826065 3430125 3982415 4453214 4827153 5059824 5089497 4891622 4516685
39784 4516685 4062268 3599998 3136807 2648770 2128787 1584634 1022491 478142 51231
39775 51231 -153893 -147690 -80763 -119569 -307446 -552852 -724905 -747785 -638559 -485477 -371122
39764 -371122 -288734 -142351 158854 625938 1216839 1896645 2639652 3403650 4141765 4815267
39754 4815267 5354179 5634587 5557988 5154706 4569234 3955953 3433801 3111271 3056501 3211354
39744C211354J95416J07479L4738N3345J26676K12082L12194M06036M27213L60675
39734E447208K95210L21418M12331M51851L62943J77197o230j07580j24365j14965
39724G115018j17961j01479k3941P0810P6031n4592k60843m61503o21596p15957
39714D903987p03653n87890m40404l09916j60483L6087K00957K26596J21761j0693
39704C276349j19587k26434k96743k04587J13766N37963Q63097R94396R98411
39695E936631R84401R82325R36882P89700N53108L03896J05634n1304k19761m21786
39685I899726o30609q12829r51365j032311j049439j019350r47416p81927m63662
39676B210818l7876L41990N51052N83321M85264K78311R935j85984j86570l0564
$$ plain form
39744 3211354 3406770 3514249 3548987 3602332 3729008 3941090 4253284 4659320 5086533 5447208
39734 5447208 5742418 6063836 6476167 6928018 7290961 7468158 7461928 7354348 7229983 7115018
39724 7115018 6997057 6895578 6871637 6942447 7018478 6963886 6703043 6241540 5619944 4903987
39714 4903987 4200334 3612444 3172040 2862124 2701641 2737728 2938685 3165281 3287042 3276349
39704 3276349 3156762 2930328 2633585 2428998 2542764 3080727 3943824 4938220 5936631
39695 5936631 6921032 7903357 8840239 9629939 10183047 10486943 10592577 10541273 10321512 9899726
39685 9899726 9269117 8456288 7504923 6472612 5423173 4403823 3456407 2674480 2210818
39676 2210818 2172942 2514932 3065984 3649305 4134569 4412880 4422815 4236831 4050261 4019697
39666D019697J13691J44704J26529J72739K94600M03917M28246L80457L27890
39657F412470L22408L57670L77917L26722J90733k801k16835m14554n50615n88009
39647F215106n37574m63585m37721m89507n91707o74629o63556n37046l60342
39638A459439k38630k22808k70017k93670k30156o0255J94057M69586O81236P69330
39628B258112P28293N90423M06006K47957J99368K96106M84264O56848P33409
39619F600786O97689N77545M15195K49319R5751o1901k44359m34278n79286o46516
39609F669945o59533o67074o84771o88028o62936o38219o43580o47618n72040
39600H06146l79721j23239J10675K77174L66478L54348K20202J7256j32153j41212
$$ plain form
39666 4019697 4133388 4278092 4404621 4577360 4871960 5275877 5704123 6084580 6412470
39657 6412470 6734878 7092548 7470465 7797187 7987920 7985119 7768284 7353730 6803115 6215106
39647 6215106 5677532 5213947 4776226 4286719 3695012 3020383 2356827 1819781 1459439
39638 1459439 1220809 998001 727984 434314 204158 143903 337960 807546 1488782 2258112
39628 2258112 2986405 3576828 3982834 4230791 4430159 4726265 5210529 5867377 6600786
39619 6600786 7298475 7876020 8291215 8540534 8636285 8574384 8330025 7895747 7316461 6669945
39609 6669945 6010412 5343338 4658567 3970539 3307603 2669384 2025804 1378186 806146
39600 806146 426425 303186 413861 691035 1057513 1411861 1632063 1649319 1517166 1375954
39590A375954l3404R9261J80716J83897J27490P2340Q3209J50860J75538O9946
39580B485807j35236l21586l99035l57394k32622q0796K6110M4967J4850J5541
39570A060606N9327P0194j6523j83432l74973n48918o45748n69646k78072J24785
39560a302400M48170N74849N24336L72037J72416j8787j10779l2404J79991L85413
39550A192842M44942L23933R8118j21650k63293l06540k50052r5358J23981L17778
39540A464701L83018K92456J28781J6257K1218J20723K46133L33373L43232K72865
39530C622757J64779Q1870N2001M8177L8014L3747O4831J12635J12699L0758r5074
39519D267194k01485k59344k68199k28026j57477j21131j85670l37465m77840
$$ plain form
39590 1375954 1342550 1441811 1622527 1806424 1933914 2006254 2089463 2240323 2415861 2485807
39580 2485807 2350571 2028985 1629950 1272556 1039934 959138 985248 1030215 1045065 1060606
39570 1060606 1119933 1190127 1173604 990172 615199 66281 -579467 -1149113 -1427185 -1302400
39560 -1302400 -854230 -279381 244955 616992 789408 770621 659842 627438 807429 1192842
39550 1192842 1637784 1961717 2059835 1938185 1674892 1368352 1118300 1022942 1146923 1464701
39540 1464701 1847719 2140175 2268956 2285213 2306431 2427154 2673287 3006660 3349892 3622757
39530 3622757 3787536 3869406 3921407 3969584 4007598 4041345 4106176 4218811 4331510 4362268 4267194
39519 4267194 4065709 3806365 3538166 3310140 3152663 3031532 2845862 2508397 2030557
39510B030557n16653m49362l32416k12614j07919m0367m6462j34613k43973k70253
39500c24075j52255O2781K51198L20128K78553K00185J37385R3811O3694N3141
39490I84546N0973J5916p3968j68493j67170j670L00751O21475Q13031P83923
39480C159314N57672K59303L0370o1750n0346k4181n6121j55599k72760l47474
39470C038428l55537l05721k07161o9876N7994R1434j7673k16476l87774m52776
39460A174862m24837l69300l30971k98297k16059k9470K61412N75498P89306Q20892
39450A953036O87515M89009L38096K93261L34053L88299L91150L31359K49594
39441E455372K00333K17071K95945L88585M16701L30114J67370K9253l7137j02782
$$ plain form
39510 2030557 1513904 1064542 732126 519512 411593 371226 324764 190151 -53822 -324075
39500 -324075 -476330 -413549 -162351 157777 436330 636515 773900 867711 931405 984546
39490 984546 1035519 1051435 977467 808974 641804 640134 940885 1562360 2375391 3159314
39480 3159314 3716986 3976289 4006659 3944909 3894563 3870382 3814261 3658662 3385902 3038428
39470 3038428 2682891 2377170 2170009 2100133 2158127 2249561 2231888 2015412 1627638 1174862
39460 1174862 750025 380725 49754 -248543 -464602 -494072 -232660 342838 1132144 1953036
39450 1953036 2640551 3129560 3467656 3760917 4094970 4483269 4874419 5205778 5455372
39441 5455372 5655705 5872776 6168721 6557306 6974007 7304121 7471491 7500744 7463607 7360825
39431G360825k57706m57498n35710l99605j60839j9854n5753j92751l43959m90201
39421D446949o02393n93498m24654j99143o0475j7305N1325K21151M26663N47614
39411C796234N23862L67016J24804j29427l19062m14076m30183l64770j89121
39402B965277N9832K36736K05319j5341k66715l99506l73804k42467r4961j3096
39392B061274k6440q9417j21495p3630N2949K30582M19128N76591O90763P82947
39382D503252Q43420P87760N35367J30287k65043n01441n35715m13228k23858
39373D860801p5227l2686n0417r759J44798L45511M90457N34805M65827K59420
39363F933530o4783l76091m98540l62330o7933J90061K45334M6449l16503o67692
$$ plain form
39431 7360825 7103119 6645621 6109911 5710306 5549467 5529613 5473860 5281109 4937150 4446949
39421 4446949 3844556 3251058 2826404 2627261 2566786 2549481 2600806 2821957 3248620 3796234
39411 3796234 4320096 4687112 4811916 4682489 4363427 3949351 3519168 3154398 2965277
39402 2965277 3025109 3261845 3467164 3451823 3185108 2785602 2411798 2169331 2074370 2061274
39392 2061274 2034834 1945417 1823922 1750292 1803241 2033823 2452951 3029542 3720305 4503252
39382 4503252 5346672 6134432 6669799 6800086 6535043 6033602 5497887 5084659 4860801
39373 4860801 4785574 4752888 4702471 4692712 4837510 5183021 5673478 6208283 6674110 6933530
39363 6933530 6868747 6492656 5994116 5631786 5563853 5753914 5999248 6045697 5729194 5061502
39353E061502q66888q90212p91403o17990l98231j74463J3311J69534L12209M01546
39343B218915L61447J86789k7410j88712k89222l57391l84903l54635l02089k80967
39333E81822k77256k17237o7711J16739K52018K86431K01910J6724j80653k58271
39323D54516j66470j4906L9630j9366n0685O5248K87356M78543N53349N17159
39313B144374M05461K53369J10629J7149n0339j57148l16618m54837m87041l96339
39303A068660k22546j4593J78621L07647L54332L47461L17826K58326J57622M5925
39293B799281l6373r8010j75746k62019l06219k92897k68966k77698l08534l31635
39283D41184l41546l40383l14454k62760k21379k19342k24158j67902k2211J79863
$$ plain form
39353 5061502 4194614 3304402 2512999 1895009 1496778 1322315 1335626 1505160 1817369 2218915
39343 2218915 2580362 2767151 2739741 2551029 2261807 1904416 1519513 1164878 862789 581822
39333 581822 304566 87329 19618 136357 388375 674806 876716 893440 712787 454516
39323 454516 288046 273140 312770 293404 242719 307967 595323 1073866 1627215 2144374
39313 2144374 2549835 2803204 2913833 2930982 2880643 2723495 2406877 1952040 1464999 1068660
39303 1068660 846114 831521 1010142 1317789 1672121 2019582 2337408 2595734 2753356 2799281
39293 2799281 2762908 2664898 2489152 2227133 1920914 1628017 1359051 1081353 772819 441184
39283 441184 99638 -240745 -555199 -817959 -1039338 -1258680 -1482838 -1650740 -1672951 -1493088
39273a493088L85588N51961O40207O25479N29160M15448L37084K96874K69928
39264B558641K43526K18599J85140J18502N982j27678k25901k41107j80797j07587
39254B447320p8377q8106r3955q9129j14985j86079k41618k08948r8323K656K3696
39243A274152l1386j17033j92813k24550j74479k2789K04242M36704N87007N84689
39233B323744M21686J77357l2192j54987k33817l15887l61651k85648p7548J59443
39223A620500K95101K69538J11677r5102k55103l10079k77030k22000j86729j65194
39213G85579j58148k04135l19503m40941m82029m39038l88523l71285l28632j85038
39203b531693L6607K23979K94320K71640K37770K31739K16645J35662j7663j80348
$$ plain form
39273 -1493088 -1107500 -555539 84668 710147 1239307 1654755 1991839 2288713 2558641
39264 2558641 2802167 3020766 3205906 3324408 3330390 3202712 2976811 2735704 2554907 2447320
39254 2447320 2368943 2280837 2186882 2097753 1982768 1796689 1555071 1346123 1247800 1250456 1274152
39243 1274152 1242766 1125733 932920 708370 533891 511102 715344 1152048 1739055 2323744
39233 2323744 2745430 2922787 2890595 2735608 2501791 2185904 1824253 1538605 1461057 1620500
39223 1620500 1915601 2185139 2296816 2201714 1946611 1636532 1359502 1137502 950773 785579
39213 785579 627431 423296 103793 -337148 -819177 -1258215 -1646738 -2018023 -2346655 -2531693
39203 -2531693 -2495086 -2271107 -1976787 -1705147 -1467377 -1235638 -1018993 -883331 -900994 -1081342
39193a081342k51456j47355J34942M81428P14313P32712O10094N17253N34028
39184B244617N65734M59452J68317k22385n90172q47180r44662q79214p14212
39175g59705n48026m28166l13830j38009J11741L82822O00274P02482O62079N06781
39165G78443L16869J75678J07028N8360n3917k69552n36093p40999q17823q18006
39155a800012q40966q86762q27936n61384j50912K28195M65524N88335O72171
39146c113747P37090P44756O56761M79608K79928J59106J72068K55072K71578
39137F42220J53790l0475j69690k25720k24841j75678o2786Q7510K02622K45732
39127D42684K53519K62095K36752J26029k9930j04380k2125J38793K17798J35645
$$ plain form
39193 -1081342 -1332798 -1480153 -1345211 -863783 -149470 583242 1193336 1710589 2244617
39184 2244617 2810351 3269803 3438120 3215735 2625563 1778383 833721 -45493 -759705
39175 -759705 -1307731 -1735897 -2049727 -2187736 -2075995 -1693173 -1092899 -390417 271662 778443
39165 778443 1095312 1270990 1378018 1436378 1382461 1112909 576816 -164183 -982006 -1800012
39155 -1800012 -2640978 -3527740 -4355676 -4917060 -5067972 -4839777 -4374253 -3785918 -3113747
39146 -3113747 -2376657 -1631901 -975140 -495532 -215604 -56498 115570 370642 642220
39137 642220 796010 765535 595845 370125 145284 -30394 -93180 -5670 196952 442684
39127 442684 696203 958298 1195050 1321079 1291149 1186769 1164644 1303437 1521235 1656880
39117A656880m0300j88221k48241k33636j75390j08522r1920j70988l02924l76195
39107b79457l38587k60745k30389k28524j77169q4068n2860j33512k35410k30683
39097b251404r8028P8158K16770K99497L40146L43983L02581K03088M4148j37559
39087f58620k68297k97839k60709k47673l04632l77211l66774k34836m9761O4925
39077c001427L6155r0639j91925j83985r0889J4493J07605K09947L10158L59977
39067b520530L73244M59430O86479R34701R69797O88127K42627j04353k18153
39058A511369j52677k0469J25080K75725M07663M84380M96177M55253L59187J95153
39048D136841j7900k22991l70907m48703m54541l74322k09123j0455J41005J92868
$$ plain form
39117 1656880 1616580 1428359 1180118 946482 771092 662570 570650 399662 96738 -279457
39107 -279457 -618044 -878789 -1109178 -1337702 -1514871 -1598939 -1651799 -1785311 -2020721 -2251404
39097 -2251404 -2349432 -2271274 -2054504 -1755007 -1414861 -1070878 -768297 -565209 -521061 -658620
39087 -658620 -926917 -1224756 -1485465 -1733138 -2037770 -2414981 -2781755 -3016591 -3066352 -3001427
39077 -3001427 -2965272 -3055911 -3247836 -3431821 -3522710 -3508217 -3400612 -3190665 -2880507 -2520530
39067 -2520530 -2147286 -1687856 -1001377 -66676 903121 1591248 1833875 1729522 1511369
39058 1511369 1358692 1338223 1463303 1739028 2146691 2631071 3127248 3582501 3941688 4136841
39048 4136841 4118941 3895950 3525043 3076340 2621799 2247477 2038354 2027899 2168904 2361772
39038B361772J41253J235k10712m48700o16336o16174m40588j99108l2411J536
39028e8233n6555j50261k64131l85133m57294m27344l20236k18386j64359j25963
39018b627895n9364L9619J53752K60210L07967K33945M1246j75598l18905l67992
39008b513015l42930k42225p4191R1686J82882K21255K92446M19329N30735N61528
38998h72500N18947M32734L00365J14860r3568k74686l94291m41037m24890l73079
38988a507145k94411j51789P8575L19835M38450M06616L57339M26787N83306O62014
38978A319577N38900K30255j43595m38574n53554m77159k79977m7704J56881K58735
38968E63785J66151j27609m65887o26577n05720j68843K51845O43517R10166R76750
$$ plain form
39038 2361772 2503025 2504260 2293548 1844848 1228512 612338 171750 -27358 -59769 -58233
39028 -58233 -114788 -265049 -529180 -914313 -1371607 -1798951 -2119187 -2337573 -2501932 -2627895
39018 -2627895 -2687259 -2647640 -2493888 -2233678 -1925711 -1691766 -1650520 -1826118 -2145023 -2513015
39008 -2513015 -2855945 -3098170 -3172361 -3080675 -2897793 -2676538 -2384092 -1964763 -1434028 -872500
38998 -872500 -353553 79181 379546 494406 400838 126152 -268139 -709176 -1134066 -1507145
38988 -1507145 -1801556 -1953345 -1874770 -1554935 -1116485 -709869 -352530 74257 657563 1319577
38978 1319577 1858477 2088732 1945137 1506563 953009 475850 195873 148169 305050 563785
38968 563785 729936 602327 136440 -490137 -995857 -1164700 -912855 -269338 640828 1617578
38958A617578Q41189N86136L14447R3675m2663r0725q7298q0135p0376k4506M6045
38947C103367P1406J4069q2670j77719l09226n19501p27426p52701m86193Q96
38937A34302N22119R10121J082226J031531Q05634M85264J44112j85603m96154
38928D433552p49805q61298p58263m62713r7685J98249L60263M03336L63434K60328
38918C089398J16346j8552q3580m8377O6804K06093L10858L49378L25715K58268
38908D572351J45487m0906l16481o32880q75330r30831p74271m86166j79222Q2747
38898E64498K80711L81166L37097J65874k3339j26357j45647j53909j78713j79852
38888I21529j35107q4392p0091q4738j03423j21665j26112o9585P2028K35957
$$ plain form
38958 1617578 2458767 3044903 3359350 3453025 3410362 3319637 3232339 3152204 3081828 3057322 3103367
38947 3103367 3174773 3188842 3106172 2928453 2619227 2099726 1372300 619599 133406 134302
38937 134302 656421 1566542 2648768 3680299 4485933 4971197 5115309 4929706 4433552
38928 4433552 3683747 2822449 2064186 1601473 1503788 1702037 2062300 2465636 2829070 3089398
38918 3089398 3205744 3187192 3103612 3055235 3122039 3328132 3638990 3988368 4314083 4572351
38908 4572351 4717838 4676932 4360451 3727571 2852241 1921410 1147139 660973 481751 564498
38898 564498 845209 1226375 1563472 1729346 1706007 1579650 1434003 1280094 1101381 921529
38888 921529 786422 702030 631939 547201 443778 322113 196001 126416 198444 434401
38878D34401L16343K75171J79009J25944J62398K67338L82972M49641M34921L46205
38868C374343K11981N6542r0564j71327j28283J9225J51643J37843m7787l09500
38858C204116n23153o19808n79145l87962n5947L28521O06650O51281M58473J28684
38848C211710k22449n10862o64959o18683l56356N0715M73836P90803R19482Q16017
38838C889254M79112k6103n57719r36722j034475q54631n33939k40736n4567N7417
38828A86891J56699K52120L08901L09625K75374K29384J65257O6242m8494j11472
38818A790527n8037J02495K80715L90496M29256M49394M57504L85976J83333j01907
38808D309752l55828m92845m88582l54941j40096N3734J18555M2529o3389p0824
$$ plain form
38878 434401 750744 1025915 1204924 1330868 1493266 1760604 2143576 2593217 3028138 3374343
38868 3374343 3586324 3642866 3552302 3380975 3252692 3271917 3423560 3561403 3513616 3204116
38858 3204116 2680963 2061155 1482010 1094048 1038101 1366622 1973272 2624553 3083026 3211710
38848 3211710 2989261 2478399 1813440 1194757 838401 889116 1362952 2153755 3073237 3889254
38838 3889254 4368366 4342263 3784544 2847822 1813347 958716 424777 184041 129474 186891
38828 186891 343590 595710 904611 1214236 1489610 1718994 1884251 1950493 1901999 1790527
38818 1790527 1732490 1834985 2115700 2506196 2935452 3384846 3842350 4228326 4411659 4309752
38808 4309752 3953924 3461079 2972497 2617556 2477460 2531194 2649749 2692278 2628889 2558065
38798B558065M3240J91160K69961K37145J09062p3572k64524m22289n26590n80918
38788A540740n85479n15041l45132j03850J23706K58742K87953K49959J78642
38779A090240Q1270l7394j60065k71903l68371m41859m80605m85320m61664l88455
38769a924126k26686J6560K60185M15853M63514M28011L02809N2619l00372o40702
38759a152335q39650q52676p24477n24383l00230p5059J45605L65655N78882P55518
38749b623150Q59920Q79638Q25159P04788N17086K73400J8885j72442k22899q9240
38739I71145J92881M94725O54736N86320L33903K2934k30636l60243l44178k16615
38729B104972p8618l9212j12233j97804j93054j02956k0278j7707q5841j56057
$$ plain form
38798 2558065 2601305 2792465 3062426 3299571 3408633 3335061 3070537 2648248 2121658 1540740
38788 1540740 955261 440220 95088 -8762 114944 373686 661639 911598 1090240
38779 1090240 1171510 1134116 974051 702148 333777 -108082 -588687 -1074007 -1535671 -1924126
38769 -1924126 -2150812 -2134252 -1874067 -1458214 -994700 -566689 -263880 -211261 -511633 -1152335
38759 -1152335 -1991985 -2844661 -3569138 -4093521 -4393751 -4468810 -4323205 -3957550 -3378668 -2623150
38749 -2623150 -1763230 -883592 -58433 646355 1163441 1436841 1455726 1283284 1060385 971145
38739 971145 1164026 1658751 2313487 2899807 3233710 3256644 3026008 2665765 2321587 2104972
38729 2104972 2026354 1987142 1874909 1677105 1484051 1381095 1360817 1343110 1257269 1101212
38719A101212j52296m0852J26436K26122J67272j0650j78851k61692l00967l72314
38709C03420m78947n45656m88766k85030r579J86950J92868N6728n0483k8949
38699a147444L7017J625j51481l03600l58556l31195k78309k10214r8252P0352
38689b770057K72435M62829N92801O30050N72093M37530K53711O3483p7074j35457
38679C02344j24725o5808M6766K02985L28899L43199K58468J64475J04418L1132
38669A592153r5755k33449l11487l10738k47891j31602J3100J15851J21362O4644
38659E76188L0301M2913N0879K2972P584O9061J92542K79434K35637O2860j27042
38648A443329j92950q3350J12852K41591K17195Q3927m3608q7715n9961k2955
$$ plain form
38719 1101212 948916 908064 1034500 1260622 1427894 1417244 1238393 976701 675734 303420
38709 303420 -175527 -721183 -1209949 -1494979 -1504558 -1317608 -1124740 -1068012 -1118495 -1147444
38699 -1147444 -1110427 -1108802 -1260283 -1563883 -1922439 -2253634 -2531943 -2742157 -2840409 -2770057
38689 -2770057 -2497622 -2034793 -1441992 -811942 -239849 197681 451392 514875 437801 302344
38679 302344 177619 111811 158577 361562 690461 1033660 1292128 1456603 1561021 1592153
38669 1592153 1496398 1262949 951462 640724 392833 261231 274331 390182 511544 576188
38659 576188 606489 649402 700281 723253 730837 799898 992440 1271874 1507511 1570371 1443329
38648 1443329 1250379 1167029 1279881 1521472 1738667 1822594 1778986 1691271 1631310 1608355
38638A608355p519K9008J50213L41376M83645M54154K50598n718j96072l15699
38628B792341m46082o24769p64759p23873m59201r4974J83291K94285K98558K84569
38618G39386K67591K18882J43848P9421L1855l2752j33609k46632l35907l84990
38608C47093l90307l46347k42464n9003K22816N73693Q82596J018052R47272P66484
38598C719885N92103M46601K74019M0807k14119m16546n11180m87304l88157k99840
38588B756269k97117l79917m75981n14511m83742m13774l30095k43499j65661
38579e48028j06186o1699l3985n3814j54913l17843m68308n43537n36414m65106
38569c289833l35828j61676J7793J78205L42343N11231N81653M19715M8036l08477
$$ plain form
38638 1608355 1600836 1629844 1780057 2121433 2605078 3059232 3309830 3304112 3108040 2792341
38628 2792341 2346259 1721490 956731 232858 -226343 -321317 -138026 156259 454817 739386
38618 739386 1006977 1225859 1369707 1449128 1480983 1448231 1314622 1067990 732083 347093
38608 347093 -43214 -389561 -632025 -691028 -468212 105481 988077 2006129 2953401 3719885
38598 3719885 4311988 4758589 5032608 5073415 4859296 4442750 3931570 3444266 3056109 2756269
38588 2756269 2459152 2079235 1603254 1088743 605001 191227 -138868 -382367 -548028
38579 -548028 -654214 -715913 -749898 -803712 -958625 -1276468 -1744776 -2288313 -2824727 -3289833
38569 -3289833 -3625661 -3787337 -3769544 -3591339 -3248996 -2737765 -2156112 -1736397 -1688361 -1996838
38559a996838m25200l02427j46576j47480l09517m78637m88305k88601J9660K66919
38549d297002L57342L38190L22239L64540M41121N17691N82499O15909N83365
38540a74106M74452L13718J27183o3184k08193k46947j77658p3291Q73N3773J26535
38529A53155K14033K61453K22967J00249o1754j97445k55556k32527j64997q7920
38519d8342k0507J3869K120j2424M4157J69186K52244J99121M5544j06281k22157
38508C16530l32590m21736m13193k81904j10519r119k6601j50921l33998m89369
38498b253420n25238m28991k90549k10285k11128k60771l31199l89717l67320
38489e268618j98725J07090M69423P94138R95708R92972P59598L97468J02734
$$ plain form
38559 -1996838 -2422038 -2724465 -2871041 -3018521 -3328038 -3806675 -4294980 -4583581 -4563921 -4297002
38549 -4297002 -3939660 -3601470 -3279231 -2914691 -2473570 -1955879 -1373380 -757471 -174106
38540 -174106 300346 614064 741247 678063 469870 222923 45265 -28026 -27153 26620 153155
38529 153155 367188 628641 851608 951857 890103 692658 437102 204575 39578 -48342
38519 -48342 -68849 -54980 -52860 -65284 -21127 148059 400303 599424 644968 538687 316530
38508 316530 -16060 -437796 -850989 -1132893 -1243412 -1252531 -1279132 -1430053 -1764051 -2253420
38498 -2253420 -2778658 -3207649 -3498198 -3708483 -3919611 -4180382 -4511581 -4901298 -5268618
38489 -5268618 -5467343 -5360253 -4890830 -4096692 -3100984 -2108012 -1348414 -950946 -848212
38480h48212J3098R8811K18013K57272K03080J09531M0710M1723J25260K62950
38470E22236M00190M91779N19909M81374L81117K51217J49938J08240Q8157L4179
38460C428336l6166m7619L840n104j89336m84728o78769o19360l49783l6555J82946
38449A167702K70834K70887K62699K98335L47461L31068K37403J66798K13295
38440C566482L24734L38995J66154j03233k83687k71902j41987q2703k29932n35103
38430B747818q01576q68128p46565n65088m10626k75295j38724k9400K2439M3936
38420a021209Q9983J73063K52688K85984K66956K19345J65640J03886J1404j22769
38410D24971k67401l61685l65323k92174j94530j21185q7293p1572m1998K741
$$ plain form
38480 -848212 -835114 -736303 -518290 -261018 -57938 51593 92303 134026 259286 522236
38470 522236 922426 1414205 1934114 2415488 2796605 3047822 3197760 3306000 3394157 3428336
38460 3428336 3392170 3344551 3348391 3343287 3153951 2669223 1990454 1371094 1021311 984756 1167702
38449 1167702 1438536 1709423 1972122 2270457 2617918 2948986 3186389 3353187 3566482
38440 3566482 3891216 4230211 4396365 4293132 4009445 3737543 3595556 3512853 3282921 2747818
38430 2747818 1946242 1078114 331549 -233539 -644165 -919460 -1058184 -1087584 -1065145 -1021209
38420 -1021209 -931226 -758163 -505475 -219491 47465 266810 432450 536336 547740 424971
38410 424971 157570 -204115 -569438 -861612 -1056142 -1177327 -1264620 -1336192 -1378190 -1375449
38400a375449J6740m9632j78701k71606k28748n5771J18546J51393K7088j23430
38390a969570j65354j09932q5693j65538k77958l08960k32060r3103P8309K69735
38380c060124M29205M91664M64158M19438L98496L75307L18705K28380J08502
38371A73731k7214j22839j34967j31592k36123m33262n34835m11987j70535K394
38361b027229Q9260K08469L69977M20846K66710K4839j14016j03647n0811m6835
38351i62437o2262q748J37611K92776L39422K41979Q1198k9230m2358J6208J02101
38340A06260J63848J28646m3657k73942l93888l02464o0732J90852L68118M67558
38330C50599N05023M90935M50158M09656L60398K71225J47594L9000k7277q6273
$$ plain form
38400 -1375449 -1358709 -1408341 -1587042 -1858648 -2087396 -2143167 -2024621 -1873228 -1846140 -1969570
38390 -1969570 -2134924 -2244856 -2330549 -2496087 -2774045 -3083005 -3315065 -3408168 -3329859 -3060124
38380 -3060124 -2630919 -2139255 -1675097 -1255659 -857163 -481856 -163151 65229 173731
38371 173731 146517 23678 -111289 -242881 -479004 -912266 -1447101 -1859088 -2029623 -2027229
38361 -2027229 -1937969 -1729500 -1359523 -938677 -671967 -647128 -761144 -864791 -915602 -962437
38351 -962437 -1024699 -1033447 -895836 -603060 -263638 -21659 59539 30309 -12049 4159 106260
38340 106260 270108 398754 355097 81155 -312733 -615197 -675929 -485077 -116959 350599
38330 350599 855622 1346557 1796715 2206371 2566769 2837994 2985588 3024588 2997311 2911038
38320B911038j82544k99510l74425l73485l15792k23461r3954N3753J44639J08080
38310A354339l6929j95922k90977k99763k19769o4989Q5420J08943l5893k45054
38300A59406l73181l70877k86195j83814j23566j70120l30473m91297n05233l55468
38290c030818j71936p4844o6044q8093j20039j79209k75669l95021m91583m89171
38280e382427l41038j03918J08878K71934M74083P55286R86853R91198P46861
38271a492290M03687J13437q6426k26714l16336l27929k42974q9322O0163J29108
38261b075596R0872j8785j39468k20813k28341j58821o3641j1226QM6721J66665
38250b612425K90557L36768L25500L30682L55697L42509K89745K68866L08779
$$ plain form
38320 2911038 2728494 2428984 2054559 1681074 1365282 1141821 1047867 1101620 1246259 1354339
38310 1354339 1317410 1121488 830511 530748 310979 245990 331410 440353 404460 159406
38300 159406 -213775 -584652 -870847 -1054661 -1178227 -1348347 -1678820 -2170117 -2675350 -3030818
38290 -3030818 -3202754 -3277598 -3343642 -3431735 -3551774 -3730983 -4006652 -4401673 -4893256 -5382427
38280 -5382427 -5723465 -5827383 -5718505 -5446571 -4972488 -4217202 -3230349 -2239151 -1492290
38271 -1492290 -1088603 -975166 -1061592 -1288306 -1604642 -1932571 -2175545 -2264867 -2204704 -2075596
38261 -2075596 -1984724 -2003509 -2142977 -2363790 -2592131 -2750952 -2814593 -2825819 -2825811 -2779090 -2612425
38250 -2612425 -2321868 -1985100 -1659600 -1328918 -973221 -630712 -340967 -72101 236678
38241B36678L47459L33069L06543L36487M19324M95052N30351N29674M71131K84440
38231D290208p6831n45924r42505j084691r24575n76371k04940J00391L30677
38222C65439M76247N05204M29480L34630L07803L58900M29590M50010L70429J80752
38212D208484o0348k45138l16303l35473m03956n18236n60300m51011k64533j52144
38202I01042j84840l17460m82165o44310p55555p32833n50150l14585j73764j45860
38192c400480j03815N7332K93588M73780N10519L92770J46339j68052m39800n62027
38182b799846n12975l52022j41844Q7921L09280M77599N55250N24948L83212J55774
38172a312703q4210k55768l35514l54133l34270k74486j89810j11060l1257R1749
$$ plain form
38241 236678 584137 917206 1223749 1560236 1979560 2474612 3004963 3534637 4005768 4290208
38231 4290208 4213377 3667453 2724948 1640257 715682 139311 -65629 34762 365439
38222 365439 841686 1346890 1776370 2111000 2418803 2777703 3207293 3657303 4027732 4208484
38212 4208484 4148136 3902998 3586695 3251222 2847266 2329030 1768730 1317719 1053186 901042
38202 901042 716202 398742 -83423 -727733 -1483288 -2216121 -2766271 -3080856 -3254620 -3400480
38192 -3400480 -3504295 -3446963 -3153375 -2679595 -2169076 -1776306 -1629967 -1798019 -2237819 -2799846
38182 -2799846 -3312821 -3664843 -3806687 -3718766 -3409486 -2931887 -2376637 -1851689 -1468477 -1312703
38172 -1312703 -1396913 -1652681 -1988195 -2342328 -2676598 -2951084 -3140894 -3251954 -3283211 -3191462
38162c191462K53919L74153L77481K75008J38190L5684K1806J30505L20929M62254
38152h01533M44911L09715K15608K67690M10677M99403M42700K66687O5981q0643
38142B041196j52168j67724j50302j17449r0340p9330n6264K6870J75456L34157
38132A764102M47465N08872N27843M84168L57462J80033J0515j40139l10967n14023
38122C315331o92987p69887p06658n16855k50564J7748K15338L11007L25139K98121
38112A545733K61464K31893J98699J05840j17428m75662q67544j147192j217777
38103a481974j060016p07314k42325J89625M27374M03477K05133O850n9105L0188
38093b288087K12763L90883M65047L77640J63471o0111j86427k01170j56575q7331
$$ plain form
38162 -3191462 -2937543 -2563390 -2185909 -1910901 -1772711 -1737027 -1715221 -1584716 -1263787 -801533
38152 -801533 -356622 -46907 168701 436391 847068 1346471 1789171 2055858 2121839 2041196
38142 2041196 1889028 1721304 1571002 1453553 1363213 1283883 1227619 1254489 1429945 1764102
38132 1764102 2211567 2720439 3248282 3732450 4089912 4269945 4280460 4140321 3829354 3315331
38122 3315331 2622344 1852457 1145799 628944 378380 396128 611466 922473 1247612 1545733
38112 1545733 1807197 2039090 2237789 2343629 2226201 1750539 882995 -264197 -1481974
38103 -1481974 -2541990 -3249304 -3491629 -3302004 -2874630 -2471153 -2266020 -2259170 -2318275 -2288087
38093 -2288087 -2075324 -1684441 -1219394 -841754 -678283 -738394 -924821 -1125991 -1282566 -1369897
38083a369897O391J01393J38004R3406K5760m00r765q2565k22101l07123k10877
38072a837774M8291L03080L85958K72094Q1328m0397l2196O6620J71909K07363
38062c73724J32899k9792j91332k53513k00185j06016l0187O8379K59802M96768
38052b26901O05048M57731J26354j84561l41685l81376m08373m50602m48750l58562
38042a611677k11723p3762J7355N9879P7466J27189K79450N34511P64143P89427
38032G52258N45125J54991j62325k55413j29488Q0360K13130J92846O2441r1403
38022A362522k31418l61192m46571m14146k50154m7080Q5855J24831J18032J15279
38012E5958J50462K48565L89793M90956M83050L97251L21293K79863K14749Q3747
$$ plain form
38083 -1369897 -1363506 -1262113 -1124109 -1030703 -1004943 -1005343 -1015108 -1097673 -1319774 -1626897 -1837774
38072 -1837774 -1789483 -1486403 -1100445 -828351 -747023 -787420 -819616 -752996 -581087 -373724
38062 -373724 -240825 -270617 -461949 -715462 -915647 -1021663 -1051850 -983471 -723669 -226901
38052 -226901 378147 835878 962232 777671 435986 54610 -353763 -804365 -1253115 -1611677
38042 -1611677 -1823400 -1897162 -1879807 -1819928 -1742462 -1615273 -1335823 -801312 -37169 752258
38032 752258 1297383 1452374 1290049 1034636 905148 985508 1198638 1391484 1453925 1362522
38022 1362522 1131104 769912 323341 -90805 -340959 -388039 -302184 -177353 -59321 55958
38012 55958 206420 454985 844778 1335734 1818784 2216035 2537328 2817191 3031940 3115687
38002C115687p5883j94169k36348k16435j81473j84899k33579k60754k03011j11226
37992A217910j23692k99407n25888o28674n39926l32460j26983k721L3702L7498
37982a290641P1616J34778J62293J22163P4584Q9600J31644Q8543q4399l04976
37972h04795m63335n33540n58099n55162m81667k83612M2004M33429P89754J007053
37962a407970J019323Q41676N83389L90702L39992L77709L81093K83802J29350
37953B939066K388o4636j00085j32283j53153j43501j10577q5498q7612j02397
37943A961712j02735q9158r2453j27208j63947j72693j75552k11836k56008k30305
37933C39817j21902k9687m3613j15109j12333P005J39881J62252N9023q1159j49463
$$ plain form
38002 3115687 3039804 2845635 2609287 2392852 2211379 2026480 1792901 1532147 1329136 1217910
37992 1217910 1094218 794811 268923 -359751 -899677 -1232137 -1359120 -1361841 -1328139 -1290641
37982 -1290641 -1219025 -1084247 -921954 -799791 -725207 -635607 -503963 -415420 -499819 -804795
37972 -804795 -1268130 -1801670 -2359769 -2914931 -3396598 -3680210 -3638206 -3204777 -2415023 -1407970
37962 -1407970 -388647 453029 1036418 1427120 1767112 2144821 2525914 2809716 2939066
37953 2939066 2941454 2876818 2776733 2644450 2491297 2347796 2237219 2151721 2064109 1961712
37943 1961712 1858977 1769819 1677366 1550158 1386211 1213518 1037966 826130 570122 339817
37933 339817 217915 188228 144615 29506 -82827 -75822 64059 226311 285334 204175 54712
37922E4712p2231J60762M62680O60743O05307K99766r0707l69175m38562l18489
37912I54806q2772J80090L69131M02899K87541J28548L9076M3084Q9771J40532
37902B552706J95818K43892K42939J76240P8178k6701j69199l72890n70357o36924
37892A713702n13524k67169l0932R5332J00304N4662M7399R7903J30905O0913
37882A489495j08492k96030m33441m99432m76978l45382j38749L8056R0711J3977
37872f66265j24571k47058k94582k37401j00031L8637J05254R1917M5810J7373
37862a370917L4185J00425J92031K65201K94884K94353K78660K31267J38956M1552
37852E00597K054K6310N1272K5548k5641l0213N3014J93839L08710L08520J49956
$$ plain form
37922 54712 -17519 143243 605923 1266666 1871973 2171739 2081032 1711857 1273295 954806
37912 954806 872034 1052124 1421255 1824154 2111695 2240243 2279319 2322403 2412174 2552706
37902 2552706 2748524 2992416 3235355 3411595 3489773 3463072 3293873 2920983 2350626 1713702
37892 1713702 1200178 933009 902077 997409 1097713 1152375 1199774 1297677 1428582 1489495
37882 1489495 1381003 1084973 651532 152100 -324878 -670260 -809009 -770953 -680242 -666265
37872 -666265 -790836 -1037894 -1332476 -1569877 -1669908 -1631271 -1526017 -1434100 -1388290 -1370917
37862 -1370917 -1336732 -1236307 -1044276 -779075 -484191 -189838 88822 320089 459045 500597
37852 500597 502651 528961 580233 605781 580140 549927 602941 796780 1105490 1414010 1563966
37841A563966j30828m25645o08820o14099m86899l60354l44318m09765l97829
37832b214591j72532K35978O53299R11222R56643Q35517O19172L57767P5003k08553
37822B048925m39766n35579m58856k91822j88996k34000l66076m56451m24462
37813a347083k71022n2284J38518K02503J11098m7726j33938p0232J16558L37656
37803a015952M90058M93111L43085J36493j2010q7751j71374l08817m36743m60386
37793a030286l59386j82863K1476K29429M16106N53716O22181N91216M14629Q9923
37783A366141k85400n66975o83190o72766o08480n25150m23603k95767j30606
37774b825796N8232J90844J62418k7855k28088k71343j44702L0168J67169K97909
$$ plain form
37841 1563966 1433138 1007493 398673 -215426 -702325 -1062679 -1406997 -1816762 -2214591
37832 -2214591 -2387123 -2151145 -1497846 -586624 370019 1205536 1824708 2182475 2257478 2048925
37822 2048925 1609159 1073580 614724 322902 133906 -100094 -466170 -922621 -1347083
37813 -1347083 -1618105 -1670389 -1531871 -1329368 -1218270 -1265996 -1399934 -1470166 -1353608 -1015952
37803 -1015952 -525894 -32783 310302 446795 434785 347034 175660 -133157 -569900 -1030286
37793 -1030286 -1389672 -1572535 -1551059 -1321630 -905524 -351808 270373 861589 1276218 1366141
37783 1366141 1080741 513766 -169424 -842190 -1450670 -1975820 -2399423 -2695190 -2825796
37774 -2825796 -2767564 -2576720 -2414302 -2442157 -2670245 -2941588 -3086290 -3056122 -2888953 -2591044
37764b591044M76451O70720P87143P63894O07017L71857J50614M5895R6957K34399
37754A613903L51666M18789M80781N47211N48741M32255K45942Q2239l0267j27635
37744D563625k30766l28949m33485n72246p08805p33912n87855l53370j74850
37735D39387j05408q0675k6622O3215J56514K27881K52845K01019P0848r0845
37725A108159k30818l32802l96642l99207l16131j75116m5139L8828J06683J86751
37715d55434K35667J76891J1831j46037j76398p6208M8331J00195O0931n2954
37705b73185k31385m21612m94125l50507o6207J58351K21230K25141L10519M42872
37695d78908M50313K56343q278j50004j16900k7616k7003j43347k74297k87434
$$ plain form
37764 -2591044 -2114593 -1443873 -656730 107164 714181 1086038 1236652 1282547 1379504 1613903
37754 1613903 1965569 2384358 2865139 3412350 3961091 4393346 4639288 4721527 4691260 4563625
37744 4563625 4332859 4003910 3570425 2998179 2289374 1555462 967607 614237 439387
37735 439387 333979 253304 226682 289897 446411 674292 927137 1128156 1199004 1108159
37725 1108159 877341 544539 147897 -251310 -567441 -742557 -787696 -748868 -642185 -455434
37715 -455434 -219767 -42876 -31045 -177082 -353480 -429688 -381357 -281162 -220231 -273185
37705 -273185 -504570 -926182 -1420307 -1770814 -1837021 -1678670 -1457440 -1232299 -921780 -478908
37695 -478908 -28595 227748 219470 69466 -47434 -75050 -102053 -245400 -519697 -807131
37685h07131j34809J12142L21581L88077K83754P2426j04764j03141J02086L62660
37675D92881M73205L58577J27426n3703j01472l5340Q0258J72945J75249N1643
37665A741669j76774m39666o38898o71413m82487j33654K10333M07889M50733
37656B67732M23618L75876K82272J32325M504J4375K02964M97734P74605R40153
37646C916158R60712Q41876O06170K95249k2908k72932m12132m54107m53514m66653
37636D537919n13878n64812n65525m97996m06611l39840k70790j19831J26673
37627A385309L62494M60467L93788K20675j4764k96595n59539o79884n88805l57363
37617C25783j29325R829O6795O8886J0977j12410k51096l05610k02960L0194K76160
$$ plain form
37685 -807131 -941940 -829798 -508217 -120140 163614 236040 131276 28135 130221 492881
37675 492881 966086 1324663 1452089 1398386 1296914 1261574 1341832 1514777 1690026 1741669
37665 1741669 1564895 1125229 486331 -185082 -667569 -801223 -590890 -183001 267732
37656 267732 691350 1067226 1349498 1481823 1486327 1500702 1703666 2201400 2976005 3916158
37646 3916158 4876870 5718746 6324916 6620165 6597257 6324325 5912193 5458086 5004572 4537919
37636 4537919 4024041 3459229 2893704 2395708 1989097 1649257 1378467 1258636 1385309
37627 1385309 1747803 2208270 2602058 2822733 2807969 2511374 1951835 1271951 683146 325783
37617 325783 196458 206287 273082 341968 352945 240535 -10561 -316171 -519131 -488937 -212777
37606b12777M20658M40209L86963K99521J67409l759j38274j53090o2639L1847
37596A176068O8765R5462J81622K98410L33398K21523J8749j66670k82604l48176
37586A596547l82234l54633k21645m07K02217K49477Q9726j74361l53753l41498
37576C09436k10669j22292j44834j98995j77376o6183P6622K15304L51867M63611
37566D96491M87384L89101K17281O1789k7456o2725p1359n3525J955P4695J13018
37555A626649R1038M9418N3618J17232K00159K84610M01677N47017O10469M54050
37545D435937O2341m26156q37238j070615j101406r48387o84347m29856k69883
37536a269610j77860o4699R1957K01772J58320m0728k84921m47169m72097l81115
$$ plain form
37606 -212777 207881 648090 1035053 1334574 1501983 1498224 1359950 1206860 1144221 1176068
37596 1176068 1244833 1340295 1521917 1820327 2153725 2375248 2393997 2227327 1944723 1596547
37586 1596547 1214313 859680 638035 637628 839845 1089322 1179048 1004687 650934 309436
37576 309436 98767 -23525 -168359 -367354 -544730 -610913 -534291 -318987 32880 496491
37566 496491 983875 1372976 1590257 1652046 1624590 1561865 1490506 1436981 1438936 1513631 1626649
37555 1626649 1717687 1767105 1820723 1937955 2138114 2422724 2824401 3371418 3981887 4435937
37545 4435937 4498278 4072122 3234884 2164269 1062863 114476 -569871 -999727 -1269610
37536 -1269610 -1447470 -1512169 -1420212 -1218440 -1060120 -1100848 -1385769 -1832938 -2305035 -2686150
37526b686150k22831m0801J19489K06755J95950J22660O4633P8591J60384K65164
37516a736156L49252L83871L46846K30457O7942o3608r2718k1282O3483O3445
37506d08468l5620j51210j89407j33488m7545j2300o5227j78085k70957k68533
37496a760840j72859p1067m5671q9495j35528j48278j40004j13697n8381j0384
37486b746204m5975j69250k58545j82728N0872L10505M83460N57114N66583N17708
37476i16460L82876J46813j58885m54316o44034o72958n58735l58957j09625J83385
$$ plain form
37526 -2686150 -2908981 -2949782 -2830293 -2623538 -2427588 -2304928 -2240295 -2161704 -2001320 -1736156
37516 -1736156 -1386904 -1003033 -656187 -425730 -357788 -421396 -514114 -535396 -471913 -408468
37506 -408468 -444088 -595298 -784705 -918193 -965738 -978038 -1043265 -1221350 -1492307 -1760840
37496 -1760840 -1933699 -2004766 -2050437 -2139932 -2275460 -2423738 -2563742 -2677439 -2735820 -2746204
37486 -2746204 -2792179 -2961429 -3219974 -3402702 -3351830 -3041325 -2557865 -2000751 -1434168 -916460
37476 -916460 -533584 -386771 -545656 -999972 -1644006 -2316964 -2875699 -3234656 -3344281 -3160896
$$ [...]
##END NTUPLES=NMR SPECTRUM
##END=
