##TITLE=31Pdec_LR-774-CK
 CDCl3
  24 sc
 20.11.2023
##JCAMPDX= 6.0         $$ Bruker NMR JCAMP-DX V2.0
##DATA TYPE= NMR SPECTRUM
##DATA CLASS= NTUPLES
##ORIGIN= UXNMR, Bruker Analytische Messtechnik GmbH
##OWNER= root
$$ XWIN-NMR		Version 3.5
$$ Mon Nov 20 16:17:07 2023 Russian Standard Time (UT+4h)  she@DPX200
##.OBSERVE FREQUENCY= 81.013821
##.OBSERVE NUCLEUS= ^31P
##.ACQUISITION MODE= SIMULTANEOUS
##.ACQUISITION SCHEME= undefined
##.AVERAGES= 24
##.DIGITISER RES= 16
##SPECTROMETER/DATA SYSTEM= spect
##.PULSE SEQUENCE= zgpg30
##.SOLVENT NAME= CDCl3
##.SHIFT REFERENCE= (INTERNAL, CDCl3, 0, 248.564)
##AUDIT TRAIL= $$ (NUMBER, WHEN, WHO, WHERE, WHAT)
$$ ##TITLE= Audit trail, XWIN-NMR		Version 3.5
$$ ##JCAMPDX= 5.01
$$ ##ORIGIN= Bruker BioSpin GmbH
$$ ##OWNER= she
$$ F:/spectra/data/she/nmr/P31/1/pdata/1/auditp.txt
$$ ##AUDIT TRAIL=  $$ (NUMBER, WHEN, WHO, WHERE, WHAT)
(   1,<2023-11-20 16:16:07.57 +0400>,<she>,<DPX200>,
      <created by zg, POWCHK disabled, PULCHK disabled
       configuration hash MD5:
       00 E9 B6 7A A2 85 ED C7 34 08 36 98 17 FE 4E 26
       data hash MD5: 32K
       E0 1D 5F C8 CD 03 31 0A 1F D6 E0 C9 21 34 DC 13>)
(   2,<2023-11-20 16:16:13.98 +0400>,<she>,<DPX200>,
      <Start of raw data processing
       efp BC_mod = 2 LB = 5 FT_mod = 6 PKNL = 1 PHC0 = -10136.86 PHC1 = -1548.709 SI = 64K 
       data hash MD5: 64K
       C4 37 01 5D 79 8F A3 51 3F C7 43 3E D6 CF 4B A5>)
(   3,<2023-11-20 16:16:40.35 +0400>,<she>,<DPX200>,
      <pk PHC0 = -99.8392 PHC1 = 80 
       data hash MD5: 64K
       FC F5 1C 45 37 24 98 10 F5 4B B8 60 65 93 6A 5D>)
(   4,<2023-11-20 16:16:43.57 +0400>,<she>,<DPX200>,
      <abs ABSG = 5 
       data hash MD5: 64K
       30 D4 9A 2D 80 C2 E4 EA 5F D5 EE ED 08 5F 09 7B>)
$$ ##END=
$$ 
$$ hash MD5
$$ DA 6D 25 69 CD CB 6D 97 79 00 A3 24 9A 81 0E AA
##$RELAX= 
##$RELAX= 
##$RELAX= 
##$RELAX= 
##$RELAX= 
##$RELAX= 
##$RELAX= 
##$RELAX= 
##$RELAX= 
$$ Bruker specific parameters
$$ --------------------------
##$DU= <F:/spectra>
##$EXPNO= 1
##$NAME= <P31>
##$PROCNO= 1
##$TYPE= <nmr>
##$USER= <she>
##$AMP= (0..31)
100 100 100 100 100 100 100 100 100 100 100 100 100 100 100 100 100 100 
100 100 100 100 100 100 100 100 100 100 100 100 100 100 
##$AQSEQ= 0
##$AQ_mod= 1
##$AUNM= <au_zg>
##$AUTOPOS= <>
##$BF1= 81.014009
##$BF2= 200.13
##$BF3= 200.13
##$BF4= 200.13
##$BF5= 200.13
##$BF6= 200.13
##$BF7= 200.13
##$BF8= 200.13
##$BYTORDA= 1
##$CFDGTYP= 0
##$CFRGTYP= 5
##$CHEMSTR= <none>
##$CNST= (0..31)
1 1 145 1 1 1 1 1 1 1 1 1 1 1 1 1 1 1 1 1 1 1 1 1 1 1 1 1 1 1 1 1 
##$CPDPRG= <waltz16>
##$CPDPRG1= <>
##$CPDPRG2= <waltz16>
##$CPDPRG3= <>
##$CPDPRG4= <mlev>
##$CPDPRG5= <mlev>
##$CPDPRG6= <mlev>
##$CPDPRG7= <mlev>
##$CPDPRG8= <mlev>
##$CPDPRGB= <>
##$CPDPRGT= <>
##$D= (0..31)
0 1 0 0 0 0 0 0 0 0 0 0.03 2e-05 3e-06 0 0 0 0 0 0 0 0 0 0 0 0 0 0 0 0 
0 0 
##$DATE= 1700482567
##$DBL= (0..7)
120 120 120 11 120 120 24 19 
##$DBP= (0..7)
150 150 150 150 150 150 150 150 
##$DBP07= 0
##$DBPNAM0= <>
##$DBPNAM1= <>
$$ [...]
##$SUBNAM3= <"">
##$SUBNAM4= <"">
##$SUBNAM5= <"">
##$SUBNAM6= <"">
##$SUBNAM7= <"">
##$SUBNAM8= <"">
##$SUBNAM9= <"">
##$SW= 501.771253377433
##$SWIBOX= (0..15)
0 1 3 0 0 0 0 0 0 0 0 0 0 0 0 0 
##$SW_h= 40650.406504065
##$TD= 32768
##$TD0= 1
##$TE= 0
##$TE2= 300
##$TE3= 300
##$TEG= 300
##$TL= (0..7)
0 120 53 12 22 120 120 120 
##$TP= (0..7)
150 150 150 150 150 150 150 150 
##$TP07= 0
##$TPNAME0= <>
##$TPNAME1= <>
##$TPNAME2= <>
##$TPNAME3= <>
##$TPNAME4= <>
##$TPNAME5= <>
##$TPNAME6= <>
##$TPNAME7= <>
##$TPOAL= (0..7)
0.5 0.5 0.5 0.5 0.5 0.5 0.5 0.5 
##$TPOFFS= (0..7)
0 0 0 0 0 0 0 0 
##$TUNHIN= 0
##$TUNHOUT= 0
##$TUNXOUT= 0
##$USERA1= <user>
##$USERA2= <user>
##$USERA3= <user>
##$USERA4= <user>
##$USERA5= <user>
##$V9= 5
##$VALIST= <valist>
##$VCLIST= <CCCCCCCCCCCCCCC>
##$VD= 0
##$VDLIST= <DDDDDDDDDDDDDDD>
##$VPLIST= <PPPPPPPPPPPPPPP>
##$VTLIST= <TTTTTTTTTTTTTTT>
##$WBST= 1024
##$WBSW= 4
##$XGAIN= (0..3)
0 0 0 0 
##$XL= 0
##$YL= 0
##$YMAX_a= 384
##$YMIN_a= -454
##$ZGOPTNS= <>
##$ZL1= 120
##$ZL2= 120
##$ZL3= 120
##$ZL4= 120
##$ABSF1= 248.5645
##$ABSF2= -253.2056
##$ABSG= 5
##$ABSL= 3
##$ALPHA= 0
##$AQORDER= 0
##$ASSFAC= 0
##$ASSFACI= 0
##$ASSFACX= 0
##$ASSWID= 0
##$AUNMP= <proc_1d>
##$AZFE= 0.1
##$AZFW= 0.5
##$BCFW= 0
##$BC_mod= 2
##$BYTORDP= 0
##$COROFFS= 0
##$CY= -3
##$DATMOD= 1
##$DC= 0
##$DFILT= <>
##$DTYPP= 0
##$F1P= 0
##$F2P= 0
##$FCOR= 1
##$FTSIZE= 65536
##$FT_mod= 6
##$GAMMA= 0
##$GB= 0
##$INTBC= 1
##$INTSCL= 6.047779e-11
##$ISEN= 30
##$LB= 5
##$LEV0= 0
##$LPBIN= 0
##$MAXI= 10000
##$MC2= 0
##$MEAN= 0
##$ME_mod= 0
##$MI= 50
##$NCOEF= 0
##$NC_proc= -12
##$NLEV= 6
##$NOISF1= 182.463
##$NOISF2= 159.3651
##$NSP= 0
##$NTH_PI= 0
##$NZP= 0
##$OFFSET= 248.5645
##$PC= 4
##$PHC0= -10236.7
##$PHC1= -1468.709
##$PH_mod= 1
##$PKNL= yes
##$PPARMOD= 0
##$PSCAL= 0
##$PSIGN= 0
##$REVERSE= no
##$SF= 81.0140089999694
##$SI= 65536
##$SIGF1= 159.3651
##$SIGF2= -187.1042
##$SINO= 113.3802
##$SIOLD= 16384
##$SREGLST= <1H.CDCl3>
##$SSB= 0
##$STSI= 65536
##$STSR= 0
##$SW_p= 40650.406504065
##$SYMM= 0
##$S_DEV= 0
##$TDeff= 32768
##$TDoff= 0
##$TI= <>
##$TILT= no
##$TM1= 0
##$TM2= 0
##$TOPLEV= 0
##$USERP1= <user>
##$USERP2= <user>
##$USERP3= <user>
##$USERP4= <user>
##$USERP5= <user>
##$WDW= 1
##$XDIM= 65536
##$YMAX_p= 373818372
##$YMIN_p= -32959901
$$ End of Bruker specific parameters
$$ ---------------------------------
##NTUPLES= NMR SPECTRUM
##VAR_NAME=  FREQUENCY,     SPECTRUM/REAL,   SPECTRUM/IMAG
##SYMBOL=    X,             R,               I
##VAR_TYPE=  INDEPENDENT,   DEPENDENT,       DEPENDENT
##VAR_FORM=  AFFN,          ASDF,            ASDF
##VAR_DIM=   65536,         65536,           65536
##UNITS=     HZ,            ARBITRARY UNITS, ARBITRARY UNITS
##FACTOR=    0.620285442955139, 1,           1
##FIRST=     20137.2065510682, 0,            0
##LAST=      -20513.1999529968, 0,           0
##MIN=       -20513.1999529968, -32959901,   0
##MAX=       20137.2065510682, 373818372,    0
$$ Real data points
##PAGE= N=1
##DATA TABLE= (X++(R..R)), XYDATA
$$ [...]
$$ plain form
43532 -10143950 -9008907 -8331797 -7740455 -6954671 -6118553 -5714206 -6038003 -6821257 -7435293
43523 -7435293 -7363859 -6376518 -4428159 -1706365 1207810 3530544 4804877 5125917 4792463
43514 4792463 3968975 2845883 1881231 1539738 1822608 2302169 2603549 2610064 2201114 1100576
43504 1100576 -866035 -3548507 -6613535 -9710458 -12364759 -13956651 -14117336 -13092489
43496 -13092489 -11467838 -9556445 -7305986 -4829193 -2704617 -1504351 -1126496 -814187
43488 -814187 143574 1840608 3858833 5772154 7446956 8934632 10231271 11211200 11743382
43479 11743382 11804840 11489544 10973130 10497282 10325558 10610907 11255929 11939399 12349317
43470 12349317 12413994 12265880 11949350 11223180 9760582 7568656 5106880 2902541 1102424
$$ packed form
43532a0143950J135043O77110N91342P85784Q36118M04347l23797p83254o14036
43523g435293P1434R87341J948359K721794K914175K322734J274333L21040l33454
43514D792463q23488j123092r64652l41493K82870M79561L01380O515m08950j100538
43504A100576j966611k682472l065028l096923k654301j591892j60685J024847
43496a3092489J624651J911393K250459K476793K124576J200266L77855L12309
43488h14187R57761J697034K018225J913321J674802J487676J296639R79929N32182
43479A1743382O1458l15296n16414m75848j71724K85349O45022O83470M09918
43470A2349317O4677j48114l16530p26170j462598k191926k461776k204339j800117
$$ plain form
43461 1102424 -507070 -2105325 -3637075 -5025436 -6386649 -7861460 -9283016 -10165096
43453 -10165096 -10074252 -8990207 -7330197 -5681862 -4477974 -3800718 -3403089 -2913090 -2057135
43444 -2057135 -745394 972776 2965830 5042470 6989465 8652320 10013594 11200167
43436 11200167 12378231 13580959 14631637 15289677 15481283 15314003 14837246 13878469 12181044
43427 12181044 9632259 6295598 2335169 -1943027 -6041926 -9470600 -12048513 -13906292
43419 -13906292 -15161217 -15715027 -15423957 -14359505 -12819917 -11137948 -9520021 -8016002
43411 -8016002 -6609543 -5372821 -4497368 -4053477 -3738953 -3075614 -1959665 -856232 -303921
43402 -303921 -349094 -620974 -826282 -930736 -919262 -668915 -126975 605994 1471615 2538398
$$ packed form
43461A102424j609494j598255j531750j388361j361213j474811j421556q82080
43453a0165096R0844J084045J660010J648335J203888O77256L97629M89999Q55955
43444b057135J311741J718170J993054K076640J946995J662855J361274J186573
43436A1200167J178064J202728J050678O58040J91606j67280m76757r58777j697425
43427A2181044k548785l336661l960429m278196m098899l428674k577913j857779
43419a3906292j254925n53810K91070J064452J539588J681969J617927J504019
43411h016002J406459J236722Q75453M43891L14524O63339J115949J103433N52311
43402c03921m5173k71880k05308j04454J1474K50347N41940P32969Q65621J066783
$$ plain form
43392 2538398 3734394 4628095 4677231 3688930 1932939 -145410 -2176837 -3853713 -4875579
43383 -4875579 -5078897 -4614337 -3908948 -3414410 -3389031 -3868306 -4718065 -5619695 -6064916 -5560679
43373 -5560679 -3987139 -1736230 585216 2592205 4241221 5600537 6624957 7139839
43365 7139839 6930246 5853875 4011510 1841764 -98557 -1529512 -2522544 -3143022 -3216088
43356 -3216088 -2627627 -1738437 -1260732 -1711337 -3125511 -5247631 -7740169 -10124814 -11765601
43347 -11765601 -12166084 -11287406 -9489157 -7216264 -4845064 -2748324 -1276212 -546277
43339 -546277 -323153 -211759 35143 459060 1109373 2164919 3719163 5485335 6869145
43330 6869145 7410237 7092232 6200039 5020852 3810095 2902434 2557852 2621181 2542092
$$ packed form
43392B538398J195996Q93701M9136r88301j755991k078349k031427j676876j021866
43383d875579k03318M64560P05389M94538K5379m79275q49759r01630m45221N04237
43373e560679J573540K250909K321446K006989J649016J359316J024420N14882
43365G139839k09593j076371j842365k169746j940321j430955r93032o20478p3066
43356c216088N88461Q89190M77705m50605j414174k122120k492538k384645j640787
43347a1765601m00483Q78678J798249K272893K371200K096740J472112P29935
43339e46277K23124J11394K46902M23917O50313J055546J554244J766172J383810
43330F869145N41092l18005q92193j179187j210757r07661l44582O3329p9089
$$ plain form
43321 2542092 1895748 812202 -198408 -748238 -791122 -457546 118316 789400 1377394
43312 1377394 1762334 1959433 2093646 2338056 2841871 3596745 4329855 4625581 4243939
43303 4243939 3299037 2087477 796393 -541931 -1839866 -2829317 -3235994 -3055330 -2588268
43294 -2588268 -2205287 -2150209 -2590140 -3705340 -5528051 -7680233 -9467807 -10386492 -10492035
43285 -10492035 -10220895 -9975798 -10017005 -10603763 -11912996 -13710460 -15293684 -15929500 -15325672
43276 -15325672 -13672368 -11400173 -9040303 -7187761 -6316236 -6475204 -7194443 -7763761 -7698960
43267 -7698960 -7051916 -6314572 -5933185 -5820055 -5374204 -4063883 -1982075 205394 1800825
43258 1800825 2513156 2488832 2113629 1803415 1813376 2128716 2578448 3099407 3843522 5008017
$$ packed form
43321B542092o46344j083546j010610n49830m2884L33576N75862O71084N87994
43312A377394L84940J97099J34213K44410N03815P54874P33110K95726l81642
43303D243939r44902j211560j291084j338324j297935r89451m06677J80664M67062
43294b588268L82981N5078m39931j115200j822711k152182j787574r18685j05543
43285a0492035K71140K45097m1207n86758j309233j797464j583224o35816O03828
43276a5325672J653304K272195K359870J852542Q71525j58968p19239n69318O4801
43267g698960O47044P37344L81387J13130M45851J310321K081808K187469J595431
43258A800825P12331k4324l75203l10214R961L15340M49732N20959P44115J164495
$$ plain form
43248 5008017 6636989 8627773 10837469 13088176 15124296 16702012 17760858 18426442
43240 18426442 18778493 18656886 17785753 16110331 13934616 11657610 9431255 7207067
43232 7207067 5116396 3607379 3035257 3171386 3268378 2621375 998597 -1375270 -4018185
43223 -4018185 -6328581 -7781074 -8229488 -8003583 -7587246 -7192662 -6681307 -5822847 -4534055
43214 -4534055 -2915003 -1173743 478063 1945613 3301801 4688842 6170821 7682831
43206 7682831 9036342 9884051 9750334 8286755 5611459 2374693 -572979 -2650837
43198 -2650837 -3813271 -4450939 -4998061 -5547019 -5860573 -5824097 -5810348 -6426875 -7877386
43189 -7877386 -9716201 -11285929 -12259220 -12675639 -12627000 -12128168 -11254271 -10168035 -8913026
$$ packed form
43248E008017J628972J990784K209696K250707K036120J577716J058846O65584
43240A8426442L52051j21607q71133j675422k175715k277006k226355k224188
43232G207067k090671j509017n72122J36129R6992o47003j622778k373867k642915
43223d018185k310396j452493m48414K25905M16337L94584N11355Q58460J288792
43214d534055J619052J741260J651806J467550J356188J387041J481979J512010
43206G682831J353511Q47709j33717j463579k675296l236766k947672k077858
43198b650837j162434o37668n47122n48958l13554L6476J3749o16527j450511
43189g877386j838815j569728r73291m16419M8639M98832Q73897J086236J255009
$$ plain form
43180 -8913026 -7332437 -5373326 -3455661 -2356605 -2566632 -3745472 -4913959 -5266336
43172 -5266336 -4791354 -4084578 -3635109 -3410995 -3118400 -2690640 -2392802 -2489021 -2907294 -3238975
43162 -3238975 -3025416 -2077224 -604186 931601 2140908 2957017 3599535 4288856 4966404
43153 4966404 5276575 4863779 3757069 2458580 1558799 1206138 1013286 561416 -26522
43144 -26522 -79709 1049084 3414246 6402585 9120748 10872717 11411226 10888408 9637565
43135 9637565 7983704 6178116 4408442 2827169 1612656 1025004 1317437 2496221
43127 2496221 4199826 5920356 7355812 8473308 9251526 9513059 9085161 8011117 6480289
43118 6480289 4621925 2535501 520144 -939972 -1580173 -1660603 -1678868 -1759173 -1496732
$$ packed form
43180h913026J580589J959111J917665J099056k10027j178840j168487l52377
43172e266336M74982P06776M49469K24114K92595M27760K97838r6219m18273l31681
43162c238975K13559R48192J473038J535787J209307Q16109O42518O89321O77548
43153D966404L10171m12796j106710j298489q99781l52661j92852m51870n87938
43144b6522n3187J128793K365162K988339K718163J751969N38509n22818j250843
43135I637565j653861j805588j769674j581273j214513n87652K92433J178784
43127B496221J703605J720530J435456J117496P78218K61533m27898j074044j530828
43118F480289j858364k086424k015357j460116o40201q0430j8265q0305K62441
$$ plain form
43109 -1496732 -503425 1025897 2447432 3296874 3612602 3689301 3775203 4082071 4799711
43100 4799711 5829965 6640336 6702469 6119125 5594768 5706070 6361397 7041646 7387167
43091 7387167 7416697 7319486 7232320 7184500 7096203 6792051 6088588 4890968 3202267 1117289
43081 1117289 -1120755 -3129054 -4563296 -5269059 -5199553 -4289360 -2591794 -524022 1236666
43072 1236666 2214747 2412689 2080552 1334605 106899 -1619424 -3669409 -5755489 -7588282
43063 -7588282 -8913367 -9574781 -9650127 -9514144 -9693006 -10568232 -12140089 -14035575 -15770640
43054 -15770640 -17061303 -17914786 -18434091 -18553844 -17972456 -16324348 -13428655 -9441640 -4840275
43045 -4840275 -261167 3699282 6605891 8226817 8597872 8101504 7384918 7047466 7330918
$$ packed form
43109a496732R93307J529322J421535Q49442L15728P6699Q5902L06868P17640
43100D799711J030254Q10371O2133n83344n24357J11302O55327O80249L45521
43091G387167K9530r7211q7166m7820q8297l04152p03463j197620j688701k084978
43081A117289k238044k008299j434242p05763O9506R10193J697566K067772J760688
43072A236666R78081J97942l32137p45947j227706j726323k049985k086080j832793
43063g588282j325085o61414p5346J35983j78862q75226j571857j895486j735065
43054a5770640j290663q53483n19305j19753N81388J648108K895693L987015M601365
43045d840275M579108L960449K906609J620926L71055m96368p16586l37452K83452
$$ plain form
43036 7330918 8089654 9003006 9777894 10238550 10368897 10283957 10056893 9560459 8594667 7207590
43026 7207590 5760053 4579891 3633291 2612974 1250915 -551237 -2754383 -5110783
43018 -5110783 -7085094 -8103290 -8022377 -7269138 -6446401 -5870829 -5502901 -5164092 -4707135
43009 -4707135 -4081936 -3388115 -2852747 -2684816 -2974833 -3741550 -4931027 -6262011 -7222038
43000 -7222038 -7438463 -7028333 -6405120 -5753915 -4874070 -3533325 -1771145 182551 2067497
42991 2067497 3584607 4461413 4722179 4764054 4969625 5298672 5395122 5011483 4181162 3087765
42981 3087765 2013066 1403300 1721138 3071212 5018113 6807427 7752849 7552521 6491460
42972 6491460 5387556 5108069 5946919 7491046 9096318 10358229 11103871 11189484 10558459
$$ packed form
43036G330918P58736R13352P74888M60656J30347q4940k27064m96434r65792j387077
43026G207590j447537j180162r46600j020317j362059j802152k203146k356400
43018e110783j974311j018196Q0913P53239Q22737N75572L67928L38809M56957
43009d707135O25199O93821N35368J67931k90017p66717j189477j330984r60027
43000g222038k16425M10130O23213O51205Q79845J340745J762180J953696J884946
42991B067497J517110Q76806K60766M1875K05571L29047R6450l83639q30321j093397
42981C087765j074699o09766L17838J350074J946901J789314R45422k00328j061061
42972F491460j103904k79487Q38850J544127J605272J261911P45642Q5613o31025
$$ plain form
42963 10558459 9448231 8355109 7749242 7828713 8420976 9006468 8969428 8051550 6564866
42954 6564866 5013671 3523824 1797172 -390261 -2833127 -5056403 -6631414 -7280568
42946 -7280568 -6907607 -5718786 -4200027 -2772195 -1473067 -85101 1459065 2903718
42938 2903718 3859412 4048745 3411110 2145473 709554 -356125 -741657 -532416 -52556
42929 -52556 444190 949190 1618972 2523974 3440215 3928432 3731233 3130036 2821778 3356217
42919 3356217 4686181 6246586 7375182 7618601 6788109 4967161 2566571 258874
42911 258874 -1320634 -1914547 -1732209 -1239011 -866046 -838058 -1112835 -1370126 -1134093 -125307
42901 -125307 1372290 2579177 2823903 2118983 1062911 181700 -510710 -1282414 -2199010
$$ packed form
42963A0558459j110228j093122o05867P9471N92263N85492l7040r17878j486684
42954F564866j551195j489847j726652k187433k442866k223276j575011o49154
42946g280568L72961J188821J518759J427832J299128J387966J544166J444653
42938B903718R55694J89333o37635j265637j435919j065679l85532K09241M79860
42929e2556M96746N05000O69782R05002R16241M88217j97199o01197l08258N34439
42919C356217J329964J560405J128596K43419q30492j820948k400590k307697
42911B58874j579508n93913J82338M93198L72965K7988k74777k57291K36033J008786
42901a25307J497597J206887K44726p04920j056072q81211o92410p71704r16596
$$ plain form
42892 -2199010 -3026758 -3550205 -3827877 -4131570 -4756072 -5905965 -7633483 -9779775 -11995566
42883 -11995566 -13867736 -15041382 -15274224 -14488379 -12831008 -10639592 -8305939 -6200019
42875 -6200019 -4705723 -4173056 -4673262 -5821216 -7004490 -7894365 -8691217 -9790101 -11213160
42866 -11213160 -12443700 -12850956 -12231400 -10890764 -9264137 -7604145 -6081326 -5008005
42858 -5008005 -4721986 -5211703 -6016404 -6594042 -6713422 -6435252 -5832176 -4858911 -3441080
42849 -3441080 -1566333 688460 3121568 5448614 7527115 9525607 11698329 13939522
42841 13939522 15703089 16453495 16113958 15027495 13609493 12131939 10711951 9333844
42833 9333844 7918676 6512427 5385562 4813410 4759363 4903308 5004742 5126461 5472003
$$ packed form
42892b199010q27748n23447k77672l03693o24502j149893j727518k146292k215791
42883a1995566j872170j173646k32842P85845J657371K191416K333653K105920
42875f200019J494296N32667n00206j147954j183274q89875p96852j098884j423059
42866a1213160j230540m07256O19556J340636J626627J659992J522819J073321
42858e008005K86019m89717q04701n77638j19380K78170O03076R73265J417831
42849c441080J874747K254793K433108K327046K078501J998492K172722K241193
42841A3939522J763567P50406l39537j086463j418002j477554j419988j378107
42833I333844j415168j406249j126865n72152n4047J43945J01434J21719L45542
$$ plain form
42824 5472003 6112349 6919795 7670108 8134890 8138116 7607136 6580079 5186263 3685654
42815 3685654 2498120 2026843 2338543 3073544 3743388 4076074 4053126 3748574 3263197
42806 3263197 2742610 2312043 2008148 1871306 2040791 2592843 3292734 3686179 3496351
42797 3496351 2800550 1763259 358425 -1496220 -3600294 -5413481 -6357386 -6138306 -4838916
42788 -4838916 -2814509 -511976 1718125 3731168 5531565 7083344 8170368 8493007
42780 8493007 7990445 7091107 6531229 6783815 7658138 8531175 8931433 8791638 8213702
42771 8213702 7236334 5890290 4239316 2210650 -424828 -3685195 -7092167 -9957725
42763 -9957725 -11894855 -12870606 -12853951 -11683181 -9301265 -5910405 -1863850 2410727 6381322
$$ packed form
42824E472003O40346Q07446P50313M64782L226n30980j027057j393816j500609
42815C685654j187534m71277L11700P35001O69844L32686k2948l04552m85377
42806C263197n20587m30567l03895j36842J69485N52052O99891L93445j89828
42797C496351o95801j037291j404834j854645k104074j813187r43905K19080J299390
42788d838916K024407K302533K230101K013043J800397J551779J087024L22639
42780H493007n02562q99338n59878K52586Q74323Q73037M00258j39795n77936
42771H213702r77368j346044j650974k028666k635478l260367l406972k865558
42763i957725j937130r75751J6655J170770K381916L390860M046555M274577L970595
$$ plain form
42754 6381322 9551427 11706375 12825153 12716078 11044669 7903980 4117106 716633
42746 716633 -1761884 -3302858 -3945026 -3622759 -2401465 -541248 1716937 4169080 6391106
42737 6391106 7739702 7816993 6852610 5509937 4356299 3543655 2876266 2087413 1116617
42728 1116617 205240 -298065 -241243 279652 1157243 2403913 3945655 5391368 6169579
42719 6169579 5923648 4736351 3015299 1246663 -159524 -921865 -936378 -353573 417387
42710 417387 915504 979979 901131 1130227 1840729 2875065 4095310 5574612 7326183
42701 7326183 9002409 10070311 10279777 9857358 9282482 8986249 9211075 9971156 11069707
42692 11069707 12227412 13236205 13959851 14232567 13888679 12931819 11583970 10109482 8631512
$$ packed form
42754F381322L170105K154948J118778j09075j671409l140689l786874l400473
42746G16633k478517j540974o42168L22267J221294J860217K258185K452143K222026
42737F391106J348596P7291r64383j342673j153638q12644o67389p88853r70796
42728A116617r11377n03305N6822N20895Q77591J246670J541742J445713P78211
42719F169579k45931j187297j721052j768636j406187p62341j4513N82805P70960
42710D17387M98117O4475p8848K29096P10502J034336J220245J479302J751571
42701G326183J676226J067902K09466m22419n74876k96233K24826P60081J098551
42692A1069707J157705J008793P23646K72716l43888r56860j347849j474488j477970
$$ plain form
42683 8631512 7137658 5606630 4110743 2853236 2108907 2030268 2463202 3032771 3468030
42674 3468030 3759311 3910551 3628338 2447753 243177 -2460573 -4760998 -5962060 -5908822
42665 -5908822 -4870258 -3252590 -1465077 79577 1042972 1334065 1159970 862250 741572
42656 741572 1047482 1996606 3627384 5631571 7457704 8644509 9028688 8678428 7764642
42647 7764642 6522792 5192256 3894162 2653552 1620344 1157623 1548016 2602492
42639 2602492 3640963 3877688 2846471 599173 -2347977 -5293680 -7741053 -9587533
42631 -9587533 -10930238 -11773100 -12031358 -11718971 -10901616 -9466374 -7205608 -4266417 -1331404
42622 -1331404 833814 1925587 2072468 1415149 -29894 -2107722 -4363502 -6227669
$$ packed form
42683H631512j493854j531028j495887j257507p44329p8639M32934N69569M35259
42674C468030K91281J51240k82213j180585k204576k703750k300425j201062N3238
42665e908822J038564J617668J787513J544654R63395K91093j74095k97720j20678
42656G41572L05910R49124J630778K004187J826133J186805L84179l50260r13786
42647G764642j241850j330536j298094j240610j033208m62721L90393J054476
42639B602492J038471K36725j031217k247298k947150k945703k447373j846480
42631i587533j342705q42862k58258L12387Q17355J435242K260766K939191K935013
42622a331404K165218J091773J46881o57319j445043k077828k255780j864167
$$ plain form
42614 -6227669 -7245725 -7129849 -5817504 -3639675 -1306568 477730 1419313 1614328 1226457
42605 1226457 350480 -822363 -1919216 -2617619 -2902876 -2977175 -2933780 -2636713 -1946945
42596 -1946945 -964772 19960 749906 1092900 983913 433617 -366611 -1074223 -1436098
42587 -1436098 -1463377 -1304224 -996159 -440937 392475 1346246 2192690 2820241 3274119 3659599
42577 3659599 4047080 4462985 4948444 5596268 6476802 7499721 8401406 8924314 8963142
42568 8963142 8473886 7335221 5483087 3189849 1010285 -671645 -1934658 -3045246
42560 -3045246 -3981562 -4379331 -3921781 -2648511 -875589 1054383 2872584 4307916 5018569
42551 5018569 4679261 3210066 943614 -1515736 -3696859 -5515436 -7073233 -8276605
$$ packed form
42614f227669j018056J15876J312345K177829K333107J784298R41583J95015l87871
42605A226457q75977j172843j096853o98403k85257p4299M3395K97067O89768
42596a946945R82173R84732P29946L42994j08987n50296q00228p07612l61875
42587a436098k7279J59153L08065N55222Q33412R53771Q46444O27551M53878L85480
42577C659599L87481M15905M85459O47824Q80534J022919R01685N22908L8828
42568H963142m89256j138665j852134k293238k179564j681930j263013j110588
42560c045246r36316l97769M57550J273270J772922J929972J818201J435332P10653
42551E018569l39308j469195k266452k459350k181123j818577j557797j203372
$$ plain form
42543 -8276605 -8801232 -8450141 -7415687 -6125778 -4919948 -3929559 -3165337 -2590695 -2123092
42534 -2123092 -1654988 -1094403 -357517 644352 1934165 3372123 4679865 5592844 5985593
42525 5985593 5860911 5247815 4108929 2320048 -247768 -3560804 -7286263 -10842070
42517 -10842070 -13652313 -15423808 -16219679 -16288994 -15823813 -14848463 -13305510 -11247691 -8978011
42508 -8978011 -6997639 -5731356 -5206243 -4988728 -4495189 -3395198 -1724486 288581 2334940
42499 2334940 3954313 4595564 4002865 2553841 1063031 181216 10887 240423 488381
42490 488381 479987 65980 -732275 -1658471 -2284354 -2235191 -1445753 -254417 780619 1225387
42480 1225387 948360 -22004 -1669444 -3858116 -6114626 -7838238 -8870835 -9695174 -10893863
$$ packed form
42543h276605n24627L51091J034454J289909J205830R90389P64222N74642M67603
42534b123092M68104N60585P36886J001869J289813J437958J307742R12979L92749
42525E985593j24682o13096j138886j788881k567816l313036l725459l555807
42517a0842070k810243j771495p95871o9315M65181R75350J542953K057819K269680
42508h978011J980372J266283N25113K17515M93539J099991J670712K013067K046359
42499B334940J619373O41251n92699j449024j490810q81815j70329K29536K47958
42490D88381q394m14007p98255r26196o25883M9163P89438J191336J035036M44768
42480A225387k77027r70364j647440k188672k256510j723612j032597q24339j198689
$$ plain form
42471 -10893863 -12474723 -13849665 -14418036 -14066797 -13180699 -12310950 -11789428 -11495231 -10956055
42462 -10956055 -9763400 -7916129 -5751922 -3649500 -1899851 -727757 -180107 16424
42454 16424 249699 581826 682616 294227 -405120 -1034940 -1466998 -1859589 -2305769 -2640717
42444 -2640717 -2621405 -2178881 -1476430 -823417 -562823 -939032 -1955491 -3298014 -4387007
42435 -4387007 -4592696 -3593017 -1660106 458175 2066523 2953989 3296823 3280987 3008458
42426 3008458 2717616 2819574 3568967 4799019 6060342 6927792 7148861 6718026 6010103
42417 6010103 5706447 6291060 7555830 8770800 9398254 9510405 9487499 9511902 9495192 9359852
42407 9359852 9190913 9116266 9144906 9100475 8630035 7348487 5150112 2427126 -110060
$$ packed form
42471a0893863j580860j374942n68371L51239Q86098Q69749N21522K94197N39176
42462a0956055J192655J847271K164207K102422J749649J172094N47650J96531
42454A6424K33275L32127J00790l88389o99347o29820m32058l92591m46180l34948
42444b640717J9312M42524P02451O53013K60594l76209j016459j342523j088993
42435d387007k05689R99679J932911K118281J608348Q87466L42834j5836k72529
42426C008458k90842J01958P49393J230052J261323Q67450K21069m30835p07923
42417F010103l03656N84613J264770J214970O27454J12151k2906K4403j6710j35340
42407I359852j68939p4647K8640m4431m70440j281548k198375k722986k537186
$$ plain form
42398 -110060 -1872781 -2638093 -2446654 -1449940 75264 1693797 2936060 3493394 3336008
42389 3336008 2731880 2135726 1892484 1943670 1904057 1508116 917142 543168 690212 1444237
42379 1444237 2731028 4247911 5395473 5532844 4395018 2169701 -813428 -4298025
42371 -4298025 -7989260 -11435694 -14156739 -15808885 -16189497 -15256557 -13314103 -11097131
42363 -11097131 -9468182 -8927370 -9391712 -10387987 -11432908 -12327755 -13193980 -14208145 -15260535
42354 -15260535 -15919538 -15756848 -14619539 -12559437 -9689724 -6296370 -2969477 -332173
42346 -332173 1458850 2831811 4378919 6378135 8666309 10792965 12258474 12771716
42338 12771716 12390888 11369263 9873311 7978740 5925146 4127310 2791078 1681203
$$ packed form
42398a10060j762721p65312J91439R96714J525204J618533J242263N57334j57386
42389C336008o04128n96154k43242N1186l9613l95941n90974l73974J47044P54025
42379A444237J286791J516883J147562J37371j137826k225317k983129l484597
42371d298025l691235l446434k721045j652146l80612R32940J942454K216972
42363a1097131J628949N40812m64342r96275j044921q94847q66225j014165j052390
42354a5260535o59003J62690J137309K060102K869713L393354L326893K637304
42346c32173J791023J372961J547108J999216K288174K126656J465509N13242
42338A2771716l80828j021625j495952j894571k053594j797836j336232j109875
$$ plain form
42330 1681203 445400 -927814 -2121352 -2851526 -3043602 -2750039 -2132587 -1494095 -1070487
42321 -1070487 -730201 -85354 1003637 2186657 2969400 3161055 2912741 2503997 2249002
42312 2249002 2465036 3297113 4570096 5934933 7132969 8022609 8441510 8241899 7469350
42303 7469350 6351532 5085166 3756636 2469334 1377607 528867 -202754 -958328 -1761709
42294 -1761709 -2567327 -3303900 -3836471 -4069884 -4181763 -4542110 -5211875 -5692482 -5445847
42285 -5445847 -4590039 -3806788 -3596756 -3943991 -4740553 -6119930 -8089539 -10104205 -11401943
42276 -11401943 -11723929 -11407679 -10780542 -9779961 -8272166 -6466171 -4795645 -3525791
42268 -3525791 -2663725 -2166759 -2043675 -2267760 -2737470 -3323423 -3855681 -4123720 -4059279 -3904707
$$ packed form
42330A681203j235803j373214j193538p30174j92076K93563O17452O38492M23608
42321a070487L40286O44847J088991J183020P82743J91655k48314m08744k54995
42312B249002K16034Q32077J272983J364837J198036Q89640M18901j99611p72549
42303G469350j117818j266366j328530j287302j091727q48740p31621p55574q03381
42294a761709q05618p36573n32571k33413j11879l60347o69765m80607K46635
42285e445847Q55808P83251K10032l47235p96562j379377j969609k014666j297738
42276a1401943l21986L16250O27137J000581J507795J805995J670526J269854
42268c525791Q62066M96966J23084k24085m69710n85953n32258k68039O4441J54572
$$ plain form
42258 -3904707 -3994859 -4302483 -4363396 -3748687 -2484027 -931114 550157 1647802 1991201
42249 1991201 1327079 -173551 -2027617 -3931847 -5939859 -8044054 -9778562 -10448583
42241 -10448583 -9706561 -7773009 -5157913 -2339038 290526 2356956 3547135 3727438
42233 3727438 2993970 1612896 -91168 -1835091 -3434470 -4826676 -6071196 -7285883
42225 -7285883 -8492889 -9501659 -10014162 -9893759 -9288759 -8464662 -7576918 -6642708 -5648395
42216 -5648395 -4606981 -3581383 -2753640 -2420040 -2780173 -3696469 -4720271 -5371260 -5394094
42207 -5394094 -4842155 -4026164 -3338642 -2985719 -2845026 -2624377 -2122849 -1278077 -66331
42198 -66331 1451445 2994014 4172108 4824393 5143611 5438314 5879144 6474423 7095182
$$ packed form
42258c904707r0152l07624o0913O14709J264660J552913J481271J097645L43399
42249A991201o64122j500630j854066j904230k008012k104195j734508o70021
42241a0448583P42022J933552K615096K818875K629564K066430J190179J80303
42233C727438p33468j381074j704064j743923j599379j392206j244520j214687
42225g285883j207006j008770n12503J20403O05000Q24097Q87744R34210R94313
42216e648395J041414J025598Q27743L33600l60133r16296j023802o50989k2834
42207e394094N51939Q15991O87522L52923J40693K20649N01528Q44772J211746
42198f6331J517776J542569J178094O52285L19218K94703M40830N95279O20759
$$ plain form
42189 7095182 7429505 7086215 5916888 4189343 2368346 799640 -363275 -1099590 -1507724
42180 -1507724 -1680905 -1432970 -332232 1719634 4041146 5622773 6045719 5685517 4988099
42171 4988099 3913583 2315474 588497 -458867 -402605 352735 989089 995339 439650
42162 439650 -296748 -879106 -1136165 -999505 -486865 243485 948522 1526146 2157581 3113709
42152 3113709 4399581 5680398 6589718 7018754 7057495 6777849 6222905 5573568 5154776
42143 5154776 5186120 5583604 6086986 6573494 7170226 8002736 8865475 9252261 8800958 7671692
42133 7671692 6381973 5269281 4241124 3094235 1910113 957737 274936 -431026 -1415563
42124 -1415563 -2616364 -3869949 -5269181 -7079066 -9292029 -11483198 -13246698 -14659574
$$ packed form
42189G095182L34323l43290j169327j727545j820997j568706j162915p36315m08134
42180a507724j73181K47935J100738K051866K321512J581627M22946l60202o97418
42171D988099j074516j598109j726977j047364N6262P55340O36354O250n55689
42162D39650p36398n82358k57059J36660N12640P30350P05037N77624O31435R56128
42152C113709J285872J280817R09320M29036L8741k79646n54944o49337m18792
42143E154776L1344L97484N03382M86508N96732Q32510Q62739L86786m51303j129266
42133G671692j289719j112692j028157j146889j184122r52376o82801p05962r84537
42124a415563j200801j253585j399232j809885k212963k191169j763500j412876
$$ plain form
42116 -14659574 -16120163 -17736616 -19080454 -19660113 -19501912 -19072674 -18660051 -18036889 -16827738
42107 -16827738 -15077658 -13327588 -12163455 -11765149 -11845185 -11934643 -11760464 -11444464 -11332315
42098 -11332315 -11551637 -11753082 -11376421 -10166342 -8337290 -6260957 -4154651 -2113061
42090 -2113061 -245220 1399381 2961077 4639596 6403306 7913609 8738308 8589528
42082 8589528 7447114 5651337 3917529 3066535 3543203 5165295 7367676 9656801
42074 9656801 11823138 13830675 15623252 17016325 17685670 17276302 15637970 13016986
42066 13016986 9976244 7068672 4557909 2409151 475193 -1347319 -3102146 -4828140
42058 -4828140 -6563023 -8268653 -9772586 -10833663 -11317922 -11352683 -11336073 -11765285 -12926075
$$ packed form
42116a4659574j460589j616453j343838n79659J58201M29238M12623O23162J209151
42107a6827738J750080J750070J164133L98306q0036q9458J74179L16000J12149
42098a1332315k19322k01445L76661J210079J829052K076333K106306K041590
42090b113061J867841J644601J561696J678519J763710J510303Q24699j48780
42082H589528j142414j795777j733808q50994M76668J622092K202381K289125
42074I656801K166337K007537J792577J393073O69345m09368j638332k620984
42066A3016986l040742k907572k510763k148758j933958j822512j754827j725994
42058d828140j734883j705630j503933j061077m84259l4761J6610m29212j160790
$$ plain form
42049 -12926075 -14600493 -16067155 -16537798 -15741492 -14114594 -12411987 -11146073 -10337240
42041 -10337240 -9618705 -8472945 -6520991 -3841090 -1070171 941071 1684036 1251504
42033 1251504 153725 -1008230 -1782928 -2056936 -2136286 -2507963 -3358350 -4321285 -4738790
42024 -4738790 -4146077 -2538217 -325471 1882724 3580787 4629558 5229922 5591993 5701803
42015 5701803 5488694 5115940 4942685 5221727 5965653 7071552 8379137 9552862 10106236
42006 10106236 9745039 8679862 7478590 6558705 5854365 4996505 3781775 2419500 1325111
41997 1325111 745748 657329 980542 1751980 3014653 4628235 6276732 7629047 8466524
41988 8466524 8769658 8776220 8831636 9010664 8966138 8364057 7424487 6744501 6499270 6079223
$$ packed form
42049a2926075j674418j466662m70643P96306J626898J702607J265914Q08833
42041a0337240P18535J145760J951954K679901K770919K011242P42965m32532
42033A251504j097779j161955p74698k74008p9350l71677q50387r62935m17505
42024d738790N92713J607860K212746K208195J698063J048771O00364L62071J09810
42015E701803k13109l72754j73255K79042P43926J105899J307585J173725N53374
42006A0106236l61197j065177j201272r19885p04340q57860j214730j362275j094389
41997A325111n79363q8419L23213P71438J262673J613582J648497J352315Q37477
41988H466524L03134O562N5416J79028m4526o02081r39570o79986k45231m20047
$$ plain form
41978 6079223 4721840 2373530 -239893 -2281219 -3369639 -3621443 -3415015 -3140533 -2956740
41969 -2956740 -2688941 -2064585 -1076614 3027 971799 1874815 2768532 3501399 3883512
41960 3883512 3923810 3669710 2864143 1028763 -1980088 -5576480 -8669346 -10270382 -9979051
41951 -9979051 -8110101 -5485510 -2990745 -1137370 32181 647994 704395 87866 -1178085
41942 -1178085 -2818378 -4412102 -5558952 -6020937 -5844789 -5372500 -5054294 -5206232 -5912551
41933 -5912551 -7025732 -8135616 -8642626 -8113785 -6657520 -4837730 -3183103 -1898684
41925 -1898684 -1064946 -896481 -1625179 -3196875 -5208559 -7125145 -8524876 -9234168 -9314366
41916 -9314366 -8869336 -7856459 -6235976 -4358870 -2968137 -2584063 -2987252 -3505225 -3713978
$$ packed form
41978F079223j357383k348310k613423k041326j088420k51804K06428K74482J83793
41969b956740K67799O24356R87971J079641R68772R03016Q93717P32867L82113
41960C883512M0298k54100q05567j835380l008851l596392l092866j601036K91331
41951i979051J868950K624591K494765J853375J169551O15813N6401o16529j265951
41942a178085j640293j593724j146850m61985J76148M72289L18206j51938p06319
41933e912551j113181j109884n07010N28841J456265J819790J654627J284419
41925a898684Q33738J68465p28698j571696k011684j916586j399731p09292q0198
41916i314366M45030J012877J620483J877106J390733L84074m03189n17973k08753
$$ plain form
41907 -3713978 -3645986 -3421379 -2996445 -2293037 -1289481 80915 1844932 3680886 4951391
41898 4951391 5264079 4884018 4427254 4219044 4048992 3447606 2104369 141244 -1903909
41889 -1903909 -3484699 -4566457 -5618980 -6956058 -8238542 -8846873 -8633151 -8045874 -7562242
41880 -7562242 -7272543 -7031811 -6727992 -6296767 -5721554 -5191396 -5080759 -5566085 -6353503
41871 -6353503 -6968865 -7255794 -7394426 -7443646 -7079278 -5881278 -3759960 -1010355 1934684
41862 1934684 4641267 6610966 7316625 6479547 4293474 1286352 -2019595 -5230130
41854 -5230130 -7928779 -9652512 -10215152 -10007969 -9788264 -10066456 -10721177 -11208757 -11061281
41845 -11061281 -10148253 -8579951 -6536350 -4241038 -1990859 -74991 1369247 2373791
$$ packed form
41907c713978O7992K24607M24934P03408J003556J370396J764017J835954J270505
41898D951391L12688l80061m56764k08210j70052o01386j343237j963125k045153
41889a903909j580790j081758j052523j337078j282484o08331K13722N87277M83632
41880g562242K89699K40732L03819M31225N75213N30158J10637m85326p87418
41871f353503o15362k86929j38632m9220L64368J198000K121318K749605K945039
41862A934684K706583J969699P05659q37078k186073l007122l305947l210535
41854e230130k698649j723733n62640K07183K19705k78192o54721m87580J47476
41845a1061281R13028J568302K043601K295312K250179J915868J444238J004544
$$ plain form
41837 2373791 2997781 3221399 3023593 2529049 2014821 1756503 1860811 2179771 2333554
41828 2333554 1911920 833690 -447291 -1220969 -1100855 -291324 723751 1625043 2314259
41819 2314259 2685633 2574780 1975361 1166075 516427 167028 -83980 -578251 -1444819
41810 -1444819 -2402137 -2921219 -2619558 -1496919 176973 2076112 3842787 5028703 5232704
41801 5232704 4390312 2899538 1462624 806987 1421156 3343216 6130480 9127265 11832636
41792 11832636 14003200 15462373 15966453 15339087 13686976 11434826 9143031 7211809
41784 7211809 5615727 3892331 1516030 -1607290 -5013206 -8041769 -10297285 -11814308
41776 -11814308 -12917239 -13933566 -14883886 -15357447 -14799136 -13040705 -10532203 -8033002
$$ packed form
41837B373791O23990K23618j97806m94544n14228k58318J04308L18960J53783
41828B333554m21634j078230j280981p73678J20114Q09531J015075R01292O89216
41819B314259L71374j10853n99419q09286o49648l49399k51008m94271q66568
41810a444819r57318n19082L01661J122639J673892J899139J766675J185916K04001
41801E232704q42392j490774j436914o55637O14169J922060K787264K996785K705371
41792A1832636K170564J459173N04080o27366j652111k252150k291795j931222
41784G211809j596082j723396k376301l123320l405916l028563k255516j517023
41776a1814308j102931j016327r50320m73561N58311J758431K508502K499201
$$ plain form
41768 -8033002 -6160080 -5228028 -5280099 -6035250 -6865467 -7053105 -6162888 -4158345 -1286208
41759 -1286208 1968415 4881363 6750025 7347722 7058960 6468386 5833268 4967060 3550013
41750 3550013 1498714 -896626 -3123201 -4770578 -5788786 -6462592 -7147869 -8029526 -9043216
41741 -9043216 -9900233 -10200655 -9692486 -8516361 -7105665 -5766591 -4447778 -3027673 -1750562
41732 -1750562 -1217626 -1897107 -3661747 -5762611 -7219385 -7348734 -6091406 -3896010 -1282327
41723 -1282327 1438549 4025732 6096614 7270285 7480148 6960018 5941523 4566550
41715 4566550 3101749 1974734 1441482 1338798 1260133 860773 -53566 -1516935 -3301376
41706 -3301376 -4967705 -6219472 -7137959 -7925551 -8535696 -8752411 -8536480 -8055955 -7430308
$$ packed form
41768h033002J872922R32052n2071p55151q30217j87638Q90217K004543K872137
41759a286208L254623K912948J868662N97697k88762n90574o35118q66208j417047
41750C550013k051299k395340k226575j647377j018208o73806o85277q81657j013690
41741i043216q57017l00422N08169J176125J410696J339074J318813J420105J277111
41732a750562N32936o79481j764640k100864j456774j29349J257328K195396K613683
41723a282327K720876K587183K070882J173671K09863n20130j018495j374973
41715D566550j464801j127015n33252j02684p8665l99360r14339j463369j784441
41706c301376j666329j251767r18487p87592o10145k16715K15931M80525O25647
$$ plain form
41697 -7430308 -6701140 -6039286 -5691453 -5646152 -5593421 -5321337 -4942743 -4606561 -4189571 -3461359
41687 -3461359 -2428470 -1332600 -371632 444432 1229161 2140214 3297736 4634441 5841324
41678 5841324 6573160 6718722 6431690 5959354 5517842 5262599 5237951 5321038 5271615 4876690
41668 4876690 4092517 3123147 2357185 2106184 2334604 2709004 2940406 2995604 2976769 2961693
41658 2961693 3031017 3281740 3684012 4043265 4220930 4285122 4352916 4436720 4569189 4898992
41648 4898992 5466236 6014897 6233429 6082510 5714408 5232027 4791535 4823676 5818517 7856201
41638 7856201 10531027 13274826 15560999 16953953 17337511 17089550 16693229 16129986 14923679
41629 14923679 12760788 9744229 6087133 2025072 -1884231 -4874496 -6627846 -7427615
$$ packed form
41697g430308P29168O61854L47833M5301N2731K72084L78594L36182M16990P28212
41687c461359J032889J095870R60968Q16064P84729R11053J157522J336705J206883
41678E841324P31836J45562k87032m72336m41512k55243k4648Q3087m9423l94925
41668D876690p84173r69370p65962k51001K28420L74400K31402N5198j8835j5076
41658B961693O9324K50723M02272L59253J77665O4192O7794Q3804J32469L29803
41648D898992N67244N48661K18532j50919l68102m82381m40492L2141R94841K037684
41638G856201K674826K743799K286173J392954L83558k47961l96321n63243j206307
41629A4923679k162891l016559l657096m062061l909303k990265j753350p99769
$$ plain form
41621 -7427615 -7416061 -6132052 -3181405 936104 5085932 8380771 10446914 11098248 10344796
41612 10344796 8755132 7331053 6793237 7113271 7706603 7866206 7098793 5405583 3342165
41603 3342165 1602364 500167 397 132541 1009682 2393517 3594135 3992586 3492025
41594 3492025 2377412 971309 -422782 -1440661 -1748764 -1199980 130971 1943730
41586 1943730 3712525 4884666 5214882 4823856 3910936 2606843 1191232 197208 31565
41577 31565 549939 1195840 1556004 1688041 1968028 2731254 3997142 5405380 6442898
41568 6442898 6851360 6820727 6741435 6845555 7179655 7798558 8738959 9772742 10411688 10324053
41558 10324053 9679118 8953164 8410474 7869385 6976924 5611139 3967987 2344609 952405
$$ packed form
41621g427615J1554J284009K950647M117509M149828L294839K066143O51334p53452
41612A0344796j589664j424079n37816L20034N93332J59603p67413j693210k063418
41603C342165j739801j102197m99770J32144Q77141J383835J200618L98451n00561
41594C492025j114613j406103j394091j017879l08103N48784J330951J812759
41586A943730J768795J172141L30216l91026r12920j304093j415611r94024j65643
41577C1565N18374O45901L60164J32037K79987P63226J265888J408238J037518
41568F442898M08462l0633p9292J04120L34100O18903R40401J033783O38946q7635
41558A0324053o44935p25954n42690n41089q92461j365785j643152j623378j392204
$$ plain form
41549 952405 -77813 -657716 -827743 -870208 -1260905 -2437945 -4518139 -7118136 -9450431
41540 -9450431 -10769882 -10894171 -10274691 -9481935 -8660881 -7543399 -5880514 -3724253 -1385985
41531 -1385985 671007 1949720 2220402 1803868 1344440 1154949 921102 177818 -1060186
41522 -1060186 -2304526 -3134888 -3569242 -3964374 -4744194 -6216235 -8430594 -11068273 -13520948
41513 -13520948 -15196543 -15814700 -15466032 -14465324 -13180234 -11942713 -11013017 -10524180 -10408890
41504 -10408890 -10397851 -10141853 -9377215 -8025669 -6230160 -4350973 -2837001 -1942463 -1533005
41495 -1533005 -1252631 -896087 -530940 -251181 47220 553130 1273454 1964323 2307263
41486 2307263 2125680 1477912 572474 -449136 -1657628 -3203820 -5035286 -6831379 -8240533
$$ packed form
41549I52405j030218n79903j70027m2465l90697j177040k080194k599997k332295
41540i450431j319451j24289O19480P92756Q21054J117482J662885K156261K338268
41531a385985K056992J278713K70682m16534m59428j89491k33847p43284j238004
41522a060186j244340q30362m34354l95132p79820j472041k214359k637679k452675
41513a3520948j675595o18157L48668J000708J285090J237521R29696M88837J15290
41504a0408890J1039K55998P64638J351546J795509J879187J513972Q94538M09458
41495a533005K80374L56544L65147K79759K98401N05910P20324O90869L42940
41486B307263j81583o47768r05438j021610j208492j546192j831466j796093j409154
$$ plain form
41477 -8240533 -9086269 -9323011 -8941995 -8023363 -6778021 -5419800 -4050095 -2741063 -1634821
41468 -1634821 -836152 -265914 255719 813307 1382849 1962623 2586172 3218950 3765645
41459 3765645 4200227 4603699 5055209 5536814 5927030 6028909 5654944 4806311 3781740
41450 3781740 3013393 2749021 2913904 3242280 3457045 3346336 2815667 1981685 1214418
41441 1214418 1022744 1788394 3453674 5379915 6619508 6543162 5319690 3768357 2707026
41432 2707026 2394698 2475026 2324690 1489155 -30295 -1760417 -3011180 -3239746 -2311492
41423 -2311492 -554693 1411152 3038208 4180414 5055137 5850924 6486438 6856669 7170833
41414 7170833 7794015 8732838 9475976 9443503 8517773 7114686 5846129 5139192 5045280
$$ packed form
41477h240533q45736k36742L81016R18632J245342J358221J369705J309032J106242
41468a634821P98669N70238N21633N57588N69542N79774O23549O32778N46695
41459C765645M34582M03472M51510M81605L90216J01879l73965q48633j024571
41450C781740p68347k64372J64883L28376K14765j10709n30669q33982p67267
41441A214418j91674P65650J665280J926241J239593p6346j223472j551333j061331
41432B707026l12328Q0328j50336q35535j519450j730122j250763k28566R28254
41423b311492J756799J965845J627056J142206Q74723P95787O35514L70231L14164
41414G170833O23182R38823P43138l2473r25730j403087j268557p06937r3912
$$ plain form
41405 5045280 5313181 5675693 6084945 6626736 7250069 7717132 7826978 7533421 6796329
41396 6796329 5497696 3655153 1638576 39144 -670565 -324362 948968 2752759
41388 2752759 4465545 5452085 5389680 4427042 2996388 1414705 -372239 -2615416 -5260772
41379 -5260772 -7658550 -8924772 -8672759 -7329823 -5714886 -4408647 -3553120 -3052317 -2755873
41370 -2755873 -2511200 -2262217 -2169421 -2510404 -3359599 -4382497 -4996036 -4770933 -3733163
41361 -3733163 -2315439 -999020 24624 842032 1519737 1935215 1947939 1631018 1245378
41352 1245378 1065830 1315085 2125052 3327766 4291248 4222253 2831507 695694 -1080937
41343 -1080937 -1556532 -409320 2015228 4905133 7304350 8486309 8209186 6713871
$$ packed form
41405E045280K67901L62512M09252N41791O23333M67063J09846k93557p37092
41396F796329j298633j842543k016577j599432p09709L46203J273330J803791
41388B752759J712786R86540o2405r62638j430654j581683j786944k243177k645356
41379e260772k397778j266222K52013J342936J614937J306239Q55527N00803K96444
41370b755873K44673K48983R2796l40983q49195j022898o13539K25103J037770
41361c733163J417724J316419J023644Q17408O77705M15478J2724l16921l85640
41352A245378j79548K49255Q09967J202714R63482o8995j390746k135813j776631
41343a080937m75595J147212K424548K889905K399217J181959k77123j495315
$$ plain form
41335 6713871 4553843 2426550 999792 655627 1280626 2347318 3277124 3772878 3882324
41326 3882324 3857059 3973865 4376123 4985192 5605050 6183041 6903061 7908382 8985258
41317 8985258 9699842 9883343 9820916 9881358 10095493 10182529 9820932 8748913 6808744 4222666
41307 4222666 1788289 450050 525337 1523294 2784653 4063396 5370498 6547505 7303325
41298 7303325 7544333 7360126 6706462 5383569 3396011 1136474 -864117 -2228424 -2761106
41289 -2761106 -2440343 -1580521 -891174 -1130648 -2594372 -4947897 -7528378 -9770523 -11412562
41280 -11412562 -12440314 -12925509 -12911029 -12406163 -11460218 -10233244 -9006405 -8121926 -7864427
41271 -7864427 -8323026 -9313310 -10417721 -11122419 -10993100 -9852599 -7899771 -5667572 -3793151
$$ packed form
41335F713871k160028k127293j426758l44165O24999J066692R29806M95754J09446
41326C882324k5265J16806M02258O09069O19858N77991P20020J005321J076876
41317H985258P14584J83501o2427O0442K14135Q7036l61597j072019j940169k586078
41307D222666k434377j338239P5287R97957J261359J278743J307102J177007P55820
41298G303325K41008j84207o53664j322893j987558k259537k000591j364307n32682
41289b761106L20763Q59822O89347k39474j463724k353525k580481k242145j642039
41280a1412562j027752m85195J4480N04866R45945J226974J226839Q84479K57499
41271g864427m58599r90284j104411p04698J29319J140501J952828K232199J874421
$$ plain form
41262 -3793151 -2720642 -2491430 -2703215 -2685517 -1882111 -223894 1839136 3685519 4884197
41253 4884197 5279617 4932960 4120016 3252075 2576167 1953052 1078318 -88799 -1262788
41244 -1262788 -2174521 -2786806 -3142395 -3200005 -2917835 -2345131 -1521466 -421490 862642
41235 862642 1980711 2519732 2323982 1566988 603859 -150494 -326664 195407 1164121
41226 1164121 2163457 2961895 3570547 3990751 4076667 3724593 3087814 2480633 2077101 1778246
41216 1778246 1398807 930479 538144 271797 -112982 -888891 -1891710 -2476877 -2055732
41207 -2055732 -613345 1360953 3322899 4924240 5974845 6457359 6633850 6918075 7506288
41198 7506288 8228797 8833624 9292170 9719279 10098332 10243158 10015031 9461777 8730368
$$ packed form
41262c793151J072509K29212k11785J7698Q03406J658217K063030J846383J198678
41253D884197L95420l46657q12944q67941o75908o23115q74734j167117j173989
41244a262788r11733o12285l55589n7610K82170N72704Q23665J099976J284132
41235H62642J118069N39021j95750p56994r63129p54353j76170N22071R68714
41226A164121R99336P98438O08652M20204Q5916l52074o36779o07181m03532k98855
41216A778246l79439m68328l92335k66347l84779p75909j002819n85167M21145
41207b055732J442387J974298J961946J601341J050605M82514J76491K84225N88213
41198G506288P22509O04827M58546M27109L79053J44826k28127n53254p31409
$$ plain form
41189 8730368 7917154 7005210 5863678 4271853 2014273 -943260 -4311925 -7524023
41181 -7524023 -9994650 -11434104 -11949644 -11849721 -11384729 -10715376 -10056762 -9674646 -9651425
41172 -9651425 -9755807 -9672785 -9344711 -8994052 -8827099 -8827864 -8871597 -8930492 -9069054 -9270020
41162 -9270020 -9355555 -9092627 -8312518 -6915788 -4874955 -2377946 21701 1554778 1708740
41153 1708740 600799 -1140261 -2827493 -3991178 -4284084 -3359046 -1055197 2275379
41145 2275379 5742738 8330254 9418009 9013727 7583701 5698054 3788945 2145190
41137 2145190 1014846 620468 1070687 2310648 4168459 6400803 8693515 10712251
41129 10712251 12229823 13182302 13571906 13374567 12607401 11442455 10168749 9048537 8262126
$$ packed form
41189H730368q13214r11944j141532j591825k257580k957533l368665l212098
41181g524023k470627j439454n15540R9923M64992O69353O58614L82116K3221
41172i651425j04382Q3022L28074L50659J66953p65m3733n8895j38562k00966
41162i270020q5535K62928P80109J396730K040833K497009K399647J533077J53962
41153A708740j107941j741060j687232j163685k92906R25038K303849L330576
41145B275379L467359K587516J087755m04282j430026j885647j909109j643755
41137B145190j130344l94378M50219J239961J857811K232344K292712K018736
41129A0712251J517572R52479L89604j97339p67166j164946j273706j120212p86411
$$ plain form
41120 8262126 7942728 8130602 8647077 9113480 9209861 8942165 8630502 8619447 8985423 9500236
41110 9500236 9861075 9955515 9915734 9952397 10181643 10592757 11075476 11404475 11270393 10463209
41100 10463209 9064539 7411323 5867743 4677377 4000724 3961279 4561537 5570929 6542652
41091 6542652 6975904 6550010 5332701 3807495 2605389 2078307 2055922 1992658 1392249
41082 1392249 221661 -970408 -1397178 -674788 801696 2198558 3004195 3407882 3971965
41073 3971965 5100967 6855269 9036877 11257977 13062702 14228025 14929909 15441373
41065 15441373 15705900 15427116 14601804 13736616 13423050 13845450 14813839 16131308 17757869
41056 17757869 19688947 21856685 24157019 26431350 28376876 29586585 29784600 29035973
$$ packed form
41120H262126l19398J87874N16475M66403R6381k67696l11663j1055L65976N14813
41110I500236L60839R4440l9781L6663K29246M11114M82719L28999j34082q07184
41100A0463209j398670j653216j543580j190366o76653l9445O00258J009392R71723
41091F542652M33252m25894j217309j525206j202106n27082k2385o3264o00409
41082A392249j170588j192069m26770P22390J476484J396862Q05637M03687N64083
41073C971965J129002J754302K181608K221100J804725J165323P01884N11464
41065A5441373K64527k78784q25312q65188l13566M22400R68389J317469J626561
41056A7757869J931078K167738K300334K274331J945526J209709J98015p48627
$$ plain form
41048 29035973 27711515 26248088 24912624 23720711 22520659 21165961 19677129 18308102
41040 18308102 17462964 17470772 18337933 19673407 20878495 21458628 21222469 20297759 19066055
41031 19066055 18076770 17894811 18890689 21095085 24201781 27683585 30960825 33575130
41023 33575130 35276660 35970251 35652344 34509543 33063572 32045657 31974140 32830716 34145717
41014 34145717 35341118 36015948 36092080 35850280 35773069 36213396 37209178 38660507 40560091
41005 40560091 42860191 45172480 46891041 47769836 48249222 49066059 50601088 52702069
40997 52702069 55037297 57427821 59838462 62240944 64593877 66850668 68857486 70285189
40989 70285189 70805242 70389512 69382950 68255803 67344141 66851687 66972970 67841499 69350972
$$ packed form
41048B9035973j324458j463427j335464j191913j200052j354698j488832j369027
41040A8308102q45138P808Q67161J335474J205088N80133k36159r24710j231704
41031A9066055r89285j81959R95878K204396L106696L481804L277240K614305
41023C3575130J701530O93591l17907j142801j445971j017915p1517Q56576J315001
41014C4145717J195401O74830P6132k41800p7211M40327R95782J451329J899584
41005D0560091K300100K312289J718561Q78795M79386Q16837J535029K100981
40997E2702069K335228K390524K410641K402482K352933K256791K006818J427703
40989G0285189N20053m15730j006562j127147r11662m92454J21283Q68529J509473
$$ plain form
40980 69350972 71191876 73181522 75501387 78504691 82289106 86510641 90609505 94199488
40972 94199488 97311524 100362005 103874614 108142918 113142224 118803099 125308250 132985051
40964 132985051 141899372 151712732 162039846 172866080 184519120 197284496 211135803
40957 211135803 225781429 240830659 255879289 270536278 284481962 297568152 309904393
40950 309904393 321828163 333656888 345300050 356060646 364891079 370927348 373818372
40943 373818372 373606249 370398307 364212633 355090073 343274517 329268202 313743849 297397190
40935 297397190 280802901 264301580 247964723 231704326 215513583 199674574 184739255
40928 184739255 171282355 159633125 149756783 141269727 133541999 125947360 118232384 110694644
$$ packed form
40980F9350972J840904J989646K319865L003304L784415M221535M098864L589983
40972I4199488L112036L050481L512609M268304M999306N660875O505151P676801
40964A32985051Q914321R813360J0327114J0826234J1653040J2765376J3851307
40957B11135803J4645626J5049230J5048630J4656989J3945684J3086190J2336241
40950C09904393J1923770J1828725J1643162J0760596Q830433O036269K891024
40943C73818372k12123l207942o185674r122560j1815556j4006315j5524353j6346659
40935B97397190j6594289j6501321j6336857j6260397j6190743j5839009j4935319
40928A84739255j3456900j1649230r876342q487056p727728p594639p714976p537740
$$ plain form
40920 110694644 103880866 98026642 92843358 87899268 83125982 78857422 75430934 72880682
40912 72880682 71007722 69590927 68464169 67530504 66852253 66666920 67137067 68050839 68910004
40903 68910004 69401916 69703666 70230054 71132007 72125701 72764135 72771887 72157804 71166439 70170538
40893 70170538 69472534 69087295 68764761 68324537 67961646 68164807 69350307 71622464 74840445
40884 74840445 78794279 83266350 87989516 92635512 96898749 100640093 103991330 107305409
40876 107305409 110943104 115066357 119625723 124512123 129674346 135110525 140835202 146911303
40868 146911303 153476636 160649445 168321704 175988977 182804761 187927348 190949945 192015690
40860 192015690 191468764 189431141 185815300 180709894 174565200 167923641 161115198 154314629
$$ packed form
40920A10694644o813778n854224n183284m944090m773286m268560l426488k550252
40912G2880682j872960j416795j126758r33665o78251j85333M70147R13772Q59165
40903F8910004M91912L01750N26388R01953R93694O38434P752o14083r91365r95901
40893G0170538o98004l85239l22534m40224l62891K03161J185500K272157L217981
40884G4840445L953834M472071M723166M645996M263237L741344L351237L314079
40876A07305409L637695M123253M559366M886400N162223N436179N724677O076101
40868A46911303O565333P172809P672259P667273O815784N122587L022597J065745
40860A92015690n46926k037623l615841n105406o144694o641559o808443o800569
$$ plain form
40852 154314629 147699681 141281999 134631284 127088701 118429809 109199444 100273111 92166072
40844 92166072 84839773 78033017 71598700 65585642 60216204 55836857 52721731 50793962
40836 50793962 49584772 48549011 47425962 46285833 45262006 44249539 42831515 40529744
40828 40529744 37245713 33511977 30219854 27993112 26823503 26319816 26202206 26440739
40820 26440739 26974654 27479882 27504526 26789009 25415408 23675026 21805999 19815012 17517258
40811 17517258 14765093 11666390 8599770 6046095 4412865 3946214 4677714 6361027
40803 6361027 8448770 10181870 10819164 9959119 7772727 4915871 2139398 -37889
40795 -37889 -1312590 -1447608 -365486 1607865 3791332 5541147 6515860 6559025 5547858
$$ packed form
40852A54314629o614948o417682o650715p542583q658892r230365q926333q107039
40844I2166072p326299o806756o434317o013058n369438m379347l115126j927769
40836E0793962j209190j035761j123049j140129j023827j012467j418024k301771
40828D0529744l284031l733736l292123k226742j169609n03687j17610K38533
40820B6440739N33915N05228K4644p15517j373601j740382j869027j990987k297754
40811A7517258k752165l098703l066620k553675j633230m66651P31500J683313
40803F361027K087743J733100O37294q60045k186392k856856k776473k177287
40795c7889j274701j35018J082122J973351K183467J749815R74713M3165j011167
$$ plain form
40786 5547858 3532995 908909 -1764776 -4113871 -6020134 -7420983 -8237892 -8522204
40778 -8522204 -8498379 -8387951 -8291608 -8258469 -8277485 -8068048 -7043058 -4750559 -1402432 2191327
40768 2191327 5293720 7764276 9889815 11866572 13624512 15081173 16300364 17281627
40760 17281627 17759453 17406499 16200513 14444144 12449136 10380883 8455870 7105947
40752 7105947 6773128 7541012 9007578 10488192 11368293 11423930 10920285 10316406 9743509
40743 9743509 8792247 6892719 3883666 181374 -3502231 -6512413 -8461374 -9324325
40735 -9324325 -9371725 -8885488 -7906523 -6323483 -4180761 -1807259 324143 1778077 2304987
40726 2304987 2022280 1432052 1025101 789831 282227 -742345 -1924308 -2608743 -2416803
$$ packed form
40786E547858k014863k624086k673685k349095j906263j400849q16909k84312
40778h522204K3825J10428R6343L3139j9016K09437J024990K292499L348127L593759
40768B191327L102393K470556K125539J976757J757940J456661J219191R81263
40760A7281627M77826l52954j205986j756369j995008k068253j925013j349923
40752G105947l32819P67884J466566J480614Q80101N5637n03645o03879n72897
40743I743509r51262j899528l009053l702292l683605l010182j948961q62951
40735i324325m7400M86237R78965J583040K142722K373502K131402J453934N26910
40726B304987k82707n90228m06951k35270n07604j024572j181963o84435J91940
$$ plain form
40717 -2416803 -1445163 -98506 1116292 1795023 1894385 1789370 1907249 2246064 2293399
40708 2293399 1401046 -762331 -3973824 -7496228 -10396940 -12029866 -12359284 -11898552 -11402702
40699 -11402702 -11564304 -12755552 -14832499 -17190554 -19122510 -20156293 -20106765 -19019956
40691 -19019956 -17218590 -15235259 -13440423 -11749426 -9865468 -7769142 -5784012 -4207514
40683 -4207514 -3116830 -2549556 -2610146 -3275880 -4273204 -5277220 -6127926 -6765571 -7062972
40674 -7062972 -6807080 -5766840 -3762403 -845712 2474301 5328198 6977271 7198087
40666 7198087 6175212 4203156 1647572 -958791 -3071103 -4446501 -5185084 -5453152
40658 -5453152 -5290679 -4713950 -3886590 -3116214 -2717884 -2888591 -3647072 -4854004 -6314436
$$ packed form
40717b416803R71640J346657J214798O78731R9362j05015J17879L38815M7335
40708B293399q92353k163377l211493l522404k900712j632926l29418M60732M95850
40699a1402702j61602j191248k076947k358055j931956j033783M9528J086809
40691a9019956J801366J983331J794836J690997J883958K096326J985130J576498
40683d207514J090684N67274o0590o65734r97324j004016q50706o37645k97401
40674g062972K55892J040240K004437K916691L320013K853897J649073K20816
40666G198087j022875j972056k555584k606363k112312j375398p38583k68068
40658e453152J62473N76729Q27360P70376L98330j70707p58481j206932j460432
$$ plain form
40649 -6314436 -7886376 -9506420 -11149075 -12771870 -14230965 -15202986 -15280931 -14282604 -12468492
40640 -12468492 -10366448 -8380036 -6653361 -5304083 -4624128 -4915567 -6143318 -7821223
40632 -7821223 -9258493 -9924219 -9645719 -8569099 -6997763 -5252127 -3607683 -2281973
40624 -2281973 -1427290 -1118299 -1340165 -1987951 -2897333 -3893923 -4791680 -5331885 -5214913
40615 -5214913 -4338892 -3030719 -1898302 -1327144 -1138694 -789083 140814 1668091 3473620
40606 3473620 5099822 6171422 6651101 6956778 7703594 9223892 11345425 13611365 15599883
40597 15599883 17001782 17558657 17125511 15817131 13984559 11982226 9973037 7968254
40589 7968254 6022173 4358212 3301783 3073137 3590010 4417161 4922109 4587738 3314733
$$ packed form
40649f314436j571940j620044j642655j622795j459095r72021p7945R98327J814112
40640a2468492K102044J986412J726675J349278O79955k91439j227751j677905
40632g821223j437270o65726K78500J076620J571336J745636J644444J325710
40624b281973Q54683L08991k21866o47786r09382r96590q97757n40205J16972
40615e214913Q76021J308173J132417N71158J88450L49611R29897J527277J805529
40606C473620J626202J071600M79679L05677P46816J520298K121533K265940J988518
40597A5599883J401899N56875m33146j308380j832572k002333k009189k004783
40589G968254j946081j663961j056429k28646N16873Q27151N04948l34371j273005
$$ plain form
40580 3314733 1495476 -233107 -1390356 -1906190 -2083928 -2360166 -2998421 -3824777 -4208458
40571 -4208458 -3475080 -1514344 1065443 3517234 5645237 7766265 10025398 11999404
40563 11999404 13101970 13212679 12712685 11967324 10983856 9624394 7990584 6450103 5308691
40554 5308691 4574426 4093341 3834364 3916714 4342352 4829620 5017699 4767273 4128416 3061227
40544 3061227 1401654 -811585 -3140341 -5043596 -6336784 -7274154 -8248692 -9516400
40536 -9516400 -11122366 -12894544 -14490975 -15629406 -16351892 -16940605 -17483043 -17632963 -16940576
40527 -16940576 -15373310 -13380340 -11461933 -9816411 -8423286 -7276770 -6365228 -5498862
40519 -5498862 -4388496 -2992911 -1662426 -785346 -300441 335209 1667783 3784925 6299989
$$ packed form
40580C314733j819257j728583j157249n15834j77738k76238o38255q26356l83681
40571d208458P33378J960736K579787K451791K128003K121028K259133J974006
40563A1999404J102566J10709m99994p45361r83468j359462j633810j540481j141412
40554E308691p34265m81085k58977Q2350M25638M87268J88079k50426o38857j067189
40544C061227j659573k213239k328756j903255j293188r37370r74538j267708
40536i516400j605966j772178j596431j138431p22486n88713n42438j49920O92387
40527a6940576J567266J992970J918407J645522J393125J146516R11542Q66366
40519e498862J110366J395585J330485Q77080M84905O35650J332574K117142K515064
$$ plain form
40510 6299989 8668972 10480352 11573658 12053828 12226829 12435477 12875744 13511303 14084983
40501 14084983 14188663 13461548 11926110 10170837 9042640 9009154 9821000 10832564 11594791
40492 11594791 12079320 12428958 12684477 12807303 12812912 12717899 12384114 11582625 10302203 8907549
40482 8907549 7853203 7225335 6670260 5827361 4744695 3778663 3156176 2781596 2459327
40473 2459327 2118416 1729709 1167268 348752 -532041 -1105539 -1199517 -977734 -665213 -286512
40463 -286512 214588 705242 872090 489905 -403767 -1556064 -2603127 -3168783 -3055099
40454 -3055099 -2435909 -1774720 -1463642 -1580237 -2019962 -2738032 -3722688 -4792077 -5617582
40445 -5617582 -6038714 -6260576 -6628665 -7223026 -7754519 -7871573 -7492862 -6780760 -5835752
$$ packed form
40510F299989K368983J811380J093306M80170J73001K08648M40267O35559N73680
40501A4084983J03680p27115j535438j755273j128197l3486Q11846J011564P62227
40492A1594791M84529L49638K55519J22826N609r5013l33785q01489j280422j394654
40482H907549j054346o27868n55075q42899j082666r66032o22487l74580l22269
40473B459327l40911l88707n62441q18516q80793n73498r3978K21783L12521L78701
40463b86512N01100M90654J66848l82185q93672j152297j047063n65656J13684
40454c055099O19190O61189L11078j16595m39725p18070r84656j069389q25505
40445e617582m21132k21862l68089n94361n31493j17054L78711P12102R45008
$$ plain form
40436 -5835752 -4534521 -2735330 -593073 1423450 2851938 3530936 3567713 3085353 2077521
40427 2077521 517279 -1442108 -3423071 -4998217 -5902434 -6074192 -5559521 -4507497 -3295418
40418 -3295418 -2480734 -2406099 -2858961 -3316189 -3576551 -3969631 -4842277 -6019061 -6951838
40409 -6951838 -7301984 -7191801 -6947478 -6795551 -6804084 -6938807 -7139875 -7460256 -8104318 -9158353
40399 -9158353 -10287439 -10919954 -10814604 -10273348 -9712539 -9208483 -8583455 -7738983 -6689216
40390 -6689216 -5385739 -3765286 -1974176 -368204 734376 1194497 1007851 331106 -402479
40381 -402479 -594910 104686 1480447 2856660 3507068 3046235 1638817 -33048 -1099195
40372 -1099195 -1007037 158464 1805667 3266374 4124736 4231014 3539464 2035789 -163527
$$ packed form
40436e835752J301231J799191K142257K016523J428488O78998L6777m82360j007832
40427B077521j560242j959387j980963j575146r04217j71758N14671J052024J212079
40418c295418Q14684P4635m52862m57228k60362l93080q72646j176784r32777
40409f951838l50146J10183K44323J51927q533j34723k01068l20381o44062j054035
40399i158353j129086o32515J05350N41256N60809N04056O25028Q44472J049767
40390f689216J303477J620453J791110J605972J102580M60121j86646o76745p33585
40381d02479j92431O99596J375761J376213O50408m60833j407418j671865j066147
40372a099195R2158J165501J647203J460707Q58362J06278o91550j503675k199316
$$ plain form
40363 -163527 -2709916 -5114945 -6992117 -8204043 -8789510 -8817150 -8349240 -7488894 -6382942
40354 -6382942 -5173419 -3966920 -2814343 -1673140 -414594 1076725 2794837 4577276
40346 4577276 6113064 7011632 7047068 6465494 5928733 5947800 6382172 6660496 6498452 6236444
40336 6236444 6447501 7389234 8905955 10682139 12432419 13938226 15072353 15803423 16111631
40327 16111631 15932185 15255523 14258585 13260064 12531056 12161318 12076756 12164845 12426842 13027502
40317 13027502 14125438 15604078 17030441 17948465 18192600 17899677 17299004 16558531 15767333
40308 15767333 14975921 14271027 13830037 13792793 13993577 13953136 13337617 12396203 11738087 11626261
40298 11626261 11664448 11281269 10392656 9448217 8894457 8744709 8673613 8383083 7780316 6867335
$$ packed form
40363a63527k546389k405029j877172j211926n85467k7640M67910Q60346J105952
40354f382942J209523J206499J152577J141203J258546J491319J718112J782439
40346D577276J535788Q98568L5436n81574n36761J9067M34372K78324j62044k62008
40336F236444K11057R41733J516721J776184J750280J505807J134127P31070L08208
40327A6111631j79446o76662r96938r98521p29008l69738q4562Q8089K61997O00660
40317A3027502J097936J478640J426363R18024K44135k92923o00673p40473p91198
40308A5767333p91412p04894m40990l7244K00784m0441o15519r41414o58116j11826
40298A1626261L8187l83179q88613r44439n53760j49748p1096k90530o02767r12981
$$ plain form
40288 6867335 5612316 4025613 2320332 867233 -90209 -635027 -1026860 -1389663 -1635640
40279 -1635640 -1680455 -1607400 -1561502 -1574445 -1591456 -1626931 -1778438 -2064936 -2334628 -2388499 -2154745
40268 -2154745 -1694696 -1093538 -466898 -100831 -439394 -1752473 -3788509 -5870388 -7407055
40259 -7407055 -8277331 -8719726 -8979756 -9157370 -9290739 -9414236 -9523527 -9595416 -9650597 -9687030
40249 -9687030 -9531991 -8891625 -7641671 -6010550 -4383070 -2921874 -1423919 440182
40241 440182 2743186 5145340 7149110 8555680 9627860 10699151 11629286 11779456 10575912
40232 10575912 7993987 4466383 531179 -3243504 -6160441 -7610546 -7557963 -6650477
40224 -6650477 -5680824 -4974843 -4378795 -3744439 -3261553 -3310380 -4111467 -5556725 -7284294
$$ packed form
40288F867335j255019j586703j705281j453099r57442n44818l91833l62803k45977
40279a635640m4815P3055M5898j2943j7011l5475j51507k86498k69692n3871K33754
40268b154745M60049O01158O26640L66067l38563j313079k036036k081879j536667
40259g407055q70276m42395k60030j77614j33369j23497j09291p1889n5181l6433
40249i687030J55039O40366J249954J631121J627480J461196J497955J864101
40241D40182K303004K402154K003770J406570J072180J071291R30135J50170j203544
40232A0575912k581925l527604l935204l774683k916937j450105N2583R07486
40224f650477R69653P05981N96048O34356M82886m8827q01087j445258j727569
$$ plain form
40215 -7284294 -8851581 -9905894 -10301293 -10091014 -9393709 -8269970 -6737411 -4881386 -2925958
40206 -2925958 -1214959 -131749 42459 -690338 -1977422 -3305489 -4322599 -4972959 -5332898
40197 -5332898 -5386381 -4987497 -3969040 -2229178 230342 3264485 6590919 9888557 12883100
40188 12883100 15318999 16931392 17574703 17408299 16887866 16514987 16543334 16829116 16897942
40179 16897942 16233149 14640574 12381698 9953156 7810188 6321563 5757883 6029664
40171 6029664 6490145 6340504 5370396 4099590 3095465 2395887 1762681 1218701 984367
40162 984367 989976 820985 217022 -612798 -1242752 -1400191 -1008464 -70487 1308801 2842707
40152 2842707 4121717 4763551 4535985 3470403 1944209 579245 -53723 318955 1654828
$$ packed form
40215g284294j567287j054313l95399K10279O97305J123739J532559J856025J955428
40206b925958J710999J083210J74208p32797j287084j328067j017110o50360l59939
40197e332898n3483L98884J018457J739862K459520L034143L326434L297638K994543
40188A2883100K435899J612393O43311j66404n20433l72879K8347K85782O8826
40179A6897942o64793j592575k258876k428542k142968j488625n63680K71781
40171F029664M60481j49641r70108j270806j004125o99578o33206n43980k34334
40162I84367N609j68991o03963q29820o29954j57439L91727R37977J379288J533906
40152B842707J279010O41834k27566j065582j526194j364964o32968L72678J335873
$$ plain form
40143 1654828 3712840 6167506 8702212 11057209 12977735 14167775 14433432 13916055
40135 13916055 13070699 12318114 11726552 11011549 9744079 7562959 4375694 522278 -3266609
40126 -3266609 -6147536 -7459443 -6910896 -4741283 -1762424 1014877 3039969 4471528
40118 4471528 5681342 6661993 7118256 7021617 6767085 6706972 6708822 6267586 4979419 2905659
40108 2905659 599006 -1207870 -2093416 -2237872 -2188077 -2303061 -2474450 -2371852 -1851393
40099 -1851393 -1095348 -460081 -260369 -645136 -1597433 -2999884 -4635619 -6123217 -7023999
40090 -7023999 -7210172 -7070430 -7119497 -7360194 -7218722 -6178943 -4323630 -2201016 -353986
40081 -353986 939357 1716579 2347716 3336713 4823660 6305963 7056291 6830230 6047290
$$ packed form
40143A654828K058012K454666K534706K354997J920526J190040K65657n17377
40135A3916055q45356p52585n91562p15003j267470k181120l187265l853416l788887
40126c266609k880927j311907N48547K169613K978859K777301K025092J431559
40118D471528J209814R80651M56263r6639k54532o0113J850m41236j288167k073760
40108B905659k306653j806876q85546j44456M9795j14984j71389J02598N20459
40099a851393P56045O35267J99712l84767r52297j402451j635735j487598r00782
40090g023999j86173J39742m9067k40697J41472J039779J855313K122614J847030
40081c53986J293343P77222O31137R88997J486947J482303P50328k26061p82940
$$ plain form
40072 6047290 5344666 5118844 5409324 5927579 6116733 5416657 3657437 1148664 -1653644
40063 -1653644 -4451903 -7041782 -9134290 -10440511 -10912698 -10775239 -10290652 -9543825 -8455775
40054 -8455775 -6973052 -5243902 -3618246 -2448210 -1861798 -1728279 -1820194 -1975306 -2146361
40045 -2146361 -2403455 -2919351 -3868654 -5287082 -7080721 -9210326 -11797379 -14959551 -18518471
40036 -18518471 -21870444 -24160854 -24710684 -23481846 -21207019 -18928930 -17260379 -16092509
40028 -16092509 -15037596 -14019165 -13292860 -12988782 -12867531 -12594442 -12124929 -11739821 -11769555
40019 -11769555 -12332796 -13270769 -14259932 -15018555 -15468762 -15709946 -15835806 -15814855 -15564060
40010 -15564060 -15088177 -14506480 -13976795 -13630619 -13539465 -13674236 -13898861 -14054884 -14059379 -13887458
$$ packed form
40072F047290p02624k25822K90480N18255J89154p00076j759220k508773k802308
40063a653644k798259k589879k092508j306221m72187J37459M84587P46827J088050
40054h455775J482723J729150J625656J170036N86412J33519r1915j55112j71055
40045b146361k57094n15896r49303j418428j793639k129605k587053l162172l558920
40036a8518471l351973k290410n49830J228838K274827K278089J668551J167870
40028a6092509J054913J018431P26305L04078J21251K73089M69513L85108k9734
40019a1769555n63241r37973r89163p58623m50207k41184j25860K0951K50795
40010a5564060M75883N81697N29685L46176R1154j34771k24625j56023m495J71921
$$ plain form
40000 -13887458 -13474635 -12701511 -11485223 -9816549 -7678882 -5028370 -1970431 1070572
39992 1070572 3509094 5035155 5881651 6605118 7586756 8733175 9599637 9740506 8958254
39983 8958254 7310967 4993789 2291020 -370696 -2464694 -3644010 -4033465 -4134613
39975 -4134613 -4345970 -4619770 -4648861 -4323271 -3920113 -3908271 -4660682 -6261019 -8384722
39966 -8384722 -10338901 -11394682 -11211285 -9932745 -7904157 -5394565 -2566262 461797
39958 461797 3569246 6496792 8707151 9615742 9167061 8080089 7314747 7297932 7779440
39949 7779440 8362547 8967109 9741750 10676947 11386994 11231748 9682580 6709314 2887129
39940 2887129 -920306 -4050469 -6298965 -7842589 -9028470 -10178705 -11448335 -12823994
$$ packed form
40000a3887458M12823P73124J216288J668674K137667K650512L057939L041003
39992A070572K438522J526061Q46496P23467R81638J146419Q66462J40869p82252
39983H958254j647287k317178k702769k661716k093998j179316l89455j01148
39975d134613k11357k73800k9091L25590M03158J1842p52411j600337k123703
39966h384722j954179j055781J83397J278540K028588K509592K828303L028059
39958D61797L107449K927546K210359R08591m48681j086972p65342j6815M81508
39949G779440N83107O04562P74641R35197P10047j55246j549168k973266l822185
39940B887129l807435l130163k248496j543624j185881j150235j269630j375659
$$ plain form
39932 -12823994 -14270959 -15781474 -17163785 -17894038 -17427284 -15719445 -13303464 -10817556
39924 -10817556 -8591020 -6690640 -5145764 -4000840 -3293251 -3107498 -3529040 -4407024 -5268762
39915 -5268762 -5638013 -5400419 -4745404 -3839296 -2739426 -1587718 -640506 23052 720716
39906 720716 1970910 4063363 6827261 9765350 12365302 14304837 15434720 15668701
39898 15668701 14989730 13579935 11846971 10219368 8914933 7946442 7304034 7032707 7122144
39889 7122144 7407696 7638713 7636192 7390586 7058550 6889989 7107056 7765942 8672805 9431623
39879 9431623 9646337 9186676 8317954 7544156 7262050 7512071 7989195 8220441 7770450
39870 7770450 6447049 4439577 2212792 150896 -1711379 -3562541 -5448923 -7102204
$$ packed form
39932a2823994j446965j510515j382311p30253M66754J707839K415981K485908
39924a0817556K226536J900380J544876J144924P07589J85753m21542q77984q61738
39915e268762l69251K37594O55015R06108J099870J151708R47212O63558O97664
39906G20716J250194K092453K763898K938089K599952J939535J129883K33981
39898A5668701o78971j409795j732964j627603j304435r68491o42408k71327Q9437
39889G122144K85552K31017k521k45606l32036j68561K17067O58886R06863P58818
39879I431623K14714m59661q68722p73798k82106K50021M77124K31246m49991
39870G770450j323401k007472k226785k061896j862275j851162j886382j653281
$$ plain form
39862 -7102204 -8116201 -8236476 -7512894 -6282327 -5027878 -4147000 -3751561 -3677980 -3697015
39853 -3697015 -3685665 -3602570 -3392970 -3019478 -2575404 -2258891 -2159518 -2115421 -1879166 -1428150
39843 -1428150 -999823 -770233 -633476 -443884 -367863 -734539 -1516049 -2247492 -2637604 -3029464
39833 -3029464 -3956641 -5323230 -6336695 -6312091 -5319438 -3969443 -2798066 -2019810 -1687858
39824 -1687858 -1804699 -2255339 -2824294 -3379454 -3970526 -4674964 -5378842 -5791899 -5731160 -5377696
39814 -5377696 -5182378 -5448640 -6011428 -6377563 -6187453 -5505729 -4691589 -4084665 -3840351
39805 -3840351 -3948180 -4267199 -4521221 -4345281 -3443196 -1789474 270253 2142082 3304108
39796 3304108 3612436 3363372 3079274 3173356 3680418 4218745 4281971 3692838 2772737 2000342
$$ packed form
39862g102204j013997j20275P23582J230567J254449Q80878L95439P3581j9035
39853c697015J1350Q3095K09600L73492M44074L16513R9373M4097K36255M51016
39843a428150M28327K29590J36757J89592P6021l66676p81510p31443l90112l91860
39833c029464r27177j366589j013465K4604R92653J349995J171377P78256L31952
39824a687858j16841m50640n68955n55160n91072p04438p03878m13057O0739L53464
39814e377696J95318k66262n62788l66135J90110O81724Q14140O06924K44314
39805c840351j07829l19019k54022J75940R02085J653722K059727J871829J162026
39796C304108L08328k49064k84098R4082N07062N38327O3226n89133r20101p72395
$$ plain form
39786 2000342 1557333 1311975 1144204 1032259 806616 140870 -991520 -2034895 -2303429
39777 -2303429 -1691177 -757510 -157536 -171219 -711037 -1465294 -1930236 -1588408 -333380
39768 -333380 1333528 2695312 3392358 3537205 3400393 3200966 3147019 3355998 3561712
39759 3561712 3102412 1485261 -1021062 -3523609 -5263888 -6115508 -6346364 -6149135 -5595281
39750 -5595281 -4887492 -4338682 -4036489 -3736869 -3205453 -2517972 -1880679 -1266050 -436428
39741 -436428 660033 1685679 2195580 2060431 1558857 1104834 930223 974726 996863 794860
39731 794860 402190 119721 314891 1093512 2103802 2682419 2281250 843824 -1185205
39722 -1185205 -3206710 -4842458 -6041275 -6930474 -7641993 -8256021 -8809863 -9283986 -9584522
$$ packed form
39786B000342m43009k45358j67771j11945k25643o65746j132390j043375k68534
39777b303429O12252R33667N99974j3683n39818p54257m64942L41828J255028
39768c33380J666908J361784O97046J44847j36812j99427n3947K08979K05714
39759C561712m59300j617151k506323k502547j740279q51620k30856J97229N53854
39750e595281P07789N48810L02193K99620N31416O87481O37293O14629Q29622
39741d36428J096461J025646N09901j35149n01574m54023j74611M4503K2137k02003
39731G94860l92670k82469J95170P78621J010290N78617m01169j437426k029029
39722a185205k021505j635748j198817q89199p11519o14028n53842m74123l00536
$$ plain form
39713 -9584522 -9584822 -9201222 -8411365 -7201729 -5552564 -3535716 -1420212 395035 1620313
39704 1620313 2259369 2553457 2757915 2959945 3040681 2758064 1917116 569104 -909217
39695 -909217 -1972570 -2209578 -1574346 -430654 582935 844616 105832 -1338264 -2857524
39686 -2857524 -3910259 -4310665 -4209245 -3952216 -3926038 -4338928 -5027020 -5528145 -5422342
39677 -5422342 -4598757 -3233123 -1644335 -219424 673969 847390 325190 -844310 -2699786
39668 -2699786 -5142314 -7654278 -9415066 -9749779 -8437098 -5692668 -2073294 1567678
39660 1567678 4270281 5377201 4848884 3183446 1063749 -920237 -2341835 -2941029
39652 -2941029 -2686810 -1840678 -891729 -347765 -515497 -1410486 -2807669 -4359659 -5751915
$$ packed form
39713i584522l00L83600P89857J209636J649165K016848K115504J815247J225278
39704A620313O39056K94088K04458K02030Q0736k82617q40948j348012j478321
39695i09217j063353k37008O35232J143692J013589K61681p38784j444096j519260
39686b857524j052735m00406J01420K57029K6178m12890o88092n01125J05803
39677e422342Q23585J365634J588788J424911Q93393J73421n22200j169500j855476
39668b699786k442528k511964j760788l34713J312681K744430L619374L640972
39660A567678K702603J106920n28317j665438k119697j983986j421598n99194
39652b941029K54219Q46132R48949N43964j67732q94989j397183j551990j392256
$$ plain form
39643 -5751915 -6862660 -7780823 -8580375 -9075723 -8922233 -7998467 -6555797 -4917741 -3189392
39634 -3189392 -1406766 187134 1288047 1938381 2544288 3419459 4499561 5586083 6674919
39625 6674919 7877467 9119637 10079386 10391919 9834158 8400134 6351657 4163842 2249787
39616 2249787 678631 -755587 -2167925 -3384570 -4156307 -4479154 -4616104 -4842950 -5257742
39607 -5257742 -5818604 -6453372 -7069934 -7514862 -7606750 -7234407 -6418225 -5305717 -4136629
39598 -4136629 -3173136 -2595725 -2455894 -2738012 -3394015 -4227499 -4807569 -4676697 -3699462
39589 -3699462 -2094895 -95035 2277965 5029507 7967481 10810365 13392740 15592985
39581 15592985 17167712 17880786 17759655 17023196 15783741 14048701 12039302 10268156
$$ packed form
39643e751915j110745r18163p99552m95348J53490R23766J442670J638056J728349
39634c189392J782626J593900J100913O50334O05907Q75171J080102J086522J088836
39625F674919J202548J242170R59749L12533n57761j434024k048477k187815j914055
39616B249787j571156j434218j412338j216645p71737l22847j36950k26846m14792
39607e257742n60862o34768o16562m44928r1888L72343Q16182J112508J169088
39598d136629R63493N77411J39831k82118o56003q33484n80070J30872R77235
39589c699462J604567J999860K373000K751542K937974K842884K582375K200245
39581A5592985J574727P13074j21131p36459j239455j735040k009399j771146
$$ plain form
39573 10268156 9178356 8820465 8926326 9153135 9219723 9002723 8618824 8284828 8011932
39564 8011932 7581552 6912546 6277639 5995168 6018586 5986755 5609845 4901461 4149588 3801086
39554 3801086 4244956 5484754 7041521 8329316 9097980 9397216 9225380 8458135 7122193
39545 7122193 5527990 4079300 3079791 2694435 2869389 3219478 3198179 2527462 1386460
39536 1386460 139998 -965232 -1759841 -2008360 -1524557 -387563 1109375 2714745 4319289
39527 4319289 5834511 7101997 7944414 8230120 7899957 7034098 5906276 4867215 4122906
39518 4122906 3684476 3539662 3746536 4276395 4873679 5223065 5229080 5003156 4607757 4009014
39508 4009014 3335522 2970844 3207051 3916269 4753386 5595687 6521833 7343091 7441015 6257055
$$ packed form
39573A0268156j089800l57891J05861K26809O6588k17000l83899l33996k72896
39564H011932m30380o69006o34907k82471K3418l1831l76910p08384p51873l48502
39554C801086M43870J239798J556767J287795P68664K99236j71836p67245j335942
39545G122193j594203j448690r99509l85356J74954L50089k1299o70717j141002
39536A386460j246462j105230p94609k48519M83803J136994J496938J605370J604544
39527D319289J515222J267486Q42417K85706l30163q65859j127822j039061p44309
39518D122906m38430j44814K06874N29859N97284L49386O015k25924l95399n98743
39508D009014o73492l64678K36207P09218Q37117Q42301R26146Q21258R7924j183960
$$ plain form
39498 6257055 3848829 876339 -1838214 -3659886 -4263743 -3685354 -2285394 -563809
39490 -563809 1002204 1970273 2029723 1333261 647958 883205 2352457 4576255 6777807
39481 6777807 8423329 9326917 9503005 9063704 8141132 6803674 5117204 3319103 1791530
39472 1791530 763857 125122 -404056 -1015901 -1799961 -2841230 -4167195 -5625871 -6928962
39463 -6928962 -7813940 -8120890 -7787200 -6877875 -5588286 -4102034 -2432602 -475743 1775313
39454 1775313 4116524 6223243 7808795 8735789 9074310 9075427 9007916 8943176 8683714 7919988
39444 7919988 6494225 4567085 2560495 920335 -96072 -426493 -70628 950341
39436 950341 2490569 4244758 5902634 7306327 8413369 9165039 9464159 9247552 8519214
$$ packed form
39498F257055k408226k972490k714553j821672o03857N78389J399960J721585
39490e63809J566013R68069N9450o96462o85303K35247J469252K223798K201552
39481F777807J645522R03588J76088m39301r22572j337458j686470j798101j527573
39472A791530j027673o38735n29178o11845p84060j041269j325965j458676j303091
39463f928962q84978l06950L33690R09325J289589J486252J669432J956859K251056
39454A775313K341211K106719J585552R26994L38521J117o7511o4740k59462p63726
39444G919988j425763j927140k006590j640160j016407l30421L55865J020969
39436I50341J540228J754189J657876J403693J107042P51670K99120k16607p28338
$$ plain form
39427 8519214 7360920 5999890 4836143 4277766 4475352 5211658 6030593 6473582 6300845
39418 6300845 5624608 4828918 4243393 3843297 3316821 2435926 1302475 233746 -504723
39409 -504723 -829775 -804837 -548120 -136825 442645 1219898 2104519 2892899 3448492 3808466
39399 3808466 4065367 4222032 4235305 4116283 3865384 3374773 2587358 1789457 1562887 2288492
39389 2288492 3728380 5182002 6020203 5998946 5132579 3471257 1139194 -1458405 -3625498
39380 -3625498 -4720912 -4608468 -3793255 -3076625 -3003191 -3559569 -4309756 -4737155 -4486340
39371 -4486340 -3451759 -1809171 31707 1631159 2769098 3504264 3999417 4317865 4368620
39362 4368620 3987831 3067474 1654853 -59757 -1871194 -3640619 -5209072 -6311844
$$ packed form
39427H519214j158294j361030j163747n58377J97586P36306Q18935M42989j72737
39418F300845o76237p95690n85525m00096n26476q80895j133451j068729p38469
39409e04723l25052K4938K56717M11295N79470P77253Q84621P88380N55593L59974
39399C808466K56901J56665J3273j19022k50899m90611p87415p97901k26570P25605
39389B288492J439888J453622Q38201k1257q66367j661322k332063k597599k167093
39380c625498j095414J12444Q15213P16630P3434n56378p50187m27399K50815
39371d486340J034581J642588J840878J599452J137939P35166M95153L18448N0755
39362D368620l80789r20357j412621j714610j811437j769425j568453j102772
$$ plain form
39354 -6311844 -6714425 -6413887 -5559714 -4173889 -2133272 506201 3349906 5956128 8159352
39345 8159352 9989826 11429279 12430196 13057442 13374407 13229745 12391169 10925651 9278731
39336 9278731 7943680 7175315 6995569 7270783 7746107 8209735 8717009 9491078 10499973
39327 10499973 11271952 11250869 10248304 8477709 6283943 3977844 1852624 202306
39319 202306 -715866 -749782 23641 1220111 2335086 3108498 3629635 4053475 4381512
39310 4381512 4622624 4982510 5686663 6699405 7791468 8810276 9707141 10372566 10668648
39301 10668648 10627719 10441051 10241190 10049986 9932664 10017605 10325105 10718680 11032011 11078524
39291 11078524 10550558 9186951 7188217 5278418 4158120 3955311 4301243 4799546 5249924
$$ packed form
39354f311844m02581L00538Q54173J385825K040617K639473K843705K606222K203224
39345H159352J830474J439453J000917O27246L16965j44662q38576j465518j646920
39336I278731j335051p68365j79746K75214M75324M63628N07274P74069J008895
39327A0499973P71979k1083j002565j770595k193766k306099k125220j650318
39319B02306r18172l3916P73423J196470J114975P73412N21137M23840L28037
39310D381512K41112L59886P04153J012742J092063J018808Q96865O65425K96082
39301A0668648m0929j86668j99861j91204j17322Q4941L07500L93575L13331M6513
39291A1078524n27966j363607j998734j909799j120298k02809L45932M98303M50378
$$ plain form
39282 5249924 5522909 5466710 4985149 4077487 2783949 1208763 -402460 -1774914 -2889678
39273 -2889678 -4061862 -5614627 -7478509 -9162045 -10101868 -10018797 -9003793 -7381067 -5533406
39264 -5533406 -3791643 -2384743 -1408790 -785610 -248083 543023 1725443 3007418 3768818
39255 3768818 3490793 2144088 191593 -1740997 -3214977 -4157416 -4857422 -5779197 -7249040
39246 -7249040 -9257669 -11561999 -13886117 -15902706 -17118987 -17079633 -15822554 -13980707
39238 -13980707 -12290754 -11074814 -10248006 -9634309 -9109481 -8609402 -8256431 -8391873 -9196012
39229 -9196012 -10256458 -10754509 -10165423 -8659520 -6863717 -5469206 -5055319 -5894310 -7629579
39220 -7629579 -9290517 -9901931 -9130403 -7318240 -5054191 -2862455 -1149704 -158018 105767
$$ packed form
39282E249924K72985n6199m81561r07662j293538j575186j611223j372454j114764
39273b889678j172184j552765j863882j683536r39823Q3071J015004J622726J847661
39264e533406J741763J406900R75953O23180N37527P91106J182420J281975P61400
39255C768818k78025j346705j952495j932590j473980r42439p00006r21775j469843
39246g249040k008629k304330k324118k016589j216281L9354J257079J841847
39238a3980707J689953J215940Q26808O13697N24828N00079L52971j35442q04139
39229i196012j060446m98051N89086J505903J795803J394511M13887q38991j735269
39220g629579j660938o11414P71528J812163K264049K191736J712751R91686K63785
$$ plain form
39211 105767 -199288 -864027 -1585446 -1913669 -1476840 -307942 1184965 2584928 3666028
39202 3666028 4268251 4268986 3860603 3676441 4364935 6010700 8103375 10057219 11617341
39193 11617341 12784031 13587678 14089962 14452995 14767078 14798463 14088130 12390373 9929559
39184 9929559 7165012 4391570 1654618 -1024176 -3480406 -5476660 -6858187 -7646641
39176 -7646641 -8069203 -8490015 -9175149 -10027617 -10603250 -10478928 -9625465 -8416281 -7322057
39167 -7322057 -6645258 -6493615 -6863358 -7636679 -8517239 -9094044 -9087431 -8546736 -7743780 -6857245
39157 -6857245 -5828138 -4541811 -3041736 -1481171 35081 1416447 2453679 2913695
39149 2913695 2800894 2370391 1829361 1175350 404407 -301615 -778406 -1179814 -1869128
$$ packed form
39211A05767l05055o64739p21419l28223M36829J168898J492907J399963J081100
39202C666028O02223P35m08383j84162O88494J645765K092675J953844J560122
39193A1617341J166690Q03647N02284L63033L14083L1385p10333j697757k460814
39184I929559k764547k773442k736952k678794k456230j996254j381527p88454
39176g646641m22562m20812o85134q52468n75633J24322Q53463J209184J094224
39167g322057O76799J51643l69743p73321q80560n76805O613N40695Q02956Q86535
39157f857245J029107J286327J500075J560565J516252J381366J037232M60016
39149B913695j12801m30503n41030o54011p70943p06022m76791m01408o89314
$$ plain form
39140 -1869128 -2999657 -4346128 -5562513 -6455286 -6956313 -6997362 -6576831 -5909916 -5370922
39131 -5370922 -5244553 -5579497 -6264020 -7132164 -7946246 -8382115 -8182057 -7361328 -6210948
39122 -6210948 -5079028 -4173868 -3533479 -3061297 -2543255 -1727469 -488681 1084689 2758940
39113 2758940 4222937 5080421 4963803 3843500 2186276 668626 -268079 -540262 -258635
39104 -258635 347872 916427 1130828 993309 765496 624513 554632 575092 807604 1212798
39094 1212798 1493939 1418504 1051098 520569 -232186 -1255202 -2310066 -3080740 -3587874
39085 -3587874 -4142619 -4913938 -5755817 -6429635 -6762071 -6586508 -5791355 -4518552 -3130504
39076 -3130504 -1889524 -820042 25920 319468 -371505 -2168276 -4671241 -7126112 -8842952
$$ packed form
39140a869128j130529j346471j216385q92773n01027m1049M20531O66915N38994
39131e370922J26369l34944o84523q68144q14082m35869K00058Q20729J150380
39122f210948J131920R05160O40389M72182N18042Q15786J238788J573370J674251
39113B758940J463997Q57484j16618j120303j657224j517650r36705k72183K81627
39104b58635O06507N68555K14401j37519k27813j40983o9881K0460K32512M05194
39094A212798K81141p5435l67406n30529p52755j023016j054864p70674n07134
39085c587874n54745p71319q41879o73818l32436J75563P95153J272803J388048
39076c130504J240980J069482Q45962K93548o90973j796771k502965k454871j716840
$$ plain form
39067 -8842952 -9612397 -9786978 -9878418 -10036063 -9984436 -9450530 -8494815 -7375210 -6263997
39058 -6263997 -5252808 -4548418 -4474048 -5209027 -6555917 -7972651 -8851290 -8856496 -8095512
39049 -8095512 -6998126 -6020407 -5405979 -5098941 -4763352 -3928954 -2289553 46468 2624951
39040 2624951 4953028 6683622 7584301 7558862 6803515 5783466 4873343 4037820 2968098
39031 2968098 1521769 -55059 -1354700 -2209744 -2843440 -3611580 -4596680 -5502810 -5982506
39022 -5982506 -5985250 -5684208 -5143885 -4252727 -2985427 -1534162 -121074 1147499 2176461
39013 2176461 2834364 3146067 3377791 3783631 4397094 5204280 6344643 7918052 9716037
39004 9716037 11400249 12881621 14260367 15425477 16028195 15946097 15536893 15297239 15416168
$$ packed form
39067h842952p69445j74581r1440j57645N1627N33906R55715J119605J111213
39058f263997J011189P04390P4370p34979j346890j416734q78639n206P60984
39049h095512J097386R77719O14428L07038L35589Q34398J639401K336021K578483
39040B624951K328077J730594R00679k5439p55347j020049r10123q35523j069722
39031B968098j446329j576828j299641q55044o33696p68140r85100r06130m79696
39022e982506k744L01042N40323Q91158J267300J451265J413088J268573J028962
39013B176461O57903L11703K31724M05840O13463Q07186J140363J573409J797985
39004I716037J684212J481372J378746J165110O02718q2098m09204k39654J18929
$$ plain form
38995 15416168 15741157 15989946 15846758 15005242 13343007 11067617 8607336 6379936 4691008
38986 4691008 3724340 3482178 3771751 4371652 5204314 6258597 7366551 8175774 8397575
38977 8397575 8055443 7472133 7003534 6738063 6433735 5808533 4928127 4221026 4024416
38968 4024416 4185061 4234435 3930981 3499090 3331024 3588294 4130599 4691829 5018316 4916911
38958 4916911 4302313 3217276 1771732 88518 -1664884 -3266238 -4553239 -5523768
38950 -5523768 -6243561 -6685438 -6777669 -6632746 -6606252 -7014830 -7789166 -8446174 -8438672 -7597725
38940 -7597725 -6306425 -5217986 -4691007 -4456557 -3915141 -2801294 -1482924 -582927 -431036
38931 -431036 -952029 -1906124 -3012069 -3894569 -4172579 -3699962 -2618055 -1165380 425057
$$ packed form
38995A5416168L24989K48789j43188q41516j662235k275390k460281k227400j688928
38986D691008r66668k42162K89573N99901Q32662J054283J107954Q09223K21801
38977H397575l42132n83310m68599k65471l04328o25202q80406p07101j96610
38968D024416J60645M9374l03454m31891j68066K57270N42305N61230L26487j01405
38958D916911o14598j085037j445544j683214j753402j601354j287001r70529
38950e523768p19793m41877r2231J44923K6494m08578p74336o57008P502Q40947
38940g597725J291300J088439N26979K34450N41416J113847J318370Q99997J51891
38931d31036n20993r54095j105945q82500k78010M72617J081907J452675J590437
$$ plain form
38922 425057 1864728 2910130 3657342 4539223 5832955 7278805 8367281 8919238 9193918
38913 9193918 9486745 9836476 10127228 10276090 10266285 10140505 10010520 9964780 9957763 9916015
38903 9916015 9934766 10178877 10563427 10749998 10538801 10040018 9325101 8153517 6309793
38894 6309793 4089262 2174017 1038667 654524 703733 832787 717129 186608 -568484
38885 -568484 -1078459 -994432 -319794 752178 2020620 3229490 4087829 4529814 4792891
38876 4792891 5030745 4978547 4257427 2966159 1724234 1098290 1164216 1635371 2188276
38867 2188276 2568626 2576990 2144775 1401750 599255 -7664 -234839 -97413 60479 -265104
38857 -265104 -1254572 -2487509 -3265108 -3187049 -2359397 -1164449 -9847 753302 929409
$$ packed form
38922D25057J439671J045402P47212Q81881J293732J445850J088476N51957K74680
38913I193918K92827L49731K90752J48862r805j25780j29985m5740p017m1748
38903I916015J8751K44111L84550J86571k11197m98783p14917j171584j843724
38894F309793k220531j915245j135350l84143M9209J29054j15658n30521p55092
38885e68484n09975Q4027O74638J071972J268442J208870Q58339M41985K63077
38876D792891K37854n2198p21120j291268j241925o25944O5926M71155N52905
38867B188276L80350Q364m32215p43025q02495o06919k27175J37426J57892l25583
38857b65104r89468j232937p77599P8059Q27652J194948J154602P63149J76107
$$ plain form
38848 929409 654059 418697 837632 2351099 5038221 8523675 12005037 14535622 15492811
38839 15492811 14872961 13181954 11106122 9272353 8149075 7964173 8624213 9726784
38831 9726784 10688794 10939673 10141608 8362505 6051220 3764222 1848171 350920 -824254
38822 -824254 -1761612 -2538150 -3288522 -4148280 -5094224 -5887926 -6235314 -6011471 -5315303 -4335096
38812 -4335096 -3224308 -2102844 -1071749 -142233 799605 1860414 2978487 3969288 4722223
38803 4722223 5267032 5649245 5865136 5988597 6266859 6951250 7992925 8946496 9230610
38794 9230610 8565871 7251673 6026926 5569249 6048963 7154942 8506102 9924383 11289234
38785 11289234 12299552 12562892 11910714 10518624 8729252 6865152 5202522 3952475
$$ packed form
38848I29409k75350k35362M18935J513467K687122L485454L481362K530585R57189
38839A5492811o19850j691007k075832j833769j123278j84902O60040J102571
38831I726784R62010K50879p98065j779103k311285k286998j916051j497251j175174
38822h24254r37358p76538p50372q59758r45944p93702l47388K23843O96168R80207
38812d335096J110788J121464J031095R29516R41838J060809J118073R90801P52935
38803D722223N44809L82213K15891J23461K78262O84391J041675R53571K84114
38794I230610o64739j314198j224747m57677M79714J105979J351160J418281J364851
38785A1289234J010318K63340o52178j392090j789372j864100j662630j250047
$$ plain form
38777 3952475 3128888 2465759 1575143 253953 -1331146 -2719356 -3408196 -3119143 -1950307
38768 -1950307 -339006 1174386 2260641 2965376 3574601 4312143 5185690 6108813 7048670
38759 7048670 7915321 8328254 7675622 5555154 2169632 -1735153 -5301786 -7969926 -9634422
38750 -9634422 -10574985 -11245050 -12035174 -13165040 -14722984 -16663747 -18670658 -20119322 -20384632
38741 -20384632 -19288818 -17231832 -14895077 -12876206 -11559766 -11125154 -11472286 -12129510
38733 -12129510 -12411888 -11873780 -10691140 -9541316 -9010808 -9102004 -9348495 -9359141 -9132727
38724 -9132727 -8856844 -8590354 -8255706 -7802684 -7200885 -6332705 -5092933 -3630402 -2354979
38715 -2354979 -1632787 -1510060 -1712890 -1828231 -1519035 -737521 177944 701328 520675
$$ packed form
38777C952475q23587o63129q90616j321190j585099j388210o88840K89053J168836
38768a950307J611301J513392J086255P04735O09225P37542Q73547R23123R39857
38759G048670Q66651M12933o52632k120468l385522l904785l566633k668140j664496
38750i634422r40563o70065p90124j129866j557944j940763k006911j448664k65310
38741b0384632J095814K056986K336755K018871J316440M34612l47132o57224
38733a2129510k82378N38108J182640J149824N30508r1196k46491j0646K26414
38724i132727K75883K66490L34648M53022O01799Q68180J239772J462531J275423
38715b354979P22192J22727k02830j15341L09196P81514R15465N23384j80653
$$ plain form
38706 520675 -243499 -1221517 -2157197 -3082020 -4175662 -5471383 -6682024 -7346773 -7209865
38697 -7209865 -6453911 -5539262 -4874264 -4693411 -5124130 -6150838 -7487956 -8671071 -9388218
38688 -9388218 -9678497 -9798923 -9981879 -10303676 -10634235 -10665847 -10123140 -9018742 -7625800
38679 -7625800 -6199900 -4879218 -3875980 -3526766 -3969849 -4866995 -5585579 -5632986 -4921309
38670 -4921309 -3802303 -2947658 -2971086 -3901778 -5062614 -5617628 -5200560 -3950959 -2158855
38661 -2158855 -141479 1651152 2767253 3089131 2880267 2481966 2096916 1794755 1472258
38652 1472258 803921 -481374 -2170071 -3631614 -4436929 -4722645 -4818851 -4716953 -4114093
38643 -4114093 -2893129 -1390693 -235405 -16719 -1000609 -2980564 -5383859 -7594265
$$ packed form
38706E20675p64174r78018r35680r24823j093642j295721j210641o64749J36908
38697g209865P55954R14649O64998J80853m30719j026708j337118j183115p17147
38688i388218k90279j20426j82956l21797l30559l1612N42707J104398J392942
38679g625800J425900J320682J003238L49214m43083q97146p18584m7407P11677
38670d921309J119006Q54645k3428r30692j160836n55014M17068J249601J792104
38661b158855K017376J792631J116101L21878k08864l98301l85050l02161l22497
38652A472258o68337j285295j688697j461543q05315k85716r6206J01898O02860
38643d114093J220964J502436J155288K18686r83890j979955k403295k210406
$$ plain form
38635 -7594265 -9174370 -9818590 -9301673 -7649292 -5279207 -2813326 -773979 453038
38627 453038 497027 -887417 -3525834 -6793043 -9965730 -12557254 -14321283 -15090896 -14760421
38618 -14760421 -13437222 -11563315 -9843729 -8973308 -9306880 -10692499 -12574433 -14259756
38610 -14259756 -15188854 -15149592 -14370376 -13363368 -12570704 -12152359 -12120917 -12545315 -13461101
38601 -13461101 -14630718 -15587865 -15978274 -15757603 -15050391 -13968772 -12632545 -11221355 -9875855
38592 -9875855 -8602312 -7355630 -6152025 -5020614 -3927898 -2881055 -2066524 -1734970
38584 -1734970 -1913940 -2328884 -2639518 -2677299 -2436221 -1949967 -1265112 -460006 423968 1450760
38574 1450760 2690607 4046857 5271416 6181683 6788164 7171634 7313873 7117366 6535635
$$ packed form
38635g594265j580105o44220N16917J652381K370085K465881K039347J227017
38627D53038M3989j384444k638417l267209l172687k591524j764029p69613L30475
38618a4760421J323199J873907J719586Q70421l33572j385619j881934j685323
38610a4259756r29098L9262P79216J007008P92664M18345L1442m24398r15786
38601a3461101j169617r57147l90409K20671P07212J081619J336227J411190J345500
38592i875855J273543J246682J203605J131411J092716J046843Q14531L31554
38584a734970j78970m14944l10634l7781K41078M86254O84855Q05106Q83974J026792
38574A450760J239847J356250J224559R10267O06481L83470J42239j96507n81731
$$ plain form
38565 6535635 5614061 4467766 3328965 2562202 2445698 2866211 3349443 3489904 3287070
38556 3287070 2988163 2691215 2235164 1446121 341933 -945522 -2330206 -3748091 -5003787
38547 -5003787 -5751304 -5717912 -4972143 -3927923 -3024551 -2405244 -1961174 -1665368 -1736759 -2418023
38537 -2418023 -3696452 -5329962 -7043465 -8561026 -9524540 -9597904 -8722450 -7187599 -5455812
38528 -5455812 -4021126 -3374796 -3839176 -5285328 -7154702 -8923068 -10484535 -11974518
38520 -11974518 -13328340 -14229297 -14508202 -14415550 -14389813 -14610840 -14843444 -14694280 -13990368
38511 -13990368 -12932862 -11910678 -11143159 -10461031 -9416857 -7638567 -5158515 -2484796
38503 -2484796 -341428 789525 997779 849909 951611 1621060 2973779 5168420 8354853
$$ packed form
38565F535635r21574j146295j138801p66763j16504M20513M83232J40461k02834
38556C287070k98907k96948m56051p89043j104188j287455j384684j417885j255696
38547e003787p47517L3392P45769J044220R03372O19307M44070K95806p1391o81264
38537b418023j278429j633510j713503j517561r63514p3364Q75454J534851J731787
38528e455812J434686O46330m64380j446152j869374j768366j561467j489983
38520a1974518j353822r00957k78905R2652K5737k21027k32604J49164P03912
38511a3990368J057506J022184P67519O82128J044174J778290K480052K673719
38503b484796K143368J130953K08254j47870J01702O69449J352719K194641L186433
$$ plain form
38494 8354853 12311561 16248755 19116863 20189116 19400913 17210986 14211859 10870975
38486 10870975 7543776 4577407 2282123 807081 136904 239352 1120359 2652138
38478 2652138 4422142 5904832 6841678 7417838 8062470 9095450 10487709 11816727 12441569
38469 12441569 11893551 10240974 8032613 5789250 3571074 1100603 -1767008 -4838509
38461 -4838509 -7821919 -10575176 -13007154 -14856942 -15759977 -15558088 -14442507 -12757672
38453 -12757672 -10733003 -8431062 -5883231 -3228916 -775823 1038797 1829057 1515655
38445 1515655 423013 -899569 -1941871 -2363573 -2053624 -1231331 -409200 -21792 -21699 20274
38435 20274 359922 762654 814093 400252 -254835 -926445 -1591652 -2312288 -3045223 -3591231
$$ packed form
38494H354853L956708L937194K868108J072253p88203k189927k999127l340884
38486A0870975l327199k966369k295284j475042o70177J02448Q81007J531779
38478B652138J770004J482690R36846N76160O44632J032980J392259J329018O24842
38469A2441569n48018j652577k208361k243363k218176k470471k867611l071501
38461d838509k983410k753257k431978j849788r03035K01889J115581J684835
38453a2757672K024669K301941K547831K654315K453093J814620P90260l13402
38445A515655j092642j322582j042302m21702L09949Q22293Q22131L87408R3M1973
38435B0274L39648M02732N1439m13841o55087o71610o65207p20636p32935n46008
$$ plain form
38425 -3591231 -3684468 -3179958 -2236893 -1276582 -665836 -464766 -542329 -836209 -1338303 -1873934
38415 -1873934 -2106001 -1827057 -1145243 -371630 152333 132041 -543315 -1593237 -2389513
38406 -2389513 -2377139 -1487805 -145414 1057925 1691457 1660916 1187295 557800 -169688
38397 -169688 -1143662 -2356257 -3433402 -3906341 -3616138 -2762411 -1677962 -702575 -147750
38388 -147750 -133238 -475783 -975301 -1838393 -3558597 -6233154 -9175311 -11389603 -12354019
38379 -12354019 -12210659 -11330131 -9967242 -8373944 -6972750 -6162977 -5954678 -5918348 -5525928
38370 -5525928 -4485901 -2772100 -482501 2200355 4951241 7340218 8980571 9601750
38362 9601750 9012337 7156924 4338374 1325444 -931503 -1827358 -1433191 -376478 619549
$$ packed form
38425c591231r3237N04510R43065R60311O10746K01070p7563k93880n02094n35631
38415a873934k32067K78944O81814P73613N23963k0292o75356j049922p96276
38406b389513J2374Q89334J342391J203339O33532l0541m73621o29495p27488
38397a69688r73974j212595j077145m72939K90203Q53727J084449R75387N54825
38388a47750J4512l42545m99518q63092j720204k674557k942157k214292r64416
38379a2354019J43360Q80528J362889J593298J401194Q09773K08299L6330L92420
38370e525928J040027J713801K289599K682856K750886K388977J640353O21179
38362I601750n89413j855413k818550l012930k256947q95855L94167J056713R96027
$$ plain form
38353 619549 1229286 1715744 2623114 4171652 5932323 7154298 7402428 6818847 5834084
38344 5834084 4802555 3950772 3469550 3449695 3753155 4095734 4292905 4348593 4296614 4076272
38334 4076272 3671787 3336261 3526462 4494348 5956973 7286625 8104717 8647053 9478915
$$ packed form
38353F19549O09737M86458R07370J548538J760671J221975K48130n83581r84763
38344E834084j031529q51783m81222j9855L03460L42579J97171N5688n1979k20342
38334D076272m04485l35526J90201R67886J462625J329652Q18092N42336Q31862
$$ [...]
##END NTUPLES=NMR SPECTRUM
##END=
