##TITLE=31Pdec_LR-773-C1M
 CDCl3 
  24 sc
 26.10.2023
##JCAMPDX= 6.0         $$ Bruker NMR JCAMP-DX V2.0
##DATA TYPE= NMR SPECTRUM
##DATA CLASS= NTUPLES
##ORIGIN= UXNMR, Bruker Analytische Messtechnik GmbH
##OWNER= root
$$ XWIN-NMR		Version 3.5
$$ Thu Oct 26 14:01:51 2023 Russian Standard Time (UT+4h)  she@DPX200
##.OBSERVE FREQUENCY= 81.013821
##.OBSERVE NUCLEUS= ^31P
##.ACQUISITION MODE= SIMULTANEOUS
##.ACQUISITION SCHEME= undefined
##.AVERAGES= 24
##.DIGITISER RES= 16
##SPECTROMETER/DATA SYSTEM= spect
##.PULSE SEQUENCE= zgpg30
##.SOLVENT NAME= CDCl3
##.SHIFT REFERENCE= (INTERNAL, CDCl3, 0, 248.564)
##AUDIT TRAIL= $$ (NUMBER, WHEN, WHO, WHERE, WHAT)
$$ ##TITLE= Audit trail, XWIN-NMR		Version 3.5
$$ ##JCAMPDX= 5.01
$$ ##ORIGIN= Bruker BioSpin GmbH
$$ ##OWNER= she
$$ F:/spectra/data/she/nmr/P31/1/pdata/1/auditp.txt
$$ ##AUDIT TRAIL=  $$ (NUMBER, WHEN, WHO, WHERE, WHAT)
(   1,<2023-10-26 14:01:00.56 +0400>,<she>,<DPX200>,
      <created by zg, POWCHK disabled, PULCHK disabled
       configuration hash MD5:
       00 E9 B6 7A A2 85 ED C7 34 08 36 98 17 FE 4E 26
       data hash MD5: 32K
       0F 0F F5 33 3B 33 41 C8 53 32 20 F9 E4 C7 BA D5>)
(   2,<2023-10-26 14:01:02.79 +0400>,<she>,<DPX200>,
      <Start of raw data processing
       efp BC_mod = 2 LB = 5 FT_mod = 6 PKNL = 1 PHC0 = -10625.02 PHC1 = 40.08972 SI = 64K 
       data hash MD5: 64K
       22 3D 9B 96 7F CE BD F5 2A FE 89 47 08 BC BA F2>)
(   3,<2023-10-26 14:01:17.64 +0400>,<she>,<DPX200>,
      <pk PHC0 = -8.092837 PHC1 = 0 
       data hash MD5: 64K
       7C 33 DD F4 3B E9 C2 22 9A 28 18 40 7C 23 EB 2A>)
(   4,<2023-10-26 14:01:28.25 +0400>,<she>,<DPX200>,
      <abs ABSG = 5 
       data hash MD5: 64K
       D2 C2 88 5D 3E 7E 25 BF CE 80 9A 83 92 FB 26 2A>)
$$ ##END=
$$ 
$$ hash MD5
$$ 84 16 C5 F8 67 5D A7 41 83 56 79 38 34 53 84 AA
##$RELAX= 
##$RELAX= 
##$RELAX= 
##$RELAX= 
##$RELAX= 
##$RELAX= 
##$RELAX= 
##$RELAX= 
##$RELAX= 
$$ Bruker specific parameters
$$ --------------------------
##$DU= <F:/spectra>
##$EXPNO= 1
##$NAME= <P31>
##$PROCNO= 1
##$TYPE= <nmr>
##$USER= <she>
##$AMP= (0..31)
100 100 100 100 100 100 100 100 100 100 100 100 100 100 100 100 100 100 
100 100 100 100 100 100 100 100 100 100 100 100 100 100 
##$AQSEQ= 0
##$AQ_mod= 1
##$AUNM= <au_zg>
##$AUTOPOS= <>
##$BF1= 81.014009
##$BF2= 200.13
##$BF3= 200.13
##$BF4= 200.13
##$BF5= 200.13
##$BF6= 200.13
##$BF7= 200.13
##$BF8= 200.13
##$BYTORDA= 1
##$CFDGTYP= 0
##$CFRGTYP= 5
##$CHEMSTR= <none>
##$CNST= (0..31)
1 1 145 1 1 1 1 1 1 1 1 1 1 1 1 1 1 1 1 1 1 1 1 1 1 1 1 1 1 1 1 1 
##$CPDPRG= <waltz16>
##$CPDPRG1= <>
##$CPDPRG2= <waltz16>
##$CPDPRG3= <>
##$CPDPRG4= <mlev>
##$CPDPRG5= <mlev>
##$CPDPRG6= <mlev>
##$CPDPRG7= <mlev>
##$CPDPRG8= <mlev>
##$CPDPRGB= <>
##$CPDPRGT= <>
##$D= (0..31)
0 1 0 0 0 0 0 0 0 0 0 0.03 2e-05 3e-06 0 0 0 0 0 0 0 0 0 0 0 0 0 0 0 0 
0 0 
##$DATE= 1698314459
##$DBL= (0..7)
120 120 120 11 120 120 24 19 
##$DBP= (0..7)
150 150 150 150 150 150 150 150 
##$DBP07= 0
##$DBPNAM0= <>
##$DBPNAM1= <>
$$ [...]
##$SUBNAM3= <"">
##$SUBNAM4= <"">
##$SUBNAM5= <"">
##$SUBNAM6= <"">
##$SUBNAM7= <"">
##$SUBNAM8= <"">
##$SUBNAM9= <"">
##$SW= 501.771253377433
##$SWIBOX= (0..15)
0 1 3 0 0 0 0 0 0 0 0 0 0 0 0 0 
##$SW_h= 40650.406504065
##$TD= 32768
##$TD0= 1
##$TE= 0
##$TE2= 300
##$TE3= 300
##$TEG= 300
##$TL= (0..7)
0 120 53 12 22 120 120 120 
##$TP= (0..7)
150 150 150 150 150 150 150 150 
##$TP07= 0
##$TPNAME0= <>
##$TPNAME1= <>
##$TPNAME2= <>
##$TPNAME3= <>
##$TPNAME4= <>
##$TPNAME5= <>
##$TPNAME6= <>
##$TPNAME7= <>
##$TPOAL= (0..7)
0.5 0.5 0.5 0.5 0.5 0.5 0.5 0.5 
##$TPOFFS= (0..7)
0 0 0 0 0 0 0 0 
##$TUNHIN= 0
##$TUNHOUT= 0
##$TUNXOUT= 0
##$USERA1= <user>
##$USERA2= <user>
##$USERA3= <user>
##$USERA4= <user>
##$USERA5= <user>
##$V9= 5
##$VALIST= <valist>
##$VCLIST= <CCCCCCCCCCCCCCC>
##$VD= 0
##$VDLIST= <DDDDDDDDDDDDDDD>
##$VPLIST= <PPPPPPPPPPPPPPP>
##$VTLIST= <TTTTTTTTTTTTTTT>
##$WBST= 1024
##$WBSW= 4
##$XGAIN= (0..3)
0 0 0 0 
##$XL= 0
##$YL= 0
##$YMAX_a= 6333
##$YMIN_a= -6071
##$ZGOPTNS= <>
##$ZL1= 120
##$ZL2= 120
##$ZL3= 120
##$ZL4= 120
##$ABSF1= 248.5645
##$ABSF2= -253.2056
##$ABSG= 5
##$ABSL= 3
##$ALPHA= 0
##$AQORDER= 0
##$ASSFAC= 0
##$ASSFACI= 0
##$ASSFACX= 0
##$ASSWID= 0
##$AUNMP= <proc_1d>
##$AZFE= 0.1
##$AZFW= 0.5
##$BCFW= 0
##$BC_mod= 2
##$BYTORDP= 0
##$COROFFS= 0
##$CY= -3
##$DATMOD= 1
##$DC= 0
##$DFILT= <>
##$DTYPP= 0
##$F1P= 0
##$F2P= 0
##$FCOR= 1
##$FTSIZE= 65536
##$FT_mod= 6
##$GAMMA= 0
##$GB= 0
##$INTBC= 1
##$INTSCL= 6.047779e-11
##$ISEN= 30
##$LB= 5
##$LEV0= 0
##$LPBIN= 0
##$MAXI= 10000
##$MC2= 0
##$MEAN= 0
##$ME_mod= 0
##$MI= 50
##$NCOEF= 0
##$NC_proc= -6
##$NLEV= 6
##$NOISF1= 182.463
##$NOISF2= 159.3651
##$NSP= 0
##$NTH_PI= 0
##$NZP= 0
##$OFFSET= 248.5645
##$PC= 4
##$PHC0= -10633.11
##$PHC1= 40.08972
##$PH_mod= 1
##$PKNL= yes
##$PPARMOD= 0
##$PSCAL= 0
##$PSIGN= 0
##$REVERSE= no
##$SF= 81.0140089999694
##$SI= 65536
##$SIGF1= 159.3651
##$SIGF2= -187.1042
##$SINO= 113.3802
##$SIOLD= 16384
##$SREGLST= <1H.CDCl3>
##$SSB= 0
##$STSI= 65536
##$STSR= 0
##$SW_p= 40650.406504065
##$SYMM= 0
##$S_DEV= 0
##$TDeff= 32768
##$TDoff= 0
##$TI= <>
##$TILT= no
##$TM1= 0
##$TM2= 0
##$TOPLEV= 0
##$USERP1= <user>
##$USERP2= <user>
##$USERP3= <user>
##$USERP4= <user>
##$USERP5= <user>
##$WDW= 1
##$XDIM= 65536
##$YMAX_p= 403742562
##$YMIN_p= -9114586
$$ End of Bruker specific parameters
$$ ---------------------------------
##NTUPLES= NMR SPECTRUM
##VAR_NAME=  FREQUENCY,     SPECTRUM/REAL,   SPECTRUM/IMAG
##SYMBOL=    X,             R,               I
##VAR_TYPE=  INDEPENDENT,   DEPENDENT,       DEPENDENT
##VAR_FORM=  AFFN,          ASDF,            ASDF
##VAR_DIM=   65536,         65536,           65536
##UNITS=     HZ,            ARBITRARY UNITS, ARBITRARY UNITS
##FACTOR=    0.620285442955139, 1,           1
##FIRST=     20137.2065510682, 0,            0
##LAST=      -20513.1999529968, 0,           0
##MIN=       -20513.1999529968, -9114586,    0
##MAX=       20137.2065510682, 403742562,    0
$$ Real data points
##PAGE= N=1
##DATA TABLE= (X++(R..R)), XYDATA
$$ [...]
$$ plain form
43346 17428 69145 121422 137369 80796 -43662 -187115 -289624 -318239 -281376 -214620 -153748
43335 -153748 -115432 -94719 -74656 -39618 12496 64431 87661 64438 7479 -43266 -47406 9769
43323 9769 115238 246407 385427 517078 622970 688465 717503 736019 775980 852103 948751
43312 948751 1026046 1043056 985019 874670 757309 673005 640176 657384 709491 768928 800692
43301 800692 778304 699301 583427 454361 322500 183220 29286 -136629 -303032 -462238
43291 -462238 -615246 -756419 -856477 -874051 -791981 -637096 -459134 -295590 -160868 -58058
43281 -58058 14192 64489 103881 134779 154824 174162 216087 291967 384149 463466 517889 553210
43269 553210 570208 556721 506924 437287 373549 324834 278138 220080 161498 138968 189477
$$ packed form
43346A7428N1717N2277J5947n6573j24458j43453j02509k8615L6863O6756O0872
43335a53748L8316K0713K0063L5038N2114N1935K3230k3223n6959n0745m140N7175
43323I769J05469J31169J39020J31651J05892O5495K9038J8516L9961P6123R6648
43312I48751P7295J7010n8037j10349j17361q4304l2829J7208N2107N9437L1764
43301H00692k2388p9003j15874j29066j31861j39280j53934j65915j66403j59206
43291d62238j53008j41173j00058j7574Q2070J54885J77962J63544J34722J02810
43281e8058P2250N0297L9392L0898K0045J9338M1925P5880R2182P9317N4423L5321
43269E53210J6998j3487m9797o9637o3738m8715m6696n8058n8582k2530N0509
$$ plain form
43258 189477 318105 487527 643387 755931 836833 911810 978569 998584 933524 786379
43248 786379 604529 446597 349952 324189 362532 450962 569561 694297 803559 883737
43238 883737 928698 936362 908058 849410 767489 666124 548250 425358 318430 240090 175627
43227 175627 92330 -24593 -148705 -230208 -234805 -162907 -40579 94579 201089 246547 226541
43216 226541 166504 96153 22913 -66101 -180713 -312337 -437681 -529886 -569104 -553406 -503461
43205 -503461 -450249 -413160 -391133 -374580 -360564 -354080 -359090 -371877 -381055 -372382 -337189 -279300
43193 -279300 -212249 -148873 -97129 -66115 -66495 -95186 -122280 -104422 -16723 130980 308969
43182 308969 491855 665750 820198 943356 1026444 1068538 1076617 1063634 1044224 1024742 993839
$$ packed form
43258A89477J28628J69422J55860J12544Q0902P4977O6759K0015o5060j47145
43248G86379j81850j57932r6645k5763L8343Q8430J18599J24736J09262Q0178
43238H83737M4961P664k8304n8648q1921j01365j17874j22892j06928p8340o4463
43227A75627q3297j16923j24112q1503m597P1898J22328J35158J06510M5458k0006
43216B26541o0037p0351p3240q9014j14612j31624j25344r2205l9218J5698M9945
43205e03461N3212L7089K2027J6553J4016O484n010j2787r178Q673L5193N7889
43193b79300O7051O3376N1744L1014l80k8691k7094J7858Q7699J47703J77989
43182C08969J82886J73895J54448J23158Q3088M2094Q079j2983j9410j9482l0903
$$ plain form
43171 993839 927370 809324 650999 489587 365803 297082 265036 226802 144086 8156
43161 8156 -159306 -325330 -460830 -541136 -547764 -483524 -382340 -290058 -229995 -192835 -161225
43150 -161225 -134681 -123841 -127417 -126138 -102073 -60371 -30397 -44600 -111065 -201845 -270318 -285528
43138 -285528 -250766 -187474 -105029 7167 158508 335714 506741 643311 737123 796446
43128 796446 830594 838643 812443 749673 661854 567121 475688 385482 292536 202004 126282 74303
43116 74303 45630 33825 31437 30314 20580 -5809 -48709 -97830 -137136 -149983 -122205 -48692
43104 -48692 55291 152090 202271 194499 152469 109408 79723 58537 41157 32326 37811 58267
43092 58267 95593 157135 245577 345826 425827 450951 399877 274662 102240 -76145 -224302
$$ packed form
43171I93839o6469j18046j58325j61412j23784o8721l2046l8234q2716j35930
43161H156j67462j66024j35500q0306o628O4240J01184R2282O0063L7160L1610
43150a61225K6544J0840l576J279K4065M1702K9974j4203o6465r0780o8473j5210
43138b85528L4762O3292Q2445J12196J51341J77206J71027J36570R3812N9323
43128G96446L4148Q049k6200o2770q7819r4733r1433r0206r2946r0532p5722n1979
43116G4303k8673j1805k388j123r734k6389m2900m9121l9306j2847K7778P3513
43104d8692J03983R6799N0181p772m2030m3061k9685k1186j7380q831N485K0456
43092E8267L7326O1542Q8442J00249Q0001K5124n1074j25215j72422j78385j48157
$$ plain form
43081 -224302 -324775 -376856 -387580 -370543 -351165 -363354 -431877 -553166 -691420 -794852 -822699
43070 -822699 -766292 -650700 -517312 -402320 -325575 -290119 -284846 -289245 -283861 -261355 -226851
43059 -226851 -187940 -149230 -119030 -115450 -157584 -248676 -370900 -497055 -604844 -681988 -725934
43048 -725934 -744165 -750552 -753434 -745482 -709150 -633678 -524592 -397077 -264677 -135514 -13174
43037 -13174 104599 225323 352980 478902 586536 667601 730129 787797 843283 883808 890233
43026 890233 847640 750590 606079 435777 272162 145808 72121 49871 72860 141318 258571
43015 258571 414654 574932 689375 717919 651039 509339 325939 129382 -59940 -223403
43005 -223403 -341387 -401250 -407809 -382617 -349770 -320993 -293205 -258454 -215134 -170281 -131498
$$ packed form
43081b24302j00473n2081j0724J7037J9378j2189o8523j21289j38254j03432k7847
43070h22699N6407J15592J33388J14992P6745L5456N273m399N384K2506L4504
43059b26851L8911L8710L0200L580m2134r1092j22224j26155j07789p7144m3946
43048g25934j8231o387k882P952L6332P5472J09086J27515J32400J29163J22340
43037a3174J17773J20724J27657J25922J07634Q1065O2528N7668N5486M0525O425
43026H90233m2593r7050j44511j70302j63615j26354p3687k2250K2989O8458J17253
43015B58571J56083J60278J14443K8544o6880j41700j83400j96557j89322j63463
43005b23403j17984n9863o559K5192L2847K8777K7788L4751M3320M4853L8783
$$ plain form
42994 -131498 -96404 -51930 11725 84979 140221 152379 116850 47119 -39038 -126161 -200561
42983 -200561 -254839 -294301 -330381 -364449 -384501 -380460 -355050 -314899 -259381 -187580 -111367 -49538
42971 -49538 -7887 25967 65245 109310 150664 189659 233946 284269 327650 348193 343347 327598
42959 327598 319701 326900 342852 360721 383910 418182 453114 458289 404939 293470 159251 51591
42947 51591 4711 21306 75685 131102 159840 154423 125989 95672 85894 111680 171912 247840
42935 247840 314256 353271 355707 313870 224501 103679 -10741 -83821 -111539 -118852 -132489
42924 -132489 -163908 -216443 -293386 -389216 -481271 -542966 -566170 -565792 -565901 -587518 -643435 -730394
42912 -730394 -824543 -897101 -940286 -968879 -991547 -992225 -950077 -869535 -777243 -692501 -612606 -524754
$$ packed form
42994a31498L5094M4474O3655P3254N5242J2158l5529o9731q6157q7123p4400
42983b00561n4278l9462l6080l4068k0052M041K5410M0151N5518P1801P6213O1829
42971d9538M1651L3854L9278M4065M1354L8995M4287N0323M3381K0543m846j5749
42959C27598p897P199J5952J7869K3189L4272L4932N175n3350j11469j34219j07660
42947E1591m6880J6595N4379N5417K8738n417k8434l0317r778K5786O0232P5928
42935B47840O6416L9015K436m1837q9369j20822j14420p3080k7718p313j3637
42924a32489l1419n2535p6943r5830r2055o1695k3204L78j09k1617n5917q6959
42912g30394r4149p2558m3185k8593k2668o78M2148Q0542R2292Q4742P9895Q7852
$$ plain form
42900 -524754 -418004 -282321 -112081 79840 260551 399459 489002 540944 573436 610859
42890 610859 683906 808181 959394 1084410 1144645 1142207 1102276 1043274 973560 906310 859965
42879 859965 841142 836063 822190 784577 722704 649726 586676 548821 531945 516073 486152 443927
42867 443927 395361 334175 249543 150272 71123 48245 88710 163308 224915 235894 189658
42856 189658 116248 65070 72170 136723 226362 303300 345927 351884 328501 282242 214462 126930
42844 126930 32743 -42667 -80348 -89974 -105733 -154151 -229739 -307397 -373341 -433855 -495012 -547201
42832 -547201 -577419 -588654 -595155 -599201 -583134 -529097 -441254 -344681 -267740 -231231 -249423 -329015
42820 -329015 -460430 -613548 -747799 -829410 -842390 -789135 -685046 -551822 -412820 -292097
$$ packed form
42900e24754J06750J35683J70240J91921J80711J38908Q9543N1942L2492L7423
42890F10859P3047J24275J51213J25016O0235k438l9931n9002o9714o7250m6345
42879H59965j8823n079j3873l7613o1873p2978o3050l7855j6876j5872k9921m2225
42867D43927m8566o1186q4632r9271p9149k2878M0465P4598O1607J0979m6236
42856A89658p3410n1178P100O4553Q9639P6938M2627N957k3383m6259o7780q7532
42844A26930r4187p5410l7681r626j5759m8418p5588p7658o5944o0514o1157n2189
42832e47201l0218j1235o501m046J6067N4037Q7843R6573P6941L6509j8192p9592
42820c29015j31415j53118j34251q1611j2980N3255J04089J33224J39002J20723
$$ plain form
42810 -292097 -212898 -189200 -214870 -265319 -315738 -358364 -400725 -450092 -502827 -544825 -556173
42799 -556173 -518426 -427329 -301294 -170577 -53961 50512 151986 253148 354581 462094
42789 462094 576457 677525 731169 718036 651454 564558 483430 413654 347116 276724 205303
42778 205303 142047 89823 37602 -29486 -110732 -184931 -228501 -235972 -220204 -197165 -177187 -168855
42766 -168855 -180047 -205888 -217718 -174861 -57269 111867 280812 408884 488308 527266 523898
42755 523898 471111 383242 298329 243494 208122 161953 92508 13325 -57729 -111511 -139843
42744 -139843 -134239 -103156 -80699 -106160 -195040 -331859 -483901 -616574 -704394 -740414 -737256
42733 -737256 -714560 -686936 -666902 -671015 -708968 -764548 -798050 -774672 -688773 -560802 -418657
$$ packed form
42810b92097P9199K3698k5670n0449n0419m2626m2361m9367n2735m1998j1348
42799e56173L7747R1097J26035J30717J16616J04473J01474J01162J01433J07513
42789D62094J14363J01068N3644j3133o6582q6896q1128o9776o6538p0392p1421
42778B05303o3256n2224n2221o7088q1246p4199m3570p471J5768K3039J9978Q332
42766a68855j1192k5841j1830M2857J17592J69136J68945J28072P9424L8958l368
42755E23898n2787q7869q4913n4835l5372m6169o9445p9183p1054n3782k8332
42744a39843N604L1083K2457k5461q8880j36819j52042j32673q7820l6020L158
42733g37256K2696K7624K0034m113l7953n5580l3502K3378Q5899J27971J42145
$$ plain form
42722 -418657 -286980 -188039 -141733 -157982 -226514 -313509 -372881 -371354 -311164 -229393 -172249
42711 -172249 -167047 -213556 -293060 -379708 -446502 -469511 -433814 -340008 -208099 -74754 19064
42700 19064 46025 5002 -79143 -166843 -221043 -225418 -194646 -167230 -184161 -269322 -420583 -606302
42688 -606302 -766323 -830600 -758084 -567734 -329119 -117999 23050 90243 99503 69503 20065
42677 20065 -22037 -26427 21444 100819 164028 176185 147477 119005 117849 136921 160511 193481
42665 193481 251394 328964 394732 419675 400951 354454 293663 222847 145733 72521 17233
42654 17233 -9529 -6730 15166 38834 48650 34444 -11931 -96784 -213946 -334963 -418283 -434776
42642 -434776 -385651 -297536 -205466 -141100 -126082 -161795 -221936 -264781 -262079 -216078 -146367 -65362
$$ packed form
42722d18657J31677R8941M6306j6249o8532q6995n9372J527O0190Q1771N7144
42711a72249N202m6509p9504q6648o6794k3009L5697R3806J31909J33345R3818
42700A9064K6961m1023q4145q7700n4200m375L0772K7416j6931q5161j51261j85719
42688f06302j60021o4277P2516J90350K38615K11120J41049O7193R260l0000m9438
42677B0065m2102m390M7871P9375O3209J2157k8708k8472j156J9072K3590L2970
42665A93481N7913P7570O5768K4943j8724m6497o0791p0816p7114p3212n5288
42654A7233k6762K799K1896K3668R816j4206m6375q4853j17162j21017q3320j6493
42642d34776M9125Q8115R2070O4366J5018l5713o0141m2845K702M6001O9711Q1005
$$ plain form
42630 -65362 26559 125869 218448 292942 354856 419880 494837 570193 629864 662328 660760 618002
42618 618002 528765 401559 269582 185071 192021 294334 448975 594905 692468 737627 745843
42607 745843 732063 706750 679492 655344 629081 591478 543310 496949 460275 423715 369927
42596 369927 295899 219529 162305 130393 116043 111282 110559 100537 59675 -22293 -127347 -219898
42584 -219898 -277021 -306631 -338144 -399144 -498113 -621641 -745381 -851485 -937019 -1002831 -1036088
42573 -1036088 -1012105 -917550 -766926 -592323 -421336 -268390 -140102 -38313 42493 113048
42563 113048 181657 251708 325624 404536 481821 543221 579684 599753 625677 674461 738952
42552 738952 783868 763876 657764 494441 341647 256415 237715 227248 159736 16084 -165972
$$ packed form
42630f5362R1921R9310R2579P4494O1914O5024P4957P5356N9671L2464j568m2758
42618F18002q9237j27206j31977q4511O950J02313J54641J45930R7563M5159Q216
42607G45843j3780k5313k7258k4148k6263l7603m8168m6361l6674l6560n3788
42596C69927p4028p6370n7224l1912j4350m761p23j0022m0862q1968j05054r2551
42584b19898n7123k9610l1513o1000r8969j23528j23740j06104q5534o5812l3257
42573a036088K3983R4555J50624J74603J70987J52946J28288J01789Q0806P0555
42563A13048O8609P0051P3916P8912P7285O1400L6463K0069K5924M8784O4491
42552G38952M4916j9992j06112j63323j52794q5232j8700j0467o7512j43652j82056
$$ plain form
42541 -165972 -325214 -420276 -451641 -454326 -470584 -519636 -585024 -631225 -635736 -605421 -563181 -525651
42529 -525651 -498523 -486066 -491601 -505435 -501788 -455186 -358186 -222245 -68658 76028 183239
42518 183239 233514 228224 187124 134140 86215 49831 20213 -14741 -62063 -114811 -161760 -205130
42506 -205130 -259589 -331182 -405717 -462835 -494704 -505124 -496337 -464752 -407214 -325047 -223591
42495 -223591 -113106 -7271 87051 178421 280972 392028 484720 529148 522136 494593 487736
42484 487736 518951 567745 595582 583226 552205 551694 624311 778727 983965 1183846 1325447
42473 1325447 1389262 1398033 1391003 1386016 1369678 1323216 1247696 1157963 1060317 948363 820502
42462 820502 691855 585081 514192 479248 471823 482726 508943 556827 634243 733985 827743
$$ packed form
42541a65972j59242r5062l1365k685j6258m9052o5388m6201m511L0315M2240L7530
42529e25651K7128J2457n535j3834L647M6602R7000J35941J53587J44686J07211
42518A83239N0275n290m1100n2984m7925l6384k9618l4954m7322n2748m6949m3370
42506b05130n4459p1593p4535n7118l1869j0420Q787L1585N7538Q2167J01456
42495b23591J10485J05835R4322R1370J02551J11056R2692M4428p012k7543o857
42484D87736L1215M8794K7837j2356l1021n11P2617J54416K05238J99881J41601
42473A325447O3815Q771p030m987j6338m6462p5520q9733r7646j11954j27861
42462H20502j28647j06774p0889l4944p425J0903K6217M7884P7416R9742R3758
$$ plain form
42451 827743 884236 895359 880188 862060 846759 825371 791550 747572 694408 624534 529690
42440 529690 412917 288460 169324 56431 -60106 -189430 -327833 -456162 -550710 -600514
42430 -600514 -615680 -617500 -619471 -618396 -602371 -562783 -497227 -408475 -310821 -235812 -216031 -250268
42418 -250268 -289173 -269108 -164968 -5280 161437 301937 398200 432947 396946 309210 213437
42407 213437 148674 130714 161182 238294 346615 444251 478436 425627 319516 238632 259805
42396 259805 410495 653505 911957 1110853 1204839 1184923 1074760 918324 753740 587687
42386 587687 398578 168467 -92547 -352597 -575807 -728344 -783347 -740647 -641196 -546239
42376 -546239 -495659 -492121 -524070 -589741 -690128 -808319 -912483 -985245 -1042948 -1116114 -1208835
$$ packed form
42451H27743N6493J1123j5171j8128j5301k1388l3821m3978n3164o9874r4844
42440E29690j16773j24457j19136j12893j16537j29324j38403j28329r4548m9804
42430f00514j5166j820j971J075J6025L9588O5556Q8752R7654P5009J9781l4237
42418b50268l8905K0065J04140J59688J66717J40500R6263L4747l6001q7736r5773
42407B13437o4763j7960L0468P7112J08321R7636L4185n2809j06111q0884K1173
42396B59805J50690K43010K58452J98896R3986j9916j10163j56436j64584j66053
42386E87687j89109k30111k61014k60050k23210j52537n5003M2700R9451R4957
42376e46239N0580L538l1949o5671j00387j18191j04164p2762n7703p3166r2721
$$ plain form
42365 -1208835 -1284083 -1294892 -1226390 -1101519 -952289 -799060 -654633 -525798 -399579 -246349
42355 -246349 -57319 127638 246924 269202 206585 86477 -65570 -215987 -324240 -369217
42345 -369217 -363174 -331189 -287447 -237196 -187568 -145920 -117649 -114206 -151480 -228829 -319463 -394617
42333 -394617 -450952 -503014 -555205 -593162 -598044 -559118 -479039 -379423 -295555 -250482 -235850 -229556
42321 -229556 -226777 -237758 -259820 -274174 -274280 -275289 -284160 -278193 -229843 -142055 -41438 57942
42309 57942 164954 283351 388953 443666 425454 338613 202458 42566 -106587 -205384
42299 -205384 -231690 -202544 -163816 -150736 -160548 -166513 -152217 -124891 -100317 -86365 -82000 -82529
42287 -82529 -83284 -86726 -108525 -165704 -250624 -323429 -340101 -287218 -185709 -67410 42504 124631
$$ packed form
42365a208835p5248j0809O8502J24871J49230J53229J44427J28835J26219J53230
42355b46349J89030J84957J19286K2278o2617j20108j52047j50417j08253m4977
42345c69217O043L1985M3742N0251M9628M1648K8271L443l7274p7349r0634p5154
42333c94617n6335n2062n2191l7957m882L8926Q0079R9616Q3868M5073J4632O294
42321b29556K779j0981k2062j4354j06j009q871N967M8350Q7788J00617R9380
42309E7942J07012J18397J05602N4713j8212q6841j36155j59892j49153r8797
42299b05384k6306K9146L8728J3080r812n965J4296K7326K4574J3952M365n29
42287h2529p55l442k1799n7179q4920p2805j6672N2883J01509J18299J09914Q2127
$$ plain form
42275 124631 162894 150925 95521 9189 -95911 -202463 -283714 -317221 -306057 -278497 -260213
42264 -260213 -250343 -230465 -192639 -148128 -108446 -70836 -30277 3965 17008 10133 226 -4405
42252 -4405 -15340 -45044 -86003 -118022 -131907 -136354 -140510 -135699 -98198 -10800 117346 252182
42240 252182 357916 419973 446248 452320 452947 463150 491270 523777 528107 481058 388642 270599
42228 270599 135240 -16765 -171339 -303954 -405180 -484703 -542701 -554417 -498221 -390573
42218 -390573 -277590 -193015 -134326 -77533 -3174 93223 202757 305553 375800 392973 352436
42207 352436 268072 167836 83909 37463 26619 32599 43546 72065 145197 275173 439798
42196 439798 589790 673913 660124 540305 325203 45019 -242134 -453854 -516878 -413078
$$ packed form
42275A24631L8263j1969n5404q6332j05100j06552q1251l3507J1164K7560J8284
42264b60213R870J9878L7826M4511L9682L7610M0559L4242J3043o875r907m631
42252d405j0935k9704m0959l2019j3885m447m156M811L7501Q7398J28146J34836
42240B52182J05734O2057K6275O072O27J0203K8120L2507M330m7049r2416j18043
42228B70599j35359j52005j54574j32615j01226p9523n7998j1716N6196J07648
42218c90573J12983Q4575N8689N6793P4359R6397J09534J02796P0247J7173m0537
42207C52436q4364j00236q3927m6446j0844N980J0947K8519P3132J29976J64625
42196D39798J49992Q4123j3789j19819k15102k80184k87153k11720o3024J03800
$$ plain form
42186 -413078 -195098 46719 235305 333810 342477 286747 206266 138778 103844 102340 129828
42175 129828 182398 248200 303578 325872 308040 258558 192819 128410 80646 51875 25433
42164 25433 -21715 -96180 -178836 -238245 -253312 -225373 -169788 -94791 8848 150754 314475
42153 314475 459301 554350 601919 620395 615332 580782 521294 454455 391698 331937 276175
42142 276175 233409 206723 186244 162866 138640 116834 91902 58490 24030 5767 21739
42131 21739 88089 210776 365451 493186 533626 465537 309155 96109 -147341 -388748
42121 -388748 -581455 -683286 -683881 -613425 -528946 -488112 -519409 -603544 -684927 -710920 -667229
42110 -667229 -579938 -487785 -413306 -355642 -304547 -257085 -219025 -191596 -162582 -115030 -42823
$$ packed form
42186d13078K17980K41817J88586R8505Q667n5730q0481o7488l4934j504K7488
42175A29828N2570O5802N5378K2294j7832m9482o5739o4409m7764k8771k6442
42164B5433m7148p4465q2656n9409j5067K7939N5585P4997J03639J41906J63721
42153C14475J44826R5049M7569J8476n063l4550n9488o6839o2757n9761n5762
42142B76175m2766k6686k0479k3378k4226k1806k4932l3412l4460j8263J5972
42131B1739O6350J22687J54675J27735M0440o8089j56382k13046k43450k41407
42121c88748j92707j01831n95P0456Q4479M0834l1297q4135q1383k5993M3691
42110f67229Q7291R2153P4479N7664N1095M7462L8060K7429K9014M7552P2207
$$ plain form
42099 -42823 46321 141557 237857 335019 432613 527052 612130 684526 750932 823870 902427 960348
42087 960348 964612 908995 822258 741454 684780 652813 646200 673653 745398 862154 1005523
42076 1005523 1136505 1212243 1213509 1153688 1056800 933331 785412 628820 495005 407711
42066 407711 365140 347369 335596 323831 320207 340652 394058 466479 522147 526802 474468 393827
42054 393827 328950 308286 323697 337522 315176 253303 174367 99089 36460 448 15448
42043 15448 87114 176139 222395 199703 135127 72900 33843 14971 11670 25425 58642 117988
42031 117988 219802 376643 575094 775934 938147 1036920 1063614 1026040 955084 895675
42021 895675 874993 880005 872783 826402 743784 649458 571693 528547 521114 538307 571782 624990
$$ packed form
42099d2823Q9144R5236R6300R7162R7594R4439Q5078P2396O6406P2938P8557N7921
42087I60348M264n5617q6737q0804n6674l1967o613K7453P1745J16756J43369
42076A005523J30982P5738J266n9821r6888j23469j47919j56592j33815q7294
42066D07711m2571j7771j1773j1765l624K0445N3406P2421N5668M655n2334q0641
42054C93827o4877k0664J5411J3825k2346o1873p8936p5278o2629l6012J5000
42043A5448P1666Q9025M6256k2692o4576o2227l9057j8872l301J3755L3217N9346
42031A17988J01814J56841J98451K00840J62213R8773K6694l7574p0956n9409
42021H95675k0682N012p222m6381q2618r4326p7765m3146p433J7193L3475N3208
$$ plain form
42009 624990 705162 811148 934230 1066232 1200157 1327060 1439636 1534330 1600602 1612406
41999 1612406 1543370 1391990 1183670 950380 720671 528039 409457 383204 434543 529473
41989 529473 637009 737059 820037 888549 952227 1012909 1059669 1081255 1073163 1028114 935426
41978 935426 802724 665957 560778 490586 437601 397250 382132 396561 429003 470460 519523
41967 519523 565940 590832 591992 590741 603262 621772 635658 653847 688734 730969 760718 777038
41955 777038 796576 827058 861380 896108 933495 959516 940295 855149 724392 593772 497053
41944 497053 441193 418783 419850 431751 441420 446138 458013 492414 553973 637941 740716 857248
41932 857248 963782 1016136 983036 882673 771621 690412 630155 558657 463994 357195 245311
$$ packed form
42009F24990Q0172J05986J23082J32002J33925J26903J12576R4694O6272J1804
41999A612406o9036j51380k08320k33290k29709j92632j18582k6253N1339R4930
41989E29473J07536J00050Q2978O8512O3678O0682M6760K1586q092m5049r2688
41978I35426j32702j36767j05179p0192n2985m0351j5118J4429L2442M1457M9063
41967E19523M6417K4892J160j251J2521J8510J3886J8189L4887M2235K9749J6320
41955G77038J9538L0482L4322L4728L7387K6021j9221q5146j30757j30620r6719
41944D97053n5860k2410J067J1901R669M718J1875L4401O1559Q3968J02775J16532
41932H57248J06534N2354l3100j00363j11052q1209o0257p1498r4663j06799j11884
$$ plain form
41921 245311 128543 24128 -34327 -34901 -6700 15826 35602 79691 149070 205989 219493
41910 219493 207587 220422 287509 392936 500694 593107 680881 783157 903436 1019826
41900 1019826 1091999 1082621 985423 837464 695843 594854 527959 471640 414916 356406 284684
41889 284684 183452 59617 -49443 -105522 -99475 -48133 28247 117997 215163 313831 402867
41878 402867 462294 471066 426126 351671 284456 250090 251705 271320 276309 233966 132346 -12638
41866 -12638 -174102 -332963 -475545 -582330 -632973 -623066 -569015 -497296 -432051 -384475 -342710
41855 -342710 -276693 -166765 -28407 100725 196818 262464 306577 328885 329750 321319 318072 321087
41843 321087 317022 288281 222356 119496 -3167 -119776 -211569 -271473 -295525 -281559 -240373
$$ packed form
41921B45311j16768j04415n8455n74K8201K2526J9776M4089O9379N6919J3504
41910B19493j1906J2835O7087J05427J07758R2413Q7774J02276J20279J16390
41900A019826P2173r378r7198j47959j41621j00989o6895n6319n6724n8510p1722
41889B84684j01232j23835j09060n6079O047N1342P6380Q9750R7166R8668Q9036
41878D02867N9427Q772m4940p4455o7215l4366J615J9615M989m2343j01620j44984
41866a2638j61464j58861j42582j06785n0643R907N4051P1719O5245M7576M1765
41855c42710O6017J09928J38358J29132R6093O5646M4113K2308Q65q431l247L015
41843C21087m065k8741o5925j02860j22663j16609r1793n9904k4052J3966M1186
$$ plain form
41832 -240373 -196794 -170786 -163447 -167568 -183975 -218005 -264124 -303052 -313515 -283463 -215697 -130792
41820 -130792 -62643 -43541 -90637 -204459 -372316 -567843 -753932 -895801 -972793 -978344 -917339
41809 -917339 -809318 -685397 -570596 -471469 -387596 -328288 -305987 -316354 -337787 -351128 -349043
41798 -349043 -326385 -275862 -200058 -117430 -46493 12618 74545 148384 224740 281267 298373
41787 298373 272199 217362 159937 127243 138952 197335 278792 340310 347145 300370 235286 192785
41775 192785 194856 242981 327884 434680 543952 632995 674475 635452 489806 244032 -49209
41764 -49209 -313018 -490646 -572928 -585597 -554325 -485837 -381724 -261169 -157696 -90210 -46573
41753 -46573 -3633 42775 77892 93474 98484 102398 103226 102917 125508 203459 341077 497750
$$ packed form
41832b40373M3579K6008P339m121j6407l4030m6119l8928j0463L0052O7766Q4905
41820a30792O8149J9102m7096j13822j67857j95527j86089j41869p6992n551O1005
41809i17339J08021J23921J14801R9127Q3873N9308K2301j0367k1433j3341K085
41798c49043K2658N0523P5804Q2628P0937N9111O1927P3839P6356N6527J7106
41787B98373k6174n4837n7425l2694J1709N8383Q1457O1518O835m6775o5084m2501
41775A92785K071M8125Q4903J06796J09272Q9043M1480l9023j45646k45774k93241
41764d9209k63809j77628q2282j2669L1272O8488J04113J20555J03473O7486M3637
41753d6573M2940M6408L5117J5582N010L914Q28l09K2591P7951J37618J56673
$$ plain form
41741 497750 612935 648573 607612 514585 384663 218199 24661 -159886 -291246 -352685
41731 -352685 -364480 -358622 -352211 -345304 -333111 -314899 -298873 -302261 -336127 -382426 -396179 -343317
41719 -343317 -232788 -101524 26565 152366 275932 380868 455611 517125 595241 692191
41709 692191 768597 775262 696457 562238 424764 325634 277659 263969 249368 202730 123598
41698 123598 51052 37065 100456 204757 284040 292197 230144 133929 45664 -4670 -1780 54588
41686 54588 144398 227821 264749 244450 194784 154668 136866 124502 103237 83535 82824 96590
41674 96590 103841 100867 113567 166726 247227 306670 301192 226691 117867 17572 -52779 -97448
41662 -97448 -127563 -143700 -139637 -119755 -105004 -117015 -158110 -210544 -255540 -289970 -321553 -347901
$$ packed form
41741D97750J15185L5638m0961r3027j29922j66464j93538j84547j31360o1439
41731c52685j1795N858O411O907J2193J8212J6026l388l3866m6299j3753N2862
41719c43317J10529J31264J28089J25801J23566J04936P4743O1514P8116R6950
41709F92191P6406O665p8805j34219j37474r9130m7975j3690j4601m6638p9132
41698A23598p2546j3987O3391J04301P9283Q157o2053r6215q8265n0334K890N6368
41686E4588Q9810Q3423L6928k0299m9666m0116j7802j2364k1265j9702p11J3766
41674I6590P251k974J2700N3159Q0501N9443n478p4501j08824j00295p0351m4669
41662i7448l0115j6137M063J9882J4751j2011m1095n2434m4996l4430l1583k6348
$$ plain form
41650 -347901 -345094 -284290 -163571 -20608 90604 136104 116753 56555 -12828 -58814 -55786
41639 -55786 1244 92760 190371 274981 337047 366160 352380 301104 239351 199887 196938 217844
41627 217844 239553 254780 280746 336835 412145 463713 456522 402577 350413 335591 351129 367968
41615 367968 371832 371883 382388 407957 444389 484883 526238 575540 648014 749041 858642 943374
41603 943374 986970 1003246 1016409 1033725 1038735 1005549 918745 787028 642127 520242 440511
41592 440511 401565 393840 405194 415938 405543 375307 354854 372639 422635 470413 491026 492029
41580 492029 498990 525805 560269 573515 544171 480625 423293 422088 506024 665877 855194
41569 855194 1006993 1064846 1013370 878196 691409 465422 210803 -31443 -198198 -249408
$$ packed form
41650c47901K807O0804J20719J42963J11212M5500j9351o0198o9383m5986L028
41639e5786N7030R1516R7611Q4610O2066K9113j3780n1276o1753l9464k949K0906
41627B17844K1709J5227K5966N6089P5310N1568p191n3945n2164j4822J5538J6839
41615C67968L864N1J0505K5569L6432M0494M1355M9302P2474J01027J09601Q4732
41603I43374M3596J6276J3163J7316N010l3186q6804j31717j44901j21885p9731
41592D40511l8946p725J1354J0744j0395l0236k0453J7785M9996M7778K0613J003
41580D92029O961K6815L4464J3246k9344o3546n7332j205Q3936J59853J89317
41569H55194J51799N7853n1476j35174j86787k25987k54619k42246j66755n1210
$$ plain form
41559 -249408 -192664 -62871 104714 275327 408581 472715 466130 417189 361698 319643 285227
41548 285227 233227 139831 3839 -152330 -301237 -424450 -510559 -552451 -553536 -529116 -495227
41537 -495227 -461256 -435337 -425097 -424717 -411095 -365279 -293933 -221147 -164525 -129453 -121506 -149697
41525 -149697 -214361 -299856 -381894 -438830 -459847 -451506 -436698 -437899 -455752 -465256 -433793 -343873
41513 -343873 -205049 -50473 81670 172785 233167 284387 333441 366538 364031 316156 228862
41502 228862 123886 32962 -17719 -23861 -4611 10705 -2866 -56607 -142541 -236007 -311388
41491 -311388 -360681 -396829 -438675 -491713 -540742 -562944 -555078 -547479 -579633 -657520 -747839 -821795
41479 -821795 -887328 -960045 -1016030 -1002985 -901018 -749243 -603896 -488137 -393505 -315088 -268721
$$ packed form
41559b49408N6744J29793J67585J70613J33254O4134o585m8941n5491m2055l4416
41548B85227n2000r3396j35992j56169j48907j23213q6109m1892j085K4420L3889
41537d95227L3971K5919J0240L80J3622M5816P1346P2786N6622L5072P947k8191
41525a49697o4664q5495q2038n6936k1017Q341J4808j201j7853r504L1463Q9920
41513c43873J38824J54576J32143R1115O0382N1220M9054L3097k507m7875q7294
41502B28862j04976r0924n0681o142J9250J5316j3571n3741q5934r3466p5381
41491c11388m9293l6148m1846n3038m9029k2202P866P599l2154p7887r0319p3956
41479h21795o5533p2717n5985J3045J01967J51775J45347J15759R4632P8417M6367
$$ plain form
41468 -268721 -278208 -356098 -494745 -669733 -852696 -1021895 -1157612 -1232867 -1223607 -1133100 -995741
41457 -995741 -851493 -725045 -630320 -575808 -551402 -522562 -456655 -353885 -240826 -135658
41447 -135658 -29912 97782 259714 448046 633732 775018 837183 810079 707313 554815
41437 554815 387548 249834 179880 184291 233008 284059 310083 300280 246472 139573 -15639
41426 -15639 -185415 -314399 -358739 -320267 -248176 -202211 -211007 -263011 -329088 -385639 -420260
41415 -420260 -429972 -422755 -415277 -419589 -430020 -426534 -392086 -325160 -235818 -132647 -14979 124670
41403 124670 292862 486821 687106 856912 954869 955857 861859 695361 489315 284548
41393 284548 121325 13428 -71111 -187665 -362609 -565716 -735923 -828883 -842105 -809991
$$ packed form
41468b68721r487p7890j38647j74988j82963j69199j35717p5255R260R0507J37359
41457i95741J44248J26448R4725N4512K4406K8840O5907J02770J13059J05168
41447a35658J05746J27694J61932J88332J85686J41286O2165k7104j02766j52498
41437E54815j67267j37714o9954M411M8717N1051K6024r803n3808j06899j55212
41426a5639j69776j28984m4340L8472P2091M5965q796n2004o6077n6551l4621
41415d20260r712P217P478m312j0431L486L4448O6926Q9342J03171J17668J39649
41403A24670J68192J93959K00285J69806R7957R88r3998j66498k06046k04767
41393B84548j63223j07897q4539j16554j74944k03107j70207r2960j3222L2114
$$ plain form
41383 -809991 -783580 -802350 -868150 -945114 -992828 -1000623 -988667 -983932 -1002393 -1045942 -1101831 -1144701
41371 -1144701 -1150056 -1109773 -1031258 -924416 -796192 -654822 -510138 -370220 -246215 -160453
41361 -160453 -140633 -201445 -332486 -498866 -647758 -724349 -701463 -599562 -467551 -340480
41351 -340480 -224297 -119678 -41309 -3434 -52 -13143 -32278 -52772 -61169 -40332 8165
41340 8165 57951 78440 55885 -5787 -95282 -200146 -308759 -412593 -506755 -588624 -659538
41329 -659538 -727055 -797048 -857477 -875125 -818494 -686858 -512384 -332277 -163985 -9871
41319 -9871 123145 221540 283773 329371 381249 443551 503745 552630 593607 633992 677689 729101
41307 729101 794313 869855 933006 950672 902146 796850 674223 584742 561312 601021 674932
$$ packed form
41383h09991K6411j8770o5800p6964m7714p795J1956M735j8461m3549n5889m2870
41371a144701n355M0283P8515J06842J28224J41370J44684J39918J24005Q5762
41361a60453J9820o0812j31041j66380j48892p6591K2886J01901J32011J27071
41351c40480J16183J04619P8369L7875L382j3091j9135k0494q397K0837M8497
41340H165M9786K0489k2555o1672q9495j04864j08613j03834r4162q1869p0914
41329f59538o7517o9993o0429j7648N6631J31636J74474J80107J68292J54114
41319i871J33016R8395O2233M5598N1878O2302O0194M8885M0977M0385M3697N1412
41307G29101O5212P5542O3151J7666m8526j05296j22627q9481k3430L9709P3911
$$ plain form
41296 674932 756719 837837 914194 968614 978237 938203 868942 798060 741027 700184 672878 651754
41284 651754 619621 554008 444175 304791 170116 71039 15038 -12843 -30555 -41511 -34692
41273 -34692 1768 68432 151768 229117 278125 286728 256004 191754 94121 -40588 -206747
41262 -206747 -381771 -534467 -639976 -686559 -673313 -607624 -504784 -384538 -264741 -159935
41252 -159935 -86393 -62591 -96561 -170253 -241400 -268116 -235865 -160732 -66099 42325 176350
41241 176350 340961 514517 657817 743698 776893 788028 813891 880096 986741 1098401
41231 1098401 1156503 1121696 1010665 880586 772161 678608 576342 469680 385864 330955
41221 330955 271934 169806 19561 -147643 -291696 -386583 -426417 -421038 -387000 -339674 -294273
$$ packed form
41296F74932Q1787Q1118P6357N4420R623m0034o9261p0882n7033m0843k7306k1124
41284F51754l2133o5613j09833j39384j34675r9077n6001k7881j7712j0956O819
41273c4692L6460O6664Q3336P7349M9008Q603l0724o4250r7633j34709j66159
41262b06747j75024j52696j05509m6583J3246O5689J02840J20246J19797J04806
41252a59935P3542K3802l3970p3692p1147k6716L2251P5133R4633J08424J34025
41241A76350J64611J73556J43300Q5881L3195J1135K5863O6205J06645J11660
41231A098401N8102l4807j11031j30079j08425r3553j02266j06662q3816n4909
41221C30955n9021j02128j50245j67204j44053r4887l9834N379L4038M7326M5401
$$ plain form
41210 -294273 -271374 -291726 -361498 -469500 -601395 -745787 -879920 -964160 -970139 -913247 -841704
41199 -841704 -788906 -744013 -667705 -524405 -299446 -4481 320645 622046 864521 1050747
41189 1050747 1201011 1318873 1388072 1400859 1375157 1339549 1311704 1296437 1293082 1292181 1269155
41178 1269155 1195351 1061442 886733 704687 542604 412677 312075 225211 131211 18199
41168 18199 -106914 -223369 -308980 -346875 -327767 -256831 -160071 -74628 -24581 -6237 1245
41157 1245 14451 38569 77505 141943 242132 374020 515475 636708 713773 733497 690766
41146 690766 587981 440123 276627 132557 36165 4711 46562 158543 320591 502201
41136 502201 680567 848861 1003568 1130541 1211441 1239703 1220177 1153726 1033610 863510
$$ packed form
41210b94273K2899k0352o9772j08002j31895j44392j34133q4240n979N6892P1543
41199h41704N2798M4893P6308J43300K24959K94965L25126L01401K42475J86226
41189A050747J50264J17862O9199J2787k5702l5608k7845j5267l355r01k3026
41178A269155p3804j33909j74709j82046j62083j29927j00602q6864r4000j13012
41168A8199j25113j16455q5611l7895J9108P0936R6760Q5443N0047J8344P482
41157A245J3206K4118L8936O4438J00189J31888J41455J21233P7065J9724m2731
41146F90766j02785j47858j63496j44070r6392l1454M1851J11981J62048J81610
41136E02201J78366J68294J54707J26973Q0900K8262j9526o6451j20116j70100
$$ plain form
41126 863510 673910 513291 419324 394012 401418 391482 335307 242429 141726 47593 -45983
41115 -45983 -137047 -196233 -188600 -109999 9429 135493 253192 361981 462212 551995 628748
41104 628748 687418 721862 731353 720014 686657 622756 526515 412735 301470 201955 115783
41093 115783 50644 18045 15966 24931 28070 31246 59106 132067 245992 369005 457162 480114
41081 480114 438396 357526 265964 179516 102581 36566 -14559 -41863 -34713 5807 54853 74383
41069 74383 42926 -27810 -106011 -159451 -159177 -81480 72876 263422 432885 554035 647219
41058 647219 749472 875407 1011698 1138108 1242378 1317529 1354705 1343244 1277616 1165001
41048 1165001 1025997 885311 760873 662493 596080 560918 544445 532295 528844 557649 632869
$$ packed form
41126H63510j89600j60619r3967k5312P406r936n6175r2878j00703r4133r3576
41115d5983r1064n9186P633P8601J19428J26064J17699J08789J00231Q9783P6753
41104F28748N8670L4444R491j1339l3357o3901r6241j13780j11265r9515q6172
41093A15783o5139l2599k079Q965L139L176K7860P2961J13925J23013Q8157K2952
41081D80114m1718q0870r1562q6448p6935o6015n1125k7304P150M0520M9046J9530
41069G4383l1457p0736p8201n3440K74P7697J54356J90546J69463J21150R3184
41058F47219J02253J25935J36291J26410J04270P5151L7176j1461o5628j12615
41048A165001j39004j40686j24438r8380o6413l5162j6473j2150l451K8805P5220
$$ plain form
41037 632869 737442 839072 921720 989715 1045160 1076710 1073318 1037022 978001 908326 847205
41026 847205 821048 844698 903634 962275 988701 966808 891623 768026 618544 481381 389172
41015 389172 347737 337126 330758 311128 271504 210976 132564 44836 -38319 -102978 -141937 -154853
41003 -154853 -139195 -82967 26463 181791 347903 481506 560725 594447 605476 609299 607245
40992 607245 591726 553236 485392 387372 262186 114734 -43026 -184114 -270985 -275245 -194610
40981 -194610 -52448 113650 263427 366940 417635 429793 416155 372549 292257 188267
40971 188267 86372 -2547 -87876 -174163 -246127 -285777 -290941 -266879 -211745 -124366 -18694
40960 -18694 84630 177878 264913 344566 410719 467382 526085 584858 627204 650343 678534
$$ packed form
41037F32869J04573J01630Q2648O7995N5445L1550l392l6296n9021o9675o1121
41026H47205k6157K3650N8936N8641K6426k1893p5185j23597j49482j37163r2209
41015C89172m1435j0611o368j9630l9624o0528p8412q7728q3155o4659l8959j2916
41003a54853J5658N6228J09430J55328J66112J33603P9219L3722J1029L823k054
40992F07245j5519l8490o7844r8020j25186j47452j57760j41088q6871m260Q0635
40981a94610J42162J66098J49777J03513N0695J2158j3638m3606q0292j03990
40971A88267j01895q8919q5329q6287p1964l9650n164K4062N5134Q7379J05672
40960a8694J03324R3248Q7035P9653O6153N6663N8703N8773M2346K3139K8191
$$ plain form
40949 678534 733807 803375 852646 866307 859597 847522 819041 750965 639450 508882 392565
40938 392565 310481 262440 234513 210501 183301 159532 150372 153055 142373 88081 -12321 -118868
40926 -118868 -173526 -143760 -42227 94108 236808 374673 499525 598917 668927 727130
40916 727130 804276 921311 1075214 1244622 1406366 1548523 1672179 1782834 1880286 1957057
40906 1957057 2005270 2021235 2002702 1947907 1862953 1766195 1677457 1604010 1545318 1511214 1523030
40895 1523030 1589192 1687675 1783261 1860311 1931476 2017624 2128690 2261818 2403984 2529920
40885 2529920 2606683 2610486 2538532 2401888 2212573 1984477 1743996 1530650 1381467 1311766
40875 1311766 1306960 1331636 1352194 1357003 1355574 1359746 1372795 1399167 1452886 1543224 1655526 1759085
$$ packed form
40949F78534N5273O9568M9271J3661o710j2075k8481o8076j11515j30568j16317
40938C92565q2084m8041k7927k4012k7200k3769r160K683j0682n4292j00402j06547
40926a18868n4658K9766J01533J36335J42700J37865J24852R9392P0010N8203
40916G27130P7146J17035J53903J69408J61744J42157J23656J10655R7452P6771
40906A957057M8213J5965j8533n4795q4954r6758q8738p3447n8692l4104J1816
40895A523030O6162R8483R5586P7050P1165Q6148J11066J33128J42166J25936
40885B529920P6763L803p1954j36644j89315k28096k40481k13346j49183o9701
40875A311766m806K4676K0558M809j429M172J3049K6372N3719R0338J12302J03559
$$ plain form
40863 1759085 1834630 1883193 1907793 1901807 1863865 1812729 1773629 1752185 1731696 1696261 1649499
40852 1649499 1609835 1592553 1596669 1603622 1586189 1522478 1407141 1254728 1096335 969461 898412
40841 898412 874337 857864 811843 734748 657894 610069 589940 572435 534105 468868 386147
40830 386147 301257 226059 162384 101656 32995 -45548 -122309 -178634 -202079 -194355 -164723 -114383
40818 -114383 -31169 94509 247688 386501 464150 455488 370085 249317 149833 115902 154709
40807 154709 235928 317210 370631 389321 380735 360997 348629 352381 365106 376838 393213 432151
40795 432151 499206 572765 619277 622194 595479 572780 585043 642911 733777 834922 932313
40784 932313 1027510 1125651 1218675 1285103 1309910 1304703 1305901 1350257 1450554 1593487 1757630
$$ packed form
40863A759085P5545M8563K4600n986l7942n1136l9100k1444k0489l5435m6762
40852A649499l9664j7282M116O953j7433o3711j15337j52413j58393j26874p1049
40841H98412k4075j6473m6021p7095p6854m7825k0129j7505l8330o5237q2721
40830C86147q4890p5198o3675o0728o8661p8543p6761n6325k3445P724K9632N0340
40818a14383Q3214J25678J53179J38813P7649q662q5403j20768r9484l3931L8807
40807A54709Q1219Q1282N3421J8690q586j9738j2368L752J2725J1732J6375L8938
40795D32151O7055P3559M6512K917k6715k2699J2263N7868R0866J01145R7391
40784I32313R5197R8141R3024O6428K4807n207J198M4356J00297J42933J64143
$$ plain form
40773 1757630 1929936 2107129 2289008 2474856 2661058 2834512 2968583 3031760 3003626 2882988
40763 2882988 2685240 2438057 2176840 1932850 1719225 1532693 1372674 1253721 1193267 1190090
40753 1190090 1221362 1260437 1292178 1310991 1311841 1290298 1251551 1215213 1207967 1249571 1343302 1476116
40741 1476116 1625902 1771731 1904204 2030581 2167475 2323370 2486871 2634007 2747116
40732 2747116 2825568 2880760 2925562 2968368 3011533 3051656 3081981 3094278 3075930 3006996 2867557
40721 2867557 2653566 2385292 2099646 1835251 1621468 1472055 1382421 1334865 1310955 1300109
40711 1300109 1298204 1303977 1320276 1354566 1412512 1490810 1577961 1660827 1729705 1780657 1816682 1846682
40699 1846682 1882003 1931748 1994317 2046058 2042878 1949024 1773287 1571225 1405761 1308715 1279527
$$ packed form
40773A757630J72306J77193J81879J85848J86202J73454J34071O3177k8134j20638
40763B882988j97748k47183k61217k43990k13625j86532j60019j18953o0454l177
40753A190090L1272L9075L1741J8813Q50k1543l8747l6338p246M1604R3731J32814
40741A476116J49786J45829J32473J26377J36894J55895J63501J47136J13109
40732B747116P8452N5192M4802M2806M3165M0123L0325J2297j8348o8934j39439
40721B867557k13991k68274k85646k64395k13783j49413q9634m7556k3910j0846
40711A300109j905N773J6299L4290N7946P8298Q7151Q2866O8878N0952L6025L0000
40699A846682L5321M9745O2569N1741l180r3854j75737k02062j65464r7046k9188
$$ plain form
40688 1279527 1306322 1376402 1475836 1596434 1745579 1940244 2190666 2497340 2864668 3310324
40678 3310324 3856800 4511904 5253977 6038549 6830709 7629572 8434122 9163555 9633440
40669 9633440 9658614 9201751 8408071 7487852 6579382 5723681 4930152 4224245 3633670 3160459
40659 3160459 2782749 2475325 2222783 2021935 1879506 1803074 1786303 1802173 1816037 1810783
40649 1810783 1801542 1824409 1907356 2048615 2218887 2379902 2502530 2578566 2625596 2677742 2761323
40638 2761323 2875935 3000726 3114384 3203010 3256272 3272644 3273625 3304211 3413080 3630078 3952642
40627 3952642 4341897 4738624 5104778 5459615 5870477 6409760 7127683 8055507 9210452
40618 9210452 10589902 12162881 13838005 15394754 16463203 16669864 15893177 14381260
$$ packed form
40688A279527K6795P0080R9434J20598J49145J94665K50422L06674L67328M45656
40678C310324N46476O55104P42073P84572P92160P98863Q04550P29433M69885
40669I633440K5174m56863p93680r20219r08470q55701p93529p05907n90575m73211
40659C160459l77710l07424k52542k00848j42429p6432j6771J5870J3864n254
40649A810783r241K2867Q2947J41259J70272J61015J22628P6036M7030N2146Q3581
40638B761323J14612J24791J13658Q8626N3262J6372R81L0586J08869K16998L22564
40627C952642L89255L96727L66154L54837M10862N39283P17923R27824J154945
40618I210452J379450J572979J675124J556749J068449K06661p76687j511917
$$ plain form
40610 14381260 12582995 10856499 9337380 8025132 6906696 5979097 5217597 4576295
40602 4576295 4013509 3500082 3019670 2579539 2209240 1932323 1745677 1633296 1585522 1592804
40592 1592804 1635299 1696363 1779067 1893764 2032627 2167490 2268189 2312401 2284048 2179339
40582 2179339 2018944 1845236 1701668 1614036 1585924 1602484 1635514 1650527 1616833 1518155 1358979
40571 1358979 1161155 951276 750085 571954 425702 308506 206724 116327 59613 66298
40561 66298 136897 240039 348323 458913 571763 667189 721658 735362 729544 723844 728321
40550 728321 748032 777841 796386 782244 738592 692135 668378 677133 718957 791624 886849 989577
40538 989577 1084126 1157399 1199108 1206991 1191040 1166337 1145300 1144344 1189978 1300705 1461464 1631243
$$ packed form
40610A4381260j798265j726496j519119j312248j118436r27599p61500o41302
40602D576295n62786n13427m80412m40131l70299k76917j86646j12381m7774P282
40592A592804M2495O1064Q2704J14697J38863J34863J00699M4212k8353j04709
40582B179339j60395j73708j43568q7632k8112J6560L3030J5013l3694r8678j59176
40571A358979j97824k09879k01191j78131j46252j17196j01782r0397n6714O685
40561F6298P0599J03142J08284J10590J12850R5426N4469J3704n818n700M477
40550G28321J9711K9809J8545j4142m3652m6457k3757Q755M1824P2667R5225J02728
40538I89577R4549P3273M1709P883j5951k4703k1037r56M5634J10727J60759J69779
$$ plain form
40526 1631243 1781612 1916846 2052217 2186013 2302543 2393833 2467024 2532699 2592628 2637478
40516 2637478 2653739 2637272 2603977 2583198 2596629 2645005 2712564 2774379 2797796 2752870 2637082
40505 2637082 2487109 2355882 2277239 2254232 2269965 2295660 2294770 2241019 2141667 2034832 1960096
40494 1960096 1938133 1975103 2066400 2185969 2289798 2351700 2392166 2454439 2550394 2642747 2681903
40483 2681903 2647664 2553340 2426563 2297969 2197588 2144593 2136831 2155424 2179844 2197808 2207640
40472 2207640 2218312 2243319 2286297 2332671 2360171 2356999 2328566 2292856 2273935 2290166 2334745
40461 2334745 2369714 2353546 2280898 2190086 2129699 2121147 2148569 2172485 2151738 2066454 1931774
40450 1931774 1788006 1672056 1595685 1545549 1496553 1427686 1336827 1244399 1175357 1134669 1105976
$$ packed form
40526A631243J50369J35234J35371J33796J16530R1290P3191O5675N9929M4850
40516B637478J6261j6467l3295k0779J3431M8376O7559O1815K3417m4926j15788
40505B637082j49973j31227p8643k3007J5733K5695q90n3751r9352j06835p4736
40494A960096k1963L6970R1297J19569J03829O1902M0466O2273R5955R2353L9156
40483B681903l4239r4324j26777j28594j00381n2995p762J8593K4420J7964R832
40472B207640J0672K5007M2978M6374K7500l172k8433l5710j8921J6231M4579
40461B334745L4969j6168p2648r0812o0387q552K7422K3916k0747q5284j34680
40450A931774j43768j15950p6371n0136m8996o8867r0859r2428o9042m0688k8693
$$ plain form
40439 1105976 1072801 1029617 971133 887294 780115 675818 607001 584284 592178 610185 633050
40428 633050 673381 747141 851394 954995 1021039 1043987 1055850 1090436 1152787 1231458 1325485
40417 1325485 1440465 1564196 1665538 1719667 1722855 1683819 1615787 1541199 1491075 1488690 1533441
40406 1533441 1600566 1655256 1674201 1665044 1665305 1712711 1812057 1932228 2030370 2072618 2041190 1942629
40394 1942629 1815909 1718864 1694157 1748258 1862112 2012906 2182958 2359602 2537462 2718045
40384 2718045 2900139 3071462 3213431 3313646 3373979 3411184 3450461 3510814 3591270 3676849
40374 3676849 3765044 3882688 4066004 4319320 4597373 4832546 4980223 5040156 5043376 5029025
40364 5029025 5032135 5075877 5157140 5238985 5271796 5232289 5141021 5041154 4965381 4924273 4918763 4959247
$$ packed form
40439A105976l3175m3184n8484q3839j07179j04297o8817k2717P894J8007K2865
40428F33050M0331P3760J04253J03601O6044K2948J1863L4586O2351P8671R4027
40417A325485J14980J23731J01342N4129L188l9036o8032p4588n0124k385M4751
40406A533441O7125N4690J8945r157K61M7406R9346J20171R8142M2248l1428r8561
40394A942629j26720r7045k4707N4101J13854J50794J70052J76644J77860J80583
40384B718045J82094J71323J41969J00215O0333L7205L9277O0353Q0456Q5579
40374C676849Q8195J17644J83316K53316K78053K35173J47677N9933L220j4351
40364E029025L110M3742Q1263Q1845L2811l9507r1268r9867p5773m1108n510M0484
$$ plain form
40352 4959247 5075868 5308363 5674819 6146838 6664114 7173212 7636623 8002903 8198282
40343 8198282 8175093 7960273 7636908 7285554 6959560 6699338 6531509 6447649 6414358 6420365
40333 6420365 6496671 6679116 6967881 7337394 7772160 8275446 8847139 9464558 10083998 10658685
40323 10658685 11164736 11616586 12047227 12460587 12804744 13000452 12999904 12821651 12536609 12222006
40313 12222006 11918714 11622314 11311036 10977608 10630544 10275196 9912685 9559908 9253271
40304 9253271 9023121 8874402 8798762 8793057 8853769 8960265 9077364 9178368 9265311 9370394
40294 9370394 9537497 9793869 10133986 10531385 10961929 11408132 11847347 12253806 12617169
40285 12617169 12947428 13258747 13560911 13869093 14206406 14589749 15025359 15523989 16106756
$$ packed form
40352D959247J16621K32495L66456M72019N17276N09098M63411L66280J95379
40343H198282k3189k14820l23365l51354l25994k60222j67829q3860l3291O007
40333F420365P6306J82445K88765L69513M34766N03286N71693O17419O19440N74687
40323A0658685N06051M51850M30641M13360L44157J95708n48j78253k85042l14603
40313A2222006l03292k96400l11278l33428l47064l55348l62511l52777l06637
40304I253271k30150j48719p5640n705O0712J06496J17099J01004Q6943J05083
40294I370394J67103K56372L40117L97399M30544M46203M39215M06459L63363
40285A2617169L30259L11319L02164L08182L37313L83343M35610M98630N82767
$$ plain form
40276 16106756 16788180 17565851 18435921 19408866 20501276 21718356 23048819 24471497 25969992
40267 25969992 27553692 29262553 31137132 33190361 35431404 37912483 40722383 43935512
40259 43935512 47606470 51824286 56731082 62465395 69119314 76774171 85552148 95619328
40251 95619328 107179020 120492694 135880249 153678674 174226832 197881276 224942927
40244 224942927 255442261 288865679 323812369 357499630 385462964 402295661 403742562
40237 403742562 388975064 361180534 325888832 288444083 252469452 219815178 191173118
40230 191173118 166570722 145656838 127938275 112933499 100187792 89263407 79797986
40223 79797986 71551494 64363742 58092589 52611906 47826457 43648345 39976161 36721208
$$ packed form
40276A6106756O81424P77671Q70070R72945J092410J217080J330463J422678J498495
40267B5969992J583700J708861J874579K053229K241043K481079K809900L213129
40259D3935512L670958M217816M906796N734313O653919P654857Q777977J0067180
40251I5619328J1559692J3313674J5387555J7798425K0548158K3654444K7061651
40244B24942927L0499334L3423418L4946690L3687261K7963334J6832697J446901
40237D03742562j4767498k7794530l5291702l7444749l5974631l2654274k8642060
40230A91173118k4602396k0913884j7718563j5004776j2745707j0924385r465421
40223G9797986q246492p187752o271153n480683m785449m178112l672184l254953
$$ plain form
40215 36721208 33835997 31297026 29076216 27143481 25475189 24040512 22797380 21721806
40207 21721806 20827045 20133054 19621990 19232858 18890288 18534913 18147754 17762585 17441743
40198 17441743 17223485 17099524 17049604 17078486 17201343 17405997 17647907 17870897 18011054 17988165
40188 17988165 17724329 17188844 16423473 15522673 14589144 13695809 12870912 12110325 11404476
40179 11404476 10753145 10158075 9615127 9123333 8693752 8338351 8053840 7824285 7634286
40170 7634286 7471892 7328328 7211399 7156418 7204830 7362942 7588263 7819650 8013961 8152035
40160 8152035 8222063 8211882 8120557 7971579 7808126 7670912 7577491 7519790 7475838 7418199 7314797
40149 7314797 7136230 6874188 6551364 6207508 5877303 5584762 5351310 5195923 5123860 5121868
$$ packed form
40215C6721208k885211k538971k220810j932735j668292j434677j243132j075574
40207B1721806q94761o93991n11064l89132l42570l55375l87159l85169l20842
40198A7441743k18258j23961m9920K8882J22857K04654K41910K22990J40157k2889
40188A7988165k63836n35485p65371r00800r33529q93335q24897p60587p05849
40179A1404476o51331n95070n42948m91794m29581l55401k84511k29555j89999
40170G634286j62394j43564j16929n4981M8412J58112K25321K31387J94311J38074
40160H152035P0028j0181r1325j48978j63453j37214r3421n7701m3952n7639j03402
40149G314797j78567k62042l22824l43856l30205k92541k33452j55387p2063j992
$$ plain form
40139 5121868 5167725 5241272 5326333 5408859 5478583 5531984 5571992 5604236 5630224 5639238 5608036
40128 5608036 5516992 5373576 5219014 5106164 5065916 5091380 5150609 5212144 5261920 5305565 5363467
40117 5363467 5462064 5617993 5821888 6042161 6254587 6469158 6722200 7043721 7440099 7905819
40107 7905819 8437096 9027925 9664965 10336635 11039657 11767048 12497290 13208003 13895828
40098 13895828 14569454 15225755 15849179 16438456 17020232 17628363 18278093 18967363 19695641
40089 19695641 20471158 21299698 22169547 23044721 23870828 24593527 25177989 25610316 25879806
40080 25879806 25966016 25847221 25515528 24977258 24243927 23333172 22278176 21126251 19922912
40071 19922912 18700181 17480882 16288331 15148087 14084032 13116134 12257577 11507239
$$ packed form
40139E121868M5857P3547Q5061Q2526O9724N3401M0008L2244K5988R014l1202
40128E608036r1044j43416j54562j12850m0248K5464N9229O1535M9776M3645N7902
40117E363467R8597J55929K03895K20273K12426K14571K53042L21521L96378M65720
40107G905819N31277N90829O37040O71670P03022P27391P30242P10713O87825
40098A3895828O73626O56301O23424N89277N81776O08131O49730O89270P28278
40089A9695641P75517Q28540Q69849Q75174Q26107P22699N84462M32327K69490
40080B5879806Q6210j18795l31693n38270p33331r10755j054996j151925j203339
40071A9922912j222731j219299j192551j140244j064055r67898q58557p50338
$$ plain form
40063 11507239 10845562 10244481 9684234 9156054 8646140 8125194 7566145 6975021 6396299
40054 6396299 5882084 5459379 5128151 4878053 4691467 4533119 4355684 4127204 3848604
40045 3848604 3540928 3224460 2917958 2649305 2450928 2339758 2306040 2322096 2358388 2393805
40035 2393805 2418821 2432105 2431236 2405656 2340280 2224748 2058404 1853351 1641002 1471169 1390189
40024 1390189 1412227 1513914 1654562 1793130 1888709 1904738 1828792 1683760 1508382 1327194
40014 1327194 1144842 964154 798269 664203 572356 523235 507050 504259 492624 458409 401414
40003 401414 332838 273187 247614 271079 333844 408626 475850 535802 593036 637666 650185
39992 650185 620816 558046 483948 430947 438958 538398 724431 950640 1154924 1294206 1357404
$$ packed form
40063A1507239o61677o01081n60247n28180n09914n20946n59049n91124n78722
40054F396299n14215m22705l31228k50098j86586j58348j77435k28480k78600
40045C848604l07676l16468l06502k68653j98377j11170l3718J6056L6292L5417
40035B393805K5016J3284q69k5580o5376j15532j66344k05053k12349j69833q0980
40024A390189K2038J01687J40648J38568R5579J6029p5946j45032j75378j81188
40014A327194j82352j80688j65885j34066r1847m9121j6185k791j1635l4215n6995
40003D01414o8576n9651k5573K3465O2765P4782O7224N9952N7234M4630J2519
39992F50185k9369o2770p4098n3001Q011R9440J86033K26209K04284J39282O3198
$$ plain form
39981 1357404 1354552 1302216 1217197 1113746 1000305 881229 765631 672829 624468 629698 679200
39970 679200 753016 832350 905374 965772 1005725 1006515 937645 775435 530916 257571 25532
39959 25532 -114712 -148607 -91812 21251 150597 268560 369135 453913 512043 526927 503688
39948 503688 474093 464711 470138 468477 456916 461412 514524 631680 803772 1000853 1183516
39937 1183516 1321804 1407575 1445937 1438860 1386590 1303391 1218285 1152416 1099870 1034441 932296
39926 932296 788511 620199 459370 337909 271685 256495 278547 325806 388849 456581 517693
39915 517693 567534 611023 655830 700428 729345 724935 687589 641414 614706 614728 623482 614438 569630
39902 569630 487275 384312 291277 233312 210885 203864 195063 182652 169261 149934 116405 65489
$$ packed form
39981A357404k852n2336q5019j03451j13441j19076j15598r2802m8361N230M9502
39970F79200P3816P9334P3024O0398L9953P90o8870j62210k44519k73345k32039
39959B5532j40244l3895N6795J13063J29346J17963J00575Q4778N8130J4884k3239
39948E03688k9595r382N427j661j1561M496N3112J17156J72092J97081J82663
39937A183516J38288Q5771L8362p077n2270q3199q5106o5869n2546o5429j02145
39926I32296j43785j68312j60829j21461o6224j5190K2052M7259O3043O7732O1112
39915E17693M9841M3489M4807M4598K8917m410l7346m6175k6708K2Q754r044m4808
39902E69630q2355j02963r3035n7965k2427p021q801j2411j3391j9327l3529n0916
$$ plain form
39890 65489 -2531 -87227 -183405 -277779 -354712 -399976 -396316 -326299 -190475 -17809 152353
39879 152353 297850 417783 514813 584585 622573 632596 626929 623359 640205 684492 741032
39868 741032 778761 773189 724299 655805 600612 583994 612914 677003 758859 842381 914917 972790
39856 972790 1030874 1115999 1237432 1368165 1469571 1534177 1590761 1665623 1752758 1827100 1874048
39845 1874048 1897292 1907415 1912462 1912126 1890385 1819307 1683804 1505475 1335183 1219089 1172125
39834 1172125 1178741 1210374 1241891 1260449 1267906 1279830 1324665 1440983 1664542 2006418 2441639
39823 2441639 2923576 3408749 3860517 4226988 4428210 4386279 4083153 3588992 3023320 2480233
39813 2480233 1990457 1552051 1181386 917289 778160 733050 722681 699950 647196 570705
$$ packed form
39890F5489o8020q4696r6178r4374p6933m5264L660P0017J35824J72666J70162
39879A52353J45497J19933R7030O9772L7988J0023n667l570J6846M4287N6540
39868G41032L7729n572m8890o8494n5193j6618K8920O4089Q1856Q3522P2536N7873
39856I72790N8084Q5125J21433J30733J01406O4606N6584P4862Q7135P4342M6948
39845A874048K3244J0123N047l36k1741p1078j35503j78329j70292j16094m6964
39834A172125O616L1633L1517J8558P457J1924M4835J16318K23559L41876M35221
39823B441639M81937M85173M51768L66471K01222m1931l03126m94161n65672n43087
39813B480233m89776m38406l70665k64097j39129m5110j0369k2731n2754p6491
$$ plain form
39803 570705 493193 442298 427152 425031 404372 362754 329207 324868 334510 326821 294183 259504
39791 259504 245228 246640 239149 205610 152867 106128 91703 121516 185382 254134 295778 298282
39779 298282 280984 280659 322236 402691 503179 612131 730787 856650 968408 1033480 1032021
39768 1032021 972066 880167 778742 675631 575879 496985 463634 485355 544597 609752 656704
39757 656704 677092 673219 652083 622030 588917 554812 521932 494421 472363 446837 405145 338785
39745 338785 244773 126842 2888 -95731 -144571 -143743 -104208 -19447 132264 351816 598819
39734 598819 816081 968023 1053625 1098388 1146261 1245999 1422397 1655847 1898089 2107576
39724 2107576 2264793 2363725 2407430 2412906 2403301 2388498 2364099 2333124 2313924 2315906 2317289 2279507
$$ packed form
39803E70705p7512n0895j5146k121k0659m1618l3547m339R642p689l2638l4679
39791B59504j4276J412p491l3539n2743m6739j4425K9813O3866O8752M1644K504
39779B98282j7298l25M1577Q0455J00488J08952J18656J25863J11758O5072j459
39768A032021n9955r1899j01425j03111r9752p8894l3351K1721N9242O5155M6952
39757F56704K0388l873k1136l0053l3113l4105l2880k7511k2058k5526m1692o6360
39745C38785r4012j17931j23954r8619m8840Q28L9535Q4761J51711K19552K47003
39734E98819K17262J51942Q5602M4763M7873R9738J76398K33450K42242K09487
39724B107576J57217R8932M3705N476r605j4803k4399l0975j9200J982J383l7782
$$ plain form
39712 2279507 2179938 2023046 1827197 1613643 1404938 1218754 1058478 917776 796383 703051
39702 703051 639870 591940 539081 475689 418205 397761 444839 570042 751066 941272 1096245
39691 1096245 1191610 1217858 1171417 1061454 918244 780124 669769 590543 544650 542949 591225
39680 591225 672842 750294 782977 746169 642321 499290 353558 230942 143752 102369 118342
39669 118342 191799 304144 429875 550948 656521 739005 801076 860719 936140 1024744 1104890
39658 1104890 1157941 1181131 1180580 1162288 1131943 1094109 1047398 987195 916794 850403 803304 786291
39646 786291 811372 890159 1015344 1149789 1248247 1294391 1311588 1336362 1386515 1456715 1538592
39635 1538592 1636765 1761786 1910121 2057264 2174891 2252689 2298651 2320201 2314259 2279200 2227581
$$ packed form
39712B279507r9569j56892j95849k13554k08705j86184j60276j40702j21393r3332
39702G03051o3181m7930n2859o3392n7484k0444M7078J25203J81024J90206J54973
39691A096245R5365K6248m6441j09963j43210j38120j10355p9226m5893j701M8276
39680E91225Q1617P7452L2683l6808j03848j43031j45732j22616q7190m1383J5973
39669A18342P3457J12345J25731J21073J05573Q2484O2071N9643P5421Q8604Q0146
39658A104890N3051K3190n51j8292l0345l7834m6711o0203p0401o6391m7099j7013
39646G86291K5081P8787J25185J34445R8458M6144J7197K4774N0153P0200Q1877
39635A538592R8173J25021J48335J47143J17627P7798M5962K1550n942l5059n1619
$$ plain form
39624 2227581 2177925 2136699 2096359 2050842 2006545 1977938 1978320 2014446 2080742 2153098 2195369 2183484
39612 2183484 2127031 2063135 2025737 2021504 2035564 2055611 2084546 2130437 2191817 2257982 2319899
39601 2319899 2374090 2416483 2439298 2436468 2407411 2352686 2270228 2160346 2032824 1906325 1802132
39590 1802132 1739133 1729258 1771456 1851443 1953401 2073358 2217074 2382976 2550427 2688573
39580 2688573 2777991 2823850 2848175 2868687 2883526 2874181 2820597 2712704 2551038 2341683 2092027
39569 2092027 1809613 1506765 1210761 966805 819468 782704 829748 915322 1005100 1084498
39559 1084498 1150387 1203868 1244906 1262675 1233913 1143462 1008930 875935 785034 747871 753132
39548 753132 781825 809422 804242 740369 617778 466925 331603 245448 218818 241889 298281
$$ packed form
39624B227581m9656m1226m0340m5517m4297k8607L82L6126O6296P2356M2271j1885
39612B183484n6453o3896l7398m233J4060K0047K8935M5891O1380O6165O1917
39601B319899N4191M2393K2815k830k9057n4725q2458j09882j27522j26499j04193
39590A802132o2999r875M2198P9987J01958J19957J43716J65902J67451J38146
39580B688573Q9418M5859K4325K0512J4839r345n3584j07893j61666k09355k49656
39569B092027k82414l02848k96004k43956j47337l6764M7044Q5574Q9778P9398
39559A084498O5889N3481M1038J7769k8762r0451j34532j32995r0901l7163N261
39548G53132K8693K7597n180o3873j22591j50853j35322q6155k6630K3071N6392
$$ plain form
39537 298281 375088 458079 520647 528687 465358 348734 217739 99463 -6056 -109944 -210018
39526 -210018 -285223 -311164 -278000 -195068 -82672 38107 149452 235610 282517 281198 232763
39515 232763 150890 58077 -25490 -93847 -155123 -215800 -266114 -285849 -264993 -214072 -154625
39504 -154625 -106890 -87490 -104987 -144194 -161849 -119016 -27294 48497 46985 -31881 -132305
39493 -132305 -200492 -224681 -220209 -195637 -147904 -80286 -5955 66326 133975 184363 193720 155046
39481 155046 98610 70866 94365 155926 228643 293093 338796 359219 351298 314153 248239 164185
39469 164185 91852 67177 102845 178550 263001 336182 387318 407035 395511 369968 348599
39458 348599 329291 296534 247519 198487 165289 151420 157527 186409 228186 252539 232114 172178
$$ packed form
39537B98281P6807Q2991O2568Q040o3329j16624j30995j18276j05519j03888j00074
39526b10018p5205k5941L3164Q2932J12396J20779J11345Q6158M6907j319m8435
39515B32763q1873r2813q3567o8357o1276o0677n0314j9735K0856N0921N9447
39504a54625M7735J9400j7497l9207j7655M2833R1722P5791j512p8866j00424
39493a32305o8187k4189M472K4572M7733O7618P4331P2281O7649N0388R357l8674
39481A55046n6436k7744K3499O1561P2717O4450M5703K0423p921l7145o5914q4054
39469A64185p2333k4675L5668P5705Q4451P3181N1136J9717j1524k5543k1369
39458C48599j9308l2757m9015m9032l3198j3869O107K8882M1777K4353k0425n9936
$$ plain form
39446 172178 104837 52987 11573 -31428 -67614 -73942 -41961 10836 59492 89503 92602 60546
39434 60546 -105 -53352 -56619 -7797 43389 43171 -13451 -88347 -153218 -222914 -334848 -507255
39422 -507255 -722679 -942375 -1126812 -1246373 -1286264 -1250907 -1162839 -1050197 -929514 -800417
39412 -800417 -658706 -512371 -380311 -277243 -208426 -181782 -214842 -317880 -470550 -623662
39402 -623662 -728346 -764228 -744557 -701478 -665124 -647098 -638010 -623224 -603622 -598154 -622180 -663997
39390 -663997 -687115 -660527 -589047 -511425 -463930 -445026 -418856 -352123 -241479 -106724 28766
39379 28766 142301 208033 205475 132567 1961 -172417 -373916 -570871 -722071 -801392 -809127
39368 -809127 -756443 -649964 -498060 -321982 -149230 2532 130698 241996 346652 451639
$$ packed form
39446A72178o7341n1850m1414m3001l6186o328L1981N2797M8656L0011L099l2056
39434F0546o0651n3247l267M8822N1186k18n6622p4896o4871o9696j11934j72407
39422e07255k15424k19696j84437j19561l9891L5357Q8068J12642J20683J29097
39412h00417J41711J46335J32060J03068O8817K6644l3060j03038j52670j53112
39402f23662j04684l5882J9671M3079L6354J8026R088J4786J9602N468k4026m1817
39390f63997k3118K6588P1480P7622M7495J8904K6170O6733J10644J34755J35490
39379B8766J13535O5732k558p2908j30606j74378k01499j96955j51200p9321p735
39368h09127N2684J06479J51904J76078J72752J51762J28166J11298J04656J04987
$$ plain form
39358 451639 550282 619573 634889 590032 503654 410830 349653 345691 396127 466322 507533 482177
39346 482177 375695 193338 -45367 -310369 -568108 -790304 -957942 -1061903 -1105401 -1104046
39336 -1104046 -1077109 -1037066 -989957 -943829 -910681 -898342 -904041 -917821 -930234 -935866 -930855 -907723
39324 -907723 -853592 -757816 -625589 -481623 -353700 -250184 -156725 -56266 50982 148767
39314 148767 221459 264982 283620 284873 284548 313687 407502 575959 785353 976598 1104862
39303 1104862 1159534 1150505 1089184 990340 882716 803058 775776 801210 861078 929859 984373
39292 984373 1012925 1019946 1017763 1010066 984104 919994 807976 659158 501787 364945 262291
39281 262291 191069 144833 119272 101487 63734 -16881 -129765 -231044 -278175 -263500 -216156
$$ packed form
39358D51639R8643O9291J5316m4857q6378r2824o1177l962N0436P0195M1211k5356
39346D82177j06482j82357k38705k65002k57739k22196j67638j03961m3498J355
39336a104046K6937M0043M7109M6128L3148J2339n699j3780j2413n632N011K3132
39324i07723N4131R5776J32227J43966J27923J03516R3459J00459J07248R7785
39314A48767P2692M3523J8638J253l25K9139R3815J68457K09394J91245J28264
39303A104862N4672r029o1321r8844j07624p9658k7282K5434N9868O8781N4514
39292I84373K8552P021k183p697k5962o4110j12018j48818j57371j36842j02654
39281B62291p1222m6236k5561j7785l7753q0615j12884j01279m7131J4675M7344
$$ plain form
39270 -216156 -177092 -170286 -188067 -200128 -182634 -141855 -105205 -89166 -84219 -73578 -56422 -45323
39258 -45323 -48764 -66430 -97418 -141192 -189100 -223564 -229851 -205411 -157244 -95500 -32696 14132
39246 14132 25474 -12464 -96663 -201277 -286731 -323203 -309344 -268058 -227391 -210781 -240490
39235 -240490 -332413 -474086 -613967 -688925 -670082 -579153 -461519 -352522 -270753 -227276 -223345
39224 -223345 -241134 -253427 -250346 -249033 -271248 -318101 -373608 -426942 -480404 -535435 -580302 -597872
39212 -597872 -585382 -565547 -576740 -646378 -767349 -900337 -1003309 -1059903 -1079390 -1075170 -1050799
39201 -1050799 -1004887 -940040 -863712 -786231 -720906 -679083 -657047 -628513 -557419 -424730 -244681
39190 -244681 -52434 127075 296535 468424 632382 751999 801078 795649 780806 790535 828705
$$ packed form
39270b16156L9064O806j7781j2061J7494M0779L6650J6039M947J0641J7156J1099
39258d5323l441j7666l0988m3774m7908l4464o287K4440M8167O1744O2804M6828
39246A4132J1342l7938q4199j04614q5454l6472J3859M1286M0667J6610k9709
39235b40490r1923j41673j39881p4958J8843R0929J17634J08997Q1769M3477L931
39224b23345j7789j2293L081J313k2215m6853n5507n3334n3462n5031m4867j7570
39212e97872J2490J9835j1193o9638j20971j32988j02972n6594j9487M220K4371
39201a050799M5912O4847P6328P7481O5325M1823K2036K8534P1094J32689J80049
39190b44681J92247J79509J69460J71889J63958J19617M9079n429j4843R729L8170
$$ plain form
39179 828705 880981 927713 945293 914171 836407 737080 641874 559881 491137 439472 409488
39168 409488 398254 396876 393416 368775 300151 180568 32151 -106508 -203037 -241298 -224474
39157 -224474 -180337 -151601 -162434 -196993 -224389 -240122 -265971 -310598 -350145 -354918 -322214 -275208
39145 -275208 -238296 -219344 -208732 -190484 -159168 -127518 -111480 -109062 -104267 -91848 -83613 -84582
39133 -84582 -76263 -34013 45931 142854 226083 267967 257449 216634 196737 239891 342887 467544
39121 467544 584243 693513 805257 910144 977532 975775 892882 744664 566555 393995
39111 393995 249965 153312 129952 197481 332857 469978 544268 538310 477446 387807 272664
39100 272664 129571 -25657 -163493 -264086 -327437 -364000 -386189 -410279 -453708 -518966 -583109
$$ packed form
39179H28705N2276M6732J7580l1122p7764r9327r5206q1993o8744n1665k9984
39168D09488j1234j378l460k4641o8624j19583j48417j38659r6529l8261J6824
39157b24474M4137K8736j0833l4559k7396j5733k5849m4627l9547m773L2704M7006
39145b75208L6912J8952J0612J8248L1316L1650J6038K418M795J2419Q235r69
39133h4582Q319M2250P9944R6923Q3229M1884j0518m0815j9897M3154J02996J24657
39121D67544J16699J09270J11744J04887O7388j757q2893j48218j78109j72560
39111C93995j44030r6653k3360O7529J35376J37121P4290n958o0864q9639j15143
39100B72664j43093j55228j37836j00593o3351l6563k2189k4090m3429o5258o4143
$$ plain form
39089 -583109 -613169 -593485 -531877 -440517 -323062 -187233 -59612 26468 58338 50272 21914
39078 21914 -19272 -68520 -105048 -94941 -16853 117415 269497 402187 503583 587602 671723
39067 671723 753396 808386 812365 762193 674944 570511 462668 368232 315138 329003 408288
39056 408288 518496 615246 670793 676755 628966 521140 355806 154421 -48193 -217939
39046 -217939 -331182 -380320 -378744 -357594 -346586 -351408 -352368 -329391 -287435 -253822 -250948 -277066
39034 -277066 -317190 -366982 -434785 -517358 -584748 -601772 -563839 -502501 -453882 -428351 -411860
39023 -411860 -387711 -352430 -317986 -304931 -327846 -380467 -438452 -482132 -512047 -536059 -546848
39012 -546848 -521234 -438194 -288723 -74035 188403 453424 659329 765217 776134 727407
$$ packed form
39089e83109l0060J9684O1608R1360J17455J35829J27621Q6080L1870q066k8358
39078B1914m1186m9248l6528J0107P8088J34268J52082J32690J01396Q4019Q4121
39067F71723Q1673N4990L979n0172q7249j04433j07843r4436n3094J3865P9285
39056D08288J10208R6750N5547N962m7789j07826j65334k01385k02614j69746
39046b17939j13243m9138J576K1150J1008m822r60K2977M1956L3613K874k6118
39034b77066m0124m9792o7803q2573o7390j7024L7933O1338M8619K5531J6491
39023d11860K4149L5281L4444J3055k2915n2621n7985m3680k9915k4012j0789
39012e46848K5614Q3040J49471K14688K62438K65021K05905J05888J0917m8727
$$ plain form
39002 727407 649846 554640 443120 318632 189131 67115 -30963 -91390 -112224 -103372 -77926
38991 -77926 -46478 -17480 5282 29511 73599 153289 269746 412927 573529 746364 922860
38980 922860 1086836 1221275 1315800 1363393 1352839 1272965 1129371 954272 794108 684607
38970 684607 636843 643252 689824 758790 824397 856222 834071 761183 661923 566992 500590 476485
38958 476485 497234 552616 623268 692268 753047 802747 831566 827997 796981 764243 754943 770890
38946 770890 794982 815839 839644 874963 912033 923962 889679 813388 720522 637022 575882
38935 575882 542384 543474 583375 652635 732570 814273 904476 1005761 1097657 1147555 1139567 1085584
38923 1085584 1008971 926008 845358 776358 726728 687991 626650 498792 283973 8870 -267382
$$ packed form
39002G27407p7561r5206j11520j24488j29501j22016r8078o0427k0834Q852K5446
38991g7926L1448K8998K2762K4229M4088P9690J16457J43181J60602J72835J76496
38980I22860J63976J34439R4525M7593j0554p9874j43594j75099j60164j09501
38970F84607m7764O409M6572O8966O5607L1825k2151p2888r9260r4931o6402k4105
38958D76485K0749N5382P0652O9000O0779M9700K8819l569l1016l2738r300J5947
38946G70890K4092K0857K3805L5319L7070J1929l4283p6291r2866q3500o1140
38935E75882l3498J090L9901O9260P9935Q1703R0203J01285R1896M9898p988n3983
38923A085584p6613q2963q0650o9000m9630l8737o1341j27858k14819k75103k76252
$$ plain form
38912 -267382 -496842 -672542 -817823 -954794 -1085900 -1195063 -1256892 -1253201 -1195559 -1129781
38902 -1129781 -1102765 -1118228 -1130113 -1080284 -939823 -723017 -478482 -266934 -128112 -57236
38892 -57236 -20301 2926 -389 -49978 -140267 -242303 -326495 -373120 -370747 -320114 -238424 -149291
38880 -149291 -67639 1131 51894 77642 74555 44462 -2924 -45644 -57297 -32004 2653 11423
38868 11423 -9171 -28283 -20665 -1211 -15751 -100071 -245549 -397804 -489430 -483766 -395569 -274417
38856 -274417 -172552 -125244 -144720 -217310 -310977 -399317 -476986 -541233 -564897 -509068 -368489
38845 -368489 -188395 -26325 93181 179127 242114 275752 265873 207062 109285 -6901 -122811
38834 -122811 -232044 -335293 -423363 -473084 -466780 -410943 -329161 -241474 -158747 -92624 -57796
$$ packed form
38912b67382k29460j75700j45281j36971j31106j09163o1829L691N7642O5778
38902a129781K7016j5463j1885M9829J40461K16806K44535K11548J38822P0876
38892e7236L6935K3227l315m9589r0289j02036q4192m6625K373N0633Q1690Q9133
38880a49291Q1652O8770N0763K5748l087l0093m7386m2720j1653K5293L4657Q770
38868A1423k0594j9112P618J9454j4540q4320j45478j52255r1626N664Q8197J21152
38856b74417J01865M7308j9476p2590r3667q8340p7669o4247k3664N5829J40579
38845c68489J80094J62070J19506Q5946O2987L3638r879n8811r7777j16186j15910
38834a22811j09233j03249q8070m9721O304N5837Q1782Q7687Q2727O6123L4828
$$ plain form
38823 -57796 -60627 -93720 -147528 -223515 -330304 -466736 -612009 -735089 -815662 -857192 -879605
38812 -879605 -899206 -916343 -922422 -916551 -912932 -931272 -979327 -1042631 -1089513 -1087434 -1019046 -888736
38800 -888736 -718629 -538357 -374004 -242534 -154808 -119674 -137958 -191512 -247534 -281834 -295520
38789 -295520 -305535 -325413 -360522 -410943 -463973 -488875 -457289 -372040 -263012 -153984 -49874
38778 -49874 39610 84035 54542 -47188 -190891 -336471 -442010 -472577 -426316 -348153 -297100
38767 -297100 -297374 -333270 -385223 -447683 -508879 -538589 -513179 -441506 -352503 -265191 -183608 -113987
38755 -113987 -69149 -52420 -47983 -33834 -2031 34758 53850 40680 2366 -34404 -43481 -22418
38743 -22418 3113 -1037 -52094 -141330 -245208 -341963 -418756 -469227 -492076 -495832 -501398 -532070
$$ packed form
38823e7796k831l3093n3808p5987j06789j36432j45273j23080q0573m1530k2413
38812h79605j9601j7137o079N871L619j8340m8055o3304m6882K079O8388J30310
38800h88736J70107J80272J64353J31470Q7726L5134j8284n3554n6022l4300j3686
38789b95520j0015j9878l5109n0421n3030k4902L1586Q5249J09028J09028J04110
38778d9874Q9484M4425k9493j01730j43703j45580j05539l0567M6261P8163N1053
38767b97100k74l5896n1953o2460o1196k9710K5410P1673Q9003Q7312Q1583O9621
38755a13987M4838J6729M437J4149L1803L6789J9092j3170l8314l6770r077K1063
38743b2418K5531m150n1057q9236j03878r6755p6793n0471k2849l756n566l0672
$$ plain form
38731 -532070 -595541 -675525 -742801 -774701 -763931 -712435 -624151 -508440 -387329 -291481 -244878
38720 -244878 -255080 -318128 -425456 -559341 -687004 -772400 -799627 -779883 -733393 -672001 -604080
38709 -604080 -546633 -518031 -516598 -515159 -481596 -401884 -283622 -146776 -19597 60800 58814
38698 58814 -36202 -194912 -361924 -490192 -564960 -599341 -615266 -632596 -668237 -732312 -821292
38687 -821292 -920678 -1016273 -1096809 -1144417 -1132813 -1044382 -887534 -692967 -495424 -321223 -185375
38676 -185375 -89835 -24611 21382 48224 48548 25052 -111 1328 38269 87370 108582 79651
38664 79651 17895 -34816 -48707 -23658 25642 86550 143222 169505 146483 86415 25275 -12094
38652 -12094 -32731 -63522 -127307 -226572 -334918 -402234 -385440 -286815 -156487 -50145 11070
$$ packed form
38731e32070o3471p9984o7276l1900J0770N1496Q8284J15711J21111R5848M6603
38720b44878j0202o3048j07328j33885j27663q5396k7227J9744M6490O1392O7921
38709f04080N7447K8602J433J439L3563P9712J18262J36846J27179Q0397j986
38698E8814r5016j58710j67012j28268p4768l4381j5925j7330l5641o4075q8980
38687h21292r9386r5595q0536m7608J1604Q8431J56848J94567J97543J74201J35848
38676a85375R5540O5224M5993K6842L24k3496k5163J439L6941M9101K1212k8931
38664G9651o1756n2711j3891K5049M9300O0908N6672K6283k3022o0068o1140l7369
38652a2094k0637l0791o3785r9265j08346o7316J6794R8625J30328J06342O1215
$$ plain form
38641 11070 36214 32732 -7167 -89855 -199922 -300153 -351425 -337160 -273960 -197593 -135446
38630 -135446 -92878 -64684 -50550 -52015 -60073 -57864 -39098 -17728 -14464 -33746 -54081 -39815
38618 -39815 35489 170093 329908 459409 502152 425337 240022 1904 -216200 -364590
38608 -364590 -437439 -459138 -454143 -428550 -373363 -280368 -156849 -27848 77990 148292 193023
38597 193023 230256 267316 295518 299586 270969 216687 159258 124775 124420 144154 152278 118544
38585 118544 30983 -98442 -242040 -374979 -491069 -601034 -715915 -835232 -950222 -1050362
38575 -1050362 -1120921 -1139527 -1085437 -956536 -774956 -573392 -374872 -185042 -3193 162101
38565 162101 294557 391002 473662 569732 677391 761917 788222 747406 649042 505591 341779
$$ packed form
38641A1070K5144l482l9899q2688j10067j00231n1272J4265O3200P6367O2147
38630a35446M2568K8194J4134j465q058K209J8766K1370L264j9282k0335J4266
38618c9815P5304J34604J59815J29501M2743p6815j85315k38118k18104j48390
38608c64590p2849k1699M995K5593N5187R2995J23519J29001J05838P0302M4731
38597A93023L7233L7060K8202M068k8617n4282n7429l4483l55J9734Q124l3734
38585A18544q7561j29425j43598j32939j16090j09965j14881j19317j14990j00140
38575a050362p0559j8606N4090J28901J81580K01564J98520J89830J81849J65294
38565A62101J32456R6445Q2660R6070J07659Q4526K6305m0816r8364j43451j63812
$$ plain form
38554 341779 209804 168887 237792 376122 520191 633576 721020 803781 892615 981800 1056432
38543 1056432 1098020 1087774 1014890 887934 736767 598357 497454 439292 416165 414116 412241
38532 412241 383633 307163 184030 44542 -63274 -100720 -66224 925 53247 78059 105114
38521 105114 169863 275504 393165 487707 534440 522499 461453 385062 331481 310709 298560
38510 298560 268086 221405 186312 186218 216866 248403 247983 206385 147873 111300 118060 160456 220885
38497 220885 293310 378785 466801 534448 566378 565679 538666 475688 357702 183155 -18229
38486 -18229 -200763 -327212 -377857 -347403 -245825 -100737 52751 188861 293818 356603
38476 356603 373029 363331 367102 403234 442912 440967 392726 342139 329423 345810 348689 311232
$$ packed form
38554C41779j31975m0917O8905J38330J44069J13385Q7444Q2761Q8834Q9185P4632
38543A056432M1588j0246p2884j26956j51167j38410j00903n8162k3127k049j875
38532D12241k8608p6470j23133j39488j07816l7446L4496O7149N2322K4812K7055
38521A05114O4749J05641J17661R4542M6733j1941o1046p6391n3581k0772j2149
38510B98560l0474m6681l5093r4L0648L1537m20m1598n8512l6573O760M2396O0429
38497B20885P2425Q5475Q8016O7647L1930o99k7013o2978j17986j74547k01384
38486a8229j82534j26449n0645L0454J01578J45088J53488J36110J04957O2785
38476C56603J6426r698L771L6132L9678j945m8241n0587j2716J6387K879l7457
$$ plain form
38464 311232 247698 196660 188791 227175 289477 348738 397496 452268 531684 631302 722614 775061
38452 775061 776513 735790 672531 607464 558764 541599 565343 627483 710785 790368 846451 870317
38440 870317 858710 805292 699388 532791 308920 48083 -216658 -453626 -647049 -799242
38430 -799242 -919610 -1012619 -1074735 -1099195 -1082218 -1025625 -933684 -808570 -653868 -485911 -335399
38419 -335399 -226941 -154652 -84810 12803 136803 254038 320962 308593 221424 101335 6129
38408 6129 -28126 -9404 22239 23889 -30339 -142222 -286057 -414086 -480895 -473771 -418689 -352483
38396 -352483 -288639 -211570 -103829 24037 133334 186137 170814 99442 -9948 -138029
38386 -138029 -255706 -328074 -337047 -295550 -234469 -180097 -147068 -143491 -171595 -224121 -286250 -340000
$$ packed form
38464C11232o3534n1038p869L8384O2302N9261M8758N4772P9416R9618R1312N2447
38452G75061J452m0723o3259o5067m8700j7165K3744O2140Q3302P9583N6083K3866
38440H70317j1607n3418j05904j66597k23871k60837k64741k36968j93423j52193
38430g99242j20368r3009o2116k4460J6977N6593R1941J25114J54702J67957J50512
38419c35399J08458P2289O9842R7613J24000J17235O6924j2369q7169j20089r5206
38408F129l4255J8722L1643J650n4228j11883j43835j28029o6809P124N5082O6206
38396c52483O3844P7069J07741J27866J09297N2803j5323p1372j09390j28081
38386a38029j17677p2368q973M1497O1081N4372L3029L577k8104n2526o2129n3750
$$ plain form
38374 -340000 -364681 -342462 -276207 -199632 -155016 -153670 -164856 -149427 -100213 -44451 -10628 -1325
38362 -1325 -536 -400 -11515 -45673 -98208 -157896 -230776 -338549 -485655 -638254 -747407 -789096
38350 -789096 -772992 -719560 -645048 -568284 -512134 -485250 -469685 -436285 -369201 -270721 -150244
38339 -150244 -19289 106514 213564 300877 374878 429458 440620 390763 295664 198166 133251
38328 133251 105064 99522 111007 148771 219766 312638 398715 443637 421320 330194 204203
38317 204203 100652 64417 98726 169994 235987 266189 245259 173818 69759 -43172 -156936
38306 -156936 -284137 -434448 -590511 -716220 -788727 -815072 -817020 -809270 -799203 -801011 -836029
38295 -836029 -913092 -1014109 -1105611 -1163055 -1179489 -1153891 -1081181 -958098 -792921 -603642 -409797
$$ packed form
38374c40000k4681K2219O6255P6575M4616J346j1186J5429M9214N5762L3823R303
38362a325P89J36j1115l4158n2535n9688p2880j07773j47106j52599j09153m1689
38350g89096J6104N3432P4512P6764N6150K6884J5565L3400O7084R8480J20477
38339a50244J30955J25803J07050Q7313P4001N4580J1162m9857r5099r7498o4915
38328A33251k8187n542J1485L7764P0995R2872Q6077M4922k2317r1126j25991
38317B04203j03551l6235L4309P1268O5993L0202k0930p1441j04059j12931j13764
38306a56936j27201j50311j56063j25709p2507k6345j948P750J0067j808l5018
38295h36029p7063j01017r1502n7444j6434K5598P2710J23083J65177J89279J93845
$$ plain form
38284 -409797 -231262 -91173 -9712 10559 -8550 -31375 -27638 12837 75438 126555 129388
38273 129388 64769 -54708 -188334 -289212 -330461 -315181 -262602 -187998 -100941 -19429 28678
38262 28678 28078 -6526 -45454 -72097 -84292 -72059 -15249 85270 187974 242331 242095 234496
38250 234496 270444 352776 440371 498067 531331 568307 616038 644243 612780 508057 350284
38239 350284 172950 3243 -140370 -241448 -282092 -246298 -129093 53158 262703 457192
38229 457192 609988 713068 763171 753767 684625 574186 456599 365577 319155 312854 321931
38218 321931 313011 260831 159209 20187 -132699 -270228 -365020 -403980 -398177 -378919 -379911
38207 -379911 -417812 -484562 -555856 -607982 -628161 -610581 -547325 -430038 -264144 -80282 71416
$$ packed form
38284d09797J78535J40089Q1461K0271j9109k2825L737M0475O2601N1117K833
38273A29388o4619j19477j33626j00878m1249J5280N2579P4604Q7057Q1512M8107
38262B8678o00l4604l8928k6643j2195J2233N6810J00519J02704N4357k36p599
38250B34496L5948Q2332Q7595N7696L3264L6976M7731K8205l1463j04723j57773
38239C50284j77334j69707j43613j01078m0644L5794J17205J82251K09545J94489
38229D57192J52796J03080N0103r404o9142j10439j17587r1022m6422o301R077
38218C21931q920n2180j01622j39022j52886j37529r4792l8960N803J9258r92
38207c79911l7901o6750p1294n2126k0179J7580O3256J17287J65894J83862J51698
$$ plain form
38196 71416 143505 116401 9585 -131015 -260370 -352809 -400583 -407739 -393141 -388917 -419343
38185 -419343 -481080 -554479 -629025 -699943 -743053 -722623 -639326 -548862 -510434 -527813 -561079
38174 -561079 -584055 -602306 -618974 -616209 -582355 -534757 -499999 -485431 -482721 -486226 -493525 -498621
38162 -498621 -500872 -513632 -546966 -584348 -592199 -553210 -476985 -377228 -254647 -110659 32790
38151 32790 139009 181484 159942 96144 17901 -57973 -135032 -230605 -355449 -496986 -621724
38140 -621724 -693761 -694464 -633169 -546053 -482668 -484401 -566659 -714970 -893834 -1060500 -1179198
38129 -1179198 -1233014 -1226504 -1174727 -1088214 -970515 -830520 -691215 -578112 -495887 -420241 -318433
38118 -318433 -179719 -24270 117120 227703 307265 356183 366870 334913 273598 211076 171262
$$ packed form
38196G1416P2089k7104j06816j40600j29355r2439m7774p156J4598M224l0426
38185d19343o1737p3399p4546p0918m3110K0430Q3297R0464L8428j7379l3266
38174e61079k2976j8251j6668K765L3854M7598L4758J4568K710l505p299n096
38162d98621k251j2760l3334l7382p851L8989P6225R9757J22581J43988J43449
38151C2790J06219M2475k1542o3798p8243p5874p7059r5573j24844j41537j24738
38140f21724p2037p03O1295Q7116O3385j733q2258j48311j78864j66666j18698
38129a179198n3816O510N1777Q6513J17699J39995J39305J13103Q2225P5646J01808
38118c18433J38714J55449J41390J10583P9562M8918J0687l1957o1315o2522l9814
$$ plain form
38107 171262 156685 146606 110738 31860 -75404 -167341 -201331 -171195 -113465 -77253 -87484
38096 -87484 -133897 -187143 -220551 -222031 -194770 -149366 -92193 -21062 64498 149127 203304 203267
38084 203267 149251 63669 -27415 -111451 -191440 -273401 -352562 -413783 -447196 -460355 -469658 -480096
38072 -480096 -478840 -449347 -385759 -291515 -171787 -35163 98734 199394 236466 195352 90965
38061 90965 -30589 -115140 -139623 -129492 -128960 -152897 -174911 -162710 -115795 -65227 -45256 -70941
38049 -70941 -134818 -213445 -277345 -303870 -286573 -233344 -158063 -77475 -13822 8546 -21591 -86032
38037 -86032 -137912 -126238 -28386 137985 335100 533844 718093 866733 948911 948193 884654
38026 884654 802512 738153 705501 701940 709595 691430 608714 457454 279274 125071 13898
$$ packed form
38107A71262j4577j0079l5868p8878j07264r1937l3990L0136N7730L6212j0231
38096h7484m6413n3246l3408j480K7261M5404N7173P1131Q5560Q4629N4177l7
38084B03267n4016q5582r1084q4036p9989q1961p9161o1221l3413j3159r303j0438
38072d80096J256K9493O3588R4244J19728J36624J33897J00660L7072m1114j04387
38061I0965j21554q4551k4483J0131N32k3937k2014J2201M6915N0568J9971k5685
38049g0941o3877p8627o3900k6525J7297N3229P5281Q0588O3653K2368l0137o4441
38037h6032n1880J1674R7852J66371J97115J98744J84249J48640Q2178p18o3539
38026H84654q2142o4359l2652l561P655j8165q2716j51260j78180j54203j11173
$$ plain form
38015 13898 -63428 -110805 -117214 -82298 -33529 -5747 -8377 -18310 432 74578 210138 390333
38003 390333 583245 757076 889610 964066 965983 895690 780270 658377 548187 439795
37993 439795 323006 210002 120107 51938 -13577 -85704 -155925 -219784 -290846 -383628 -491722
37982 -491722 -590393 -652119 -652267 -573186 -422294 -244483 -98864 -16345 13996 20759 27977 55866
37970 55866 119382 210409 294660 343185 359809 363130 350678 302432 218324 130531 73063 57436
37958 57436 86054 169848 314310 496248 671526 806702 896792 957941 1012572 1076718 1149462
37947 1149462 1214972 1262473 1300272 1339459 1367446 1352153 1274723 1147622 1000503 862076 757802
37936 757802 705629 698069 696108 656169 565641 448831 343300 274971 246284 234491 203300
$$ packed form
38015A3898p7326m7377o409L4916M8769K7782k630r933J8742P4146J35560J80195
38003C90333J92912J73831J32534P4456J917p0293j15420j21893j10190j08392
37993D39795j16789j13004q9895o8169o5515p2127p0221o3859p1062r2782j08094
37982d91722r8671o1726j48P9081J50892J77811J45619Q2519L0341O763P218K7889
37970E5866O3516R1027Q4251M8525J6624L321j2452m8246q4108q7793n7468j5627
37958E7436K8618Q3794J44462J81938J75278J35176R0090O1149N4631O4146P2744
37947A149462O5510M7501L7799L9187K7987j5293p7430j27101j47119j38427j04274
37936G57802n2173p560j961l9939r0528j16810j05531o8329k8687j1793l1191
$$ plain form
37925 203300 129492 23539 -80235 -154139 -194639 -215967 -238793 -284942 -367747 -477431 -583046
37914 -583046 -658998 -708070 -751917 -801056 -841791 -853306 -831285 -791932 -756683 -736007 -725515
37903 -725515 -713223 -688213 -641885 -562459 -433961 -248751 -24457 196820 373847 492544
37893 492544 564579 602451 604093 563766 487427 387600 269090 133530 -1681 -104190 -156358
37882 -156358 -177958 -211163 -285961 -404312 -549301 -696947 -821554 -905028 -948733 -969407 -976344
37871 -976344 -955150 -877923 -727602 -511262 -256017 1053 221420 373887 443463 434291
37861 434291 363936 254786 130415 17371 -56135 -71967 -37686 11882 35489 13128 -43461
37850 -43461 -103080 -135292 -125313 -82126 -39123 -41563 -122803 -285023 -498660 -718600 -904690
$$ packed form
37925B03300p3808j05953j03774p3904m0500k1328k2826m6149q2805j09684j05615
37914e83046p5952m9072m3847m9139m0735j1515K2021L9353L5249K0676J0492
37903g25515J2292K5010M6328P9426J28498J85210K24294K21277J77027J18697
37893D92544P2035L7872J642m0327p6339r9827j18510j35560j35211j02509n2168
37882a56358k1600l3205p4798j18351j44989j47646j24607q3474m3705k0674o937
37871i76344K1194P7227J50321K16340K55245K57070K20367J52467O9576r172
37861D34291p0355j09150j24371j13044p3506j5832L4281M9568K3607k2361n6589
37850d3461n9619l2212R979M3187M3003k440q1240j62220k13637k19940j86090
$$ plain form
37839 -904690 -1036879 -1119651 -1172998 -1214517 -1246608 -1260015 -1249453 -1224873 -1206250 -1205587 -1213179 -1202824
37827 -1202824 -1151908 -1055324 -920096 -753373 -564267 -376220 -226283 -143859 -130996 -164966
37817 -164966 -215696 -258957 -281542 -285026 -284906 -297588 -323392 -343999 -337080 -291047 -207397 -96832
37805 -96832 21226 119478 173099 175783 144835 106001 70653 29104 -31669 -105421 -165643 -187923
37793 -187923 -170288 -131059 -92437 -70798 -77451 -116183 -173097 -214362 -205364 -138509 -40484 52332
37781 52332 126310 195309 271844 337656 348325 267906 97868 -123809 -344388 -518258 -621250
37770 -621250 -657240 -651891 -632828 -612292 -589431 -565704 -550375 -548645 -549925 -532854 -481404 -395384
37758 -395384 -289481 -186679 -110052 -72268 -67058 -72304 -65571 -37514 10310 76262 159591 249953
$$ packed form
37839i04690j32189q2772n3347m1519l2091j3407J0562K4580J8623O63p592J0355
37827a202824N0916R6584J35228J66723J89106J88047J49937Q2424J2863l3970
37817a64966n0730m3261k2585l484J20j2682k5804k0607O919M6033Q3650J10565
37805i6832J18058R8252N3621K684l0948l8834l5348m1549o0773p3752o0222k2280
37793a87923J7635L9229L8622K1639o653l8732n6914m1265Q998O6855R8025R2816
37781E2332P3978O8999P6535O5812J0669q0419j70038k21677k20579j73870j02992
37770f21250l5990N349J9063K0536K2861K3727J5329J730j280J7071N1450Q6020
37758c95384J05903J02802P6627L7784N210n246O733K8057M7824O5952Q3329R0362
$$ plain form
37746 249953 325231 368290 384163 395122 420562 466920 533829 620039 721146 829303 938357
37735 938357 1042516 1126231 1163024 1133403 1045568 937318 856638 832430 851281 861875 816671
37724 816671 717764 612379 536321 474172 386669 264450 135545 26633 -59830 -128535 -175066
37713 -175066 -199556 -222764 -272579 -355142 -444415 -497709 -481121 -388548 -242631 -74876 96784
37702 96784 268608 434397 579460 691199 763968 792348 774761 729935 694712 693634 719310
37691 719310 750965 779935 803923 807748 769816 686615 577174 464866 366854 297632 265019
37680 265019 257235 245186 204162 130838 43032 -28208 -51941 -21037 32575 59518 36978 -15602
37668 -15602 -64301 -89974 -87235 -55112 -5015 33311 32837 -5457 -61333 -126725 -213366 -326907
$$ packed form
37746B49953P5278M3059J5873J0959K5440M6358O6909Q6210J01107J08157J09054
37735I38357J04159Q3715L6793k9621q7835j08250q0680k4208J8851J0594m5204
37724H16671r8907j05385p6058o2149q7503j22219j28905j08912q6463o8705m6531
37713a75066k4490k3208m9815q2563q9273n3294J6588R2573J45917J67755J71660
37702I6784J71824J65789J45063J11739P2769K8380j7587m4826l5223j078K5676
37691G19310L1655K8970K3988L825l7932q3201j09441j12308r8012o9222l2613
37680B65019p784j2049m1024p3324q7806p1240k3733L0904N3612K6943k2540n2580
37668a5602m8699k5673K739L2123N0097L8326m74l8294n5876o5392q6641j13541
$$ plain form
37656 -326907 -447208 -542142 -593985 -606784 -594494 -568803 -533454 -481521 -400245 -289002 -175887
37645 -175887 -107976 -116288 -190343 -289317 -372896 -415963 -403358 -331810 -225270 -133751 -100929
37634 -100929 -134125 -211762 -310979 -415562 -505995 -564526 -594855 -620426 -655436 -688516 -699875
37623 -699875 -680955 -630104 -545683 -440311 -352633 -324957 -366896 -450724 -539889 -610521 -648389
37612 -648389 -643318 -595581 -519227 -431475 -342785 -260666 -196557 -161179 -153787 -161323 -171723 -189543
37600 -189543 -237681 -338593 -488405 -650352 -778273 -847711 -863957 -845925 -810200 -768603 -729968
37589 -729968 -697848 -669547 -640711 -609650 -577713 -549109 -530032 -522414 -516250 -491874 -433464 -341886
37577 -341886 -237695 -153527 -116590 -128337 -161706 -187295 -203445 -232850 -289982 -363205 -430898
$$ packed form
37656c26907j20301r4934n1843j2799J2290K5691L5349N1933Q1276J11243J13115
37645a75887O7911q312p4055r8974q3579m3067J2605P1548J06540R1519L2822
37634a00929l3196p7637r9217j04583r0433n8531l0329k5571l5010l3080j1359
37623f99875J8920N0851Q4421J05372Q7678K7676m1939q3828q9165p0632l7868
37612f48389N071M7737P6354Q7752Q8690Q2119O4109L5378P392p536j0400j7820
37600a89543m8138j00912j49812j61947j27921o9438j6246J8032L5725M1597L8635
37589g29968L2120K8301K8836L1061L1937K8604J9077P618O164K4376N8410R1578
37577c41886J04191Q4168L6937j1747l3369k5589j6150k9405n7132p3223o7693
$$ plain form
37566 -430898 -480765 -505412 -493615 -442905 -375512 -325100 -305367 -302064 -297468 -293435 -308470 -360364
37554 -360364 -453230 -571625 -682101 -748185 -751867 -700055 -610476 -498971 -384181 -294264 -255766
37543 -255766 -274663 -335055 -416870 -509032 -605534 -698165 -780750 -858179 -944190 -1047338 -1160876
37532 -1160876 -1266952 -1347189 -1385118 -1360074 -1247996 -1038926 -757493 -461363 -211930 -41054
37522 -41054 57544 108779 130947 127982 101892 68070 54024 80125 142849 220945 297896 371870
37510 371870 440081 480356 458648 357694 195994 20546 -116255 -180991 -176789 -141256 -115001
37499 -115001 -103052 -73061 2491 110180 209185 270953 291624 272403 209615 110313 1917
37488 1917 -84989 -137369 -158997 -159735 -153426 -155372 -167037 -165299 -118798 -18031 113974 237527
$$ packed form
37566d30898m9867k4647J1797N0710O7393N0412J9733L303M596M033j5035n1894
37554c60364r2866j18395j10476o6084l682N1812Q9579J11505J14790Q9917L8498
37543b55766j8897o0392q1815r2162r6502r2631q2585p7429q6011j03148j13538
37532a160876j06076q0237l7929K5044J12078K09070K81433K96130K49433J70876
37522d1054R8598N1235K2168k965k6090l3822j4046K6101O2724P8096P6951P3974
37510C71870O8211M0275k1708j00954j61700j75448j36801o4736M202L5533K6255
37499a15001J1949K9991P5552J07689R9005O1768K0671j9221o2788r9302j08396
37488A917q6906n2380k1628p38O309j946j1665J738M6501J00767J32005J23553
$$ plain form
37476 237527 318423 342629 323223 294694 291185 325725 391648 478517 577477 674175 749889 794173
37464 794173 809674 803978 785550 767333 759870 753182 716086 624490 487104 338329 212803
37453 212803 132621 107424 129568 169423 190323 176036 140062 107616 94944 106525 142283
37442 142283 199779 273224 358047 457695 581804 734045 899883 1045715 1132432 1135769 1059675
37431 1059675 932884 791473 659852 541650 423945 291375 142420 -1789 -103351
37422 -103351 -127589 -66643 50073 170408 252533 291607 318254 372374 475602 619439 768518
37411 768518 873148 889478 802217 637202 454113 321484 284707 342183 446667 536119
37401 536119 571831 552188 497538 432083 380743 369584 415393 513240 638002 757955 848829
$$ packed form
37476B37527Q0896K4206j9406k8529l509L4540O5923Q6869R8960R6698P5714M4284
37464G94173J5501n696j8428j8217p463o688l7096r1596j37386j48775j25526
37453B12803q0182k5197K2144L9855K0900j4287l5974l2446j2672J1581L5758
37442A42283N7496P3445Q4823R9648J24109J52241J65838J45832Q6717L337p6094
37431A059675j26791j41411j31621j18202j17705j32570j48955j44209j01562
37422a03351k4238O0946J16716J20335Q2125L9074K6647N4120J03228J43837J49079
37411G68518J04630J6330q7261j65015j83089j32629l6777N7476J04484Q9452
37401E36119L5712j9643n4650o5455n1340j1159M5809R7847J24762J19953R0874
$$ plain form
37390 848829 905112 946188 1005020 1097560 1200370 1266174 1266275 1214947 1149539 1088333 1010215 876485
37378 876485 672750 428465 194549 4998 -136499 -240315 -317447 -384426 -461647 -548772
37368 -548772 -608490 -592699 -487292 -320893 -130644 66198 263113 441860 572320 632103
37358 632103 619631 550754 449809 343812 256742 200465 168794 145840 126475 126110 161566
37347 161566 222347 273158 290558 285646 281850 283711 284259 293695 335821 411712 485438 515219 489053
37334 489053 425404 350496 280698 216029 142670 48493 -59413 -160421 -245334 -322754 -394397
37323 -394397 -438624 -431586 -376358 -299343 -225438 -169259 -142340 -148296 -167711 -164320 -117806 -46493
37311 -46493 9695 29679 33277 62915 143327 259671 375259 465910 530674 573851 591879
$$ packed form
37390H48829N6283M1076N8832R2540J02810O5804J01n1328o5408o1206p8118j33730
37378H76485k03735k44285k33916j89551j41497j03816p7132o6979p7221q7125
37368e48772n9718J5791J05407J66399J90249J96842J96915J78747J30460N9783
37358F32103j2472o8877j00945j05997q7070n6277l1671k2954j9365l65L5456
37347A61566O0781N0811J7400m912l796J861N48R436M2126P5891P3726K9781k6166
37334D89053o3649p4908o9798o4669p3359r4177j07906j01008q4913p7420p1643
37323c94397m4227P038N5228P7015P3905N6179K6919n956j9415L391M6514P1313
37311d6493N6188J9984L598K9638Q0412J16344J15588R0651O4764M3177J8028
$$ plain form
37300 591879 583949 563185 545305 530597 505301 456720 379712 273551 142252 -3389 -151096
37289 -151096 -293329 -424559 -537867 -630716 -708052 -770398 -802905 -786326 -717475 -611364 -486585
37278 -486585 -357829 -239561 -144946 -79236 -41546 -31990 -48377 -77418 -100925 -114341 -131710
37267 -131710 -170107 -235317 -323197 -426530 -536564 -642502 -732394 -793943 -818958 -813718 -801789
37256 -801789 -807175 -833371 -863985 -881167 -876832 -851080 -811864 -774973 -751910 -735867 -708728 -660500
37244 -660500 -590280 -490447 -347934 -167219 21067 180423 287262 329657 308620 253073
37234 253073 216996 240840 317123 402992 460370 474429 442883 366773 256259 136296 41462
37223 41462 3554 36087 122953 226472 315301 384458 445518 503298 548150 564816 540760
$$ packed form
37300E91879p930k0764j7880j4708k5296m8581p7008j06161j31299j45641j47707
37289a51096j42233j31230j13308r2849p7336o2346l2507J6579O8851J06111J24779
37278d86585J28756J18268R4615O5710L7690R556j6387k9041k3507j3416j7369
37267a31710l8397o5210q7880j03333j10034j05938q9892o1549k5015N240J1929
37256h01789n386k6196l0614j7182M335K5752L9216L6891K3063J6043K7139M8228
37244f60500P0220R9833J42513J80715J88286J59356J06839M2395k1037n5547
37234B53073l6077K3844P6283Q5869N7378J4059l1546p6110j10514j19963r4834
37223D1462l7908L2533Q6866J03519Q8829O9157O1060N7780M4852J6666k4056
$$ plain form
37212 540760 471581 369500 266390 200796 199765 271096 402068 557840 691638 771830 798597
37201 798597 787444 745041 674429 594948 533289 490217 434200 337860 211033 91471 11631
37190 11631 -21681 -27587 -40460 -88925 -172546 -261187 -323119 -347573 -333343 -267498 -136540 38675
37178 38675 198300 290519 321852 351469 434166 572997 724867 841340 899145 901396 863648
37167 863648 801016 720801 624957 524183 446885 421687 445991 481872 490823 465675 423023
37156 423023 377228 337133 321545 357675 458767 613291 797784 988321 1154741 1255988
37146 1255988 1254771 1139785 932375 671981 393200 113887 -152455 -371908 -489358 -468194
37136 -468194 -331245 -151203 949 90979 114395 80357 12602 -51708 -81849 -69227 -19521
$$ packed form
37212E40760o9179j02081j03110o5594j031P1331J30972J55772J33798Q0192K6767
37201G98597j1153m2403p0612p9481o1659m3072n6017r6340j26827j19562p9840
37190A1631l3312n906j2873m8465q3621q8641o1932k4454J4230O5845J30958J75215
37178C8675J59625R2219L1333K9617Q2697J38831J51870J16473N7805K251l7748
37167H63648o2632q0215r5844j00774p7298k5198K4304L5881Q951k5148m2652
37156D23023m5795m0095j5588L6130J01092J54524J84493J90537J66420J01247
37146A255988j217j14986k07410k60394k78781k79313k66342k19453j17450K1164
37136d68194J36949J80042J52152R0030K3416l4038o7755o4310l0141J2622M9706
$$ plain form
37125 -19521 56474 132022 158368 92990 -62523 -263602 -461828 -635051 -784725 -922258
37115 -922258 -1064685 -1230517 -1425345 -1629302 -1802599 -1906693 -1925660 -1874089 -1785580 -1688643
37105 -1688643 -1589948 -1480048 -1352417 -1212743 -1070837 -929539 -785221 -637872 -497605 -378270
37095 -378270 -283187 -200986 -122744 -63254 -54611 -110114 -198481 -261582 -257843 -187210 -82253 14743
$$ packed form
37125a9521P5995P5548K6346o5378j55513k01079j98226j73223j49674j37533
37115i22258j42427j65832j94828k03957j73297j04094j8967N1571Q8509R6937
37105a688643R8695J09900J27631J39674J41906J41298J44318J47349J40267J19335
37095c78270R5083Q2201P8242N9490Q643n5503q8367o3101L739P0633J04957R6996
$$ [...]
##END NTUPLES=NMR SPECTRUM
##END=
