##TITLE=31Pdec_LR-772-RB-OM1
 CDCl3
  24 sc
 30.10.2023
##JCAMPDX= 6.0         $$ Bruker NMR JCAMP-DX V2.0
##DATA TYPE= NMR SPECTRUM
##DATA CLASS= NTUPLES
##ORIGIN= UXNMR, Bruker Analytische Messtechnik GmbH
##OWNER= root
$$ XWIN-NMR		Version 3.5
$$ Mon Oct 30 16:33:15 2023 Russian Standard Time (UT+4h)  she@DPX200
##.OBSERVE FREQUENCY= 81.013821
##.OBSERVE NUCLEUS= ^31P
##.ACQUISITION MODE= SIMULTANEOUS
##.ACQUISITION SCHEME= undefined
##.AVERAGES= 24
##.DIGITISER RES= 16
##SPECTROMETER/DATA SYSTEM= spect
##.PULSE SEQUENCE= zgpg30
##.SOLVENT NAME= CDCl3
##.SHIFT REFERENCE= (INTERNAL, CDCl3, 0, 248.564)
##AUDIT TRAIL= $$ (NUMBER, WHEN, WHO, WHERE, WHAT)
$$ ##TITLE= Audit trail, XWIN-NMR		Version 3.5
$$ ##JCAMPDX= 5.01
$$ ##ORIGIN= Bruker BioSpin GmbH
$$ ##OWNER= she
$$ F:/spectra/data/she/nmr/P31/1/pdata/1/auditp.txt
$$ ##AUDIT TRAIL=  $$ (NUMBER, WHEN, WHO, WHERE, WHAT)
(   1,<2023-10-30 16:32:00.26 +0400>,<she>,<DPX200>,
      <created by zg, POWCHK disabled, PULCHK disabled
       configuration hash MD5:
       00 E9 B6 7A A2 85 ED C7 34 08 36 98 17 FE 4E 26
       data hash MD5: 32K
       55 20 A0 B7 35 D2 70 52 C2 5C 39 B7 E3 20 3C D3>)
(   2,<2023-10-30 16:32:03.15 +0400>,<she>,<DPX200>,
      <Start of raw data processing
       efp BC_mod = 2 LB = 5 FT_mod = 6 PKNL = 1 PHC0 = -10729.51 PHC1 = 206.89 SI = 64K 
       data hash MD5: 64K
       4A 9A 33 0D 57 43 D2 9A 9F AD 8F AD 57 3F 97 CE>)
(   3,<2023-10-30 16:32:19.96 +0400>,<she>,<DPX200>,
      <pk PHC0 = 26.42355 PHC1 = 0 
       data hash MD5: 64K
       FA A6 75 59 8E BC 2A D4 DB 8B 2A FD 82 3B 97 82>)
(   4,<2023-10-30 16:32:27.53 +0400>,<she>,<DPX200>,
      <abs ABSG = 5 
       data hash MD5: 64K
       EE F8 E1 F9 38 A3 7E CA F4 4B AC 96 32 83 FB 64>)
$$ ##END=
$$ 
$$ hash MD5
$$ 90 DD 97 84 1B 03 43 80 10 85 CC 5B 52 81 67 E3
##$RELAX= 
##$RELAX= 
##$RELAX= 
##$RELAX= 
##$RELAX= 
##$RELAX= 
##$RELAX= 
##$RELAX= 
##$RELAX= 
$$ Bruker specific parameters
$$ --------------------------
##$DU= <F:/spectra>
##$EXPNO= 1
##$NAME= <P31>
##$PROCNO= 1
##$TYPE= <nmr>
##$USER= <she>
##$AMP= (0..31)
100 100 100 100 100 100 100 100 100 100 100 100 100 100 100 100 100 100 
100 100 100 100 100 100 100 100 100 100 100 100 100 100 
##$AQSEQ= 0
##$AQ_mod= 1
##$AUNM= <au_zg>
##$AUTOPOS= <>
##$BF1= 81.014009
##$BF2= 200.13
##$BF3= 200.13
##$BF4= 200.13
##$BF5= 200.13
##$BF6= 200.13
##$BF7= 200.13
##$BF8= 200.13
##$BYTORDA= 1
##$CFDGTYP= 0
##$CFRGTYP= 5
##$CHEMSTR= <none>
##$CNST= (0..31)
1 1 145 1 1 1 1 1 1 1 1 1 1 1 1 1 1 1 1 1 1 1 1 1 1 1 1 1 1 1 1 1 
##$CPDPRG= <waltz16>
##$CPDPRG1= <>
##$CPDPRG2= <waltz16>
##$CPDPRG3= <>
##$CPDPRG4= <mlev>
##$CPDPRG5= <mlev>
##$CPDPRG6= <mlev>
##$CPDPRG7= <mlev>
##$CPDPRG8= <mlev>
##$CPDPRGB= <>
##$CPDPRGT= <>
##$D= (0..31)
0 1 0 0 0 0 0 0 0 0 0 0.03 2e-05 3e-06 0 0 0 0 0 0 0 0 0 0 0 0 0 0 0 0 
0 0 
##$DATE= 1698669119
##$DBL= (0..7)
120 120 120 11 120 120 24 19 
##$DBP= (0..7)
150 150 150 150 150 150 150 150 
##$DBP07= 0
##$DBPNAM0= <>
##$DBPNAM1= <>
$$ [...]
##$SUBNAM3= <"">
##$SUBNAM4= <"">
##$SUBNAM5= <"">
##$SUBNAM6= <"">
##$SUBNAM7= <"">
##$SUBNAM8= <"">
##$SUBNAM9= <"">
##$SW= 501.771253377433
##$SWIBOX= (0..15)
0 1 3 0 0 0 0 0 0 0 0 0 0 0 0 0 
##$SW_h= 40650.406504065
##$TD= 32768
##$TD0= 1
##$TE= 0
##$TE2= 300
##$TE3= 300
##$TEG= 300
##$TL= (0..7)
0 120 53 12 22 120 120 120 
##$TP= (0..7)
150 150 150 150 150 150 150 150 
##$TP07= 0
##$TPNAME0= <>
##$TPNAME1= <>
##$TPNAME2= <>
##$TPNAME3= <>
##$TPNAME4= <>
##$TPNAME5= <>
##$TPNAME6= <>
##$TPNAME7= <>
##$TPOAL= (0..7)
0.5 0.5 0.5 0.5 0.5 0.5 0.5 0.5 
##$TPOFFS= (0..7)
0 0 0 0 0 0 0 0 
##$TUNHIN= 0
##$TUNHOUT= 0
##$TUNXOUT= 0
##$USERA1= <user>
##$USERA2= <user>
##$USERA3= <user>
##$USERA4= <user>
##$USERA5= <user>
##$V9= 5
##$VALIST= <valist>
##$VCLIST= <CCCCCCCCCCCCCCC>
##$VD= 0
##$VDLIST= <DDDDDDDDDDDDDDD>
##$VPLIST= <PPPPPPPPPPPPPPP>
##$VTLIST= <TTTTTTTTTTTTTTT>
##$WBST= 1024
##$WBSW= 4
##$XGAIN= (0..3)
0 0 0 0 
##$XL= 0
##$YL= 0
##$YMAX_a= 1710
##$YMIN_a= -1999
##$ZGOPTNS= <>
##$ZL1= 120
##$ZL2= 120
##$ZL3= 120
##$ZL4= 120
##$ABSF1= 248.5645
##$ABSF2= -253.2056
##$ABSG= 5
##$ABSL= 3
##$ALPHA= 0
##$AQORDER= 0
##$ASSFAC= 0
##$ASSFACI= 0
##$ASSFACX= 0
##$ASSWID= 0
##$AUNMP= <proc_1d>
##$AZFE= 0.1
##$AZFW= 0.5
##$BCFW= 0
##$BC_mod= 2
##$BYTORDP= 0
##$COROFFS= 0
##$CY= -3
##$DATMOD= 1
##$DC= 0
##$DFILT= <>
##$DTYPP= 0
##$F1P= 0
##$F2P= 0
##$FCOR= 1
##$FTSIZE= 65536
##$FT_mod= 6
##$GAMMA= 0
##$GB= 0
##$INTBC= 1
##$INTSCL= 6.047779e-11
##$ISEN= 30
##$LB= 5
##$LEV0= 0
##$LPBIN= 0
##$MAXI= 10000
##$MC2= 0
##$MEAN= 0
##$ME_mod= 0
##$MI= 50
##$NCOEF= 0
##$NC_proc= -10
##$NLEV= 6
##$NOISF1= 182.463
##$NOISF2= 159.3651
##$NSP= 0
##$NTH_PI= 0
##$NZP= 0
##$OFFSET= 248.5645
##$PC= 4
##$PHC0= -10703.09
##$PHC1= 206.89
##$PH_mod= 1
##$PKNL= yes
##$PPARMOD= 0
##$PSCAL= 0
##$PSIGN= 0
##$REVERSE= no
##$SF= 81.0140089999694
##$SI= 65536
##$SIGF1= 159.3651
##$SIGF2= -187.1042
##$SINO= 113.3802
##$SIOLD= 16384
##$SREGLST= <1H.CDCl3>
##$SSB= 0
##$STSI= 65536
##$STSR= 0
##$SW_p= 40650.406504065
##$SYMM= 0
##$S_DEV= 0
##$TDeff= 32768
##$TDoff= 0
##$TI= <>
##$TILT= no
##$TM1= 0
##$TM2= 0
##$TOPLEV= 0
##$USERP1= <user>
##$USERP2= <user>
##$USERP3= <user>
##$USERP4= <user>
##$USERP5= <user>
##$WDW= 1
##$XDIM= 65536
##$YMAX_p= 323367509
##$YMIN_p= -230375156
$$ End of Bruker specific parameters
$$ ---------------------------------
##NTUPLES= NMR SPECTRUM
##VAR_NAME=  FREQUENCY,     SPECTRUM/REAL,   SPECTRUM/IMAG
##SYMBOL=    X,             R,               I
##VAR_TYPE=  INDEPENDENT,   DEPENDENT,       DEPENDENT
##VAR_FORM=  AFFN,          ASDF,            ASDF
##VAR_DIM=   65536,         65536,           65536
##UNITS=     HZ,            ARBITRARY UNITS, ARBITRARY UNITS
##FACTOR=    0.620285442955139, 1,           1
##FIRST=     20137.2065510682, 0,            0
##LAST=      -20513.1999529968, 0,           0
##MIN=       -20513.1999529968, -230375156,  0
##MAX=       20137.2065510682, 323367509,    0
$$ Real data points
##PAGE= N=1
##DATA TABLE= (X++(R..R)), XYDATA
$$ [...]
45157 -7393818 -5645776 -4728838 -4617847 -4775575 -4513855 -3443382 -1735657 51608 1504406
45148 1504406 2735451 4208018 6201352 8497243 10555189 11900789 12324812 11799073
45140 11799073 10335205 8035261 5304668 2897016 1544539 1430619 2069644 2758074
45132 2758074 3104725 3130886 3036293 3044667 3401724 4276651 5539845 6708779 7211117 6751482
45122 6751482 5501991 4026036 2973165 2666500 2848216 2834412 2001900 222942 -2055964
45113 -2055964 -4091376 -5287744 -5552472 -5295981 -5042351 -5026596 -5198130 -5525695 -6112108
45104 -6112108 -6985714 -7984749 -8995339 -10189424 -11842053 -13905896 -15861061 -16994518
45096 -16994518 -16818452 -15351480 -13175511 -11199431 -10138914 -10032519 -10239283 -9962782 -8831631
45087 -8831631 -7047731 -5058963 -3107723 -1044164 1461266 4511896 7758366 10538855
45079 10538855 12222685 12487395 11440422 9603146 7703113 6288824 5438860 4839924
45071 4839924 4123993 3118285 1891345 717516 -42425 -221697 -53358 70472 113721
45062 113721 498138 1561274 3047455 4303302 4895747 4875156 4509747 3990851 3420660
45053 3420660 2881131 2399367 1931135 1431271 854354 67933 -1081146 -2511383 -3832936
45044 -3832936 -4679508 -5077249 -5353713 -5678953 -5808603 -5325423 -4082650 -2389136 -804330
45035 -804330 235907 654801 670053 522599 274411 -139549 -719369 -1328661 -1811522 -2118448
45025 -2118448 -2291654 -2368293 -2328188 -2112404 -1688544 -1166960 -905091 -1412463 -2976856 -5296269
45015 -5296269 -7559386 -9020680 -9545089 -9578793 -9626216 -9832962 -10066551 -10266509 -10592233
45006 -10592233 -11242480 -12218380 -13287713 -14130894 -14500295 -14296561 -13580066 -12562304 -11572406
44997 -11572406 -10947297 -10842548 -11096173 -11310235 -11117042 -10389467 -9247749 -7975696 -6972507
44988 -6972507 -6649081 -7187605 -8382170 -9821758 -11252745 -12674848 -14068694 -15147051
44980 -15147051 -15458165 -14706272 -12959209 -10605726 -8116503 -5742142 -3379218 -779459
44972 -779459 2095899 5007167 7699435 10045271 11842062 12688503 12323253 11038647 9525360
44963 9525360 8260298 7188737 6016371 4629327 3146229 1697792 271695 -1286818
44955 -1286818 -3180269 -5474082 -7912042 -9965350 -11149400 -11292070 -10512191 -9080425
44947 -9080425 -7412328 -6081030 -5594062 -6046301 -7058533 -8132479 -9056119 -9936744 -10875085
44938 -10875085 -11689496 -12026074 -11741839 -11109138 -10565156 -10263476 -9935107 -9195605 -7925697
44929 -7925697 -6368041 -5003357 -4420346 -5138268 -7257799 -10163972 -12714165 -13921023
44921 -13921023 -13542219 -12033450 -10002641 -7781057 -5463649 -3188466 -1252922 12122
44913 12122 401737 -107077 -1360597 -3064162 -4883100 -6547438 -7835042 -8512646 -8481159
44904 -8481159 -8076953 -8070700 -9134330 -11268497 -13845815 -16192604 -18025566 -19402758 -20503593
44895 -20503593 -21544216 -22705405 -23947716 -24931772 -25221071 -24552053 -22904154 -20432486
44887 -20432486 -17417798 -14174668 -10876575 -7502281 -4019310 -557319 2640613 5296258
44879 5296258 7015301 7306168 5951290 3369484 435628 -2077920 -3781492 -4515119
44871 -4515119 -4234420 -3146283 -1727206 -423611 588763 1281950 1580166 1453481 1108933
44862 1108933 878307 876785 873609 532867 -267558 -1352196 -2414931 -3241039 -3793513 -4125879
44852 -4125879 -4268611 -4248869 -4181503 -4231974 -4456193 -4755553 -5030149 -5302270 -5635446 -5989429
44842 -5989429 -6201069 -6055335 -5355964 -4035396 -2275403 -431201 1273050 2926687 4721976
44833 4721976 6608479 8240416 9200349 9163803 7928974 5506773 2253950 -1208899 -4310216
44824 -4310216 -6752587 -8476786 -9545921 -10112371 -10373354 -10440319 -10270152 -9774724 -8979732
44815 -8979732 -8070080 -7343539 -7136359 -7680197 -8913821 -10452978 -11839717 -12865641 -13648777
44806 -13648777 -14404165 -15136168 -15512939 -15039446 -13446285 -11000403 -8416892 -6391091 -5180787
44797 -5180787 -4606816 -4342130 -4093649 -3578614 -2550636 -992480 785737 2385735 3690883
44788 3690883 4914116 6229494 7438072 8127880 8178225 7975391 8022910 8400500 8732139
44779 8732139 8650955 8119361 7263318 6127905 4806064 3693882 3331920 3907721 5054682
44770 5054682 6191760 6916826 7012473 6295946 4735314 2708123 934958 38959 194802
44761 194802 1179041 2620688 4137450 5362506 6034992 6136224 5888453 5568836 5314700
44752 5314700 5107638 4936831 4968918 5539557 6936479 9146068 11793015 14333204 16329126
44743 16329126 17585154 18074990 17778549 16611654 14547068 11828443 9020404 6745169
44735 6745169 5310029 4607642 4357525 4321904 4221840 3618141 2173077 131148 -1638962
44726 -1638962 -2275233 -1594011 -77607 1696583 3437929 5007129 6190626 6803752 6912037
44717 6912037 6752785 6430595 5815267 4747918 3227819 1373751 -664889 -2683968 -4425414
44708 -4425414 -5738263 -6726856 -7662914 -8755573 -10037825 -11415352 -12741060 -13870396
44700 -13870396 -14718763 -15232489 -15238324 -14420859 -12643040 -10291555 -8087734 -6438131 -5113341
44691 -5113341 -3707524 -2298012 -1447876 -1574358 -2502050 -3698132 -4814015 -5900206 -7171145
44682 -7171145 -8686042 -10269936 -11663835 -12693343 -13302401 -13468417 -13121419 -12166683 -10614189
44673 -10614189 -8718429 -6958002 -5736581 -4973900 -4041740 -2283921 319094 3061180
44665 3061180 5077182 5887980 5438290 3916596 1759515 -362184 -1900536 -2796020 -3290257
44656 -3290257 -3400481 -2827490 -1418968 536015 2587547 4473466 6017681 6873404 6651214
44647 6651214 5316308 3307494 1231065 -503067 -1778105 -2606670 -2906024 -2455890 -1156520
44638 -1156520 662131 2325973 3303060 3511310 3077183 1962978 36631 -2560569 -5318746
44629 -5318746 -7616697 -8921200 -8818774 -7184911 -4484501 -1706873 256291 1216246
44621 1216246 1628515 1992453 2408805 2697275 2779846 2789146 2785508 2523327 1697191 455154
44611 455154 -503194 -485924 592552 2259187 4000289 5531906 6625801 6976716 6399328
44602 6399328 5024483 3172222 1101890 -1028275 -3029158 -4606060 -5400844 -5106423
44594 -5106423 -3648672 -1326903 1297464 3716421 5640091 6878586 7266565 6847897
44586 6847897 6006418 5217194 4687698 4364991 4234153 4429105 5042089 5981323 7056334
44577 7056334 8078723 8840625 9129080 8854592 8101788 7007463 5682305 4331371 3363563
44568 3363563 3235079 4143194 5899155 8075272 10233602 12066792 13451018 14444581 15212916
44559 15212916 15892171 16480409 16834698 16764895 16151895 15014058 13485500 11741738 9955108
44550 9955108 8309781 7003506 6171359 5804975 5794181 6052919 6533241 7076212 7344131
44541 7344131 7046429 6254776 5389317 4844944 4712486 4902879 5394036 6183290 7050923
44532 7050923 7590927 7579635 7224197 6958732 7026128 7299008 7469736 7377445 7176394 7202928
44522 7202928 7646493 8343846 8918773 9080902 8718940 7792619 6359957 4758563 3504034
44513 3504034 2776213 2100385 776472 -1341865 -3628736 -5255939 -5862054 -5662144 -5081236
44504 -5081236 -4408917 -3733275 -3033169 -2227222 -1168479 238631 1732062 2520727 1685350
44495 1685350 -1017335 -4808335 -8520919 -11557266 -14067067 -16262030 -17876336 -18455146
44487 -18455146 -17966362 -16876851 -15646228 -14314997 -12631145 -10473357 -8057756 -5732668
44479 -5732668 -3641971 -1672433 266262 2026547 3372805 4246730 4737625 4855164 4531385
44470 4531385 3844244 3022540 2178266 1260442 397105 83030 832265 2731075 5438093
44461 5438093 8458882 11256547 13304609 14386762 14853446 15315317 16005347 16592028 16612672
44452 16612672 15889895 14531119 12818249 11241141 10393926 10559061 11404032 12205803 12359278
44443 12359278 11668354 10332631 8811099 7566744 6702705 5833966 4469324 2553530
44435 2553530 563017 -878792 -1354903 -709679 971107 3300702 5642588 7376811
44427 7376811 8148727 7919147 6944121 5771732 5070683 5235637 6135591 7314987 8392818
44418 8392818 9207035 9715309 9978924 10228443 10721141 11449111 12120634 12471799 12428765 11897027
44408 11897027 10623055 8489329 5849968 3366795 1549531 605088 621749 1601952 3282469
44399 3282469 5205091 7109189 9079972 11190365 13171764 14587815 15178037 14863989
44391 14863989 13596344 11489626 9064565 7052197 5821852 5090923 4205254 2601866
44383 2601866 82373 -3077798 -6174555 -8437905 -9564616 -9883716 -9954005 -10078191 -10216906
44374 -10216906 -10181733 -9792231 -9026973 -8222303 -7982679 -8603804 -9584711 -9959060 -9173351
44365 -9173351 -7456240 -5308566 -2938638 -403855 1936260 3500590 4073986 4088502 4222449
44356 4222449 4825872 5736608 6441074 6303995 4874627 2294840 -557845 -2563028 -3170915
44347 -3170915 -2732898 -2032128 -1587942 -1462626 -1595475 -2094451 -3110844 -4521260 -5866649
44338 -5866649 -6655449 -6705355 -6182026 -5367326 -4465474 -3601149 -2856541 -2216410 -1559091 -820328
44328 -820328 -134372 277661 298409 -125084 -1093335 -2531980 -3815571 -3953053 -2436106
44319 -2436106 193619 2824549 4757144 6060741 7104031 8052332 8875491 9591704 10324942
44310 10324942 11173428 12071385 12739456 12824626 12242342 11379607 10778758 10557359 10287175
44301 10287175 9514361 8254026 6891123 5767218 5038177 4835956 5326272 6501779 7970072
44292 7970072 9027776 9046499 7908981 6094103 4246237 2626764 1062142 -577447
44284 -577447 -2017007 -2794649 -2743028 -2160826 -1579670 -1430446 -1828063 -2533055 -3117927 -3230836
44274 -3230836 -2714027 -1540271 200771 2227790 4182430 5945212 7688277 9472479
44266 9472479 10929930 11526566 11057219 9736610 7914532 5890174 3923458 2225266
44258 2225266 974207 484577 1218197 3344510 6308717 9098332 10987071 11865333 11931997
44249 11931997 11387542 10466134 9420754 8276297 6774680 4693821 2063680 -1008411
44241 -1008411 -4491625 -8240099 -11817265 -14702750 -16603044 -17485170 -17475982 -16865034 -16034904
44232 -16034904 -15178117 -14140091 -12655971 -10657612 -8296066 -5875162 -3913925 -3028996
44224 -3028996 -3444506 -4693547 -6031254 -7063779 -7791926 -8244943 -8448461 -8668908 -9242672
44215 -9242672 -10073225 -10666558 -10815722 -10923734 -11426650 -12145466 -12461253 -11963994 -10695847
44206 -10695847 -8906184 -6848407 -4754362 -2729468 -628025 1786679 4503664 7184281
44198 7184281 9413372 10926863 11636671 11603645 11014293 10053484 8775176 7214141 5607645
44189 5607645 4292778 3283350 2131213 414390 -1665953 -3308102 -3729130 -2701850
44181 -2701850 -561664 2133986 4897998 7400814 9433869 10885417 11797875 12414838
44173 12414838 13024731 13626458 13802753 13081925 11444429 9347402 7229319 5132433 2852198
44164 2852198 279663 -2511037 -5338959 -7901348 -9825223 -10982968 -11695155 -12347822
44156 -12347822 -12792734 -12403226 -10832159 -8496667 -6178592 -4334395 -2950115 -1872871
44148 -1872871 -1034766 -466649 -375401 -1181352 -3182030 -6065492 -8933744 -10936895 -11821953
44139 -11821953 -11858468 -11421963 -10783065 -10156665 -9708760 -9445639 -9194843 -8774844 -8194052
44130 -8194052 -7697499 -7640868 -8287276 -9639441 -11390937 -13021903 -13997696 -13988629 -13016102
44121 -13016102 -11450016 -9856681 -8777441 -8522514 -9033286 -9890665 -10538492 -10615340 -10117981
44112 -10117981 -9260104 -8224133 -7077790 -5859627 -4647304 -3529299 -2542859 -1630604
44104 -1630604 -655641 467531 1607090 2455058 2819852 2828648 2774374 2852914 3145807 3706828
44094 3706828 4415071 4786945 4233170 2611372 346267 -2043776 -4281647 -6075543 -6867103
44085 -6867103 -6236931 -4514144 -2638519 -1289225 -299789 1002920 3013056 5443277
44077 5443277 7556513 8715588 8837498 8452249 8274925 8588689 9002578 8849384 7842648
44068 7842648 6353359 5083756 4510666 4627180 5139562 5797727 6451969 6835057 6485366
44059 6485366 5076902 2828474 428769 -1548618 -3101515 -4590534 -6112104 -7193791
44051 -7193791 -7169621 -5824279 -3630697 -1382215 356004 1459653 2055542 2262499 2113470
44042 2113470 1585892 601145 -944149 -3012319 -5265795 -7172033 -8353113 -8849143 -9054658
44033 -9054658 -9435770 -10281500 -11598977 -13131619 -14494718 -15402997 -15835486 -15961320 -15876348
44024 -15876348 -15442530 -14442054 -12885380 -11082929 -9342865 -7649302 -5770748 -3723488
44016 -3723488 -1988876 -1109387 -1071481 -1206661 -736652 654425 2753763 5099913 7166019
44007 7166019 8412018 8487718 7549088 6250826 5239840 4618342 3961009 2858421 1398352
43998 1398352 135584 -336181 216436 1583131 3329368 5108194 6811925 8443567
43990 8443567 9856132 10673515 10534547 9438634 7837181 6369505 5482235 5238018 5402278
43981 5402278 5655329 5726820 5400322 4509080 3022555 1118222 -943197 -3067568 -5367599
43972 -5367599 -7855349 -10144451 -11604879 -11869504 -11126419 -9897573 -8628200 -7545679
43964 -7545679 -6802126 -6586539 -7056049 -8206303 -9792665 -11306941 -12071364 -11545607 -9707415
43955 -9707415 -7133952 -4627737 -2741203 -1684064 -1611764 -2804057 -5404486 -8993692
43947 -8993692 -12526643 -14782376 -14979281 -13144747 -10087730 -7017751 -4952637 -4219911
43939 -4219911 -4413969 -4843131 -5039578 -4900197 -4500665 -3931776 -3297281 -2719134 -2260432
43930 -2260432 -1876199 -1458759 -891269 -63569 1081977 2476729 3935132 5258738 6308229
43921 6308229 7000852 7312573 7268502 6833888 5839019 4198701 2291152 947098 865615
43912 865615 2058174 3954849 5965444 7789694 9271637 10220749 10479897 10045765 9049836
43903 9049836 7701108 6267708 4992631 3976128 3248121 2989222 3512300 4900679 6778965
43894 6778965 8588328 10019516 11042495 11596062 11463164 10488931 8784722 6684087 4614947
43885 4614947 3036482 2338936 2662892 3811435 5340371 6686451 7274877 6734955 5177166
43876 5177166 3200468 1510802 528597 358945 988277 2366714 4367485 6805113 9450579
43867 9450579 11900473 13506809 13682235 12386063 10224176 8021461 6340671 5344163
43859 5344163 4897591 4708193 4505582 4213264 3879604 3406654 2517057 1127055 -378217
43850 -378217 -1428155 -1766672 -1510563 -784476 464652 2245965 4297018 6162959 7416396
43841 7416396 7811965 7425437 6740295 6414290 6738962 7340429 7544837 7041053 6096519
43832 6096519 5169327 4488240 4069971 3957675 4210981 4662796 4905476 4679668 4214366
43823 4214366 4048954 4543031 5680827 7310074 9345178 11644979 13889949 15779932
43815 15779932 17275372 18468765 19260390 19337692 18496325 16886650 14987172 13457308 12917981
43806 12917981 13591607 15047483 16448668 17149765 16992989 16059333 14371120 11985926 9256134
43797 9256134 6824203 5338441 5149091 6146503 7830816 9652236 11374918 13071635
43789 13071635 14801005 16466199 18000910 19427724 20588539 21061047 20599026 19520311
43781 19520311 18390717 17385066 16217993 14701645 13129917 12040968 11745840 12119180
43773 12119180 12702976 12970083 12616931 11676888 10323987 8627955 6623856 4555482 2814723
43764 2814723 1549666 454276 -988987 -3135579 -6018313 -9338734 -12485621 -14701418
43756 -14701418 -15454301 -14740157 -13029403 -10937490 -8917963 -7168567 -5759847 -4848911
43748 -4848911 -4715312 -5466754 -6681516 -7480294 -7113887 -5542603 -3447543 -1686179 -698923
43739 -698923 -326911 -79206 478738 1545073 3117113 5028907 6961719 8614432 9963898
43730 9963898 11200510 12275523 12690182 11977347 10311249 8396544 6805340 5692559
43722 5692559 5131254 5347409 6445714 8138704 9933336 11436275 12365523 12507118 11937082
43713 11937082 11201756 11020117 11734735 13093664 14486397 15302572 15192834 14212412 12775104
43704 12775104 11387431 10362184 9700317 9090382 7995054 5972702 3140745 260935
43696 260935 -1819284 -2837637 -3189321 -3424494 -3773515 -4065330 -3961430 -3325870 -2489903
43687 -2489903 -2056747 -2249189 -2485265 -1806759 219776 3114153 5919829 7845081 8539344
43678 8539344 8092468 6999314 6005705 5734582 6330595 7433470 8474417 9040370 9069995
43669 9069995 8779306 8395751 7950736 7313061 6350794 5004392 3282630 1315908 -604013
43660 -604013 -2163327 -3234982 -3884125 -4192994 -4196735 -3996667 -3803529 -3799294 -4016375 -4383695
43650 -4383695 -4827479 -5293012 -5714903 -6004742 -6091409 -6050980 -6239633 -7161068 -9013471 -11390486
43640 -11390486 -13599034 -15269994 -16478523 -17257069 -17236238 -15909848 -13116481 -9136249
43632 -9136249 -4436231 535967 5402615 9889399 13842923 17163400 19746883 21524195
43624 21524195 22481167 22591957 21840449 20410888 18776610 17470029 16775257 16680179 16997253
43615 16997253 17377415 17304558 16353028 14585382 12618038 11200844 10690074 10832260 10929057
43606 10929057 10231883 8364465 5515136 2237107 -943561 -3707413 -5818066 -7026090
43598 -7026090 -7226976 -6642698 -5710323 -4780665 -4000485 -3459418 -3281347 -3453532 -3664479
43589 -3664479 -3525718 -3035057 -2689824 -2995839 -3891549 -4767331 -5044324 -4647249 -3961649
43580 -3961649 -3504329 -3646280 -4420344 -5437514 -6133678 -6285172 -6187434 -6121155 -5719428 -4166092
43570 -4166092 -1128105 2685566 5989061 7807850 7882694 6514048 4339153 2176055
43562 2176055 700007 55658 -123039 -206336 -140722 429313 1718407 3567116 5543723
43553 5543723 7111178 7715990 6920775 4625884 1200708 -2618291 -5986823 -8222549
43545 -8222549 -9010898 -8480764 -7082302 -5340615 -3680652 -2390521 -1609127 -1309110 -1404084
43536 -1404084 -1939869 -3057849 -4637573 -6077093 -6671835 -6310982 -5704246 -5828131 -7130102
43527 -7130102 -9208509 -11139262 -12087575 -11749215 -10384237 -8534535 -6747887 -5505474
43519 -5505474 -5189132 -5888552 -7243286 -8641298 -9612645 -9936931 -9451472 -8052448 -5996804
43510 -5996804 -3952543 -2518397 -1785434 -1511518 -1576628 -2050855 -2928321 -4085911 -5518610
43501 -5518610 -7355898 -9524056 -11526657 -12674756 -12521830 -11113508 -8934882 -6617669
43493 -6617669 -4557486 -2739583 -961693 829870 2544062 4228326 6133171 8414825
43485 8414825 10889221 13118153 14616807 14977568 14032364 12078405 9855036 8140210
43477 8140210 7348137 7488939 8337085 9522613 10621324 11394932 11960623 12605782 13429316
43468 13429316 14229447 14691369 14585765 13845065 12618576 11306799 10440648 10421491 11312958
43459 11312958 12806409 14357301 15462865 15958221 16081651 16222161 16624681 17347711 18384136
43450 18384136 19678510 21044791 22184945 22821626 22794870 22099096 20902961 19452415 17827225
43441 17827225 15850082 13385058 10682832 8244445 6340281 4862624 3707826 3102601
43433 3102601 3414316 4749952 6843673 9207675 11242739 12320062 12041825 10573724
43425 10573724 8675777 7302771 7058459 7878346 9113078 9940247 9843072 8842928 7367837
43416 7367837 5938441 4935822 4535053 4716184 5272139 5836095 6009997 5600638 4771688
43407 4771688 3862302 2975518 1862189 381376 -1001896 -1453283 -611078 956644 2220138
43398 2220138 2496584 1791493 627615 -248379 -197163 904934 2513799 3829473 4390411
43389 4390411 4197129 3396753 2116450 589071 -870989 -2155772 -3417467 -4675577
43381 -4675577 -5550647 -5630148 -5047544 -4474015 -4470960 -4960072 -5379247 -5271002 -4648001 -3843048
43371 -3843048 -3133614 -2595456 -2285364 -2429273 -3304437 -4923251 -6903150 -8696463 -9958214
43362 -9958214 -10713969 -11191870 -11462988 -11232393 -10074738 -7974385 -5565264 -3672997 -2599770
43353 -2599770 -1980272 -1337062 -596083 6990 325882 427472 415000 312060 100121 -273348
43343 -273348 -925690 -1956312 -3307144 -4778211 -6176513 -7375781 -8266051 -8779591 -8982987
43334 -8982987 -9000495 -8772974 -8016945 -6565580 -4712407 -3067910 -2019297 -1408859 -805112
43325 -805112 -17317 784518 1452770 2181917 3283334 4699966 5944749 6587138 6664967
43316 6664967 6525830 6386037 6191259 5845907 5418352 5111305 5117353 5453093 5796710 5538087
43306 5538087 4228134 2090459 -46292 -1452214 -2091871 -2490313 -3125638 -4030347 -4854139
43297 -4854139 -5152244 -4668788 -3521296 -2158590 -1062643 -476784 -449670 -1036340 -2277508
43288 -2277508 -3984324 -5723412 -7084372 -7839493 -7797234 -6694218 -4417073 -1249051 2290649
43279 2290649 5834810 9223369 12163905 14068561 14428126 13319210 11411964 9446238
43271 9446238 7744639 6208107 4658951 3098141 1680856 577767 -77947 -205270
43263 -205270 106191 468366 333835 -593021 -2093800 -3652651 -4893722 -5725969 -6155637
43254 -6155637 -6199026 -6058649 -6183426 -6952531 -8339425 -10003209 -11634652 -13034250 -13863822
43245 -13863822 -13540036 -11534264 -7783833 -2822442 2404055 6852784 9721486 10736399
43237 10736399 10231080 8899441 7339671 5700936 3721045 1180002 -1597696 -3724646
43229 -3724646 -4335057 -3213494 -832998 2113565 5057927 7522115 9086390 9613533
43221 9613533 9392382 8883163 8367917 7958601 7820350 8128600 8762186 9235886 9084105
43212 9084105 8284653 7264131 6535159 6363517 6733518 7551370 8815180 10526762 12432420
43203 12432420 13971771 14643789 14449474 13869186 13357457 12933395 12296829 11230689 9777274
43194 9777274 8083717 6245464 4373698 2727999 1659740 1387357 1854985 2811479 3969511
43185 3969511 5044331 5693200 5551360 4436278 2544334 423446 -1304301 -2303105 -2730218
43176 -2730218 -3105969 -3885141 -5072694 -6252349 -6973906 -7053150 -6520326 -5434778 -3845618
43167 -3845618 -1822088 612425 3496189 6696106 9661457 11597989 12009421 11053898
43159 11053898 9387418 7745812 6641506 6235998 6302609 6326176 5788915 4486478 2648516
43150 2648516 808368 -473488 -895241 -569894 45207 385910 3134 -1330668 -3581957
43141 -3581957 -6443868 -9392754 -11824074 -13217875 -13318460 -12299021 -10740818 -9285070
43133 -9285070 -8177346 -7166038 -5886164 -4316022 -2850595 -1997720 -2036043 -2884938 -4218283
43124 -4218283 -5727918 -7340352 -9170317 -11228382 -13196543 -14530020 -14775977 -13809329
43116 -13809329 -11857805 -9393481 -6969267 -5028664 -3751216 -3011122 -2468098 -1763650
43108 -1763650 -749276 421209 1468192 2274378 2934303 3512504 3897945 4018100 4102748
43099 4102748 4556578 5563444 6942870 8398019 9754614 10914443 11746231 12172247 12298948
43090 12298948 12340019 12446005 12706124 13231707 14009360 14609003 14256037 12429902 9387958
43081 9387958 5965386 2874211 346125 -1565751 -2646481 -2742126 -2210089 -1814696 -2030418
43072 -2030418 -2593388 -2886880 -2699315 -2456674 -2707194 -3491618 -4272597 -4428377 -3761177
43063 -3761177 -2546313 -1170234 191416 1521912 2685864 3342363 3195758 2289195 1001690
43054 1001690 -231754 -1190097 -1928799 -2662146 -3590189 -4773971 -6109898 -7380450 -8308933
43045 -8308933 -8599157 -8028866 -6626305 -4803481 -3254188 -2579297 -2871708 -3630706 -4171776
43036 -4171776 -4225130 -4140968 -4470672 -5377381 -6506918 -7366233 -7696104 -7498710 -6893141 -6039468
43026 -6039468 -5080147 -4034774 -2822978 -1497024 -390596 81106 -254451 -1278163 -2780058
43017 -2780058 -4566880 -6397386 -7978372 -9086504 -9623240 -9565647 -9003706 -8252831 -7756462
43008 -7756462 -7752601 -8126581 -8691652 -9495306 -10666689 -12012132 -12986647 -13138853 -12439996
42999 -12439996 -11106480 -9268398 -6964344 -4325528 -1518232 1468144 4692230 7807239
42991 7807239 9985679 10578492 9819669 8674851 7961456 7737408 7519928 6883851 5768322
42982 5768322 4416035 3244237 2729441 3191092 4550219 6318259 7887069 8886349 9317987
42973 9317987 9388356 9229792 8801044 8045391 7054520 5990036 4899671 3732553 2490026
42964 2490026 1172217 -436872 -2674416 -5515121 -8338412 -10402211 -11510603 -12050073
42956 -12050073 -12405943 -12527550 -12093298 -10966432 -9441086 -8095674 -7348974 -7016657 -6327239
42947 -6327239 -4568771 -1803402 1155313 3505319 5080519 6203033 7119728 7745171
42939 7745171 7852557 7309380 6097870 4243030 1813052 -1040186 -4100656 -7164843
42931 -7164843 -10086507 -12736690 -14941840 -16513640 -17363374 -17549276 -17196567 -16448715 -15552369
42922 -15552369 -14878868 -14691356 -14887133 -15099074 -15072294 -14837461 -14522863 -14158099 -13713991
42913 -13713991 -13180986 -12512981 -11618278 -10521445 -9450486 -8673212 -8336053 -8527592 -9321910
42904 -9321910 -10574585 -11814523 -12614298 -13049697 -13533631 -14154366 -14437551 -13888841 -12561930
42895 -12561930 -10917210 -9285790 -7693250 -6097445 -4512385 -2881792 -1097510 718832
42887 718832 2113175 2652909 2348428 1627898 929010 379342 -199675 -1104962 -2547686
42878 -2547686 -4496197 -6665471 -8711716 -10436573 -11741543 -12441239 -12309318 -11382508 -10072531
42869 -10072531 -8838760 -7811202 -6830730 -5764671 -4631896 -3495216 -2461026 -1814317
42861 -1814317 -1922128 -2842355 -4120638 -5094757 -5350860 -4835695 -3685576 -2147115 -611994
42852 -611994 503083 1004121 970637 575299 9789 -395280 -222719 653116 1833423
42843 1833423 2734908 3144593 3298338 3472787 3732954 4106927 4729703 5622635 6500517
42834 6500517 7044786 7314008 7651768 8166282 8500130 8194060 7143460 5624303 3997442
42825 3997442 2486284 1146882 -57502 -1094617 -1681342 -1334416 240317 2763510
42817 2763510 5445850 7479987 8512234 8728400 8557752 8263692 7757467 6813458 5475810
42808 5475810 4184329 3435434 3349811 3601557 3704411 3343122 2575866 1860360 1787237 2573131
42798 2573131 3781836 4674761 4871961 4600506 4351450 4463843 5032596 5962949 6918843
42789 6918843 7301351 6490653 4260417 1049882 -2139575 -4261424 -4903696 -4572792 -4196541
42780 -4196541 -4262315 -4511273 -4481645 -4159170 -3960580 -4218985 -4874750 -5612571 -6122385 -6233877
42770 -6233877 -5954501 -5419079 -4718748 -3783931 -2536165 -1150580 -50160 384958 16543
42761 16543 -1108280 -2804602 -4632472 -5908642 -6104083 -5310487 -4212035 -3513087 -3394403
42752 -3394403 -3515385 -3469890 -3184172 -2911234 -2933347 -3329245 -4009051 -4892500 -5965946 -7141890
42742 -7141890 -8128973 -8540356 -8177509 -7186137 -5914723 -4657308 -3581401 -2881499 -2897767
42733 -2897767 -3966856 -6084067 -8709524 -10985580 -12269892 -12529093 -12194212 -11627014 -10809444
42724 -10809444 -9591645 -8094420 -6686808 -5628860 -4958494 -4731265 -5078142 -5848002 -6401382
42715 -6401382 -6066058 -4832787 -3455342 -2820188 -3242623 -4290531 -5181952 -5414945 -5139745
42706 -5139745 -4899514 -4950075 -4945484 -4407151 -3347366 -2210208 -1319663 -698298 -395279 -608957
42696 -608957 -1329267 -2120755 -2457119 -2127765 -1204982 177766 1803291 3247906 4011491
42687 4011491 3813235 2750495 1278877 66444 -346082 72319 863739 1552070 1957720
42678 1957720 2009030 1558885 674179 -75209 26781 1199654 3095367 5282627 7497382
42669 7497382 9433969 10674761 11049023 10914767 10922737 11514186 12613793 13664972 13975587
42660 13975587 13245365 11843847 10427557 9231393 7903500 6094557 3990034 2111827
42652 2111827 769455 -101265 -689610 -1146246 -1632818 -2300188 -3143270 -4003608 -4781878
42643 -4781878 -5577233 -6582666 -7905298 -9509153 -11257811 -12966855 -14473550 -15725572
42635 -15725572 -16790750 -17731014 -18463041 -18779178 -18519219 -17699639 -16477801 -15063245 -13739275
42626 -13739275 -12915685 -12959783 -13801689 -14720064 -14673328 -12984968 -9789757 -5897676 -2290348
42617 -2290348 318431 1653737 1846271 1305642 543561 -13955 -132001 281156 1289368
42608 1289368 2911258 4940037 6882844 8252925 8955042 9269747 9446855 9478270 9327136
42599 9327136 9164737 9192205 9359992 9480968 9542562 9676007 9861749 9937434 9936115 10148669
42589 10148669 10714153 11329314 11510687 11022129 9929129 8378259 6507362 4502199 2540560
42580 2540560 624825 -1457784 -3967781 -6971510 -10172587 -12958769 -14754824 -15459837
42572 -15459837 -15487296 -15274765 -14792222 -13620102 -11475262 -8579165 -5546331 -2990742 -1192186
42563 -1192186 -24629 820108 1499228 1905240 1865382 1349692 437193 -769834 -2044358
42554 -2044358 -2972018 -3257662 -3128662 -3209589 -3862709 -4749517 -5119870 -4430574 -2619375
42545 -2619375 38159 3083623 5889232 7784974 8427753 8091719 7482283 7152613 7085181
42536 7085181 6878526 6308299 5580396 4982916 4449605 3688175 2734923 2145561 2488801
42527 2488801 3773667 5539612 7428144 9445057 11645339 13796638 15506208 16535505
42519 16535505 16784217 16039495 14038363 10908628 7347717 4123694 1430559 -1075397
42511 -1075397 -3605668 -5826293 -7201952 -7561509 -7161739 -6348709 -5410982 -4696689 -4523947
42502 -4523947 -4819293 -5072737 -4886418 -4472702 -4396571 -4879851 -5604611 -6235428 -6883669 -7887529
42492 -7887529 -9259491 -10517705 -11005255 -10253251 -8137507 -4946061 -1386597 1643301
42484 1643301 3490882 4024563 3527586 2420788 1105795 -92156 -1023603 -1761825 -2412047
42475 -2412047 -2810112 -2492715 -1079391 1262955 3734463 5335632 5525692 4605958 3488422
42466 3488422 2977432 3138215 3301233 2691962 1107477 -946564 -2719473 -3821044 -4447873
42457 -4447873 -5097156 -6097175 -7395573 -8713204 -9781119 -10391258 -10329881 -9407203 -7570143
42448 -7570143 -4918311 -1633901 1979090 5362551 7776917 8681707 8065796 6369513
42440 6369513 4163152 2009950 537226 315428 1415442 3118426 4260995 4009210
42432 4009210 2358246 -33611 -2400565 -4301153 -5701023 -6811525 -7878895 -9066477
42424 -9066477 -10464111 -12106861 -13865392 -15311602 -15848370 -15121083 -13282339 -10769764
42416 -10769764 -7874931 -4656786 -1254388 1896523 4268311 5624171 6167361 6352923
42408 6352923 6542496 6756952 6743484 6333126 5683666 5048728 4377828 3420387 2311330
42399 2311330 1751844 2302598 3579327 4417620 3876062 1960506 -553367 -2757661 -4059485
42390 -4059485 -4309095 -3751399 -2828687 -1887055 -1006566 -89434 926951 1936362 2691264
42381 2691264 2976860 2818778 2508195 2373528 2566837 3123640 4107946 5509212 7050345
42372 7050345 8367494 9481028 10885151 12986816 15532971 17739853 18968972 19193851
42364 19193851 18854024 18380459 17903561 17368643 16864848 16764400 17470407 19022743 20971126
42355 20971126 22578011 23098785 22039493 19470287 16195662 13372809 11696877 10944510
42347 10944510 10366397 9408573 7934034 5900720 3130308 -503535 -4785190 -9136084
42339 -9136084 -12833924 -15259411 -16075138 -15314519 -13336366 -10665427 -7843478 -5373401
42331 -5373401 -3692470 -3072925 -3477677 -4532576 -5719179 -6656372 -7209697 -7371994 -7153400
42322 -7153400 -6644083 -6063600 -5593207 -5187532 -4680236 -4047723 -3422542 -2869936 -2341040
42313 -2341040 -1863802 -1556118 -1360147 -984872 -289730 425826 727749 586779 455678
42304 455678 850708 1978345 3698132 5667781 7514397 8996517 10044823 10618875 10584054
42295 10584054 9797602 8244766 6027912 3361545 716727 -1200493 -1921016 -1690679
42287 -1690679 -1271543 -1226784 -1550234 -1961587 -2288921 -2472965 -2463793 -2330631 -2327399 -2613195
42277 -2613195 -2946449 -2863576 -2226466 -1507568 -1486460 -2670062 -4949231 -7714578 -10276995
42268 -10276995 -12240349 -13545424 -14214871 -14113063 -12988639 -10754665 -7732465 -4622661
42260 -4622661 -2177450 -784802 -282710 -147086 144379 880692 2081896 3523170 4806523
42251 4806523 5580789 5790124 5643234 5298512 4688242 3741757 2665939 1807911 1221955
42242 1221955 545793 -561341 -1901627 -2766994 -2513521 -1087718 970758 2929709 4225751
42233 4225751 4579066 3996801 2783063 1456883 507297 161881 377227 986226 1783047
42224 1783047 2520099 2978611 3123727 3123101 3121228 3010034 2511597 1530599 371006 -486180
42214 -486180 -854931 -1051072 -1567486 -2527966 -3482113 -3746696 -2956521 -1332735 524343
42205 524343 2105392 3304590 4284998 5054922 5285210 4652882 3290530 1707000 246294
42196 246294 -1186462 -2787942 -4435085 -5756111 -6508998 -6733228 -6613932 -6380493 -6308664
42187 -6308664 -6630085 -7366174 -8313715 -9195469 -9761536 -9773282 -8999410 -7290356 -4699553
42178 -4699553 -1624347 1174103 2906350 3316068 2860532 2222897 1760499 1571111 1873894
42169 1873894 2927867 4578352 6269649 7650247 8875309 10131562 11128841 11342741
42161 11342741 10628603 9326166 7799359 6104102 4128597 1869647 -519397 -2872780
42153 -2872780 -5137781 -7362608 -9548881 -11504126 -12895345 -13501757 -13384257 -12779752 -11895867
42144 -11895867 -10855323 -9746925 -8615520 -7432106 -6173021 -4925518 -3842379 -2986412
42136 -2986412 -2256301 -1443637 -337388 1146157 2824966 4264644 5062611 5197155 5076464
42127 5076464 5217628 5865834 6874715 7888860 8637844 9088644 9301752 9116463 8061265
42118 8061265 5739593 2370836 -1160701 -3932789 -5669258 -6735685 -7493227 -7807973
42110 -7807973 -7261433 -5691328 -3337377 -510898 2619106 5792441 8395127 9681386
42102 9681386 9332887 7779749 6015010 5098353 5636707 7467062 9760952 11556850 12316449
42093 12316449 12065281 11158996 10031921 9060537 8453199 8222706 8327076 8745445 9256917
42084 9256917 9257834 8128803 5898820 3356727 1391508 330634 -63119 -169467 -194382
42075 -194382 -70857 490034 1714586 3387344 4878707 5707259 5997535 6272539 6898299
42066 6898299 7829160 8733195 9188751 8893098 7916570 6718061 5736869 5002066 4267273
42057 4267273 3413463 2502447 1508657 265085 -1306343 -3120477 -5087342 -7105885 -8859007
42048 -8859007 -9894696 -10101171 -9970705 -10228202 -11236101 -12805571 -14445693 -15663731 -16137785
42039 -16137785 -15831005 -15017509 -14100875 -13305180 -12524380 -11510102 -10241741 -9080755 -8458574
42030 -8458574 -8366168 -8256578 -7568199 -6287915 -4876724 -3705464 -2754845 -1873949 -1116523
42021 -1116523 -713026 -848458 -1575972 -2827542 -4366730 -5806680 -6844740 -7503215 -8050655
42012 -8050655 -8666419 -9231166 -9443012 -9095620 -8260696 -7259923 -6457622 -6006980 -5734451
42003 -5734451 -5261426 -4271125 -2719282 -843960 1028684 2737021 4371792 6102349
41995 6102349 7926346 9622525 10922365 11657272 11764072 11294295 10494308 9749188 9275778
41986 9275778 8879202 8156148 6989518 5741227 4879383 4481450 4204306 3720682 3075553
41977 3075553 2586412 2502828 2868732 3675549 5005286 6937910 9347228 11833600 13849979
41968 13849979 14899871 14707601 13332087 11182853 8886613 7030515 5907226 5416169
41960 5416169 5204520 4961392 4615760 4256593 3908670 3478110 2934531 2446211 2255677
41951 2255677 2469709 3039424 3886137 4916446 5889318 6379232 5990902 4662820 2768270
41942 2768270 903780 -469252 -1245115 -1611114 -1821539 -2030044 -2252106 -2397671 -2378278
41933 -2378278 -2300042 -2541064 -3480724 -5083835 -6866137 -8337535 -9360424 -10002000 -10216771
41924 -10216771 -9879293 -9059589 -8073526 -7270369 -6896198 -7093892 -7827683 -8805021 -9671180
41915 -9671180 -10325639 -10882672 -11294861 -11237219 -10483322 -9215853 -7778825 -6209249 -4203889
41906 -4203889 -1570940 1374139 3883922 5261918 5394603 4919988 4808190 5623062 7140518
41897 7140518 8707928 9930546 10944241 12094943 13522907 15102300 16631619 17919091
41889 17919091 18694769 18593872 17358293 15083889 12257722 9565735 7650416 6919040
41881 6919040 7375795 8550079 9703680 10264710 10095699 9343219 8146961 6627362 5086481
41872 5086481 4002099 3713044 4151099 4893215 5432546 5476098 5169035 5067994 5703032
41863 5703032 7024377 8380865 9175719 9468164 9785718 10398366 10960984 10897282 9977118
41854 9977118 8437297 6669836 4949705 3431116 2231693 1420383 985793 909109 1254210
41845 1254210 2111765 3451415 5092934 6827177 8494937 9948514 11060229 11845240
41837 11845240 12485178 13126978 13717163 14139861 14453504 14823628 15204986 15248991 14636395
41828 14636395 13463411 12240310 11513557 11480303 11901363 12321424 12363502 11861104 10822392
41819 10822392 9396378 7878102 6606228 5767885 5368675 5408223 5916589 6729070 7444526
41810 7444526 7842550 8214019 8996513 10120684 10989313 11124588 10609156 9881989 9353815
41801 9353815 9249941 9522614 9776677 9521195 8677988 7712591 7178919 7306164 8076819
41792 8076819 9401825 11002776 12343840 12956789 12758384 11902170 10467293 8467719 6014945
41783 6014945 3283256 473899 -1985661 -3413067 -3364652 -2079455 -174773 1985020
41775 1985020 4310881 6505943 8020232 8604917 8598506 8513142 8540343 8545039 8308696 7647493
41765 7647493 6484681 4957694 3338943 1772076 224737 -1243736 -2369530 -2976698
41757 -2976698 -3242767 -3531980 -4046351 -4723335 -5364277 -5775270 -5913754 -6024711 -6527659
41748 -6527659 -7613526 -8981266 -10063610 -10486002 -10277421 -9744842 -9232725 -8897206 -8555060
41739 -8555060 -7751283 -6063718 -3383504 44435 3725834 7024777 9328068 10272830
41731 10272830 9838071 8228716 5772422 2924145 148260 -2370379 -4783080 -7185511
41723 -7185511 -9249871 -10405247 -10332348 -9144703 -7150866 -4612855 -1713821 1408407
41715 1408407 4619309 7665472 10102409 11465177 11523897 10325849 8115633 5403810
41707 5403810 3002971 1633892 1338721 1449386 1240631 490795 -604578 -1766756 -2667743
41698 -2667743 -2862084 -2057328 -500769 1097274 2088436 2278980 1913084 1494124 1606310
41689 1606310 2608469 4286632 5897602 6737228 6706325 6288555 6019702 6048656 6194278
41680 6194278 6340153 6701964 7674190 9417003 11642210 13830317 15572543 16609046 16653308
41671 16653308 15466687 13220026 10585061 8255897 6410119 4743307 2954074 1064866
41663 1064866 -648336 -1852317 -2310935 -2051272 -1425792 -854126 -434401 91305 971786
41654 971786 2182670 3534401 4837150 5860620 6327599 6143893 5544595 4833091 4012519
41645 4012519 2816295 1062746 -1166811 -3667759 -6242797 -8645840 -10543923 -11656181
41637 -11656181 -11927404 -11557398 -10893063 -10261306 -9801094 -9396962 -8790025 -7757839 -6182559
41628 -6182559 -4025611 -1377234 1412020 3721910 4905842 4670795 3340150 1775932
41620 1775932 912210 1166544 2202542 3266165 3783526 3708995 3433609 3429725 3890180 4588034
41610 4588034 5100306 5229824 5165685 5185330 5306147 5343442 5212812 5008544 4835852 4738370
41600 4738370 4761856 4907935 5028435 4942739 4662845 4314941 3833503 2971718 1692054 314752
41590 314752 -872280 -1989686 -3403374 -5304092 -7565670 -9876237 -11858024 -13192859
41582 -13192859 -13837960 -14071314 -14168295 -14080473 -13565488 -12548100 -11170023 -9554827 -7772929
41573 -7772929 -6047609 -4710789 -3792237 -2836204 -1371074 449184 1848112 2133046 1303411
41564 1303411 -93193 -1572595 -2990828 -4231149 -4891024 -4522705 -3128347 -1207113
41556 -1207113 708042 2404441 3901281 5259598 6585186 8004498 9449263 10584273
41548 10584273 11115171 11073185 10648317 9876215 8736131 7518068 6825231 7103294 8269732
41539 8269732 9846256 11374961 12714596 14052844 15661005 17547733 19312847 20366953
41531 20366953 20277255 18919411 16491984 13570573 11002787 9395804 8583907 7767147 6268139
41522 6268139 4070651 1664556 -383918 -1636987 -1863104 -1199617 -170959 675476 1197118
41513 1197118 1665209 2409708 3546062 4967134 6429500 7629012 8327406 8489689 8270097
41504 8270097 7839701 7256338 6517973 5713930 5081868 4874981 5141172 5643391 6036655
41495 6036655 6123394 5906074 5431054 4690481 3707370 2617240 1595972 783931 377769
41486 377769 736557 2219382 4808795 7938219 10808271 12948685 14466447 15734565
41478 15734565 16921726 17949071 18860830 19969568 21441494 22884146 23629957 23447071
41470 23447071 22746921 22043594 21452714 20861915 20373562 20301270 20754162 21422954 21826178
41461 21826178 21684857 21066298 20263929 19554391 18995969 18429013 17684864 16763440 15769537
41452 15769537 14724639 13513018 11986644 10058186 7729399 5134219 2573010 423734
41444 423734 -1038811 -1738128 -1730961 -1091491 136447 1908266 4109584 6489005 8643304
41435 8643304 10101793 10506451 9805629 8306766 6478566 4647667 2942341 1568054
41427 1568054 966253 1464222 2810857 4348444 5732327 7222975 9115519 11156846
41419 11156846 12837773 14110010 15421201 16995041 18399168 18998346 18665027 17881524
41411 17881524 17224939 16867178 16522584 15781909 14515514 13024901 11820339 11236040 11235846
41402 11235846 11518111 11738464 11684574 11365257 10954813 10564678 10059076 9200292 8024782
41393 8024782 7006030 6796233 7823677 10085662 13168010 16376056 18948504 20309855
41385 20309855 20203915 18629054 15712977 11697405 7024558 2377665 -1462527 -3951452
41377 -3951452 -5080572 -5305205 -5075927 -4458547 -3296930 -1692749 -162644 706506 642783
41368 642783 -273488 -1797406 -3667793 -5672578 -7651093 -9408306 -10676717 -11325751 -11628229
41359 -11628229 -12106557 -12960991 -13736723 -13651049 -12170338 -9246568 -5232143 -793747 3220161
41350 3220161 6160126 7972158 9164730 10374969 11984942 14012275 16144449 17861177
41342 17861177 18720997 18660333 17988845 17091763 16204089 15435600 14835891 14326081 13648716
41333 13648716 12521341 10892355 9041816 7421124 6365452 5927848 5983752 6467771 7424100
41324 7424100 8791947 10255928 11445555 12269152 12964107 13849894 15124112 16823704 18757160
41315 18757160 20381418 20908299 19749712 16949687 13194206 9406817 6276980 4026138
41307 4026138 2477858 1290650 147718 -1158339 -2619634 -3859189 -4197158 -3120909
41299 -3120909 -790502 2012261 4482063 6265447 7376744 7878884 7822882 7393633 6890910
41290 6890910 6509027 6221943 5909210 5535236 5200251 5071435 5254967 5656814 5953176
41281 5953176 5778437 5004455 3823693 2557938 1442570 610626 173721 187149 559463
41272 559463 1143271 1964541 3229259 4990733 6910482 8526359 9746648 10920629 12402242
41263 12402242 14190833 16000269 17443729 18055635 17420033 15577722 13193145 11021068
41255 11021068 9226314 7475872 5662271 4198213 3509696 3558889 4064329 4939338 6233254
41246 6233254 7776497 9185512 10226582 10984984 11673869 12434434 13306084 14187442 14747750
41237 14747750 14516876 13200168 10928742 8222326 5749131 4057833 3376330 3570903
41229 3570903 4325432 5396297 6695517 8170108 9679455 10996196 11863027 12044949 11413972
41220 11413972 10048191 8227255 6285648 4453798 2837065 1534932 742143 649052
41212 649052 1166878 1812777 2054979 1866083 1822077 2545159 4139219 6275811 8672654
41203 8672654 11218733 13657742 15472171 16274583 16199164 15770101 15438853 15317929 15264074
41194 15264074 15089226 14714393 14212096 13716404 13290520 12938388 12741244 12835298 13143897
41185 13143897 13225934 12545606 10900187 8523195 5841450 3270206 1215634 77886
41177 77886 102640 1203656 2913628 4503868 5292724 5070871 4306834 3809789 4079293
41168 4079293 5001905 6155837 7238041 8095308 8518636 8280382 7411716 6257707 5140607
41159 5140607 4042819 2733032 1213946 -12616 -185792 1142602 3715790 6735668
41151 6735668 9414808 11342462 12367902 12371680 11400410 9971591 8939486 8888214 9749794
41142 9749794 11069318 12469128 13743822 14717323 15268570 15417203 15139957 14154930 12191466
41133 12191466 9552799 7163763 5897705 5964986 7016879 8627123 10477404 12219023
41125 12219023 13447011 13898207 13594418 12785575 11806001 10929142 10245342 9677201 9179430
41116 9179430 8888562 8975363 9352676 9631154 9426235 8716439 7918541 7595783 7987203 8746953
41106 8746953 9217645 9056508 8551781 8256367 8398136 8759272 9014637 8959230 8426778 7267521
41096 7267521 5564055 3737636 2289942 1463952 1179797 1161315 1012034 312677 -1078889
41087 -1078889 -2717366 -3682353 -3180847 -1156653 1631447 4114621 5565771 5923632 5671155
41078 5671155 5480092 5849464 6839475 8031562 8880841 9305578 9927899 11582129 14539620
41069 14539620 18292132 22057056 25308502 27771730 29151002 29147025 27765721 25462029
41061 25462029 22907383 20624962 18789790 17260599 15775927 14214061 12753660 11787088
41053 11787088 11638636 12332695 13601471 15081060 16488310 17645487 18416446 18702764 18519936
41044 18519936 18019137 17385169 16731868 16104133 15490621 14748837 13612702 11989312 10322853
41035 10322853 9502983 10201830 12217585 14484022 15759094 15391418 13573987 10989193
41027 10989193 8237815 5552102 2943128 467372 -1747262 -3658677 -5332588 -6784199
41019 -6784199 -7919150 -8680711 -9154106 -9450854 -9544532 -9264292 -8394898 -6768892 -4372027
41010 -4372027 -1437322 1634600 4526040 7137351 9452435 11378772 12810577 13777599
41002 13777599 14435764 14957265 15493950 16151467 16856401 17275400 16999731 15855483 14020323
40993 14020323 11911592 10042233 8884089 8657850 9182184 10020863 10838697 11580194 12298363
40984 12298363 12879483 12990690 12325534 10951713 9427107 8466787 8388417 8913508 9561690
40975 9561690 10145002 10784156 11581624 12488710 13422272 14255265 14694023 14461535 13724360
40966 13724360 13098789 13044127 13404106 13729829 13907483 14212352 14788311 15324674 15315219 14508106
40956 14508106 13090433 11585287 10607732 10555675 11406148 12848240 14654784 16855639 19514928
40947 19514928 22450597 25279443 27688576 29568281 30917707 31748642 32123562 32210562 32215333
40938 32215333 32223791 32106431 31619422 30709045 29799380 29715954 31165806 34206992 38252390
40929 38252390 42596873 46885678 51096212 55237543 59215780 62953414 66514509 70085506
40921 70085506 73876673 78012371 82438585 86946414 91355658 95655385 99878049 103866797
40913 103866797 107321212 110128429 112518409 114768929 116798596 118150218 118387660 117485657
40905 117485657 115870424 114130447 112656012 111469995 110326349 108912636 106967777 104359567
40897 104359567 101243897 98130070 95545780 93499881 91431480 88868755 86050818 83718843
40889 83718843 82348675 81782644 81582581 81480337 81374299 81094224 80401330 79204483 77636696
40880 77636696 75884233 73989722 71808604 69089380 65599852 61275161 56330967 51224701
40872 51224701 46438849 42264821 38810149 36191017 34596483 34056499 34212662 34503840
40864 34503840 34651622 34859425 35462447 36474623 37564104 38378836 38761239 38683082 38120804
40855 38120804 37057717 35577063 33933519 32497199 31521159 30909429 30307869 29505236 28664463
40846 28664463 28085767 27863743 27903108 28139565 28529837 28869244 28829768 28204883 27005865
40837 27005865 25393515 23709520 22499277 22193852 22686601 23441751 24093747 24726789 25495761
40828 25495761 26248626 26714587 26866527 26869674 26800575 26664014 26650299 27147184 28403770 30223636
40818 30223636 31992546 33022437 32990762 32137737 30990716 29879145 28822589 27880246 27355289
40809 27355289 27478660 28046066 28575754 28764692 28652162 28421417 28179234 27832493 27043266
40800 27043266 25451228 23162271 20921451 19557044 19294996 19825863 20933739 22708810
40792 22708810 25120243 27750552 30140475 32173555 33940159 35385302 36273934 36413476
40784 36413476 35785440 34564469 33154659 32132357 31976633 32797920 34333874 36152795
40776 36152795 37831368 39019775 39426062 38779788 36932394 34178835 31462726 29972667
40768 29972667 30289784 31938502 33818803 34996974 35116157 34381308 33438529 33117092 33914489
40759 33914489 35628630 37646306 39610186 41651789 43988191 46524594 48949395 51045867
40751 51045867 52778534 54193933 55387233 56504558 57625373 58629404 59278313 59477538
40743 59477538 59447166 59650316 60571440 62500986 65409856 68941512 72523298 75574967 77769953
40734 77769953 79240155 80535018 82245316 84530748 86982859 88964622 90073749 90295562
40726 90295562 89824519 88871156 87644385 86388954 85307375 84402264 83428176 82075538 80295014
40717 80295014 78482186 77286600 77150059 77998838 79367459 80721981 81562747 81320744 79469246
40708 79469246 75967606 71535754 67291355 64011261 61710573 59820168 57640672 54711859
40700 54711859 51038707 47164132 43957637 42147573 41930651 42934384 44437568 45620510
40692 45620510 45818242 44817380 43021878 41248083 40219199 40128160 40568901 40850113 40479271
40683 40479271 39487992 38324428 37386964 36670621 35908728 35011857 34256420 34019966 34412296
40674 34412296 35203735 36054121 36771471 37411752 38227297 39555915 41712154 44874512 48958977
40665 48958977 53577036 58219554 62586979 66730055 70825745 74871965 78675748 82074604
40657 82074604 85049966 87666042 90051069 92441594 95084878 98047634 101252517 104748464
40649 104748464 108778639 113458511 118504675 123453401 128150098 132956387 138503632 145275494
40641 145275494 153338904 162382079 172045367 182260300 193201714 204888179 216989018
40634 216989018 229147861 241357265 253816572 266475496 278889623 290475052 300724709
40627 300724709 309232156 315752542 320277987 322861473 323367509 321658680 318076833 313387384
40619 313387384 307985571 301360398 292651143 281686488 269279624 256600040 244497896
40612 244497896 233323343 222953886 212787208 201978195 190037659 177275372 164592155
40605 164592155 152866749 142566512 133779034 126356700 119947871 114047176 108228866 102422087
40597 102422087 96914332 92006969 87654442 83492760 79232531 74946630 70929304 67366460
40589 67366460 64231712 61393319 58631487 55590831 51981521 47959691 44161340 41221523
40581 41221523 39337152 38356238 38084608 38276266 38457436 38123228 37222368 36229805 35583827
40572 35583827 35170074 34500811 33327483 31945255 30940061 30761174 31503509 32920868 34548461
40563 34548461 35900979 36712159 37065588 37267598 37519507 37679456 37394029 36530818 35454236
40554 35454236 34770123 34766131 35188179 35605140 35877949 36173669 36640572 37275472 38086015 39127809
40544 39127809 40254797 41025403 41090953 40629286 40177602 40003831 39816008 39136414 37754143
40535 37754143 35678032 32862160 29289894 25305333 21557469 18480241 15998340 13870330
40527 13870330 12162214 11201206 11155508 11858152 13023221 14464240 16091428 17854693 19745651
40518 19745651 21759467 23833768 25929206 28181048 30828898 33920767 37164010 40098629
40510 40098629 42311687 43457519 43263390 41726709 39319503 36898198 35342498 35186461
40502 35186461 36426510 38576970 40964678 43059655 44564601 45312972 45302938 44867104 44558149
40493 44558149 44687540 45124710 45711465 46690669 48456290 50974749 53752733 56376730 58822237
40484 58822237 61212176 63572354 65972386 68707161 72155812 76510259 81658347 87176871
40476 87176871 92410041 96804647 100353389 103589068 107015161 110677865 114423152 118371570
40468 118371570 122853547 127903833 133026656 137459480 140520255 141762547 141067846 138720604
40460 138720604 135289127 131337211 127249168 123249186 119412753 115627289 111702362 107618278
40452 107618278 103592420 99850420 96417249 93178995 90041961 86948567 83835823 80707066
40444 80707066 77697062 74914123 72172523 68972221 64839691 59726203 54081785 48537478
40436 48537478 43495388 39011886 35066045 31880798 29886789 29353239 30142787 31878154
40428 31878154 34248925 37035423 39894592 42327207 43969582 44858469 45330789 45676176
40420 45676176 45900012 45747180 44881841 43094874 40446160 37229300 33756896 30196636
40412 30196636 26661964 23388561 20652307 18464276 16481962 14332814 11969493 9640251
40404 9640251 7608694 6040188 5113956 5068109 6066637 8085270 10925044 14232494 17492773
40395 17492773 20161512 21965923 23107793 24140238 25626235 27851804 30734449 33908251
40387 33908251 36903208 39301477 40803049 41284707 40931956 40272860 39876327 39880628 39866670
40378 39866670 39273763 37930010 36181582 34597625 33589244 33208684 33217066 33377079 33714045
40369 33714045 34416871 35445853 36365079 36686612 36329967 35658563 35128984 34975605 35105614
40360 35105614 35112507 34430515 32672120 29880802 26394813 22512716 18416718 14362187 10712167
40351 10712167 7691989 5219292 3031993 905685 -1246110 -3332164 -5096433 -6319393
40343 -6319393 -7080703 -7675575 -8157184 -8084089 -6873292 -4355897 -896976 2916598 6528010
40334 6528010 9424927 11185270 11671919 11122068 9967289 8595018 7289768 6273184
40326 6273184 5645678 5274919 4842605 4070393 2896784 1451958 -46854 -1310285 -1976060
40317 -1976060 -1772251 -758004 677116 2124214 3414412 4523588 5327801 5608447 5297964
40308 5297964 4596081 3801798 3099157 2518738 2018990 1561182 1162016 906264 860882 954050
40298 954050 986020 788390 364109 -92988 -267705 108613 993907 1912616 2246861 1749314
40288 1749314 718799 -337571 -1086974 -1377317 -1058215 363 1739208 3890883 6121511
40279 6121511 8108337 9536919 10198552 10165702 9793880 9473587 9387121 9526505 9902808
40270 9902808 10635269 11743637 12874319 13410105 13043023 12231737 11919765 12726200 14501508
40261 14501508 16671883 18796096 20639592 21901545 22195643 21377179 19740594 17817321
40253 17817321 16037037 14593127 13528989 12847744 12497500 12259773 11743608 10653456 9144405
40244 9144405 7820523 7267418 7583391 8349899 8913255 8631488 7081767 4348016 1158287
40235 1158287 -1426311 -2560185 -1917404 320906 3536478 6813275 9341304 10852706
40227 10852706 11589652 11855429 11763330 11424690 11120018 11109460 11384115 11737630 12026926 12291330
40217 12291330 12691913 13402041 14481580 15782450 17005462 17842870 17989115 17093453 14984865
40208 14984865 12082666 9382371 7788464 7459271 7874821 8431219 8840429 9081053 9192865
40199 9192865 9123426 8621133 7295697 4974755 2060376 -613796 -2389298 -3206535 -3402094
40190 -3402094 -3205852 -2586511 -1594454 -683032 -469700 -1089014 -1897494 -1994526 -1054608 458274
40180 458274 1871165 2906627 3675742 4332581 4971405 5761736 6915116 8438257 10025361
40171 10025361 11248151 11833405 11806868 11451132 11098898 10893294 10770336 10713899 10935264
40162 10935264 11679852 12886344 14130173 14883020 14785662 13774478 12075452 10027073 7810847
40153 7810847 5438028 3104422 1390303 845946 1416529 2508650 3605128 4583392 5476068
40144 5476068 6275058 7082653 8137820 9471342 10731491 11557695 11981097 12271048 12520770
40135 12520770 12574046 12242778 11411662 10067372 8474766 7227141 6797916 6980366 6989220
40126 6989220 6202311 4684447 3002722 1750753 1311112 1822865 3131446 4788971 6229236
40117 6229236 6982910 6776643 5587625 3709991 1676717 -24912 -1177994 -1769683 -1809382
40108 -1809382 -1319311 -424755 719689 2104097 3802245 5658881 7170591 7845193 7682748
40099 7682748 7200973 6975146 7239679 7930785 8924938 10057249 10985225 11304956 10956562
40090 10956562 10412036 10286067 10732867 11317560 11515933 11268572 10977567 10991638 11195184
40081 11195184 11171802 10734075 10168511 9872731 9811046 9471443 8417281 6818321 5397376
40072 5397376 4903547 5641019 7365805 9473958 11289352 12323550 12421727 11762251 10756083
40063 10756083 9885887 9496091 9649113 10225407 11187070 12628830 14473160 16231381 17270955
40054 17270955 17345155 16735712 15861701 14878164 13686617 12193940 10478418 8807253 7579957
40045 7579957 7154119 7580421 8499546 9349791 9652885 9097087 7510112 4969541 1964066
40036 1964066 -725453 -2457635 -3087111 -2915570 -2328477 -1461635 -150086 1824960 4402188
40027 4402188 7140848 9496225 11207230 12388859 13298516 14149542 15172578 16644023
40019 16644023 18612432 20605174 21820336 21763796 20708102 19536328 19182840 20137656 22233092
40010 22233092 24734887 26744581 27726701 27712715 26980717 25652960 23758853 21602505 19779408
40001 19779408 18702535 18259258 18059514 17916866 17959201 18354671 19093295 20019205 20922231
39992 20922231 21543522 21581461 20784913 19085894 16689801 14057742 11727700 10045007 9026199
39983 9026199 8477724 8204272 8098349 8145610 8459168 9254780 10647348 12440165 14194597
39974 14194597 15542349 16411645 16995397 17581911 18387677 19425034 20458269 21101216 20971738
39965 20971738 19799379 17549156 14596034 11708938 9646774 8678324 8540713 8809415
39957 8809415 9159501 9316335 9032215 8264978 7248932 6285244 5593999 5461989 6317762
39948 6317762 8388118 11327333 14430617 17265689 19934092 22664616 25320532 27448416
39940 27448416 28766608 29507442 30264995 31517748 33251191 34974946 36082281 36228718
39932 36228718 35456855 34084157 32537510 31222228 30409387 30185509 30532642 31446233 32900205
39923 32900205 34666242 36244576 37073855 36840838 35581588 33538468 31030757 28498159
39915 28498159 26538974 25712485 26228579 27880166 30281627 33069592 35846566 38112989
39907 38112989 39457960 39803551 39347592 38318380 36931400 35513905 34400063 33613216
39899 33613216 32850619 31906161 30942548 30192829 29539969 28611430 27242668 25661305 24234655
39890 24234655 23223448 22795964 23051562 23854098 24731302 25165551 25122327 25261431 26495488
39881 26495488 29230604 33015045 36902155 40031202 41796817 41721437 39613582 35982924
39873 35982924 31984666 28672922 26378276 24899930 24066180 23874604 24287285 25228013 26702652
39864 26702652 28606444 30463342 31710639 32277743 32553073 32707997 32406595 31344659 29744296
39855 29744296 28056697 26433523 24821830 23425878 22685948 22754957 23257811 23684158 23921785
39846 23921785 24383535 25695947 28215068 31668425 35223573 38045038 39887555 41111449
39838 41111449 42077386 42563013 41829269 39302522 35237404 30710731 26883790 24192505
39830 24192505 22248398 20490753 18812896 17514135 16806491 16531884 16282121 15624521 14277657
39821 14277657 12335232 10417524 9395146 9720924 11000499 12309615 12965068 12977001 12816831
39812 12816831 12868513 13139908 13391270 13397995 13076793 12479569 11749103 11020676 10291342 9451958
39802 9451958 8551780 7954357 8037604 8716964 9443882 9754424 9686215 9593501 9731177 10157790
39792 10157790 10885228 11893396 13027173 14043854 14761788 15082865 14979153 14639446 14543016
39783 14543016 15103909 16160240 16999571 17001333 16173450 15043735 14186200 13929565 14361251
39774 14361251 15410449 16872573 18367432 19297757 19000890 17194439 14352764 11469519
39766 11469519 9306692 7933845 7011088 6289410 5644063 4800258 3378098 1286776 -1116879
39757 -1116879 -3333319 -5014373 -5849113 -5340523 -3003202 1065037 5875179 9972544
39749 9972544 12321634 12878955 12373366 11588437 10861833 10151127 9369564 8552643 7802883
39740 7802883 7225007 6914719 6904265 7093749 7310989 7466575 7590810 7701093 7719825 7596072
39730 7596072 7459091 7545058 7938319 8436200 8704138 8519431 7802085 6449085 4303029
39721 4303029 1430977 -1586079 -3800098 -4471125 -3554003 -1668657 339938 1853134
39713 1853134 2705659 3158393 3615168 4204346 4608006 4431013 3787543 3382550 3879882
39704 3879882 5242152 6799410 7899573 8320352 8068945 7069837 5291070 3088785 1159486
39695 1159486 58291 -115580 479441 1747273 3614815 5793076 7825586 9427814
39687 9427814 10636357 11579118 12258648 12678822 13059913 13718242 14696102 15640971 16154038
39678 16154038 16256359 16477010 17450531 19359404 21682995 23475480 23987245 23171986 21715344
39669 21715344 20597739 20523246 21577593 23281325 24946079 26052935 26388285 25933833 24761281
39660 24761281 23097824 21399924 20183160 19680217 19684400 19745434 19468494 18611228 17028205
39651 17028205 14728194 12061349 9722298 8369103 8123550 8440142 8512709 7885056 6761822
39642 6761822 5785163 5480214 5850939 6493996 7090639 7693063 8451162 9186542 9489481
39633 9489481 9271525 8960174 8980818 9247418 9393322 9326303 9207778 8954875 8209240 6957830
39623 6957830 5843885 5597938 6352394 7725756 9347140 10972613 12246897 12800685 12668896
39614 12668896 12302940 12037981 11767539 11258770 10571460 10000237 9774961 10016376 10858857
39605 10858857 12353300 14235001 15989526 17245652 18020671 18522878 18796631 18672715 18074685
39596 18074685 17272611 16710148 16534440 16365758 15631709 14155460 12404053 11207017 11268295
39587 11268295 12816548 15489103 18479102 20944227 22411365 22807110 22192957 20700243
39579 20700243 18783007 17254041 16777136 17349335 18436188 19537479 20434559 20992525 21077494
39570 21077494 20793693 20542941 20610195 20771284 20496817 19544039 18252125 17283122 17157674
39561 17157674 17976793 19408996 20860114 21732294 21633977 20432483 18232781 15440500 12827100
39552 12827100 11314338 11458800 13082154 15468080 17942380 20222577 22250479 23867286
39544 23867286 24794666 24880872 24232619 23111699 21825951 20731630 20167828 20233696 20653699
39535 20653699 20955702 20799386 20130852 19101899 17920003 16717329 15441826 13867062
39527 13867062 11802361 9333882 6826699 4691078 3170353 2291467 1902043 1750456
39519 1750456 1656866 1685699 2092245 3016655 4220459 5151333 5304796 4603640 3497018
39510 3497018 2642401 2364559 2388668 2168359 1482299 643098 162471 367013 1345400 3023094
39500 3023094 5088880 6960038 8064305 8229191 7737719 7033901 6451929 6157243 6167223
39491 6167223 6366319 6576297 6643218 6431321 5804706 4747219 3481968 2323858 1390303
39482 1390303 593645 -51191 -278507 170983 1256281 2681908 4118762 5294460 6043116
39473 6043116 6488273 7107050 8357913 10161866 11854895 12660460 12114913 10137880 7025912
39464 7025912 3538990 735056 -649377 -752987 -430893 -525630 -1327341 -2632389 -4106718
39455 -4106718 -5520774 -6765855 -7775282 -8447058 -8645305 -8314661 -7572629 -6606423 -5473263
39446 -5473263 -4090032 -2429509 -613576 1226504 3051970 4783539 6161512 6853712
39438 6853712 6655541 5526802 3579319 1221245 -769525 -1610914 -1101850 230910 1588355
39429 1588355 2401282 2450740 1816666 909614 360516 582241 1430236 2448874 3395595
39420 3395595 4302966 5035765 5093954 4067080 2171015 133718 -1462475 -2630723 -3795197
39411 -3795197 -5278192 -7017504 -8717484 -10166505 -11327242 -12120092 -12246454 -11404344 -9728783
39402 -9728783 -7889507 -6624864 -6202584 -6396643 -6895273 -7549099 -8202226 -8472749 -7874816
39393 -7874816 -6161508 -3495553 -325905 2815880 5417293 7038762 7439282 6732352
39385 6732352 5388845 3989718 2899202 2177857 1819048 1967079 2747808 3892236 4753072
39376 4753072 4881156 4508156 4275289 4512434 4992245 5427447 5952995 6904632 8231594
39367 8231594 9368891 9730138 9204412 8155841 7057531 6155566 5373359 4481673 3439015
39358 3439015 2601941 2485186 3206735 4226995 4759393 4463875 3699418 3126001 3134228 3646665
39348 3646665 4338606 4919295 5191925 4971501 4112263 2672535 949101 -775154 -2499908
39339 -2499908 -4432130 -6668094 -9058331 -11338380 -13185370 -14121129 -13659422 -11799689
39331 -11799689 -9236221 -6804972 -4753306 -2774913 -705332 1146167 2428920 3177114
39323 3177114 3569393 3492534 2683810 1272920 -99778 -784219 -590869 261232 1483580
39314 1483580 2919223 4542480 6370325 8293650 9911962 10631399 10064504 8325796
39306 8325796 5888636 3254187 880033 -707126 -1053259 -159793 1432944 3057096
39298 3057096 4306446 4993855 5016361 4531141 4067585 4031442 4055456 3231300 1181141 -1374480
39288 -1374480 -3342047 -4323578 -4704859 -4900125 -4907164 -4556536 -3798614 -2659717 -1256158
39279 -1256158 -20193 362429 -509753 -2389592 -4692727 -7021603 -9228613 -11143431
39271 -11143431 -12501239 -13088550 -12766587 -11432157 -9211177 -6679842 -4612910 -3387147
39263 -3387147 -2778373 -2415582 -2256951 -2479051 -3023553 -3454489 -3292403 -2423096 -1196833
39254 -1196833 -192476 143557 -262725 -1145944 -2147887 -3043147 -3783012 -4417689 -5016380
39245 -5016380 -5584898 -5961424 -5811417 -4851277 -3169597 -1301687 97378 696123 613104
39236 613104 168120 -364994 -732464 -625981 114359 1213995 2103237 2452152 2410097 2188383
39226 2188383 1581604 151939 -2158271 -4826329 -7169806 -8773705 -9511900 -9444398 -8863649
39217 -8863649 -8252796 -7968873 -8003130 -8152824 -8303214 -8363312 -8034781 -6944469 -5102749
39208 -5102749 -3059512 -1468462 -538042 40042 684183 1497745 2191459 2367563 1907281
39199 1907281 1120274 506558 367312 658629 1158124 1633770 1820817 1417213 315299
39190 315299 -1155331 -2377806 -2943887 -2962553 -2828067 -2731944 -2482724 -1802989 -735673
39181 -735673 271461 651222 86779 -1308607 -3069146 -4625831 -5586016 -5887030 -5731630
39172 -5731630 -5379009 -4976768 -4527020 -3919966 -2985030 -1626363 -23681 1358979 2141337
39163 2141337 2463339 2917243 3922414 5253810 6349879 7036040 7695004 8616593 9401310
39154 9401310 9284906 8025842 6211778 4598436 3359073 2162025 819296 -454527
39146 -454527 -1456479 -2393036 -3683463 -5484236 -7570963 -9618853 -11414322 -12790385
39138 -12790385 -13541651 -13506393 -12642432 -10932444 -8289135 -4693719 -459990 3718510 7072496
39129 7072496 9174431 10120914 10347462 10260744 10031936 9727806 9562981 9872662 10746500
39120 10746500 11769263 12271453 11865567 10658468 8946570 6858863 4412159 1829963
39112 1829963 -371013 -1680905 -1944770 -1406115 -466866 557520 1482776 2131237 2235103
39103 2235103 1526916 -51214 -2268566 -4774656 -7317144 -9752485 -11898358 -13489324
39095 -13489324 -14301650 -14251920 -13364955 -11737349 -9563334 -7091515 -4490077 -1858225 530765
39086 530765 2126659 2486818 1832470 1083923 1235839 2707834 5245361 8220278 10859224
39077 10859224 12337593 12026365 9897411 6677491 3488188 1241217 267336 353283 1013150
39068 1013150 1776957 2384177 2806612 3083570 3134562 2800669 2120132 1501562 1505280 2395328
39058 2395328 3912370 5463015 6483167 6670355 6045353 4920738 3737209 2756303 1849334
39049 1849334 647505 -1074701 -3206367 -5457151 -7571479 -9324409 -10433102 -10652977
39041 -10652977 -10002297 -8815279 -7532137 -6452621 -5662160 -5098125 -4632634 -4142787 -3581984
39032 -3581984 -3002193 -2468129 -1908990 -1050854 447605 2687115 5289007 7524144 8814792
39023 8814792 9167986 9062269 8879945 8517125 7583032 5867918 3490320 656227 -2513650
39014 -2513650 -5831308 -8848303 -10967765 -11771421 -11232709 -9703874 -7777489 -6053834
39006 -6053834 -4830402 -3960695 -3151645 -2469990 -2413701 -3334590 -4875872 -6189812 -6739333
38997 -6739333 -6708555 -6552411 -6345252 -5791478 -4791666 -3711165 -2986538 -2644117 -2351106
38988 -2351106 -1828476 -1047177 -88348 966869 1948537 2555870 2535849 1895790 924496
38979 924496 43877 -403246 -381934 -262992 -580483 -1582262 -3073465 -4749149 -6539163
38970 -6539163 -8492368 -10474631 -12258060 -13899748 -15733231 -17815156 -19533338 -19961699
38962 -19961699 -18607533 -15764997 -12236035 -8836870 -6124688 -4398176 -3786154 -4259096
38954 -4259096 -5552580 -7154860 -8495158 -9218578 -9276473 -8782297 -7870128 -6688825 -5379954
38945 -5379954 -3955622 -2282395 -297137 1810686 3732231 5312179 6574091 7480984
38937 7480984 7779273 7132684 5410082 2894924 272481 -1648076 -2330292 -1697487 42284
38928 42284 2654669 5881435 9287570 12300239 14460951 15596303 15803094 15403131 14872703
38919 14872703 14591980 14546539 14365236 13707970 12527724 10954197 9142201 7390817 6238393
38910 6238393 6143089 7011519 8198839 9045306 9334815 9216483 8826484 8113390 6983254
38901 6983254 5484495 3813817 2208154 870546 -61925 -573935 -808986 -979261 -1203160
38892 -1203160 -1494743 -1955801 -2862440 -4371483 -6100688 -7159468 -6775321 -4959433 -2574356
38883 -2574356 -773362 -318492 -1254732 -3049439 -4993329 -6537464 -7347862 -7166615 -5778247
38874 -5778247 -3194001 185261 3669743 6552276 8319603 8786363 8232563 7395478 7095832
38865 7095832 7685596 8850593 9973010 10622282 10673282 10115294 8979474 7502795 6198797
38856 6198797 5591208 5827687 6575154 7303689 7686664 7754916 7663953 7301838 6212832 4087221
38846 4087221 1387618 -707448 -1241689 -397895 662863 914453 324213 -351694 -374083
38837 -374083 509905 2190684 4497840 7346554 10718190 14504722 18284140 21314000
38829 21314000 22953478 23183118 22626818 22006007 21604386 21226673 20528379 19311020 17588695
38820 17588695 15478027 13039470 10224582 7012183 3583711 290422 -2571613 -4898275
38812 -4898275 -6697104 -7974886 -8756557 -9143175 -9279518 -9280338 -9206374 -9067698 -8816349 -8358788
38802 -8358788 -7592219 -6426123 -4823080 -2907052 -1021794 423514 1217169 1428516 1267592
38793 1267592 964890 780951 982213 1703066 2850730 4141731 5173930 5537240 5083950
38784 5083950 4199687 3652169 3981893 5031085 6126269 6685108 6610545 6184571 5690559
38775 5690559 5145911 4369865 3308920 2253031 1661981 1824812 2795493 4560381 6983835
38766 6983835 9532544 11352148 11840330 11031597 9336621 7164914 5022142 3696678
38758 3696678 3871765 5474410 7657555 9501190 10616802 11157348 11523451 12108435 13076599
38749 13076599 14235563 15202637 15718353 15698974 15047916 13655883 11633802 9338237 7097130
38740 7097130 5097327 3584128 2878814 2980614 3327502 3221792 2485599 1569610 1082203
38731 1082203 1347328 2323225 3700239 5011792 5819148 5936687 5486209 4720105 3820712
38722 3820712 2853844 1825120 720561 -466852 -1671187 -2697730 -3302377 -3409522 -3250380
38713 -3250380 -3192752 -3360349 -3450034 -2989780 -1777576 -45772 1759345 3301620 4504755
38704 4504755 5477155 6309572 6920399 7126733 6893439 6437269 6005151 5603967 5032263
38695 5032263 4118753 2841078 1299188 -290381 -1655895 -2705242 -3640832 -4636443 -5447785
38686 -5447785 -5602651 -4991488 -4011075 -3096607 -2427888 -2193627 -2758828 -4265839 -6301078
38677 -6301078 -8282409 -10036965 -11684364 -13064247 -13657918 -13093459 -11404678 -8737409
38669 -8737409 -5149364 -900707 3298324 6616962 8658814 9568574 9662863 9096609 7846425
38660 7846425 5869368 3269342 432689 -1971487 -3270148 -3217341 -2162310 -725847
38652 -725847 694156 2048989 3329453 4331686 4872835 5128489 5536564 6349843 7449002
38643 7449002 8588712 9548794 9894438 8866134 5901921 1323985 -3700119 -7954859
38635 -7954859 -10858308 -12438245 -12920138 -12492983 -11347590 -9760963 -8108591 -6799270
38627 -6799270 -6108519 -5979684 -6003074 -5671248 -4730122 -3366514 -2128774 -1625420 -2137417
38618 -2137417 -3379543 -4614614 -5060235 -4298977 -2472194 -225781 1569381 2247156 1667126
38609 1667126 152035 -1870334 -4124972 -6458736 -8726676 -10786329 -12505968 -13698653
38601 -13698653 -14127164 -13666244 -12420846 -10635144 -8554663 -6423903 -4491562 -2888194
38593 -2888194 -1586714 -629701 -303434 -867314 -2130429 -3534554 -4713047 -5761395 -6891052
38584 -6891052 -8074316 -9203976 -10368786 -11672530 -12882820 -13579607 -13686970 -13627024 -13894725
38575 -13894725 -14657746 -15772582 -16913588 -17554738 -17066053 -15099588 -11891762 -8138111
38567 -8138111 -4654270 -2134261 -930082 -812068 -1076632 -1142568 -1020886 -1075035 -1466023
38558 -1466023 -2068696 -2812475 -3762393 -4841068 -5775186 -6422940 -6936651 -7512214 -8182663
38549 -8182663 -8946280 -9867158 -10891256 -11743177 -12196019 -12352354 -12532725 -12982575 -13769790
38540 -13769790 -14792345 -15716188 -16054013 -15545731 -14433517 -13208362 -12141893 -11216993 -10422436
38531 -10422436 -9866820 -9582757 -9431143 -9290332 -9221395 -9375398 -9808124 -10406997 -10903050
38522 -10903050 -10916873 -10099886 -8347999 -5908974 -3277431 -967610 685397 1598406 1857846
38513 1857846 1575353 859706 -69964 -843661 -1115123 -784288 -39303 768529 1290986
38504 1290986 1353006 1044589 566539 -65221 -1020671 -2254276 -3275573 -3556209 -3111484
38495 -3111484 -2461778 -2035791 -1827730 -1651535 -1477535 -1391558 -1391165 -1386963 -1349344 -1354018 -1504281
38484 -1504281 -1827962 -2168901 -2143279 -1318052 439023 2772738 5029172 6630456 7312000
38475 7312000 7115571 6234042 4845965 3065440 1038078 -971463 -2673684 -3949392
38467 -3949392 -4902359 -5717567 -6503733 -7238150 -7788129 -8009992 -7922567 -7778565 -7863665 -8206091
38457 -8206091 -8568873 -8747239 -8787399 -8867313 -9004452 -8908854 -8132383 -6437965 -4100447 -1797174
38447 -1797174 -125338 714816 715266 -235807 -2145737 -4484619 -6358999 -7303418 -7681013
38438 -7681013 -8112004 -8660415 -8783163 -7988323 -6356047 -4461293 -2964634 -2269508 -2368927
38429 -2368927 -2855873 -3087320 -2499163 -1004812 769338 1776749 1364330 -112672 -1618834
38420 -1618834 -2401684 -2469942 -2156226 -1576654 -744804 57223 398795 148283 -470468 -1264347
38410 -1264347 -2280589 -3600072 -5114459 -6562157 -7646052 -8096340 -7784598 -6847889 -5591490
38401 -5591490 -4226685 -2810752 -1456357 -413121 186177 541778 969453 1465126 1614870
38392 1614870 1011695 -257033 -1555981 -2120607 -1547403 31748 2124213 4176403 5820534
38383 5820534 7003083 7913966 8702671 9249900 9331592 9037253 8867441 9291884 10293746
38374 10293746 11450649 12362704 12854164 12831635 12148383 10659866 8348230 5448158 2565649
38365 2565649 569549 82811 961301 2405519 3688217 4709408 5810018 7168679
38357 7168679 8478123 9147187 8746624 7317865 5331386 3328683 1554893 -76971
38349 -76971 -1723329 -3428970 -5216924 -7196677 -9431084 -11713732 -13578944 -14569736 -14496662
38340 -14496662 -13487190 -11863040 -10004218 -8309462 -7204359 -7028201 -7773410 -8971682
38332 -8971682 -10003617 -10583172 -10838218 -10897432 -10596363 -9748869 -8564594 -7526416 -6814460
38323 -6814460 -6041042 -4660560 -2553092 -141627 1968572 3381829 4045641 4162681 4003471
38314 4003471 3718635 3278697 2602123 1717854 740233 -316460 -1604334 -3230119 -4971503
38305 -4971503 -6272534 -6606235 -5905866 -4651531 -3487634 -2703899 -2082749 -1241226 -38859
38296 -38859 1410714 3005849 4707152 6303939 7401004 7852903 8075567 8652498 9614511
38287 9614511 10307400 10018032 8580955 6363985 3897155 1645534 -48143 -1034358 -1371070
38278 -1371070 -1197874 -676685 -106361 114150 -124640 -379502 -54620 898576 1875265
38269 1875265 2237580 1829102 807729 -766928 -2928710 -5479895 -7925712 -9800997
38261 -9800997 -10950086 -11458119 -11447567 -11057297 -10554013 -10296571 -10508218 -11137671 -12006017
38252 -12006017 -13035662 -14226561 -15416027 -16201429 -16187008 -15254790 -13558949 -11363253 -8986769
38243 -8986769 -6822908 -5239897 -4411384 -4269198 -4557225 -4856230 -4673644 -3735225 -2239261
38234 -2239261 -696067 518832 1358294 1893808 2135021 2145043 2139371 2282021 2454068 2372491
38224 2372491 1904954 1154965 280315 -636575 -1544235 -2385046 -3156313 -3935752 -4802301
38215 -4802301 -5778775 -6886786 -8211621 -9843455 -11728681 -13604814 -15141702 -16196487
38207 -16196487 -16911757 -17506722 -17990488 -18178792 -18005770 -17676374 -17410183 -17161072 -16788917
38198 -16788917 -16481407 -16763836 -17941401 -19612546 -20842992 -20786175 -19100359 -15931445 -11760723
38189 -11760723 -7332695 -3506982 -914811 339504 646519 604806 755143 1417390 2569643
38180 2569643 3865695 4916101 5616970 6148588 6693498 7317724 8122336 9250900 10600375
38171 10600375 11746223 12417245 12947618 13993293 15814044 18042763 20103881 21549185
38163 21549185 21951800 20871346 18236513 14620600 10870489 7470241 4393443 1486368
38155 1486368 -1211731 -3520629 -5300106 -6505681 -7159244 -7328242 -7096898 -6527691 -5665721
38146 -5665721 -4587707 -3452877 -2527192 -2115771 -2335552 -2863502 -2973494 -1953600 413823
38137 413823 3673850 6885841 9051182 9619687 8770219 7171566 5439177 3924101 2990685
38128 2990685 3142355 4575696 6757403 8757355 10000168 10514315 10568760 10387521 10185465
38119 10185465 10088974 9876632 9083739 7537616 5577131 3604663 1673450 -279574 -2052464
38110 -2052464 -3365887 -4312891 -5286281 -6470812 -7684942 -8730424 -9598770 -10236446 -10369216
38101 -10369216 -9748916 -8440926 -6724391 -4830052 -2938313 -1343626 -406315 -297740
38093 -297740 -888304 -1891222 -3021891 -4013686 -4608211 -4637209 -4120349 -3275807 -2458201
38084 -2458201 -2051864 -2297657 -3122564 -4163378 -5037518 -5609757 -5978878 -6261240 -6497008
38075 -6497008 -6782587 -7366456 -8482018 -10078272 -11784986 -13175408 -14049350 -14466910 -14552347
38066 -14552347 -14318756 -13729518 -12941160 -12401690 -12557460 -13399807 -14406023 -15039969 -15255222
38057 -15255222 -15390977 -15632429 -15762121 -15486865 -14856474 -14256411 -14055233 -14314574 -14759886
38048 -14759886 -14961952 -14619521 -13754094 -12605151 -11317832 -9838269 -8188194 -6719862
38040 -6719862 -5930176 -6024703 -6751330 -7626072 -8233044 -8381911 -8158617 -7848236 -7659893 -7469834
38030 -7469834 -6954770 -6056918 -5223146 -5064093 -5762010 -6831224 -7439083 -6979918 -5442696
38021 -5442696 -3322572 -1202656 589119 1965870 2878893 3292559 3349028 3372526 3580702
38012 3580702 3832500 3728003 2942977 1480394 -293014 -1796116 -2522525 -2317310 -1397189
38003 -1397189 -109099 1250721 2373247 2881136 2530387 1443351 7524 -1454986
37995 -1454986 -2818183 -3989643 -4789835 -5077859 -4928632 -4617938 -4432046 -4466266 -4556938
37986 -4556938 -4450809 -4158870 -4155235 -5079718 -7109577 -9626813 -11567952 -12146791 -11313741
37977 -11313741 -9647664 -7889560 -6527601 -5682538 -5239156 -4989189 -4668505 -4020178 -2991415
37968 -2991415 -1866019 -1080025 -881754 -1263111 -2199788 -3750765 -5797515 -7839583 -9280801
37959 -9280801 -9951594 -10237243 -10655208 -11348213 -11963454 -11954882 -11039476 -9474774 -7909339
37950 -7909339 -6876385 -6410931 -6215883 -6159777 -6461689 -7355974 -8735176 -10226208 -11495820
37941 -11495820 -12346594 -12623529 -12249105 -11364224 -10250660 -9048096 -7694950 -6241825 -5086474
37932 -5086474 -4726353 -5292816 -6428232 -7601878 -8470471 -8992594 -9348408 -9775239 -10360939
37923 -10360939 -10936149 -11224767 -11105992 -10641163 -9852151 -8642971 -7046579 -5450255 -4448426
37914 -4448426 -4469055 -5516749 -7102178 -8318290 -8205315 -6386388 -3433749 -466229 1671526
37905 1671526 2790351 3070878 2714788 1964246 1181921 628610 189829 -513438 -1718932
37896 -1718932 -3278548 -4774173 -5828089 -6388692 -6814072 -7606255 -8919812 -10326090 -11157220
37887 -11157220 -11102907 -10439197 -9740943 -9476544 -9813163 -10584395 -11326149 -11479215 -10778129
37878 -10778129 -9518500 -8349273 -7675124 -7229770 -6321318 -4603548 -2603888 -1380752
37870 -1380752 -1581459 -2859385 -4233522 -4960057 -5046265 -5068357 -5637291 -6952848 -8628323
37861 -8628323 -9840765 -9789109 -8211759 -5578362 -2817089 -808857 33541 -85461 -554103
37852 -554103 -854354 -981080 -1331094 -2111073 -2916395 -3020444 -2106132 -628867 609456
37843 609456 1237420 1651448 2612511 4548312 7228369 10018330 12344405 13924935 14722248
37834 14722248 14861115 14615570 14304597 14024471 13483620 12246566 10239582 7956487 6053662
37825 6053662 4748104 3717356 2590198 1365215 237114 -834940 -2145710 -3831403
37817 -3831403 -5636701 -7145764 -8078963 -8303622 -7777861 -6694081 -5567660 -4924549 -4832948
37808 -4832948 -4845030 -4425087 -3385783 -1982529 -762413 -355133 -1223715 -3401883 -6380292
37799 -6380292 -9265589 -11165059 -11629039 -10902841 -9748928 -8891642 -8535587 -8370280 -7952584
37790 -7952584 -7030425 -5608506 -3881419 -2137763 -644551 385694 680320 -119841 -2150363
37781 -2150363 -4942312 -7523661 -9037025 -9266592 -8620624 -7753756 -7213838 -7231757 -7668579
37772 -7668579 -8207623 -8681102 -9153678 -9642546 -9889547 -9556555 -8589611 -7243381 -5749711
37763 -5749711 -4080622 -2056393 411886 3219648 6106229 8695753 10524735 11154966
37755 11154966 10401002 8527961 6201290 4127853 2609576 1348089 -335548 -2984115
37747 -2984115 -6500507 -10031177 -12448076 -13149818 -12466100 -11234130 -10005791 -8752171
37739 -8752171 -7268841 -5641677 -4220489 -3279298 -2822178 -2630064 -2380265 -1797740 -861166
37730 -861166 84852 478729 -136809 -1865670 -4412644 -7227637 -9757934 -11640812 -12687507
37721 -12687507 -12770248 -11889625 -10404171 -9030940 -8424883 -8709100 -9437129 -9982218 -9958558
37712 -9958558 -9377034 -8509729 -7601047 -6661578 -5536469 -4143571 -2570148 -963009 541950
37703 541950 1786498 2692660 3470993 4485227 5717381 6567274 6478032 5672958 4959968
37694 4959968 4809238 4941052 4901598 4704535 4644493 4670171 4277742 3054871 1133831 -944927
37684 -944927 -2665459 -3753187 -4109800 -3759549 -2948000 -2185591 -1994921 -2482380 -3174827
37675 -3174827 -3387198 -2828758 -1844406 -1037828 -687511 -596160 -516009 -603468 -1295903 -2715073
37665 -2715073 -4345542 -5435039 -5641156 -5153931 -4281699 -3182456 -2040238 -1202859 -898408
37656 -898408 -928416 -860265 -483895 102075 831208 1898340 3600329 6072798 9194827
37647 9194827 12576725 15544594 17289496 17273237 15606657 13012866 10348784 8079191
37639 8079191 6147741 4314976 2569707 1167076 327590 54640 284219 1031397 2228294
37630 2228294 3523430 4458612 4864034 4940981 4939487 4875375 4573468 3849798 2601955 837610
37620 837610 -1300044 -3574185 -5741891 -7550076 -8678472 -8848377 -8095891 -6893920 -5931901
37611 -5931901 -5746290 -6481357 -7852565 -9281044 -10173925 -10209430 -9409135 -8000414 -6297173
37602 -6297173 -4660410 -3355152 -2327154 -1262929 -28942 1053658 1584194 1690587
37594 1690587 1982392 2768678 3526442 3381213 2058642 155424 -1513809 -2606704 -3258157
37585 -3258157 -3706615 -4161353 -4859599 -5902673 -7006999 -7687191 -7799983 -7751482 -8088595
37576 -8088595 -9012902 -10320105 -11618171 -12521166 -12824840 -12622664 -12107256 -11189220 -9548706
37567 -9548706 -7209941 -4799307 -2970481 -1763323 -819589 -64853 184481 -279835 -1301923
37558 -1301923 -2580124 -3798932 -4537941 -4428400 -3528492 -2271199 -936939 567052 2323907
37549 2323907 4117172 5693978 7055711 8272737 9204357 9625477 9515890 9062081 8485645
37540 8485645 8001905 7819170 8038598 8651633 9703697 11267292 13115278 14619536 15202908
37531 15202908 14831125 13955999 13103861 12605072 12500101 12514712 12303106 11906943 11771652
37522 11771652 12066956 12200640 11335848 9262191 6440811 3347102 196567 -2756738
37514 -2756738 -5176114 -7018734 -8515687 -9583678 -9674070 -8540528 -6875915 -5795256
37506 -5795256 -5783453 -6429048 -7068809 -7356652 -7253875 -6872065 -6489209 -6449669 -6802038 -7128647
37496 -7128647 -6908082 -5997287 -4618535 -2935398 -860979 1634296 4161537 5994888
37488 5994888 6521941 5643508 3888411 2236546 1655607 2502402 4262550 5978691 6991203
37479 6991203 7230221 6914343 6259410 5548523 5162108 5244485 5452160 5279292 4581800 3572986
37469 3572986 2381346 927587 -694706 -2015371 -2607150 -2632877 -2809000 -3819822 -5821562
37460 -5821562 -8451178 -11172501 -13552135 -15277715 -16081749 -15832306 -14765779 -13515618
37452 -13515618 -12745102 -12711471 -13231205 -14005443 -14822466 -15439193 -15503449 -14835341 -13784529
37443 -13784529 -13114094 -13369449 -14357580 -15332717 -15723687 -15606026 -15408806 -15270688 -14878878
37434 -14878878 -13966604 -12768943 -11822458 -11380951 -11170992 -10713037 -9783281 -8570561 -7484374
37425 -7484374 -6837759 -6648168 -6687247 -6697878 -6547956 -6231940 -5864215 -5720583 -6133782 -7173716
37415 -7173716 -8432310 -9206371 -8900246 -7289660 -4596769 -1475644 1207598 2863921
37407 2863921 3546494 3755639 3906514 4084570 4222719 4263194 4089791 3513032 2468884
37398 2468884 1151191 -123254 -1082298 -1472875 -1042391 215213 1766429 2685305 2302849
37389 2302849 781973 -995521 -2141089 -2319550 -1635247 -215190 1806692 3955635
37381 3955635 5474090 5956061 5748218 5534063 5687229 6216046 7089963 8223738 9201110
37372 9201110 9414409 8597861 7015223 5103101 3181786 1550790 559900 406000 998719
37363 998719 2089440 3345911 4248934 4189957 2883307 582821 -2208111 -5108812 -7870374
37354 -7870374 -10215469 -11860790 -12633077 -12465188 -11371555 -9532023 -7337881 -5284679
37346 -5284679 -3837190 -3312338 -3682763 -4473255 -5078920 -5289823 -5364169 -5577814 -5929563
37337 -5929563 -6300899 -6557871 -6347098 -5136768 -2750525 321932 3337439 5795047 7353286
37328 7353286 7645824 6634598 4982117 3631768 3035214 3073839 3582533 4499977 5521394
37319 5521394 6073525 5793378 4743279 3065931 739819 -2169817 -5243594 -7825211
37311 -7825211 -9262721 -9060052 -7137794 -4119496 -1122293 950588 1840301 1680462 627012
37302 627012 -1114518 -3196004 -5352298 -7573726 -9812666 -11657765 -12605576 -12646069 -12328812
37293 -12328812 -12179217 -12193509 -11967562 -11231557 -10211753 -9508462 -9620675 -10541741 -11800741
37284 -11800741 -12883985 -13579493 -13959539 -14192861 -14455917 -14895898 -15519238 -16123761 -16415614
37275 -16415614 -16176195 -15290873 -13705886 -11451426 -8677600 -5634144 -2684951 -343249
37267 -343249 914095 1044623 548262 -14652 -561349 -1365345 -2471293 -3520545 -4240730
37258 -4240730 -4860004 -5833478 -7270187 -8820986 -10091087 -10986457 -11645090 -12215650 -12832761
37249 -12832761 -13725655 -15174256 -17268251 -19723992 -21967174 -23410623 -23709218 -22857110
37241 -22857110 -21118530 -18842220 -16270535 -13501394 -10644147 -7976252 -5870912 -4538896
37233 -4538896 -3868360 -3535689 -3271676 -3061520 -3160168 -3918091 -5501876 -7701447 -10005402
37224 -10005402 -11901459 -13150189 -13841937 -14255059 -14630251 -14981674 -15085937 -14699837 -13810213
37215 -13810213 -12646126 -11484252 -10536539 -10007162 -10088821 -10798540 -11901319 -13085408 -14142218
37206 -14142218 -14891865 -15042236 -14319218 -12777279 -10875746 -9187827 -8042277 -7395180 -6944947
37197 -6944947 -6366607 -5538158 -4591918 -3701940 -2815523 -1674314 -137005 1590368 3095909
37188 3095909 4066631 4383667 3994789 2872987 1191705 -546263 -1713971 -1977674 -1493069
37179 -1493069 -663293 260371 1303963 2578307 4112737 5916930 8047142 10425676
37171 10425676 12606988 13907331 13897523 12741785 10997887 9132471 7303014 5550463
37163 5550463 4020695 2872370 2011153 1039875 -462343 -2619203 -5212919 -7916471
37155 -7916471 -10532371 -13004750 -15229327 -16909702 -17683842 -17449931 -16536685 -15470004 -14548762
37146 -14548762 -13696627 -12731624 -11701446 -10916806 -10719707 -11247851 -12325642 -13500096 -14263624
37137 -14263624 -14379820 -14015535 -13534525 -13236142 -13337554 -14027650 -15297303 -16760571 -17902988
37128 -17902988 -18567189 -18979201 -19198331 -18750091 -16988865 -13727326 -9375698 -4578709 95580
37119 95580 4171671 7222542 8957835 9367382 8784476 7780713 6864843 6176323 5513713
37110 5513713 4693878 3761156 2784194 1667124 400610 -618432 -823805 -65478 1263847
37101 1263847 2707145 4100471 5388141 6372569 6872967 6979729 6917422 6720841 6268076
37092 6268076 5639938 5238343 5426784 6121395 6822269 7022830 6515502 5297799 3312877
37083 3312877 479168 -2952295 -6233792 -8545750 -9631939 -9906321 -9930335 -9910093 -9683730
37074 -9683730 -8972880 -7551672 -5384169 -2793065 -377610 1427369 2656173 3555667
37066 3555667 4169942 4422245 4525018 4970834 6011391 7368294 8589088 9528446 10349964
37057 10349964 11190468 11980737 12539917 12754221 12739025 12894175 13661441 15078788 16664484
37048 16664484 17886975 18646485 19106326 19175095 18508091 17097789 15554494 14578922 14305574
37039 14305574 14350118 14358399 14259481 14054986 13673470 13117904 12521704 11910764 11088169 9973666
37029 9973666 8987678 8860194 9977735 12016346 14243319 16052221 17137405 17310360 16410918
37020 16410918 14525342 12226315 10458105 10047216 11179452 13233603 15127262 15980887
37012 15980887 15643663 14681920 13864348 13630552 13997233 14838840 16093092 17655192 19206137
37003 19206137 20296418 20620310 20164370 19121786 17749632 16300181 14965071 13797049
36995 13797049 12718205 11657401 10652264 9762796 8901568 7826919 6368821 4671266
36987 4671266 3157603 2169399 1614701 1062105 259335 -527103 -822389 -530923 -26150
36978 -26150 312435 371848 45410 -936152 -2582918 -4235595 -4979576 -4499040 -3250446
36969 -3250446 -1795270 -294409 1257793 2670164 3689176 4288604 4572407 4527511 4109681
36960 4109681 3465748 2827555 2264719 1794510 1670101 2232077 3401776 4584080 5206845
36951 5206845 5186449 4763760 4086501 3151288 2057164 1111196 660754 900428 1817553
36942 1817553 3240131 4931409 6671285 8240945 9366558 9808686 9572144 8924953 8117078
36933 8117078 7165570 6030354 4924819 4281382 4387714 5162295 6306747 7584482 8915272
36924 8915272 10268100 11511532 12362820 12524396 11963356 11072101 10460500 10510200 11123046
36915 11123046 11880321 12373589 12363815 11724039 10362134 8258553 5581316 2768924 495308
36906 495308 -509584 271717 2905805 6919728 11430970 15472449 18354890 19841781
36898 19841781 20050551 19231951 17630548 15457807 12896573 10118600 7323445 4721769
36890 4721769 2425031 394219 -1420023 -2924265 -3985402 -4674256 -5259411 -5918056 -6593660
36881 -6593660 -7206636 -7833677 -8505204 -8923065 -8602942 -7323380 -5294352 -2886177 -387545
36872 -387545 1889181 3459882 3860209 3015247 1344750 -483358 -1862672 -2428934 -2151809
36863 -2151809 -1325683 -338451 698709 2095225 4269712 7238461 10406725 12888126
36855 12888126 14098293 14138512 13641378 13169089 12670946 11539782 9273082 6085188 2812174
36846 2812174 220634 -1509074 -2630243 -3348876 -3656159 -3566827 -3298132 -3096336 -2961432
36837 -2961432 -2638410 -1866661 -607879 906533 2273910 3117151 3323638 3140143 2955269
36828 2955269 2936023 2938834 2821298 2725912 2889548 3200589 3185034 2592485 1854690 1692291
36818 1692291 2215208 2618737 1924722 -51711 -2557606 -4591417 -5582650 -5530632 -4817134
36809 -4817134 -4005693 -3591908 -3703012 -4056691 -4319028 -4449809 -4602941 -4784249 -4779239 -4384629
36799 -4384629 -3534846 -2200236 -359188 1853034 4121942 6173060 7878881 9044352
36791 9044352 9247878 8119103 5767559 2804108 -47620 -2284010 -3725504 -4609876
36783 -4609876 -5652748 -7718524 -11123174 -15218017 -18734030 -20549213 -20216007 -18047927
36775 -18047927 -14943368 -11987740 -9855932 -8445802 -7227607 -6014118 -5211780 -5189583
36767 -5189583 -5569247 -5391110 -4001794 -1635819 882278 2842762 4005660 4458683 4361046
36758 4361046 3839237 2957825 1659983 -237564 -2888203 -6171126 -9551700 -12187827
36750 -12187827 -13298158 -12640771 -10754415 -8632339 -6960629 -5599437 -3868696 -1356499
36742 -1356499 1620245 4320943 6170375 6987683 6856914 6041830 5012954 4310475 4227422
36733 4227422 4670299 5371866 6181026 7116767 8211189 9358022 10308507 10837433 10956566
36724 10956566 10904071 10812499 10442917 9434557 7823707 6094994 4646295 3440913 2340600
36715 2340600 1531892 1319538 1617769 1992601 2232673 2584257 3315897 4275735 5028906
36706 5028906 5291822 5098042 4640135 4077631 3443425 2644715 1590698 349202 -916123
36697 -916123 -2201516 -3708105 -5525764 -7415979 -9079479 -10521699 -11892639 -12967581
36689 -12967581 -13071744 -11698341 -9100027 -6158418 -3766588 -2435066 -2312230 -3245016
36681 -3245016 -4721976 -6002539 -6550982 -6334613 -5609486 -4520095 -3080413 -1452022 59748
36672 59748 1361504 2677716 4161638 5612175 6773264 7727752 8706665 9586743 9876179
36663 9876179 9222327 7702839 5597822 3132214 530514 -1900159 -3892750 -5311561
36655 -5311561 -6055736 -6028144 -5294184 -4144504 -2925806 -1921052 -1389960 -1470452 -1904435
36646 -1904435 -2067390 -1468522 -149074 1463608 2914154 3896359 4426337 5080879 6761138
36637 6761138 9830090 13599889 16976028 19473220 21283147 22553350 23143433 23111294 22891282
36628 22891282 22739265 22349120 21279394 19527328 17466120 15420724 13516334 11751025
36620 11751025 9955287 7781085 4978177 1687553 -1647005 -4598601 -6899705 -8392680
36612 -8392680 -9024908 -8885638 -8155862 -7048473 -5832362 -4799876 -4096758 -3636202 -3236414
36603 -3236414 -2753940 -2054740 -1057226 32464 680697 464269 -459471 -1449165 -1891654
36594 -1891654 -1505705 -291760 1507938 3351031 4559463 4745783 4054105 2949339 1870765
36585 1870765 1149594 1110706 2001237 3696180 5563328 6815077 7121344 6846523 6609957
36576 6609957 6668114 6843437 6987116 7262290 7888042 8820558 9868078 10994042 12305134
36567 12305134 13783461 15193123 16240379 16718308 16547021 15818356 14781910 13637151
36559 13637151 12305282 10499378 8062445 5233434 2639133 1037117 879568 1906914
36551 1906914 3179245 3670528 2911271 1109946 -1133774 -3061558 -3923286 -3336895 -1606716
36542 -1606716 505215 2384798 3810276 4685410 4913996 4695384 4611010 5058160 5663620
36533 5663620 5522596 4055616 1515240 -1291667 -3594265 -4992984 -5484227 -5378699 -5173044
36524 -5173044 -5338347 -6112713 -7468850 -9276551 -11449303 -13874860 -16241615 -18083180
36516 -18083180 -19089108 -19291534 -18841748 -17687483 -15655206 -12871034 -9946519 -7648271
36508 -7648271 -6389916 -6004394 -5917202 -5563282 -4761221 -3724700 -2688936 -1626292 -455938
36499 -455938 594060 1113819 1018549 689028 569899 877668 1736430 3214611 4974461
36490 4974461 6177424 6139441 5057444 3866593 3423389 3952140 5060603 5937359 5637411
36481 5637411 3669912 537860 -2516763 -4497028 -5339916 -5676353 -6172591 -7195295 -8811213
36472 -8811213 -10775725 -12546552 -13544537 -13504287 -12551985 -11001857 -9176547 -7376588 -5847651
36463 -5847651 -4670122 -3716673 -2795289 -1861983 -1076496 -629282 -523152 -555776 -514218 -339682
36453 -339682 -104952 63993 -22159 -581754 -1631454 -2785080 -3436505 -3206156 -2127748
36444 -2127748 -395774 1900145 4671442 7557943 9917556 11137900 10979910 9719308
36436 9719308 8025416 6589694 5666902 4895925 3629734 1492359 -1392074 -4668254
36428 -4668254 -8100565 -11554196 -14701080 -16949476 -17818370 -17360701 -16103115 -14552832
36420 -14552832 -12884719 -11172205 -9764512 -9203175 -9723996 -10970739 -12245251 -12936009
36412 -12936009 -12682767 -11328768 -8949016 -5951207 -3004389 -737724 570008 1091715
36404 1091715 1299137 1641975 2245010 2854199 3095228 2810440 2172581 1534181 1210090
36395 1210090 1350381 1914053 2717488 3533633 4167872 4453891 4237792 3438912 2112793
36386 2112793 380382 -1695463 -4038993 -6291624 -7721325 -7611269 -5859807 -3162043
36378 -3162043 -510647 1522386 3021659 4313083 5425668 6036294 5904814 5244483 4583110
36369 4583110 4283776 4268517 4208500 3898212 3392936 2866747 2482715 2418518 2853018 3767189
36359 3767189 4795173 5430347 5430472 4935707 4174031 3194759 1994580 802833 84922
36350 84922 260373 1472486 3535130 5936331 7943752 8979862 9067200 8820829 8867661
36341 8867661 9265275 9496963 8945816 7336008 4870237 2133041 -145764 -1404028 -1461653
36332 -1461653 -482553 1211699 3254375 5254470 6869883 7941384 8543863 8900970 9243590
36323 9243590 9674752 10084822 10216650 9888142 9148438 8179478 7116016 6077766 5327696
36314 5327696 5199565 5777926 6745680 7618970 8065576 7969250 7337838 6305825 5175665
36305 5175665 4288795 3787796 3534667 3248530 2673882 1653333 160149 -1657766 -3472308
36296 -3472308 -4859342 -5462070 -5173723 -4210305 -2946121 -1615002 -216926 1226514 2411924
36287 2411924 2889665 2445597 1225152 -497768 -2475658 -4332520 -5454531 -5278887 -3724773
36278 -3724773 -1260327 1424948 3737690 5284397 5926536 5864361 5544895 5319338 5174968
36269 5174968 4868768 4305770 3695997 3317438 3205653 3148224 2957097 2665658 2431308 2300526
36259 2300526 2127969 1706752 912848 -286950 -1897306 -3901827 -6215941 -8653950 -10925772
36250 -10925772 -12666598 -13546916 -13444924 -12527493 -11135485 -9590300 -8093166 -6704614
36242 -6704614 -5321830 -3734943 -1853950 96979 1720502 2813149 3497078 3971371
36234 3971371 4281618 4423692 4534768 4807037 5252734 5709852 6091336 6509372 7124294
36225 7124294 7957099 8867539 9621402 9941929 9596110 8547938 7061858 5639743 4803040
36216 4803040 4812026 5475348 6249473 6640048 6543471 6147812 5545965 4596190 3179490 1409798
36206 1409798 -514678 -2505477 -4447903 -5972526 -6609338 -6209770 -5046028 -3439089
36198 -3439089 -1458329 901862 3403914 5633666 7352661 8594309 9385169 9582353
36190 9582353 9137940 8381878 7790167 7454131 6994056 6097578 4964336 4052089 3526524
36181 3526524 3219538 3090376 3414740 4379994 5706091 6875710 7648186 8165979 8600008
36172 8600008 8859428 8653217 7714652 5983064 3718887 1471083 -213903 -1155697 -1591475
36163 -1591475 -1859278 -2082979 -2137718 -1792166 -853912 679390 2503065 4122013 5216462
36154 5216462 5899090 6557140 7451197 8480605 9261296 9365394 8578204 7089310 5463883
36145 5463883 4298637 3780523 3547691 2993957 1753957 6549 -1567005 -2121751 -1109527
36136 -1109527 1395716 4719724 7936512 10296170 11488698 11672368 11315271 10928937 10810253
36127 10810253 10930813 11025102 10791087 10084743 9051601 8140110 7894378 8535085 9626976
36118 9626976 10234107 9572298 7602469 4985371 2492231 545182 -719636 -1221494 -1022933
36109 -1022933 -560420 -460323 -968305 -1716236 -2213955 -2482957 -3053957 -4399115 -6511703
36100 -6511703 -8969155 -11181169 -12571559 -12816105 -12136072 -11259663 -10859888 -10957520 -10938619
36091 -10938619 -10168137 -8562667 -6647588 -5194010 -4790705 -5586389 -7279719 -9319841
36083 -9319841 -11141713 -12257047 -12260847 -10972216 -8687453 -6190542 -4310235 -3357580 -3006408
36074 -3006408 -2734276 -2342300 -2029277 -2021996 -2229695 -2302321 -1986977 -1365992 -752958 -437227
36064 -437227 -565665 -1155808 -2042537 -2789360 -2847899 -2010111 -721374 160514 -13018 -1257114
36054 -1257114 -3036002 -4652365 -5604871 -5761814 -5335773 -4697118 -4169091 -3964281 -4215583
36045 -4215583 -4912912 -5760191 -6205900 -5733055 -4144538 -1602399 1488729 4575676 7064525
$$ [...]
##END NTUPLES=NMR SPECTRUM
##END=
