##TITLE=31Pdec_LR-772-RA-PhCH3
 CDCl3 
  24 sc
 25.10.2023
##JCAMPDX= 6.0         $$ Bruker NMR JCAMP-DX V2.0
##DATA TYPE= NMR SPECTRUM
##DATA CLASS= NTUPLES
##ORIGIN= UXNMR, Bruker Analytische Messtechnik GmbH
##OWNER= root
$$ XWIN-NMR		Version 3.5
$$ Wed Oct 25 14:14:41 2023 Russian Standard Time (UT+4h)  she@DPX200
##.OBSERVE FREQUENCY= 81.013821
##.OBSERVE NUCLEUS= ^31P
##.ACQUISITION MODE= SIMULTANEOUS
##.ACQUISITION SCHEME= undefined
##.AVERAGES= 24
##.DIGITISER RES= 16
##SPECTROMETER/DATA SYSTEM= spect
##.PULSE SEQUENCE= zgpg30
##.SOLVENT NAME= CDCl3
##.SHIFT REFERENCE= (INTERNAL, CDCl3, 0, 248.564)
##AUDIT TRAIL= $$ (NUMBER, WHEN, WHO, WHERE, WHAT)
$$ ##TITLE= Audit trail, XWIN-NMR		Version 3.5
$$ ##JCAMPDX= 5.01
$$ ##ORIGIN= Bruker BioSpin GmbH
$$ ##OWNER= she
$$ F:/spectra/data/she/nmr/P31/1/pdata/1/auditp.txt
$$ ##AUDIT TRAIL=  $$ (NUMBER, WHEN, WHO, WHERE, WHAT)
(   1,<2023-10-25 14:13:18.46 +0400>,<she>,<DPX200>,
      <created by zg, POWCHK disabled, PULCHK disabled
       configuration hash MD5:
       00 E9 B6 7A A2 85 ED C7 34 08 36 98 17 FE 4E 26
       data hash MD5: 32K
       D6 FC 10 B6 5E 61 B8 43 52 FB 72 38 82 AC 6F 09>)
(   2,<2023-10-25 14:13:23.51 +0400>,<she>,<DPX200>,
      <Start of raw data processing
       efp BC_mod = 2 LB = 5 FT_mod = 6 PKNL = 1 PHC0 = -10727.18 PHC1 = 259.8862 SI = 64K 
       data hash MD5: 64K
       AD 4B A8 1C 4A 58 55 44 CA 38 70 38 53 F3 21 4E>)
(   3,<2023-10-25 14:13:36.10 +0400>,<she>,<DPX200>,
      <pk PHC0 = -8.797218 PHC1 = 0 
       data hash MD5: 64K
       72 48 B1 14 18 6C 23 53 EF 2E 43 B4 F1 6F 52 94>)
$$ ##END=
$$ 
$$ hash MD5
$$ 81 B5 90 44 90 C6 93 B7 64 28 CF 9E 4E 17 F8 6F
##$RELAX= 
##$RELAX= 
##$RELAX= 
##$RELAX= 
##$RELAX= 
##$RELAX= 
##$RELAX= 
##$RELAX= 
##$RELAX= 
$$ Bruker specific parameters
$$ --------------------------
##$DU= <F:/spectra>
##$EXPNO= 1
##$NAME= <P31>
##$PROCNO= 1
##$TYPE= <nmr>
##$USER= <she>
##$AMP= (0..31)
100 100 100 100 100 100 100 100 100 100 100 100 100 100 100 100 100 100 
100 100 100 100 100 100 100 100 100 100 100 100 100 100 
##$AQSEQ= 0
##$AQ_mod= 1
##$AUNM= <au_zg>
##$AUTOPOS= <>
##$BF1= 81.014009
##$BF2= 200.13
##$BF3= 200.13
##$BF4= 200.13
##$BF5= 200.13
##$BF6= 200.13
##$BF7= 200.13
##$BF8= 200.13
##$BYTORDA= 1
##$CFDGTYP= 0
##$CFRGTYP= 5
##$CHEMSTR= <none>
##$CNST= (0..31)
1 1 145 1 1 1 1 1 1 1 1 1 1 1 1 1 1 1 1 1 1 1 1 1 1 1 1 1 1 1 1 1 
##$CPDPRG= <waltz16>
##$CPDPRG1= <>
##$CPDPRG2= <waltz16>
##$CPDPRG3= <>
##$CPDPRG4= <mlev>
##$CPDPRG5= <mlev>
##$CPDPRG6= <mlev>
##$CPDPRG7= <mlev>
##$CPDPRG8= <mlev>
##$CPDPRGB= <>
##$CPDPRGT= <>
##$D= (0..31)
0 1 0 0 0 0 0 0 0 0 0 0.03 2e-05 3e-06 0 0 0 0 0 0 0 0 0 0 0 0 0 0 0 0 
0 0 
##$DATE= 1698228797
##$DBL= (0..7)
120 120 120 11 120 120 24 19 
##$DBP= (0..7)
150 150 150 150 150 150 150 150 
##$DBP07= 0
##$DBPNAM0= <>
##$DBPNAM1= <>
##$DBPNAM2= <>
##$DBPNAM3= <>
##$DBPNAM4= <>
##$DBPNAM5= <>
##$DBPNAM6= <>
##$DBPNAM7= <>
##$DBPOAL= (0..7)
0.5 0.5 0.5 0.5 0.5 0.5 0.5 0.5 
$$ [...]
##$SUBNAM2= <"">
##$SUBNAM3= <"">
##$SUBNAM4= <"">
##$SUBNAM5= <"">
##$SUBNAM6= <"">
##$SUBNAM7= <"">
##$SUBNAM8= <"">
##$SUBNAM9= <"">
##$SW= 501.771253377433
##$SWIBOX= (0..15)
0 1 3 0 0 0 0 0 0 0 0 0 0 0 0 0 
##$SW_h= 40650.406504065
##$TD= 32768
##$TD0= 1
##$TE= 0
##$TE2= 300
##$TE3= 300
##$TEG= 300
##$TL= (0..7)
0 120 53 12 22 120 120 120 
##$TP= (0..7)
150 150 150 150 150 150 150 150 
##$TP07= 0
##$TPNAME0= <>
##$TPNAME1= <>
##$TPNAME2= <>
##$TPNAME3= <>
##$TPNAME4= <>
##$TPNAME5= <>
##$TPNAME6= <>
##$TPNAME7= <>
##$TPOAL= (0..7)
0.5 0.5 0.5 0.5 0.5 0.5 0.5 0.5 
##$TPOFFS= (0..7)
0 0 0 0 0 0 0 0 
##$TUNHIN= 0
##$TUNHOUT= 0
##$TUNXOUT= 0
##$USERA1= <user>
##$USERA2= <user>
##$USERA3= <user>
##$USERA4= <user>
##$USERA5= <user>
##$V9= 5
##$VALIST= <valist>
##$VCLIST= <CCCCCCCCCCCCCCC>
##$VD= 0
##$VDLIST= <DDDDDDDDDDDDDDD>
##$VPLIST= <PPPPPPPPPPPPPPP>
##$VTLIST= <TTTTTTTTTTTTTTT>
##$WBST= 1024
##$WBSW= 4
##$XGAIN= (0..3)
0 0 0 0 
##$XL= 0
##$YL= 0
##$YMAX_a= 898
##$YMIN_a= -986
##$ZGOPTNS= <>
##$ZL1= 120
##$ZL2= 120
##$ZL3= 120
##$ZL4= 120
##$ABSF1= 0
##$ABSF2= 0
##$ABSG= 0
##$ABSL= 0
##$ALPHA= 0
##$AQORDER= 0
##$ASSFAC= 0
##$ASSFACI= 0
##$ASSFACX= 0
##$ASSWID= 0
##$AUNMP= <proc_1d>
##$AZFE= 0.1
##$AZFW= 0.5
##$BCFW= 0
##$BC_mod= 2
##$BYTORDP= 0
##$COROFFS= 0
##$CY= -3
##$DATMOD= 1
##$DC= 0
##$DFILT= <>
##$DTYPP= 0
##$F1P= 0
##$F2P= 0
##$FCOR= 1
##$FTSIZE= 65536
##$FT_mod= 6
##$GAMMA= 0
##$GB= 0
##$INTBC= 1
##$INTSCL= 6.047779e-11
##$ISEN= 30
##$LB= 5
##$LEV0= 0
##$LPBIN= 0
##$MAXI= 10000
##$MC2= 0
##$MEAN= 0
##$ME_mod= 0
##$MI= 50
##$NCOEF= 0
##$NC_proc= -11
##$NLEV= 6
##$NOISF1= 182.463
##$NOISF2= 159.3651
##$NSP= 0
##$NTH_PI= 0
##$NZP= 0
##$OFFSET= 248.5645
##$PC= 4
##$PHC0= -10735.98
##$PHC1= 259.8862
##$PH_mod= 1
##$PKNL= yes
##$PPARMOD= 0
##$PSCAL= 0
##$PSIGN= 0
##$REVERSE= no
##$SF= 81.0140089999694
##$SI= 65536
##$SIGF1= 159.3651
##$SIGF2= -187.1042
##$SINO= 113.3802
##$SIOLD= 16384
##$SREGLST= <1H.CDCl3>
##$SSB= 0
##$STSI= 65536
##$STSR= 0
##$SW_p= 40650.406504065
##$SYMM= 0
##$S_DEV= 0
##$TDeff= 32768
##$TDoff= 0
##$TI= <>
##$TILT= no
##$TM1= 0
##$TM2= 0
##$TOPLEV= 0
##$USERP1= <user>
##$USERP2= <user>
##$USERP3= <user>
##$USERP4= <user>
##$USERP5= <user>
##$WDW= 1
##$XDIM= 65536
##$YMAX_p= 304142150
##$YMIN_p= -93635042
$$ End of Bruker specific parameters
$$ ---------------------------------
##NTUPLES= NMR SPECTRUM
##VAR_NAME=  FREQUENCY,     SPECTRUM/REAL,   SPECTRUM/IMAG
##SYMBOL=    X,             R,               I
##VAR_TYPE=  INDEPENDENT,   DEPENDENT,       DEPENDENT
##VAR_FORM=  AFFN,          ASDF,            ASDF
##VAR_DIM=   65536,         65536,           65536
##UNITS=     HZ,            ARBITRARY UNITS, ARBITRARY UNITS
##FACTOR=    0.620285442955139, 1,           1
##FIRST=     20137.2065510682, 0,            0
##LAST=      -20513.1999529968, 0,           0
##MIN=       -20513.1999529968, -93635042,   0
##MAX=       20137.2065510682, 304142150,    0
$$ Real data points
##PAGE= N=1
##DATA TABLE= (X++(R..R)), XYDATA
$$ [...]
12940D071608p55133q74547r94161j049004j055933r75201o59689j7971P22248
$$ 4071608 3316475 2441928 1447767 398763 -657170 -1632371 -2292060 -2310031 -1587783
12931a587783R95390L45140j026593k297622k727944k236578j216773K5513J425492
$$ -1587783 -592393 -247253 -1273846 -3571468 -6299412 -8535990 -9752763 -9727250 -8301758
12922h301758K843529L849557L874408K518215j06350l065360m813289m288553
$$ -8301758 -5458229 -1608672 2265736 4783951 4677601 1612241 -3201048 -7489601
12914g489601k062897o3766J81585j091007k391338k523812j351926N93101K632868
$$ -7489601 -9552498 -9616264 -9434679 -10525686 -12917024 -15440836 -16792762 -16199661 -13566793
12905a3566793M094369M547055M171638L609562L261363K942941K309093J309821
$$ -13566793 -9472424 -4925369 -753731 2855831 6117194 9060135 11369228 12679049
12897A2679049J00232j158821k196629k653385k485239k067958j601057p46166
$$ 12679049 12779281 11620460 9423831 6770446 4285207 2217249 616192 -129974
12889a29974O72391J866175J658156m9539j894400k344000j064668J035481K662095
$$ -129974 542417 2408592 4066748 4017209 2122809 -221191 -1285859 -250378 2411717
12880B411717K859723J419445r34340k941348l770214l543151k771772j613881
$$ 2411717 5271440 6690885 5756545 2815197 -955017 -4498168 -7269940 -8883821
12872h883821r1281J254214J634107J068247N86931J016272J906594K098698J203609
$$ -8883821 -8975102 -7720888 -6086781 -5018534 -4431603 -3415331 -1508737 589961 1793570
12863A793570O7711l11503J1855O0872q61315k364548l431212l490819k837555
$$ 1793570 1861281 1549778 1561633 1622505 761190 -1603358 -5034570 -8525389 -11362944
12854a1362944k054137j351212o71159j92883k94785r44040j474418j224195k46300
$$ -11362944 -13417081 -14768293 -15439452 -15632335 -15927120 -16871160 -18345578 -19569773 -19816073
12845a9816073Q22417J493920J827649K172130K730137L363763L626994K996973
$$ -19816073 -18993656 -17499736 -15672087 -13499957 -10769820 -7406057 -3779063 -782090
12837g82090J338796p17543k038657j866012m96440R62774J565535J332656J178803
$$ -782090 556706 -160837 -2199494 -4065506 -4561946 -3599172 -2033637 -700981 477822
12828D77822K009067L764549N334296N492175L936585J383839j198378l194743
$$ 477822 2486889 6251438 11585734 17077909 21014494 22398333 21199955 18005212
12820A8005212m286071m294135l392921k214027j337899o88480K93775J829050
$$ 18005212 13719141 9425006 6032085 3818058 2480159 1791679 2085454 3914504
12812C914504L329057L815709K756802N63393j611682k655396k295957j195454
$$ 3914504 7243561 11059270 13816072 14379465 12767783 10112387 7816430 6620976
12804F620976k23649K61440L85951L37059K79889M68340R69182J329461J001728
$$ 6620976 6397327 6658767 7044718 7381777 7661666 8130006 9099188 10428649 11430377
12795A1430377J53768m27012l62851j11397j43772k62383j66566j85379p64784
$$ 11430377 11584145 11157133 10794282 10682885 10539113 10276730 10110164 9924785 9160001
12786I160001j483928j364444k37205Q26385O76378p60850k680029m274582n051328
$$ 9160001 7676073 6311629 6074424 6900809 7577187 6816337 4136308 -138274 -5189602
12777e189602m632705k844947j15760K522543M066184M226067L499071K567424
$$ -5189602 -9822307 -12667254 -12783014 -10260471 -6194287 -1968220 1530851 4098275
12769D098275J616600K92925j609015l533289m464311l892415k320202p41913
$$ 4098275 5714875 6007800 4398785 865496 -3598815 -7491230 -9811432 -10553345
12761a0553345K48381P79066J315305K117468L028831L657628L695207L032887
$$ -10553345 -10304964 -9525898 -8210593 -6093125 -3064294 593334 4288541 7321428
12753G321428J631509m89156k936861m800681n216306m175409k524664j101122
$$ 7321428 8952937 8463781 5526920 726239 -4490067 -8665476 -11190140 -12291262
12745a2291262j54630L12468J08079q38363j969429k408120j830957p35298K17015
$$ -12291262 -12445892 -12133424 -12025345 -12863708 -14833137 -17241257 -19072214 -19807512 -19590497
12736a9590497Q74297J550206K536829L778113M860833N209964M435779K668871
$$ -19590497 -18716200 -17165994 -14629165 -10851052 -5990219 -780255 3655524 6324395
12728F324395N43633j245091k390539k981378l139249k758891j663910K560J640298
$$ 6324395 6868028 5622937 3232398 251020 -2888229 -5647120 -7311030 -7308470 -5668172
12719e668172K577048K649261K329829K210958K428966K694450K799062K864645
$$ -5668172 -3091124 -441863 1887966 4098924 6527890 9222340 12021402 14886047
12711A4886047L006439K914129J976271j27621l012382n758486p431600p475552
$$ 14886047 17892486 20806615 22782886 22655265 19642883 13884397 6452797 -1022755
12703a022755n847234l070611j91114J659086K024503J499722J151178J528969
$$ -1022755 -6869989 -9940600 -10131714 -8472628 -6448125 -4948403 -3797225 -2268256
12695b268256K400766L417255M679154O398476Q189464R038133Q073321N322259
$$ -2268256 132510 3549765 8228919 14627395 22816859 31854992 39928313 45250572
12687D5250572J784849j155629k574018k551367j959960j627782j750529k133477
$$ 45250572 47035421 45879792 43305774 40754407 38794447 37166665 35416136 33282659
12679C3282659k698888l401069l813491l356114k098686r23377n91958q95368
$$ 33282659 30583771 27182702 23369211 20013097 17914411 16991034 16399076 15503708
12671A5503708r95203l93064P30048J919808K772423K937367K279851J176803
$$ 15503708 14508505 14115441 14845489 16765297 19537720 22475087 24754938 25931741
12663B5931741K94135j35620n56439j408633k461648l122692l230751l153893
$$ 25931741 26225876 26090256 25533817 24125184 21663536 18540844 15310093 12156200
12655A2156200l120240k859293k080893j018941k04077K10731O35314J510757
$$ 12156200 9035960 6176667 4095774 3076833 2872756 3083487 3718801 5229558
12647E229558K740227L715636L852902L082803J869953P73423l5033q28413j924801
$$ 5229558 7969785 11685421 15538323 18621126 20491079 21264502 21229469 20401056 18476255
12638A8476255l306147m661161n678391o161969n956349n010979l594968k266224
$$ 18476255 15170108 10508947 4830556 -1331413 -7287762 -12298741 -15893709 -18159933
12630a8159933j478000j256883j292881j213222p17033L29042J691735K779643
$$ -18159933 -19637933 -20894816 -22187697 -23400919 -24117952 -23788910 -22097175 -19317532
12622a9317532L136490K939354K769182K856012K833535K374913J786513J667332
$$ -19317532 -16181042 -13241688 -10472506 -7616494 -4782959 -2408046 -621533 1045799
12614A045799K103033K530629K428488J869352J296601R85705Q97762R11198R76355
$$ 1045799 3148832 5679461 8107949 9977301 11273902 12259607 13157369 14068567 15044922
12605A5044922J067470J152482J255154J466061J841236K267675K385531J698894
$$ 15044922 16112392 17264874 18520028 19986089 21827325 24095000 26480531 28179425
12597B8179425j3291k249735l911103m139440l069210j636813p19585o17100j204587
$$ 28179425 28166134 25916399 22005296 17865856 14796646 13159833 12440248 11823148 10618561
12588A0618561k154166k879161k649456j151179J074565K893000L275048J825544
$$ 10618561 8464395 5585234 2935778 1784599 2859164 5752164 9027212 10852756
12580A0852756j031286m161802o256375o631278n573721l845192k021173m51301
$$ 10852756 9821470 5659668 -596707 -7227985 -12801706 -16646898 -18668071 -19119372
12572a9119372M72163M96499o5648n02911m07377M0790N13119R39617J373980
$$ -19119372 -18647209 -18150710 -18216358 -18719269 -19126646 -19085856 -18572737 -17633120 -16259140
12563a6259140J743082J910206J822241J493250J006214N76334L88889L24615
$$ -16259140 -14516058 -12605852 -10783611 -9290361 -8284147 -7707813 -7318924 -6994309
12555f994309J27118q4644J43021Q24654J198037N88973o09196j315250j080452
$$ -6994309 -6867191 -6951835 -6808814 -5984160 -4786123 -4197150 -4806346 -6121596 -7202048
12546g202048n67397o08000j178738j542015j132485L395J514627L110047M472858
$$ -7202048 -7769445 -8377445 -9556183 -11098198 -12230683 -12227288 -10712661 -7602614 -3129756
12537c129756N034207M167230J783928j304547l764217m591081l713111j939282
$$ -3129756 1904451 6071681 7855609 6551062 2786845 -1804236 -5517347 -7456629
12529g456629m32253m6778p97463j795112j902494p27356R68909J914739J430076
$$ -7456629 -7888882 -7935660 -8733123 -10528235 -12430729 -13158085 -12189176 -10274437 -8844361
12520h844361j6371j193847j041565N69297K786292M452168M903186M213959K877690
$$ -8844361 -8860732 -10054579 -11096144 -10526847 -7740555 -3288387 1614799 5828758 8706448
12511H706448J449828L99753l8517k4780L8843p4256k47815k78602j34552K4148
$$ 8706448 10156276 10556029 10517512 10492732 10531575 10457319 10209504 9930902 9796350 9820498
12501I820498j54501j167256l231000n753614p521764p595504n843832k668605
$$ 9820498 9665997 8498741 5267741 -485873 -8007637 -15603141 -21446973 -24115578
12493b4115578J254763M779127O506086N858081L722340J580614J97606m90643
$$ -24115578 -22860815 -18081688 -11575602 -5717521 -1995181 -414567 -216961 -707604
12485g07604o29280k99628L6988k93524j398161k631733l231250k788050j278016
$$ -707604 -1336884 -1636512 -1599524 -1893048 -3291209 -5922942 -9154192 -11942242 -13220258
12476a3220258P43342K010231J376335r31409l379339m642385m581435l628605
$$ -13220258 -12476916 -10466685 -9090350 -10021759 -13401098 -18043483 -22624918 -26253523
12468b6253523j950105L29260K630334M229816M793313M249596K567238J57493
$$ -26253523 -28203628 -27874368 -25244034 -21014218 -16220905 -11971309 -9404071 -9246578
12460i246578j884791k602470k108216j187725j55570J288771L148396M757710
$$ -9246578 -11131369 -13733839 -15842055 -17029780 -17185350 -15896579 -12748183 -7990473
12452g990473N464495N112364L638580Q16836l033424o355969p073701m338419
$$ -7990473 -2525978 2586386 6224966 7041802 4008378 -2347591 -9421292 -13759711
12444a3759711N27332M986257P241276P327598O472355N653492M936654L998512
$$ -13759711 -13232379 -8246122 -1004846 6322752 12795107 18448599 23385253 27383765
12436B7383765K803814J550349K97347r28950j774377j742001q32422L18270J104438
$$ 27383765 30187579 31737928 32035275 31106325 29331948 27589947 26757525 27075795 28180233
12427B8180233J538367J993795K530349K726497K184471J024594k05575j051982
$$ 28180233 29718600 31712395 34242744 36969241 39153712 40178306 39972731 38920749
12419C8920749j527585k011875k866343m147283n559577o571259o670769n748887
$$ 38920749 37393164 35381289 32514946 28367663 22808086 16236827 9566058 3817171
12411C817171m281472k931912j854567n77849J227329L009234L675312K728966
$$ 3817171 -464301 -3396213 -5250780 -5828629 -4601300 -1592066 2083246 4812212
12403D812212Q65335o74243j222769j071201q68237q59121p73714l04719M86406
$$ 4812212 5677547 5003304 3780535 2709334 1841097 981976 208262 -96457 389949
12394C89949J221430J486549J020135j58097j605099k575779k584716j905839
$$ 389949 1611379 3097928 4118063 3959966 2354867 -220912 -2805628 -4711467
12386d711467j346810j497035k329355l480476m632964n526640n847292n327791
$$ -4711467 -6058277 -7555312 -9884667 -13365143 -17998107 -23524747 -29372039 -34699830
12378c4699830l934250j940227O4388J298475J248896J77053j000714j457991
$$ -34699830 -38634080 -40574307 -40509919 -39211444 -37962548 -37785495 -38786209 -40244200
12370d0244200r65066K92948K001081L634837M512011M382661L843400L763925
$$ -40244200 -41209266 -40916318 -38915237 -35280400 -30768389 -26385728 -22542328 -18778403
12362a8778403M270245M560241L785004J955319m7828j245677j333106p65440
$$ -18778403 -14508158 -9947917 -6162913 -4207594 -4255422 -5501099 -6834205 -7599645
12354g599645j53865K71311M61065Q8339j130683k562047k753192r07281K065998
$$ -7599645 -7753510 -7482199 -7021134 -6932795 -8063478 -10625525 -13378717 -14285998 -12220000
12345a2220000M427115N285698M996413M232858L333469K455760J690646Q88932
$$ -12220000 -7792885 -2507187 2489226 6722084 10055553 12511313 14201959 15090891
12337A5090891j40262j149094j597313j363410q87313n28698k31069Q9993L34501
$$ 15090891 14950629 13801535 12204222 10840812 9953499 9424801 9193732 9283725 9618226
12328I618226N56017R74344J392708J158501J20474q65995r55138m86044m79464
$$ 9618226 10174243 11148587 12541295 13699796 13820270 12954275 11999137 11513093 11033629
12319A1033629j121927j481173q57416K01494N79850r8770j244355k162339k686952
$$ 11033629 9911702 8430529 7573113 7774607 8354457 8255687 7011332 4848993 2162041
12310B162041k945115k902825k389757j370684O3518J824789L603697M611756
$$ 2162041 -783074 -3685899 -6075656 -7446340 -7382822 -5558033 -1954336 2657420
12302B657420M123035K553928J537603K374539M549624O226263O084623M221669
$$ 2657420 6780455 9334383 10871986 13246525 17796149 24022412 30107035 34328704
12294C4328704J445099j538291m074105n481059n587166n020657m563848m459901
$$ 34328704 35773803 34235512 30161407 24680348 19093182 14072525 9508677 5048776
12286E048776m622556n105377n825332o027898m638626j331589K917283O325215
$$ 5048776 426220 -4679157 -10504489 -16532387 -21171013 -22502602 -19585319 -13260104
12278a3260104P331050N534408K053270j184217k909274l311890l266094l072131
$$ -13260104 -5929054 -394646 1658624 474407 -2434867 -5746757 -9012851 -12084982
12270a2084982k348080q79522J036288L037884M881244O083329N990580M532075
$$ -12084982 -14433062 -15312584 -14276296 -11238412 -6357168 -273839 5716741 10248816
12262A0248816K549597J086957N63572P71009J308550J729255J546861N11427
$$ 10248816 12798413 13885370 14448942 15219951 16528501 18257756 19804617 20316044
12254B0316044j134319k845994m150550m757326m549699l725225k819307k336565
$$ 20316044 19181725 16335731 12185181 7427855 2878156 -847069 -3666376 -6002941
12246f002941k373013k697306l045115l143339k612439j187863Q84909K823703
$$ -6002941 -8375954 -11073260 -14118375 -17261714 -19874153 -21062016 -20177107 -17353404
12238a7353404L739228L133632J216150j051102k396162k133289p48460N89396
$$ -17353404 -13614176 -10480544 -9264394 -10315496 -12711658 -14844947 -15593407 -15004011
12230a5004011J169803J245619J390322J630559J455563O03521m32613q50095
$$ -15004011 -13834208 -12588589 -11198267 -9567708 -8112145 -7508624 -7941237 -8791332
12222h791332m43565J05813l1270r13808j884379k508636l068646l895911m580271
$$ -8791332 -9234897 -9129084 -9160354 -10074162 -11958541 -14467177 -17535823 -21431734 -26012005
12213b6012005m335355l040077j408365p5564R99389K069684L032126L646011
$$ -26012005 -30347360 -33387437 -34795802 -34871366 -33871977 -31802293 -28770167 -25124156
12205b5124156L936330L960637L434530K066421J82085j372464j930892j369076
$$ -25124156 -21187826 -17227189 -13792659 -11726238 -11544153 -12916617 -14847509 -16216585
12197a6216585K1607J597287K468605K164468J287328R85819J596155K257431
$$ -16216585 -16194978 -14597691 -12129086 -9964618 -8677290 -7691471 -6095316 -3837885
12189c837885K052045J028497j78317j210483k017757k461218k483063k448180
$$ -3837885 -1785840 -757343 -935660 -2146143 -4163900 -6625118 -9108181 -11556361
12181a1556361k752175l195632l238979k786449k240848j888375j757728j974771
$$ -11556361 -14308536 -17504168 -20743147 -23529596 -25770444 -27658819 -29416547 -31391318
12173c1391318k568109k884666j997733m4909J483311J298722k27420j556836
$$ -31391318 -33959427 -36844093 -38841826 -38886735 -37403424 -36104702 -36332122 -37888958
12165c7888958j545055j35912J987632L802146M333573L439538K185996J826676
$$ -37888958 -39434013 -39569925 -37582293 -33780147 -29446574 -26007036 -23821040 -21994364
12157b1994364K390670K845580K625868K244127K175376J912699O99252j264226
$$ -21994364 -19603694 -16758114 -14132246 -11888119 -9712743 -7800044 -7100792 -8365018
12149h365018k949842l602388l196937k026937m77704Q04362J182045P68630M99271
$$ -8365018 -11314860 -14917248 -18114185 -20141122 -20618826 -19814464 -18632419 -17863789 -17364518
12140a7364518J105374K201920K680680J925857M35207o92197o95785L55055J761271
$$ -17364518 -16259144 -14057224 -11376544 -9450687 -9015480 -9707677 -10403462 -10048407 -8287136
12131h287136K781738L114985K921084K481911J960105J468166J129934Q90602
$$ -8287136 -5505398 -2390413 530671 3012582 4972687 6440853 7570787 8461389
12123H461389M25383m83964j510928j991560j615598o61173N38819K045797L943193
$$ 8461389 8886772 8402808 6891880 4900320 3284722 2623549 3162368 5208165 9151358
12114I151358N690723O275481N174088K980702Q73344n29930j621156l011681
$$ 9151358 14842081 21117562 26291650 29272352 30145696 29615766 27994610 24982929
12106B4982929m420666m689622l136560o94676P40383K03877j423925k539791
$$ 24982929 20562263 15872641 12736081 12041405 12781788 12985665 11561740 9021949
12098I021949k478040j744723r64826k12330N97723J187425J078818R5308j423831
$$ 9021949 6543909 4799186 3834360 3622030 4219753 5407178 6485996 6581304 5157473
12089E157473k760702l169281k382742r11348L64293J015703J335420J780224
$$ 5157473 2396771 -772510 -3155252 -4066600 -3702307 -2686604 -1351184 429040
12081D29040K430967L073732L454807L275610K336703J035370L66956Q91844J851638
$$ 429040 2860007 5933739 9388546 12664156 15000859 16036229 16403185 17295029 19146667
12072A9146667J906425Q08855k14767N091J130149J795103J254482M9939r17835
$$ 19146667 21053092 21861947 21647180 21652271 22782420 24577523 25832005 25881944 24964109
12063B4964109j479830k111182l026693l753187l691558k909624k153263j996880
$$ 24964109 23484279 21373097 18346404 14593217 10901659 7992035 5838772 3841892
12055C841892k093526j472555L14700K471478L589301L035050J543508L80996
$$ 3841892 1748366 275811 590511 3061989 6651290 9686340 11229848 11610844
12047A1610844J33509M62441P83989P98716M46410j39893m41760K43997K001976
$$ 11610844 11744353 12206794 12990783 13789499 14235909 14096016 13654256 13898253 15900229
12038A5900229L876351M605918L703565J590770j066767l677688n517660n876312
$$ 15900229 19776580 24382498 28086063 29676833 28610066 24932378 19414718 13538406
12030A3538406m696650k725386q18481O17712J375556J121080k22698j967133
$$ 13538406 8841756 6116370 5297889 5915601 7291157 8412237 8189539 6222406
12022F222406l007820k783656j734333q46853q81146j907034l328362m320817
$$ 6222406 3214586 430930 -1303403 -2150256 -3031402 -4938436 -8266798 -12587615
12014a2587615m404605l688596k618153j601802q64718m18122l4626N56152J292163
$$ -12587615 -16992220 -20680816 -23298969 -24900771 -25765489 -26183611 -26218237 -25662085 -24369922
12005b4369922J776909J814753J748994K058082K803902L706165M525869N027103
$$ -24369922 -22593013 -20778260 -19029266 -16971184 -14167282 -10461117 -5935248 -908145
11997i08145M761729L410256J373767m24811j499238k226561l121364l983502
$$ -908145 3853584 7263840 8637607 8212796 6713558 4486997 1365633 -2617869
11989b617869m076104l010124j148510Q42681K550346L811032M412719M154816
$$ -2617869 -6693973 -9704097 -10852607 -10009926 -7459580 -3648548 764171 4918987
11981D918987L260948K421993K134793K108799J661335O94887j18945k93658k83161
$$ 4918987 8179935 10601928 12736721 14845520 16506855 17201742 17082797 16789139 16505978
11972A6505978r28732k363086l850892m633549m565977l924014k949051j708529
$$ 16505978 15577246 13214160 9363268 4729719 163742 -3760272 -6709323 -8417852
11964h417852j55466J817510M195391O534952P945297P609995N483840K496973
$$ -8417852 -8573318 -6755808 -2560417 3974535 11919832 19529827 25013667 27510640
11956B7510640l0542j338288j672706j788064k095218k429008k497160k206260
$$ 27510640 27480098 26141810 24469104 22681040 20585822 18156814 15659654 13453394
11948A3453394j562736o82264P671O4870k51703j12528O33824Q91510l47115k455584
$$ 13453394 11890658 11208394 11216065 11280935 11029232 10916704 11550528 12442038 12094923 9639339
11938I639339l722134l290319j826031l47201P75551J531177J800941J557284
$$ 9639339 5917205 2626886 800855 453654 1229205 2760382 4561323 6118607
11930F118607R86292J16861j160834k455375k885699k203861j394491j541811
$$ 6118607 7104899 7221760 6060926 3605551 719852 -1484009 -2878500 -4420311
11922d420311k377281k538368j182316J098913K934096L422051K791451K087911
$$ -4420311 -6797592 -9335960 -10518276 -9419363 -6485267 -3063216 -271765 1816146
11914A816146K152017K737185K785599J721792J78707q41295j199541j545991
$$ 1816146 3968163 6705348 9490947 11212739 11391446 10550151 9350610 7804619
11906G804619k219704k831816l003186k976002l211556l692283l926978l515078
$$ 7804619 5584915 2753099 -250087 -3226089 -6437645 -10129928 -14056906 -17571984
11898a7571984k475588j101820K51262J183202J295574N10970o20967j182775
$$ -17571984 -20047572 -21149392 -20898130 -19714928 -18419354 -17908384 -18529351 -19712126
11890a9712126o63309O14654J984256L165654M200845M804100M303741K420772
$$ -19712126 -20375435 -19760781 -17776525 -14610871 -10410026 -5605926 -1302185 1118587
11882A118587k27243k604193m016172m321808l762860k812037j870915q60262
$$ 1118587 891344 -1712849 -5729021 -10050829 -13813689 -16625726 -18496641 -19356903
11874a9356903N95577K319318L302140K754383J240003K60398P09485K074519
$$ -19356903 -18761326 -16442008 -13139868 -10385485 -9145482 -8885084 -8175599 -6101080
11866f101080L108992K957111J690989J73517n34190j315J150889J853974J721260
$$ -6101080 -2992088 -34977 1656012 1829529 1295339 1294024 2444913 4298887 6020147
11857F020147J394149J688861K595826L262915K860369J353365m93022j730969
$$ 6020147 7414296 9103157 11698983 14961898 17822267 19175632 18682610 16951641
11849A6951641j862721j063729l5291L36006m69016k012360l019056k592232j359633
$$ 16951641 15088920 14025191 13989900 14325906 13856890 11844530 8825474 6233242 4873609
11840D873609r08974j910062l287470l507062k163936M3055K268850L785836L806961
$$ 4873609 3964635 2054573 -1232897 -4739959 -6903895 -6860840 -4591990 -806154 3000807
11831C000807K043634n76487k561188l384252l761039m295384m522385l581531
$$ 3000807 5044441 4467954 1906766 -1477486 -5238525 -9533909 -14056294 -17637825
11823a7637825j316849J601462M210603N608519N236147L315762Q81271r42702
$$ -17637825 -18954674 -17353212 -13142609 -7534090 -2297943 1017819 1899090 956388
11815I56388j669263j451558o96528J12110M86051J33034r69475k706139m710215
$$ 956388 -712875 -2164433 -2860961 -2748851 -2262800 -2129766 -3099241 -5805380 -10515595
11806a0515595o038010n490343k749809J000851M020441N508522N904462N904945
$$ -10515595 -16553605 -22043948 -24793757 -23792906 -19772465 -14263943 -8359481 -2454536
11798b454536N655956M911478L525249J583331o61303k750493m098183m390515
$$ -2454536 3201420 8112898 11638147 13221478 12560175 9809682 5711499 1320984
11790A320984l914841l307350k912656k520466j824765r92614n11572m51340k05821
$$ 1320984 -2593857 -5901207 -8813863 -11334329 -13159094 -14151708 -14663280 -15114620 -15320441
11781a5320441P54688K049678K693560K275343J502782J386638K070807K670211
$$ -15320441 -14565753 -12516075 -9822515 -7547172 -6044390 -4657752 -2586945 83266
11773H3266K192309M70459j784957l723028n041339n898580o218009n361676k785454
$$ 83266 2275575 2746034 961077 -2761951 -7803290 -13701870 -19919879 -25281555 -28067009
11764b8067009J021263M535586O287489N923690M309092K818153K501221L568943
$$ -28067009 -27045746 -22510160 -16222671 -10298981 -5989889 -3171736 -670515 2898428
11756B898428N356657O760157O868219N437074L080908J077284N50680J352643
$$ 2898428 8255085 15015242 21883461 27320535 30401443 31478727 32029407 33382050
11748C3382050J874000N07325k569603n410678o193010m795759k508158o80684
$$ 33382050 35256050 35763375 33193772 27783094 21590084 16794325 14286167 13605483
11740A3605483R4214q8483q33615j773686k694342l344678l256093k101019k61278
$$ 13605483 13699697 13611214 12777599 11003913 8309571 4964893 1708800 -392219 -653497
11731f53497J373860K300261K661830K490715J315452r93552l456739m740012
$$ -653497 720363 3020624 5682454 8173169 9488621 8495069 5038330 298318
11723B98318m540191l689628k973190k368190j477124k20072J087737K063217
$$ 298318 -4241873 -7931501 -10904691 -13272881 -14750005 -14970077 -13882340 -11819123
11715a1819123K509378K491778K215411J745805R46116j62050j124802j389031
$$ -11819123 -9309745 -6817967 -4602556 -2856751 -1910635 -2072685 -3197487 -4586518
11707d586518q41697J52496J101413J585288J374195P23338L76065Q20588J592686
$$ -4586518 -5428215 -5275719 -4174306 -2589018 -1214823 -491485 -115420 705168 2297854
11698B297854J726492Q67324m77231j757118k934320m109241n077193n487523
$$ 2297854 4024346 4891670 4414439 2657321 -276999 -4386240 -9463433 -14950956
11690a4950956n091956l662673j097569K055367M518211N217741M283818K857462
$$ -14950956 -20042912 -23705585 -24803154 -22747787 -18229576 -13011835 -8728017 -5870555
11682e870555J943598J635755J369411O66010m09386j341106j610544j083246
$$ -5870555 -3926957 -2291202 -921791 -255781 -665167 -2006273 -3616817 -4700063
11674d700063K3508J485365L180348M731930N258540L899954Q10338k544260m402842
$$ -4700063 -4676555 -3191190 -10842 4721088 9979628 13879582 14689920 12145660 7742818
11665G742818m160323k721875j412883p84847o35599q00131j309636j811755j561807
$$ 7742818 3582495 860620 -552263 -1337110 -1972709 -2772840 -4082476 -5894231 -7456038
11656g456038l58333J027527J841549K373968L420998M997165O258661O614110
$$ -7456038 -7814371 -6786844 -4945295 -2571327 849671 5846836 12105497 18719607
11648A8719607O248189N509742M412322K890166J027874j081313l178200m459936
$$ 18719607 24967796 30477538 34889860 37780026 38807900 37726587 34548387 30088451
11640C0088451m046457k119690j5132J135199J277834O96539p38584k872707m515135
$$ 30088451 26041994 23922304 23907172 25042371 26320205 27016744 26278160 23405453 18890318
11631A8890318m423709k807066r67717L87611J564617K681562L150323K696207
$$ 18890318 14466609 11659543 10691826 11079437 12644054 15325616 18475939 21172146
11623B1172146J965737J518950Q90326o21202k632555l899408l730959k569335
$$ 21172146 23137883 24656833 25547159 24925957 22293402 18393994 14663035 12093700
11615A2093700j208596o5157O28452M92357o59743k331582l615525m028923l858577
$$ 12093700 10885104 10819947 11448399 11940756 11281013 8949431 5333906 1304983 -2553594
11606b553594l569874l070277j835885K02195K167793K896737K063235M79615
$$ -2553594 -6123468 -9193745 -11029630 -10827435 -8659642 -5762905 -3699670 -3220055
11598c220055p26713j073076q62616o23087o06048p64538r96543j238490j284937
$$ -3220055 -3946768 -5019844 -5882460 -6505547 -7111595 -7876133 -8872676 -10111166 -11396103
11589a1396103o77063R02871K945417M090794L256855Q72063j354597k058816
$$ -11396103 -12073166 -11170295 -8224878 -4134084 -877229 -5166 -1359763 -3418579
11581c418579j368346l03696N70038J450904K415727K802386J792334n21376k862536
$$ -3418579 -4786925 -5090621 -4520583 -3069679 -653952 2148434 3940768 3419392 556856
11572E56856l657790k306586K55287K208759K223338M00505j975039l527233l702973
$$ 556856 -3100934 -5407520 -5152233 -2943474 -720136 -319631 -2294670 -5821903 -9524876
11563i524876k871425j777624r12112k58607M43359J220698J726952J631999J047361
$$ -9524876 -12396301 -14173925 -15086037 -15344644 -14901285 -13680587 -11953635 -10321636 -9274275
11554i274275M21760N0626j79460n79309j312019k229983k927568l000345k423814
$$ -9274275 -8852515 -8801889 -8981349 -9560658 -10872677 -13102660 -16030228 -19030573 -21454387
11545b1454387j660326j205422j026768o61065J10946R41429J362501J303818
$$ -21454387 -23114713 -24320135 -25346903 -26007968 -25897022 -24955593 -23593092 -22289274
11537b2289274R97150O00700J90982J051L45588J245435K286495K911515K809895
$$ -22289274 -21292124 -20691424 -20500442 -20499391 -20153803 -18908368 -16621873 -13710358 -10900463
11528a0900463K080074J111720K77805l23908p83764j064323j008454p78323r77406
$$ -10900463 -8820389 -7708669 -7430864 -7754772 -8538536 -9602859 -10611313 -11389636 -12367042
11519a2367042j972562l215591l632983k736564j081723L80295J127420J269023
$$ -12367042 -14339604 -17555195 -21188178 -23924742 -25006465 -24626170 -23498750 -22229727
11511b2229727J304356J763127K695681L337086K670245O74750j231362j417294
$$ -22229727 -20925371 -19162244 -16466563 -13129477 -10459232 -9784482 -11015844 -12433138
11503a2433138L15130K567666L772329L528162K570943J771123J345666Q95443
$$ -12433138 -12118008 -9550342 -5778013 -2249851 321092 2092215 3437881 4333324
11495D333324j0507j337894k563908l036282k394666q58982P51126J493798J152319
$$ 4333324 4322817 2984923 421015 -2615267 -5009933 -5868915 -5117789 -3623991 -2471672
11486b471672N85116Q95210K203100L556851M072620L727192K929531J893036
$$ -2471672 -1886556 -991346 1211754 4768605 8841225 12568417 15497948 17390984
11478A7390984P82978l7183m46848r01366j761859k573821k611926j901697j029798
$$ 17390984 18173962 18136779 17689931 16788565 15026706 12452885 9840959 7939262 6909464
11469F909464j50439R76205J977273J839177J98163k044660l709594m310903l821846
$$ 6909464 6759025 7735230 9712503 11551680 11749843 9705183 5995589 1684686 -2137160
11460b137160k331420m86058M96977Q3010p58788p46901O8739O41958N84808N32237
$$ -2137160 -4468580 -4954638 -4457661 -4374651 -5133439 -5880340 -5811601 -5169643 -4584835 -4052598
11450d052598R20703J361927J449553J413615J637757K106549K643427L185496
$$ -4052598 -3131895 -1769968 -320415 1093200 2730957 4837506 7480933 10666429
11442A0666429L494815L052879J629489l24130k077831l084900k907624j279704
$$ 10666429 14161244 17214123 18843612 18519482 16441651 13356751 10449127 9169423
11434I169423J277608L331746L673743K479171R21066j93222r08970j397481j423108
$$ 9169423 10447031 13778777 17452520 19931691 20852757 20659535 19750565 18353084 16929976
11425A6929976p83156J36567O18184L54815k40640m80903j11321M65842P17295
$$ 16929976 16146820 16283387 16901571 17256386 17015746 16534843 16423522 16889364 17606659
11416A7606659O22494N31082M00641l34308j840475l290513l749073l395435l199193
$$ 17606659 18229153 18760235 19160876 18826568 16986093 13695580 9946507 6551072 3351879
11407C351879l461164l412993k407603q02844O67145J789044K690576L304140
$$ 3351879 -109285 -3522278 -5929881 -6732725 -6065580 -4276536 -1585960 1718180
11399A718180L621586M110766N153211O182314O049039M316635J707772p41244
$$ 1718180 5339766 9450532 14603743 20786057 26835096 31151731 32859503 32118259
11391C2118259k441687l151008k822018j923711j410808j858751k810112l296241
$$ 32118259 29676572 26525564 23703546 21779835 20369027 18510276 15700164 12403923
11383A2403923k809330j511102J80773J753465K568579K265081J249647L31553
$$ 12403923 9594593 8083491 8264264 10017729 12586308 14851389 16101036 16432589
11375A6432589k58819j114755k753130m798969o305528o661799n952411m619218
$$ 16432589 16173770 15059015 12305885 7506916 1201388 -5460411 -11412822 -16032040
11367a6032040l092887j738527q90116p58677j258591j904861j985192j088026
$$ -16032040 -19124927 -20863454 -21753570 -22512247 -23770838 -25675699 -27660891 -28748917
11359b8748917M22557J639945J989099J735969J465610J233301N38772q90421
$$ -28748917 -28326360 -26686415 -24697316 -22961347 -21495737 -20262436 -19723664 -20614085
11351b0614085k572292l579069l195543j329145J384535L762683M702318L976800
$$ -20614085 -23186377 -26765446 -29960989 -31290134 -29905599 -26142916 -21440598 -17463798
11343a7463798K383021R63661J79300p1499P9755N68641J028739Q10507l67427
$$ -17463798 -15080777 -14117116 -13937816 -14009315 -13929560 -13360919 -12332180 -11521673 -11889100
11334a1889100j994593l232471l706548l661782l430712k995265k130253q36578
$$ -11889100 -13883693 -17116164 -20822712 -24484494 -27915206 -30910471 -33040724 -33877302
11326c3877302M61288J132237P77250m46682j876575k730390k503503j126698
$$ -33877302 -33416014 -32283777 -31506527 -31953209 -33829784 -36560174 -39063677 -40190375
11318d0190375J037007L245178M627865M713676L809232K725465K047634J728601
$$ -40190375 -39153368 -35908190 -31280325 -26566649 -22757417 -20031952 -17984318 -16255717
11310a6255717J381786Q23503K62570N9298L60426Q99892J149015P94043J11722
$$ -16255717 -14873931 -14050428 -13787858 -13728560 -13368134 -12468242 -11319227 -10525184 -10413462
11301a0413462k64008j2526N75061J030039J248490J476211J965812K865636M242499
$$ -10413462 -10677470 -10689996 -10114935 -9084896 -7836406 -6360195 -4394383 -1528747 2713752
11292B713752N839661O862707O450964M585873K305619P81675K56829K3493o68969
$$ 2713752 8553413 15416120 21867084 26452957 28758576 29540251 29797080 29820573 29151604
11283B9151604j880793l101419l862854m101758l987689l555447k629343j138025
$$ 29151604 27270811 24169392 20306538 16204780 12217091 8661644 6032301 4894276
11275D894276N53428J699417J627953K71104j584837k605397j807131N21097K872582
$$ 4894276 5447704 7147121 8775074 9046178 7461341 4855944 3048813 3569910 6442492
11266F442492L809521L257573K340149J987427K059545J895778J244242K94172
$$ 6442492 10252013 13509586 15849735 17837162 19896707 21792485 23036727 23330899
11258B3330899q42356k081909k887455k532475j197183l54844j472638m318218
$$ 23330899 22488543 20406634 17519179 14986704 13789521 13434677 11962039 7643821
11250G643821o937159p419842n474480k273461Q18751L109972M575971N567444
$$ 7643821 706662 -6713180 -12187660 -14461121 -13642370 -10532398 -5956427 -388983
11242c88983O516671P484012P880740P008524N009928K891828J374115J05961
$$ -388983 6127688 13611700 21492440 28500964 33510892 36402720 37776835 37882796
11234C7882796j623352l746083n461484o158100n742902m257938j893597N78185
$$ 37882796 36259444 32513361 27051877 20893777 15150875 10892937 8999340 9577525
11226I577525K108667K383101K002081J463092O18699m88155r80185q9374J638577
$$ 9577525 11686192 14069293 16071374 17534466 18153165 17665010 16684825 16595451 18234028
11217A8234028K841030K843588J959508M77803j679551m058033n317407m478601
$$ 18234028 21075058 23918646 25878154 26355957 24676406 20618373 15300966 10822365
11209A0822365k206803k93565P3704q00604j841483k408854k682802l103019l684762
$$ 10822365 8615562 8321997 8395701 7595097 5753614 3344760 661958 -2441061 -6125823
11200f125823l981504l660288k925877k238763j737362j161296k87511Q23594
$$ -6125823 -10107327 -13767615 -16693492 -18932255 -20669617 -21830913 -22118424 -21294830
11192b1294830K005840L086375L720204L485824K425069J277729Q31282J040497
$$ -21294830 -19288990 -16202615 -12482411 -8996587 -6571518 -5293789 -4462507 -3422010
11184c422010J023947q137j943574l897644n014024n053046m275073k961410j255678
$$ -3422010 -2398063 -2406200 -4349774 -8247418 -13261442 -18314488 -22589561 -25550971 -26806649
11175b6806649N40454J820164K112130J615146J043766R16275J192337J623757
$$ -26806649 -26266195 -24446031 -22333901 -20718755 -19674989 -18758714 -17566377 -15942620
11167a5942620K200017L098950M321596N469756N823165M700090J993150j564630
$$ -15942620 -13742603 -10643653 -6322057 -852301 4970864 9670954 11664104 10099474
11159A0099474m835147p040047p988697p710072o331097m435717l013152k577346
$$ 10099474 5264327 -1775720 -9764417 -17474489 -23805586 -28241303 -31254455 -33831801
11151c3831801k531617j801001j4103K222513M067386N083729N229757M682644
$$ -33831801 -36363418 -38164419 -38178522 -35956009 -31888623 -26804894 -21575137 -16892493
11143a6892493L810217K998838K316339J519725N26050k94908m77835n1139L84134
$$ -16892493 -13082276 -10083438 -7767099 -6247374 -5721324 -6016232 -6494067 -6545206 -6161072
11134f161072K24243n02462j114276r47174k6693J029696J744710K196710K650680
$$ -6161072 -5936829 -6439291 -7553567 -8500741 -8527434 -7497738 -5753028 -3556318 -905638
11125i05638L059837L135326K690130J692377K36223j208623j774299r50345O59202
$$ -905638 2154199 5289525 7979655 9672032 9908255 8699632 6925333 5974988 6634190
11116F634190J792723J791869J010057j3041j187790k457068l297824l135909
$$ 6634190 8426913 10218782 11228839 11215798 10028008 7570940 4273116 1137207
11108A137207k045528o81647L37197P46868O11061L57309O72859J921067L618148
$$ 1137207 -908321 -1589968 -1252771 -505903 105158 462467 1135326 3056393 6674541
11099F674541M762699M725942L668826K190670Q44790m2814m27145n94866j030144
$$ 6674541 11437240 16163182 19832008 22022678 22867468 22824654 22397509 21802643 20772499
11090B0772499k069017l593173m966380n320911m211250k185687m86749R4302
$$ 20772499 18703482 15110309 10143929 4823018 611768 -1573919 -2060668 -1966366
11082a966366p8287j66040N12r2424o11398q88429j71850J446079L038497L617905
$$ -1966366 -2044653 -2210693 -2210181 -2302605 -2914003 -3802432 -3974282 -2528203 510294 4128199
11072D128199K887747J496336N82097P42351J343371J147844k63317k009352k972576
$$ 4128199 7015946 8512282 9094379 9836730 11180101 12327945 12064628 10055276 7082700
11063G082700k966370k605474k380762k267838k069490j730958j305653q58636
$$ 7082700 4116330 1510856 -869906 -3137744 -5207234 -6938192 -8243845 -9102481
11055i102481m36155k6795L88267O88729O71743L26667j54528p01052j360262
$$ -9102481 -9538636 -9565431 -9177164 -8488435 -7816692 -7490025 -7644553 -8345605 -9705867
11046i705867j822150j406795P3888J784212K684273K642639K230358J678247
$$ -9705867 -11528017 -12934812 -12860924 -11076712 -8392439 -5749800 -3519442 -1841195
11038a841195P65726l16105q41480n96212l86264j012354k151678k775198k437516
$$ -1841195 -1075469 -1391574 -2233054 -2829266 -3215530 -4227884 -6379562 -9154760 -11592276
11029a1592276j624524q64318L604J420517L178173M237438L675721J764754j54006
$$ -11592276 -13216800 -14081118 -14077514 -12656997 -9478824 -5241386 -1565665 199089 45083
11020D5083j006349r62112q46871q86770n54482M48754J703738K729368L566532
$$ 45083 -961266 -1923378 -2770249 -3657019 -4211501 -3762747 -2059009 670359 4236891
11011D236891M372837M839089M418139K962650R06308r97469j999286j766110
$$ 4236891 8609728 13448817 17866956 20829606 21735914 20738445 18739159 16973049
11003A6973049p12213L54930J075322J651373K004371J482339j02280j722714
$$ 16973049 16260836 16615766 17691088 19342461 21346832 22829171 22726891 21004177
10995B1004177k165252j470710n91775J20451J144785K501717L244873K663306
$$ 21004177 18838925 17368215 16776440 16896891 18041676 20543393 23788266 26451572
10987B6451572J274984O2797q20018j987288l686086n291233n980140n557106
$$ 26451572 27726556 27789353 26969335 24982047 21295961 16004728 10024588 4467482
10979D467482m469161l207062j947581q69484n78621j719724l932232n605921
$$ 4467482 -1679 -3208741 -5156322 -6025806 -6604427 -8324151 -12256383 -17862304
10971a7862304n213953k799505K72548K877681M883897O448057P351716P321865
$$ -17862304 -23076257 -25875762 -25603214 -22725533 -17841636 -11393579 -4041863 3280002
10963C280002O427000M808296K517041M561j718746j979039j246793n82188m80525
$$ 3280002 9707002 14515298 17032339 17036900 15318154 13339115 12092322 11510134 11029609
10954A1029609p04494j011013j410892j687223j238725K88235K427579M158004
$$ 11029609 10325115 9314102 7903210 6215987 4977262 5265497 7693076 11851080
10946A1851080M705242M091880L008800K158683J675578J215254N54505j45131
$$ 11851080 16556322 20648202 23657002 25815685 27491263 28706517 29261022 29115891
10938B9115891p19386j283463j873807k106996j587721n11021N11534J140979
$$ 29115891 28396505 27113042 25239235 23132239 21544518 21033497 21545031 22686010
10930B2686010J485788J672061J622858J262949N98309m14273j723046k881122
$$ 22686010 24171798 25843859 27466717 28729666 29327975 28913702 27190656 24309534
10922B4309534l293190k904040k306142j988777j786119j285245m90278K39624
$$ 24309534 21016344 18112304 15806162 13817385 12031266 10746021 10255743 10495367
10914A0495367P44698J209455J779088K316835K601296K547265K117145J176956
$$ 10495367 11240065 12449520 14228608 16545443 19146739 21694004 23811149 24988105
10906B4988105l44726k133083l470603l678749k604662o86432J344846K734450
$$ 24988105 24643379 22510296 19039693 15360944 12756282 12069850 13414696 16149146
10898A6149146K871035J591747n18919k411663l439698l845635m190402m484475
$$ 16149146 19020181 20611928 20093009 17681346 14241648 10396013 6205611 1721136
10890A721136m257256l446396k756633k885440l641492m136625l778668k806567
$$ 1721136 -2536120 -5982516 -8739149 -11624589 -15266081 -19402706 -23181374 -25987941
10882b5987941j815976j025055k28976O39641J250202J323212J093470J026968
$$ -25987941 -27803917 -28828972 -29057948 -28418307 -27168105 -25844893 -24751423 -23724455
10874b3724455J183581J214887R93981Q45326J010616J262449J280803J073148
$$ -23724455 -22540874 -21325987 -20332006 -19486680 -18476064 -17213615 -15932812 -14859664
10866a4859664P19741K3890j169229k504250l359706l402025k569644q33382J445461
$$ -14859664 -14139923 -14116033 -15285262 -17789512 -21149218 -24551243 -27120887 -27954269 -26508808
10857b6508808L158407L286507K229477J584442K292498L573351M056586L459836
$$ -26508808 -23350401 -20063894 -17834417 -16249975 -13957477 -10384126 -6327540 -2867704
10849b867704K688486K652793L467036M532738M903814L754118J055088k125563
$$ -2867704 -179218 2473575 5940611 10473349 15377163 19131281 20186369 18060806
10841A8060806m337725m877379m123460k914059j835486j004760k31898O42783
$$ 18060806 13723081 8845702 4722242 1808183 -27303 -1032063 -1263961 -621178
10833f21178J437855J733363J398614Q16522L62562j13676r46291j954978k522656
$$ -621178 816677 2550040 3948654 4765176 5127738 5014062 4067771 2112793 -409863
10824d09863k386599k022639k171147l133358m406189m776883l069954O13025
$$ -409863 -2796462 -4819101 -6990248 -10123606 -14529795 -19306678 -22376632 -21763607
10816b1763607M423595O171066N446553L932426L421169L999604M449414L890387
$$ -21763607 -17340012 -11168946 -5722393 -1789967 1631202 5630806 10080220 13970607
10808A3970607K492481R08343l59041j111454j539968k202636l446872m717590
$$ 13970607 16463088 17371431 17012390 15900936 14360968 12158332 8711460 3993870
10800C993870m826900l142858l11061K330872L859822M215375L850577L208154
$$ 3993870 -833030 -3975888 -4286949 -1956077 1903745 6119120 9969697 13177851
10792A3177851K437808J422993J04996j137326j546139o06955J374129L406916
$$ 13177851 15615659 17038652 17143648 16006322 14460183 13853228 15227357 18634273
10784A8634273M559346M584344L915795L136944K440167J587544M11261p50247
$$ 18634273 23193619 27777963 31693758 34830702 37270869 38858413 39269674 38519427
10776C8519427j314252j163927q47373r24732j324282j573679j534917j624590
$$ 38519427 37205175 36041248 35193875 34269143 32944861 31371182 29836265 28211675
10768B8211675k296232l485760m578189m823976l898706k243188p50098J09753
$$ 28211675 25915443 22429683 17851494 13027518 9128812 6885624 6135526 6245279
10760F245279P08664J489462J967945J160074q40471k391213j960734P7656J867860
$$ 6245279 6953943 8443405 10411350 11571424 10730953 8339740 6379006 6456662 8324522
10751H324522K088853R75019n42052j916153k939714l296214k814279j955280
$$ 8324522 10413375 11388394 10846342 8930189 5990475 2694261 -120018 -2075298
10743b075298j459970j460781j377299q26844k46043k99931r20543j377578j298514
$$ -2075298 -3535268 -4996049 -6373348 -7200192 -7446235 -7746166 -8666709 -10044287 -11342801
10734a1342801j145974j397519j588942p18913J359332L435859M123104L261386
$$ -11342801 -12488775 -13886294 -15475236 -16194149 -14834817 -11398958 -7275854 -4014468
10726d014468J826590O61927j97539r00578j019152J28284K476579M910334O145251
$$ -4014468 -2187878 -1525951 -1723490 -2624068 -3643220 -3514936 -1038357 3871977 10017228
10717A0017228N822193M618957L363783K248060R80446n07228j799423k443338
$$ 10017228 15839421 20458378 23822161 26070221 27050667 26543439 24744016 22300678
10709B2300678k425436k140362k068692k520189l438472m340948m708946m601477
$$ 22300678 19875242 17734880 15666188 13145999 9707527 5366579 657633 -3943844
10701c943844m595801m873069m688241l201386o92568J522260K382708J905236
$$ -3943844 -8539645 -13412714 -18100955 -21302341 -21994909 -20472649 -18089941 -16184705
10693a6184705P52493n14346j600699k333914k678205k736534k581973k224668
$$ -16184705 -15432212 -15946558 -17547257 -19881171 -22559376 -25295910 -27877883 -30102551
10685c0102551j780237j431748j166714q11452l74284l8033K58376Q40193J735082
$$ -30102551 -31882788 -33314536 -34481250 -35292702 -35666986 -35705019 -35446643 -34606450 -32871368
10676c2871368K482829K744435K724891K690952K450772J740704Q46642L46840
$$ -32871368 -30388539 -27644104 -24919213 -22228261 -19777489 -18036785 -17190143 -16843303
10668a6843303L77001N93002P54041Q85570R18354O61580K16532j9598M0691j34884
$$ -16843303 -16466302 -15873300 -15119259 -14233689 -13315335 -12653755 -12437223 -12456821 -12416130 -12551014
10658a2551014j155477k928823m505205m691742k994725j91348K140777K983390
$$ -12551014 -13706491 -16635314 -21140519 -25832261 -28826986 -29018334 -26877557 -23894167
10650b3894167K773955K712650L280822L831623L615281K696525J664352Q68467
$$ -23894167 -21120212 -18407562 -15126740 -11295117 -7679836 -4983311 -3318959 -2450492
10642b450492K86954j06252k09314L5237N51291J169745J662276J863120J861444
$$ -2450492 -2163538 -2269790 -2479104 -2443867 -1892576 -722831 939445 2802565 4664009
10633D664009J909351K008851J775095R11253k87697j080216q72814L90293K239840
$$ 4664009 6573360 8582211 10357306 11268559 10980862 9900646 9027832 9418125 11657965
10624A1657965L908517M694886M342296L082680J304565o44335k294627l073260
$$ 11657965 15566482 20261368 24603664 27686344 28990909 28346574 26051947 22978687
10616B2978687k809840k020669j340686q06479o2960Q34503J291475R02766r7373
$$ 22978687 20168847 18148178 16807492 16001013 15938053 16772556 18064031 18966797 18869424
10607A8869424j251601k397274l549144m491777m711429l684061j281181J824871
$$ 18869424 17617823 15220549 11671405 7179628 2468199 -1215862 -2497043 -672172
10599f72172M164001M390261K582036L88650m71271K46271J454577K114692K030265
$$ -672172 3491829 7882090 10464126 10852776 10381505 10627776 12082353 14197045 16227310
10590A6227310J453816N50720n04358j292618j395004q19199O402O71074J131381
$$ 16227310 17681126 18231846 17727488 16434870 15039866 14220667 14227069 14898143 16029524
10581A6029524J596867K081612K169448J428212R6191r45246j128874q97957j098889
$$ 16029524 17626391 19708003 21877451 23305663 23401854 22456608 21327734 20429777 19330888
10572A9330888j843656k408860k199313j338416k75250O89084J328931J416392
$$ 19330888 17487232 15078372 12879059 11540643 11265393 11954477 13283408 14699800
10564A4699800R88501L87003j39594n42511n82589J44478J494006K572006K681751
$$ 14699800 15688301 16075304 15935710 15393199 14810610 14955088 16449094 19021100 21702851
10555B1702851K099158J482570R11068N9245r88797j746615k004365j929615j606803
$$ 21702851 23802009 25284579 26195647 26254892 25266095 23519480 21515115 19585500 17978697
10546A7978697j054916o34199q14334j450313j781574j275014j55447Q46596R30881
$$ 17978697 16923781 16289582 15475248 14024935 12243361 10968347 10812900 11659496 12590377
10537A2590377l64547k595097m336615m342563k860677j291275n71708m87245
$$ 12590377 12225830 9630733 5294118 951555 -1909122 -3200397 -3772105 -4259350
10529d259350m97182m49040l76806l93457r78041k540864m378888m878402l257327
$$ -4259350 -4756532 -5205572 -5582378 -5975835 -6953876 -9494740 -13873628 -18752030 -22009357
10520b2009357m89372J919877L441919M407804N121902N713238O327876O883684
$$ -22009357 -22498729 -20578852 -17136933 -12729129 -7607227 -1893989 4433887 11317571
10512A1317571P060259O949227P149425P761181P937570P021355N551887M577842
$$ 11317571 18377830 25327057 32476482 40237663 48175233 55196588 60748475 65326317
10504F5326317M551097N402704O962892Q658995R566094R494252R311522R606102
$$ 65326317 69877414 75280118 82243010 90902005 100468099 109962351 119273873 128879975
10496A28879975J0063402J0868446J3290853J7715328K2596450K6641784K9650391
$$ 128879975 138943377 149811823 163102676 180818004 203414454 230056238 259706629
10489B59706629K8603242J5832279j3108867m9295341p3745800p4251350n6322010
$$ 259706629 288309871 304142150 291033283 241737942 167992142 93740792 37418782
10482C7418782l5313120k0956821j2782341p336605l899057k723634k382968j222847
$$ 37418782 2105662 -18851159 -31633500 -38970105 -42869162 -45592796 -47975764 -49198611
10474d9198611O14201K088716K725643K260121L56982k250266l607568k679604
$$ -49198611 -48584410 -46495694 -43770051 -41509930 -41152948 -43403214 -47010782 -49690386
10466d9690386p81075P8198m52426j200730j255377o91592J0791M20834K98334
$$ -49690386 -50471461 -50393263 -50845689 -52046419 -53301796 -53993388 -53982597 -53561763 -53263429
10457e3263429n4770J86346J461967L177574M426257N082958N682953O436662
$$ -53263429 -53318199 -53131853 -51669886 -48492312 -44066055 -38983097 -33300144 -26863482
10449b6863482O873022O370803M696697K172242l67270j971183k300197j860238
$$ -26863482 -19990460 -13619657 -8922960 -6750718 -7117988 -9089171 -11389368 -13249606
10441a3249606j298175p23193j8820N37423N28091J28144k148L74731P37950N31900
$$ -13249606 -14547781 -15270974 -15289794 -14752371 -14224280 -14096136 -14098284 -13723553 -12985603 -12453703
10431a2453703j40105p44497r53888p85555k53696P96713K386286M024662M816072
$$ -12453703 -12593808 -13338305 -14292193 -15077748 -15331444 -14534731 -12148445 -8123783 -3307711
10422c307711M129518K242213J96304j141781j843353k596280l665260m430037
$$ -3307711 821807 3064020 3260324 2118543 275190 -2321090 -5986350 -10416387
10414a0416387m108059k755854j264748l60535R5374O62004J476603K224771K808355
$$ -10416387 -14524446 -17280300 -18545048 -18905583 -18810209 -18148205 -16671602 -14446831 -11638476
10405a1638476L519967M407950M918192M477877L122037J245796q64571k745235
$$ -11638476 -8118509 -3710559 1207633 5685510 8807547 10053343 9188772 6443537
10397F443537l359256j844559J219778L987072N102930M818387M098862L229822
$$ 6443537 3084281 1239722 2459500 6446572 11549502 16367889 20466751 23696573
10389B3696573J864233M0759j609629k655090l245133l563600l422237k699636
$$ 23696573 25560806 25601565 23991936 21336846 18091713 14528113 11105876 8406240
10381H406240j804112j247597q74280N3148J885669L989582N307989N362343M515076
$$ 8406240 6602128 5354531 4480251 4533399 6419068 10408650 15716639 21078982 25594058
10372B5594058L411789K486506J957096J851580J813398J212862j79576j758473
$$ 25594058 29005847 31492353 33449449 35301029 37114427 38327289 38147713 36389240
10364C6389240k627488k512312j904812j451760j518406k190237l206314l866127
$$ 36389240 33761752 31249440 29344628 27892868 26374462 24184225 20977911 17111784
10356A7111784l509738k295580j136925o68126o16459m25426j50641l83874j468962
$$ 17111784 13602046 11306466 10169541 9501415 8884956 8459530 8308889 7925015 6456053
10347F456053l069638m382436m624267l595065k032692j118218j218733j300281
$$ 6456053 3386415 -996021 -5620288 -9215353 -11248045 -12366263 -13584996 -14885277
10339a4885277l0529K618858N281835O624952O382238N005583K974468Q16532
$$ -14885277 -14915806 -12296948 -7015113 -390161 5992077 10997660 13972128 14788660
10331A4788660o89995r91220m44075j27668q14294k254366l498875l786684l096714
$$ 14788660 14098665 13107445 12663370 12535702 11721408 9467042 5968167 2181483 -915231
10322i15231k004258j146033q15688r74734j524754k442198l608464m616771m915332
$$ -915231 -2919489 -4065522 -4881210 -5855944 -7380698 -9822896 -13431360 -18048131 -22963463
10313b2963463m229249k822696j293260p5027Q66839J856871L054821M225077
$$ -22963463 -27192712 -30015408 -31308668 -31383695 -30516856 -28659985 -25605164 -21380087
10305b1380087M950814M972989M245111K797020Q13366j125744k225526k213463
$$ -21380087 -16429273 -11456284 -7211173 -4414153 -3600787 -4726531 -6952057 -9165520
10297i165520j775026j909228k828881l814655m218557m203731m241162m275602
$$ -9165520 -10940546 -12849774 -15678655 -19493310 -23711867 -27915598 -32156760 -36432362
10289c6432362l891789l100034k330702j623329m87513J134172K354349K363326
$$ -36432362 -40324151 -43424185 -45754887 -47378216 -47865729 -46731557 -44377208 -42013882
10281d2013882J652935J574514K712042M256518N115013N153478N064761N336647
$$ -42013882 -40360947 -38786433 -36074391 -31817873 -26702860 -21549382 -16484621 -11147974
10273a1147974N709309N532081M364861K257664k89837k523405l738955l625855
$$ -11147974 -5438665 93416 4458277 6715941 6426104 3902699 163744 -3462111
10265c462111k433122p72362Q12474K068844K819039K726896J615347K3854r87750
$$ -3462111 -5895233 -6667595 -5855121 -3786277 -967238 1759658 3375005 3398859 2411109
10256B411109r00677l56933l69167j055784j526801r66138N19545K103663K931037
$$ 2411109 1510432 1153499 784332 -271452 -1798253 -2764391 -2244846 -141183 2789854
10247B789854K588333J289754j99699j038371r01214r9491Q03434J347491J307460
$$ 2789854 5378187 6667941 6468242 5429871 4528657 4429166 5232600 6580091 7887551
10238G887551Q03620K59799l2331k54042o61648r82240o93931J11601P14885P34670
$$ 7887551 8691171 8950970 8918639 8664597 8002949 7020709 6326778 6438379 7153264 7887934
10228G887934N22972L41165k71875j818174l856553n162669m762564k646889J94211
$$ 7887934 8410906 8752071 8480196 6662022 2805469 -2357200 -7119764 -9766653 -9572442
10219i572442K196959K160540L21907j647984k113900q50885J209154L174990
$$ -9572442 -7375483 -5214943 -4893036 -6541020 -8654920 -9505805 -8296651 -5121661
10211e121661M678565N523583N564019M956619M053808K993084J718185L34120
$$ -5121661 -443096 5080487 10644506 15601125 19654933 22648017 24366202 24700322
10203B4700322r51759k202678l662279n246810o413884o545887n308356k874690
$$ 24700322 23748563 21545885 17883606 12636796 6222912 -322975 -5631331 -8506021
10195h506021j53957J469490J204154l50985j888539k765817l259139l681600
$$ -8506021 -8659978 -7190488 -5986334 -6337319 -8225858 -10991675 -14250814 -17932414
10187a7932414l952096l997787l823621l073467j290374J141388L054033L857834
$$ -17932414 -21884510 -25882297 -29705918 -32779385 -34069759 -32928371 -29874338 -26016504
10179b6016504M170041M675198N074316M764535L911975L044623K041194M71292
$$ -26016504 -21846463 -17171265 -12096949 -7332414 -3420439 -375816 1665378 2136670
10171B136670j237569j935816j221973p4833K40923n63919j780201k465973k063097
$$ 2136670 899101 -1036715 -2258688 -2333521 -2092598 -2656517 -4436718 -6902691 -8965788
10162h965788p24097O70165J122695M46707n45408q83083k99781P21469J406579
$$ -8965788 -9689885 -9019720 -7897025 -7450318 -7995726 -8878809 -9178590 -8457121 -7050542
10153g050542J128908j44373j565810j932063q69732P03086J569125J392496O01771
$$ -7050542 -5921634 -6066007 -7631817 -9563880 -10433612 -9730526 -8161401 -6768905 -6167134
10144f167134m76178j670480k300324j348008J290998M244689N842173N631459
$$ -6167134 -6643312 -8313792 -10614116 -11962124 -10671126 -6426437 -584264 5047195
10136E047195M415776L112886K067912J289470P28017K03827m80068j176472j515027
$$ 5047195 9462971 12575857 14643769 15933239 16661256 16865083 16385015 15208543 13693516
10127A3693516j568341k008545l256484m690587n033931l458403j81575L720462
$$ 13693516 12125175 10116630 6860146 2169559 -2864372 -6322775 -6504350 -2783888
10119b783888O750197P555076N767441K502414l74605j787021k181400k718954
$$ -2783888 3966309 11521385 17288826 19791240 19416635 17629614 15448214 12729260
10111A2729260m012682n771857p335364q178422q017941o858036n117107l485899
$$ 12729260 8716578 2944721 -4390643 -12569065 -20587006 -27445042 -32562149 -36048048
10103c6048048k378642j507521j86507J847994M051233N639763O402750O663364
$$ -36048048 -38426690 -39934211 -40120718 -38272724 -34221491 -28581728 -22178978 -15515614
10095a5515614O480131N327893K849561l12891k768723l432973k241702p1590
$$ -15515614 -9035483 -3707590 -858029 -1170920 -3939643 -7372616 -9614318 -9685908
10087i685908J797290K407567J785893Q88312O15420R74618J482109K114994L287926
$$ -9685908 -7888618 -5481051 -3695158 -2806846 -2191426 -1216808 265301 2380295 5668221
10078E668221M976379O534525P485562P836100P404354N588036K326640j243566
$$ 5668221 10644600 17179125 24664687 32500787 39905141 45493177 47819817 46576251
10070D6576251l736980m826689n075796m817208l947139k726219j984826k264378
$$ 46576251 42839271 38012582 32936786 28119578 24172439 21446220 19461394 17197016
10062A7197016l224328m134178m600311m605926m167524l255639j931198l85762
$$ 17197016 13972688 9838510 5238199 632273 -3535251 -6790890 -8722088 -9107850
10054i107850J078923K071355K281925J723214O87218n29164j651639k190048
$$ -9107850 -8028927 -5957572 -3675647 -1952433 -1265215 -1794379 -3446018 -5636066
10046e636066j537017M20367K893250M579810M478967K427773q14224l841598
$$ -5636066 -7173083 -6752716 -3859466 720344 5199311 7627084 6812860 2971262
10038B971262n319495m904913l487046k254539j535645q10445K04885R47567O73775
$$ 2971262 -2348233 -7253146 -10740192 -12994731 -14530376 -15340821 -15135936 -14188369 -13514594
10029a3514594o25829k272849l561828l973313l020536o10319K309614M111043
$$ -13514594 -14140423 -16413272 -19975100 -23948413 -26968949 -27579268 -25269654 -21158611
10021b1158611L943000K523106J148998K85676m10557j010401r79610L8734J658846
$$ -21158611 -17215611 -14692505 -13543507 -13257831 -13668388 -14678789 -15658399 -15619665 -13960819
10012a3960819L080526L593136K819223J086656l34505j21497J509436K641263
$$ -13960819 -10880293 -7287157 -4467934 -3381278 -3715783 -3837280 -2327844 313419
10004C13419J682140p55488k564150k508893j276174k34122J81028N82389J563175
$$ 313419 1995559 1240071 -1324079 -3832972 -5109146 -5343268 -5162240 -4579851 -3016676
9995c016676K921102L912594M044932L469110K595499J528409J29461j467449
$$ -3016676 -95574 3817020 7861952 11331062 13926561 15454970 15584431 14116982
9987A4116982k824092l761925m531276n233221n511649n097546m208189l034941
$$ 14116982 11292890 7530965 2999689 -2233532 -7745181 -12842727 -17050916 -20085857
9979b0085857j322641R86760L103473M097850M043314L757584L566207L083143
$$ -20085857 -21408498 -20421738 -17318265 -13220415 -9177101 -5419517 -1853310 1229833
9971A229833K147819J110112K3241j621123l978276o306647p762734q263413q175712
$$ 1229833 3377652 4487764 4511005 2889882 -1088394 -7395041 -15157775 -23421188 -31596900
9962c1596900p578349o243052m051988j142265K036418M584751N567926M998419
$$ -31596900 -39175249 -45418301 -49470289 -50612554 -48576136 -43991385 -38423459 -33425040
9954c3425040M036575L753582L987169L859876L093509K209980J605904J081389
$$ -33425040 -29388465 -25634883 -21647714 -17787838 -14694329 -12484349 -10878445 -9797056
9946i797056L39685n68280j441463k173708k631457k588411j973945j014257k1084
$$ -9797056 -9457371 -10025651 -11467114 -13640822 -16272279 -18860690 -20834635 -21848892 -21869976
9937b1869976P95669J251614J173358O32428Q413m25582q90689j782234k930989
$$ -21869976 -21074307 -19822693 -18649335 -18016907 -18008494 -18434076 -19324765 -21106999 -24037988
9928b4037988l527057l036316j951368j212453r57926l55526J220458L367984
$$ -24037988 -27565045 -30601361 -32552729 -33765182 -34723108 -35078634 -33858176 -30490192
9920c0490192N257564O508678P048584O631964N166057L206671J486124J88171
$$ -30490192 -25232628 -18723950 -11675366 -5043402 122655 3329326 4815450 5003621
9912E003621p26999q90934p4595R23660R05300l79589k425606n140707q580966
$$ 5003621 4276622 3385688 3311093 4234753 5140053 4760464 2334858 -2805849 -11386815
9903a1386815j1916613j4307686j6369899j8257659j6258899n137471J3778577
$$ -11386815 -23303428 -37611114 -53981013 -72238672 -88497571 -93635042 -79856465
9896g9856465K9831296L2256730K1357018P408080p90483k797611k423622j532826
$$ -79856465 -50025169 -17768439 3588579 10996659 10206176 7408565 4984943 3452117
9888C452117j02544R36842L01544j397739k468967k563845k462901k157456j044181
$$ 3452117 3349573 4286415 4587959 3190220 721253 -1842592 -4305493 -6462949 -7507130
9879g507130L82251Q75932M28615L40127J210745K227526K579837K289028J405280
$$ -7507130 -7124879 -6248947 -5820332 -5480205 -4269460 -2041934 537903 2826931 4232211
9870D232211l42336k624922m298386m689722m321740l877839l202163j917715
$$ 4232211 3889875 1264953 -3033433 -7723155 -12044895 -15922734 -19124897 -21042612
9862b1042612m49609K24967m20116k080495l901402m799942l937722j432002J504071
$$ -21042612 -21492221 -21267254 -21687370 -23767865 -27669267 -32469209 -36406931 -37838933 -36334862
9853c6334862L491086M042252L599857K779173J864487R29568J50938j20511L69341
$$ -36334862 -32843776 -28801524 -25201667 -22422494 -20558007 -19628439 -19477501 -19598012 -19228671
9844a9228671J385643K197490K190500J471313O69860K41254K73417Q66347K153150
$$ -19228671 -17843028 -15645538 -13455038 -11983725 -11313865 -11072611 -10799194 -9932847 -7779697
9835g779697L775120M800889M515628L088530J275663k80774j289560j718539
$$ -7779697 -4004577 796312 5311940 8400470 9676133 9395359 8105799 6387260
9827F387260j838353k146070k839225l425367l202549k147110j013166m28949
$$ 6387260 4548907 2402837 -436388 -3861755 -7064304 -9211414 -10224580 -10653529
9819a0653529j28822O74939K195449L586703L732655K452535P07386m01315n47035
$$ -10653529 -10782351 -10107412 -7911963 -4325260 -592605 1859930 2567316 2166001 1618966
9810A618966R946J057800K361186L185917K655042Q41508r81534j557346q83779
$$ 1618966 1628912 2686712 5047898 8233815 10888857 11730365 10748831 9191485 8307706
9801H307706r212J31825o02245j792540k975049l949560m795318n552196n830712
$$ 8307706 8298494 8430319 7828074 6035534 3060485 -889075 -5684393 -11236589 -17067301
9792a7067301n006837l045747q71297M84850R84610J417976K188573K787108K666688
$$ -17067301 -22074138 -25119885 -25991182 -25506332 -24521722 -23103746 -20915173 -18128065 -15461377
9783a5461377K180856K185869K848975L320840K746621J326654J06088k10871
$$ -15461377 -13280521 -11094652 -8245677 -4924837 -2178216 -851562 -745474 -956345
9775i56345K7887m5167q13936j912294k811437l332506l488067l101017j899819
$$ -956345 -928458 -973625 -1787561 -3699855 -6511292 -9843798 -13331865 -16432882 -18332701
9766a8332701m1157J623931K004706O70805j610721l327044l377171j841891L61949
$$ -18332701 -18373858 -16749927 -14745221 -14074416 -15685137 -19012181 -22389352 -24231243 -23869294
9757b3869294K385113L828228M484027M229367L312823K362350J826840J588999
$$ -23869294 -21484181 -17655953 -13171926 -8942559 -5629736 -3267386 -1440546 148453
9749A48453J297264Q52159L55858j84379p99468j329724j518243j250675n09105
$$ 148453 1445717 2297876 2653734 2469355 1669887 340163 -1178080 -2428755 -2937860
9740b937860P35755K289246L537478L883998L377140K567593J748712P27807n74896
$$ -2937860 -2202105 87141 3624619 7508617 10885757 13453350 15202062 15929869 15354973
9731A5354973j738038k311579k373438k294997k143296j672476q55979r2428K15465
$$ 15354973 13616935 11305356 8931918 6636921 4493625 2821149 1965170 1872742 2088207
9722B088207R7043p4290n187K48177L60039K1008q16515j917345k954863l699304
$$ 2088207 2185250 2110960 2105773 2353950 2713989 2734997 1918482 1137 -2953726 -6653030
9712f653030m057578m091162m121041m664848n940944p334685p636001o100097
$$ -6653030 -10710608 -14801770 -18922811 -23587659 -29528603 -36863288 -44499289 -50599386
9704e0599386l227283k97867J810575L128489M003638M411960M066006K970130
$$ -50599386 -53826669 -54124536 -52313961 -49185472 -45181834 -40769874 -36703868 -33733738
9696c3733738J592024N45117K41338P13680J563801K173478K196677J825687J445892
$$ -33733738 -32141714 -31596597 -31355259 -30641579 -29077778 -26904300 -24707623 -22881936 -21436044
9687b1436044J161231Q60638N80508M80136N63975P73376J229002J909099K155205
$$ -21436044 -20274813 -19414175 -18833667 -18353531 -17789556 -17016180 -15787178 -13878079 -11722874
9678a1722874J159683q49151k528080k925924k571353k561437l011568l105084
$$ -11722874 -10563191 -11412342 -13940422 -16866346 -19437699 -21999136 -25010704 -28115788
9670b8115788k452938j606064j126300q28804k50049O03991J355860J839584K252785
$$ -28115788 -30568726 -32174790 -33301090 -34129894 -34379943 -33775952 -32420092 -30580508 -28327723
9661b8327723K857662L766836M897002N870542O018310M797378K401778j13244
$$ -28327723 -25470061 -21703225 -16806223 -10935681 -4917371 -119993 2281785 2168541
9653B168541j509853j322548j79497Q37668J106173O95570j17967j216996k463509
$$ 2168541 658688 -663860 -843357 -5689 1100484 1796054 1678087 461091 -2002418
9644b002418l535547m227518m689344n062993n053786m211509k548280n50087
$$ -2002418 -5537965 -9765483 -14454827 -19517820 -24571606 -28783115 -31331395 -31881482
9636c1881482J351319K980187M172759M758198M819541M592880M063975L079488
$$ -31881482 -30530163 -27549976 -23377217 -18619019 -13799478 -9206598 -5142623 -2063135
9628b063135J937011J355819J584019J942739J627996O86795j67626m70297l08111
$$ -2063135 -126124 1229695 2813714 4756453 6384449 7071244 6903618 6433321 6125210
9619F125210J34006Q15207J542283J829972J309097J45241j100826j998861k596224
$$ 6125210 6259216 7074423 8616706 10446678 11755775 11901016 10800190 8801329 6205105
9610F205105l274518m242942n121862n094858l618383j026606J618377L293631
$$ 6205105 2930587 -1312355 -6434217 -11529075 -15147458 -16174064 -14555687 -11262056
9602a1262056L641019K949317J708055K89293r84502j674435j422387m55544L19056
$$ -11262056 -7621037 -4671720 -2963665 -2674372 -3658874 -5333309 -6755696 -7211240 -6892184
9593f892184R8133q60148j348541m80215J318946K790592L191054K896017K673862
$$ -6892184 -6794051 -7654199 -9002740 -9482955 -8164009 -5373417 -2182363 713654 3387516
9584C387516K645082K181755P91496j113073k499926k751913k225023j677520
$$ 3387516 6032598 8214353 9005849 7892776 5392850 2640937 415914 -1261606
9576a261606j350967q79914J3779J137336K193216L124153L875878M161976L829454
$$ -1261606 -2612573 -3492487 -3478708 -2341372 -148156 2975997 6851875 11013851 14843305
9567A4843305L257512K961595K827390K156505O34555j032672j721473j068262
$$ 14843305 18100817 21062412 23889802 26046307 26680862 25648190 23926717 22858455
9559B2858455J31612P03035J39319j132728k307240k779225k289725r85670L54640
$$ 22858455 22990067 23693102 23832421 22699693 20392453 17613228 15323503 14337833 14692473
9550A4692473N05550j181725l869818n813055o011976m932881l486623j866161
$$ 14692473 15198023 14016298 10146480 4333425 -1678551 -6611432 -10098055 -11964216
9542a1964216J87859K427676M058917M534331L861113K219862j04139k309413
$$ -11964216 -11776357 -9348681 -5289764 -755433 3105680 5325542 5221403 2911990
9534B911990l196525k101484M76589L351042N546408O639796O572401N471883
$$ 2911990 -284535 -2386019 -1909430 1441612 6988020 13627816 20200217 25672100
9526B5672100L596044J270694j094659k947683l817704l770026l422494l259966
$$ 25672100 29268144 30538838 29444179 26496496 22678792 18908766 15486272 12226306
9518A2226306l051832k204716o39109R44654J720085J478689O74003j12510o38407
$$ 12226306 9174474 6969758 6330649 7275303 8995388 10474077 11148080 11035570 10397163
9509A0397163j028778j495779k080907k615012k838208k513328j488970K01810
$$ 10397163 9368385 7872606 5791699 3176687 338479 -2174849 -3663819 -3462009
9501c462009K215706L923111M688536M246972K879363J223340j72902j209653
$$ -3462009 -1246303 2676808 7365344 11612316 14491679 15715019 15542117 14332464
9493A4332464k158340l179847l968726m013058l233819k209576j632973j619200
$$ 14332464 12174124 8994277 5025551 1012493 -2221326 -4430902 -6063875 -7683075
9485g683075j710985j547994j319057j420954j812459j958341j451988m80333
$$ -7683075 -9394060 -10942054 -12261111 -13682065 -15494524 -17452865 -18904853 -19385186
9477a9385186M71277J219594J962478K820112L577424L982211M105589M239621
$$ -19385186 -18913909 -17694315 -15731837 -12911725 -9334301 -5352090 -1246501 2993120
9469B993120M511368M729501M602831M046725L271713K570028K005046J389180
$$ 2993120 7504488 12233989 16836820 20883545 24155258 26725286 28730332 30119512
9461C0119512O39289l29l08589n30521j095277j886228k228637j766840r51485
$$ 30119512 30758801 30758472 30449883 29919362 28824085 26937857 24709220 22942380 21990895
9452B1990895m14993k71829l88697r33557k086202l408177m100259l869048l051039
$$ 21990895 21575902 21304073 20915376 19981819 17895617 14487440 10387181 6518133 3467094
9443C467094j907921l61661J446856K848381L174783K326368O74089j314626l241227
$$ 3467094 1559173 1197512 2644368 5492749 8667532 10993900 11667989 10353363 7112136
9434G112136m875138o216440p202896p340120o041961l471923o31050J579607
$$ 7112136 2236998 -3979442 -11182338 -18522458 -24564419 -28036342 -28667392 -27087785
9426b7087785K989188L699592L574244K613471J391214N39624J8197n96179j259071
$$ -27087785 -24098597 -20399005 -16824761 -14211290 -12820076 -12280452 -12262255 -12858434 -14117505
9417a4117505j427938q41022J19395Q48920R70620M71073j59759K4317J665840
$$ -14117505 -15545443 -16386465 -16267070 -15418150 -14447530 -13976457 -14136216 -14111899 -12446059
9408a2446059M174646N933642N697310L659923J152081m14646l42705J019002
$$ -12446059 -8271413 -2337771 3359539 7019462 8171543 7756897 7414192 8433194
9400H433194K389610K409179R00673q10389j232952l51740M25265Q598j088952
$$ 8433194 10822804 13231983 14132656 13322267 12089315 11737575 12162840 12171438 11082486
9391A1082486j504485q10692l2004k18635r41552p76407O94389J952616J095529
$$ 11082486 9578001 8767309 8735305 8516670 7575118 6798711 7493100 9445716 10541245
9382A0541245j885816m897638n888449m813237l298256k722052k990684l041349
$$ 10541245 8655429 3757791 -2130658 -6943895 -10242151 -12964203 -15954887 -18996236
9374a8996236k109928l81991J312629K194980K037022J259843O44474P99221J738735
$$ -18996236 -21106164 -21488155 -20175526 -17980546 -15943524 -14683681 -14039207 -13239986 -11501251
9365a1501251K948969L854243M134632L620446K207604J72781j655484k560162
$$ -11501251 -8552282 -4698039 -563407 3057039 5264643 5437424 3781940 1221778
9357A221778k812862l368194m455190m968787l704361q74963K078666L937586
$$ 1221778 -1591084 -4959278 -9414468 -14383255 -18087616 -18962579 -16883913 -12946327
9349a2946327M429980L757824K213768M20881p58054r96139q30221q90049j114057
$$ -12946327 -8516347 -4758523 -2544755 -2123874 -2881928 -3878067 -4708288 -5598337 -6712394
9340f712394j036180n23861J75630Q96200J599078K038257J824507R17309k23432
$$ -6712394 -7748574 -8272435 -8096805 -7200605 -5601527 -3563270 -1738763 -821454 -1044886
9331a044886j062497j370770j151633m53108N48851J387480J478828O28138o42115
$$ -1044886 -2107383 -3478153 -4629786 -5082894 -4534043 -3146563 -1667735 -1039597 -1681712
9322a681712j437123j327721p92514o46644j074118j489907j380413r21657n70423
$$ -1681712 -3118835 -4446556 -5239070 -5885714 -6959832 -8449739 -9830152 -10751809 -11322232
9313a1322232l62751L2734P20338J394676J738231J739327J588155J428860J224136
$$ -11322232 -11684983 -11652249 -10931911 -9537235 -7799004 -6059677 -4471522 -3042662 -1818526
9304a818526P70580p6329j100398j807222j954776j790839j543876r46491L48043
$$ -1818526 -1047946 -1124275 -2224673 -4031895 -5986671 -7777510 -9321386 -10267877 -9919834
9295i919834K058699L460193M202514M465000M323697L543935K145994O48068
$$ -9919834 -7861135 -4400942 -198428 4266572 8590269 12134204 14280198 14928266
9287A4928266m89658j210784j460793j041176k73525k04191j420230k979626l327279
$$ 14928266 14438608 13227824 11767031 10725855 10452330 10248139 8827909 5848283 2521004
9278B521004k239905j128269j269166k381312l227681l079696k174218j112446
$$ 2521004 281099 -847170 -2116336 -4497648 -7725329 -10805025 -12979243 -14091689
9270a4091689l12471R3009K61002N78747J344032K461873L581797M461209M998373
$$ -14091689 -14404160 -14311151 -14050149 -13471402 -12127370 -9665497 -6083700 -1622491 3375882
9261C375882M952664L906614J675550j292309m033144n662812n913390n109752
$$ 3375882 8328546 12235160 13910710 12618401 8585257 2922445 -2990945 -8100697
9253h100697l676764j835171J28742J567708J887164J284544O54365N59348O40796
$$ -8100697 -11777461 -13612632 -13483890 -11916182 -10029018 -8744474 -8090109 -7530761 -6889965
9244f889965L08511l38137o93036n04237m9645M44483J021592J583069J780317
$$ -6889965 -6581454 -6919591 -7612627 -8116864 -8166509 -7722026 -6700434 -5117365 -3337048
9235c337048J528062J225859J207361J268849R97561L02824o45224j752011k941686
$$ -3337048 -1808986 -583127 624234 1893083 2890644 3193468 2548244 796233 -2145453
9226b145453l929462m370331m111782l007832o87996K958005O987145R580286
$$ -2145453 -6074915 -10445246 -14557028 -17564860 -18252856 -15294851 -8307706 1272580
9218A272580R403606O769138L353485Q33819k45093n52622j151196k498116m075184
$$ 1272580 10676186 17445324 20798809 21632628 21387535 20834913 19683717 17185601 13110417
9209A3110417m963228m770038l901268k921147j851903k82494J895177M038995
$$ 13110417 8147189 3377151 -524117 -3445264 -5297167 -5579661 -3684484 354511
9201C54511N123711M569159K773174Q84468k9558K24055Q54713P75141m60262
$$ 354511 5478222 10047381 12820555 13705023 13675465 13899520 14754233 15529374 15069112
9192A5069112k249600l465731l510509k906382k735241l438084m335301m470015
$$ 15069112 12819512 9353781 5843272 2936890 201649 -3236435 -7571736 -12041751
9184a2041751l739381k910431k598434k593341k295184j503088n30286L07953
$$ -12041751 -15781132 -18691563 -21289997 -23883338 -26178522 -27681610 -28211896 -27903943
9176b7903943J053416J926534K907249L540881L201054J674286m42055k017611
$$ -27903943 -26850527 -24923993 -22016744 -18475863 -15274809 -13600523 -14042578 -16060189
9168a6060189k185387r04383J178501L244458M652079N032848M339454K880236
$$ -16060189 -18245576 -19149959 -17971458 -14727000 -10074921 -5042073 -702619 2177617
9160B177617J241184J02716j7788R02914K203633K855830K213699N10531j416112
$$ 2177617 3418801 3521517 3503729 4406643 6610276 9466106 11679805 12190336 10774224
9151A0774224k840504l567309l783889l688169l320090k707557k079389j778176
$$ 10774224 7933720 4366411 582522 -3105647 -6425737 -9133294 -11212683 -12990859
9143a2990859j868593j980360j753296j326560j073145r17365l73274O50450J604897
$$ -12990859 -14859452 -16839812 -18593108 -19919668 -20992813 -21910178 -22283452 -21633002 -20028105
9134b0028105K138002K667537L618414M459100M164558K549050N73627o45680
$$ -20028105 -17890103 -15222566 -11604152 -7145052 -2980494 -431444 142183 -503497
9126e03497o13394O75444K867583M979375N666915M377024K027308J46106n57089
$$ -503497 -1116891 -441447 2426136 7405511 13072426 17449450 19476758 19622864 19065775
9117A9065775n60890p35207j504622k627980l439645l341950k341012j139677
$$ 19065775 18504885 17769678 16265056 13637076 10197431 6855481 4514469 3374792
9109C374792n85102j061785k429992m248693n798378o166636m835299k290147
$$ 3374792 2789690 1727905 -702087 -4950780 -10749158 -16915794 -21751093 -24041240
9101b4041240K12645J575303J476649K82165j229004k031396j279191R95509L695649
$$ -24041240 -23828595 -22253292 -20776643 -20494478 -21723482 -23754878 -25034069 -24038560 -20342911
9092b0342911N455633N691492M821397L590414K405696J323372L99338j99892
$$ -20342911 -14887278 -9195786 -4374389 -783975 1621721 2945093 3344431 3144539
9084C144539m01403l40689k06246j05098j60802n72475j371783k204047k594975
$$ 3144539 2743136 2402447 2196201 2091103 1930301 1357826 -13957 -2218004 -4812979
9075d812979k446223k067377j724518j411507j103558r22461q83862p23816j88061
$$ -4812979 -7259202 -9326579 -11051097 -12462604 -13566162 -14488623 -15372485 -16096301 -16284362
9066a6284362O45635J455508J914871J789350J115747M37772M79589J291309K067944
$$ -16284362 -15638727 -14183219 -12268348 -10478998 -9363251 -8925479 -8445890 -7154581 -5086637
9057e086637K164547J902966J896503J993187J618801R14144O30572Q80463R00399
$$ -5086637 -2922090 -1019124 877379 2870566 4489367 5403511 6034083 6914546 7814945
9048G814945K88515l81351n70020n72697p31764o02650K77513J309022J429253
$$ 7814945 8103460 7722109 7152089 6579392 5847628 5244978 5522491 6831513 8260766
9039H260766N01060p85136k172372l949519n756341o400993n359966l625589k422236
$$ 8260766 8761826 7976690 5804318 1854799 -3901542 -10302535 -15662501 -19288090 -21710326
9030b1710326j690053n59108J113771K529605L138254L256671L371109L445721
$$ -21710326 -23400379 -23959487 -22845716 -20316111 -17177857 -13921186 -10550077 -7104356
9022g104356L190779K556994J616318K49370j653063l748640n267316n491672
$$ -7104356 -3913577 -1356583 259735 509105 -1143958 -4892598 -10159914 -15651586
9014a5651586m151145j534320J542199M009069N207451N461919N771795O692572
$$ -15651586 -19802731 -21337051 -19794852 -15785783 -10578332 -5116413 655382 7347954
9006G347954P583850P147641M711670Q82032k978333n683368o676126n995193
$$ 7347954 14931804 22079445 26791115 27673147 24694814 19011446 12335320 6340127
8998F340127m198659k227294q99242l04995J34525Q48920J534201J641141J326169
$$ 6340127 2141468 -85826 -985068 -1290063 -1155538 -306618 1227583 2868724 4194893
8989D194893J490266K686765M292821N131894M859291M381042M772935N989302
$$ 4194893 5685159 8371924 12664745 17796639 22655930 27036972 31809907 37799209
8981C7799209O787651N823661K771207j403321n057848o921989o874974n805734
$$ 37799209 44586860 50410521 53181728 51778407 46720559 39798570 32923596 27117862
8973B7117862m646648l607165k426993j118615n5512O37727J322343K278246L221042
$$ 27117862 22471214 18864049 16437056 15318441 15262929 15900656 17222999 19501245 22722287
8964B2722287L636642L381315K721636J993695J488519J453644J818657K021120
$$ 22722287 26358929 29740244 32461880 34455575 35944094 37397738 39216395 41237515
8956D1237515J542339O70819L47609J086472K324188L019930K661985J473553
$$ 41237515 42779854 43450673 43798282 44884754 47208942 50228872 52890857 54364410
8948E4364410j45870k017828m018922n793220o795257o614800n295195l414490
$$ 54364410 54218540 52200712 48181790 42388570 35593313 28978513 23683318 20268828
8940B0268828j794569r33692o28550k67524L74287P08376q4162j968510l751150
$$ 20268828 18474259 17540567 16912017 16644493 17018780 17727156 17642994 15674484 11923334
8931A1923334m096423k835405j087817j00575j96522q91050j673181k372794k967544
$$ 11923334 7826911 4991506 3903689 3803114 3606592 2715542 1042361 -1330433 -4297977
8922d297977l423139l725791l787100l314361k085990m38498Q17082J167938R57651
$$ -4297977 -7721116 -11446907 -15234007 -18548368 -20634358 -21072856 -20255774 -19087836 -18130185
8913a8130185J046318J999067L619922N080337N444693M352186K417256Q25433
$$ -18130185 -17083867 -15084800 -11464878 -6384541 -939848 3412338 5829594 6655027
8905F655027L31445P01214J174604J230312P46046k35578j452044k281838k189716
$$ 6655027 6986472 7687686 8862290 10092602 10838648 10603070 9151026 6869188 4679472
8896D679472j411519p86733p36979p64161k01496Q66183J798008K277501K480348
$$ 4679472 3267953 2481220 1744241 980080 778584 1644767 3442775 5720276 8200624
8887H200624K351319J270020j159412m185838o216738o172627m356545j911962
$$ 8200624 10551943 11821963 10662551 6476713 259975 -5912652 -10269197 -12181159
8879a2181159L37656K265307L821991M545543M008915K546790J087655J76904
$$ -12181159 -11843503 -9578196 -5756205 -1210662 2798253 5345043 6432698 6609602
8871F609602m73083j239397j735649j199434K84773J445276J005003r85160l209720
$$ 6609602 6136519 4897122 3161473 1962039 2246812 3692088 4697091 3711931 502211
8862E02211m334355l993028k736667j385826m74582m4975J75536L47467L23529
$$ 502211 -3832144 -7825172 -10561839 -11947665 -12422247 -12467222 -12291686 -11944219 -11620690
8853a1620690J1518k44328o1948J69385o01369k802002n342442o429785n223790
$$ -11620690 -11609172 -11853500 -11915448 -11746063 -12347432 -15149434 -20491876 -26921661 -32145451
8844c2145451k442642M87660K484848L124209K507103J162943j26224p03148l06082
$$ -32145451 -34588093 -34100433 -31615585 -28491376 -25984273 -24821330 -24947554 -25650702 -25956784
8835b5956784R78869K853045M838685O359666O962184O512049N267286L832581
$$ -25956784 -24977915 -22124870 -17286185 -10926519 -3964335 2547714 7815000 11647581
8827A1647581K862247K534121K387590J981421J638922K096741L339238M284444
$$ 11647581 14509828 17043949 19431539 21412960 23051882 25148623 28487861 32772305
8819C2772305L921240K378102N18281j151349k642733l785924m050555l220812
$$ 32772305 36693545 39071647 39589928 38438579 35795846 32009922 27959367 24738555
8811B4738555j788606m31524O15757J455765K034242K030263J168197n29266k725611
$$ 24738555 22949949 22518425 23134182 24589947 26624189 28654452 29822649 29293383 26567772
8802B6567772m856529o319083o818677o619573o336747o363502o509011o241318
$$ 26567772 21711243 15392160 8573483 1953910 -4382837 -10746339 -17255350 -23496668
8794b3496668n251000l695356j912007o9703J757825L289979M085523L982663
$$ -23496668 -28747668 -32443024 -34355031 -34424734 -32666909 -29376930 -25291407 -21308744
8786b1308744L321127K591091J966287J320387O21103J17905Q9955M82502Q41317
$$ -21308744 -17987617 -15396526 -13430239 -12109852 -11488749 -11370844 -11280889 -10798387 -9957070
8777i957070O47513j85804j103953j299691m37952R94901K085636K214267J438605
$$ -9957070 -9309557 -9495361 -10599314 -11899005 -12336957 -11342056 -9256420 -7042153 -5603548
8768e603548L48312l75482m11280P513L56136L45175J38098J3303o4944m26847
$$ -5603548 -5255236 -5630718 -6041998 -6034485 -5678349 -5333174 -5195076 -5181773 -5246717 -5673564
8758e673564j311367k568123l675108m038284l438153k274462j237186o49938
$$ -5673564 -6984931 -9553054 -13228162 -17266446 -20704599 -22979061 -24216247 -24866185
8750b4866185k64979K70332R90132J735010K377050K721842K523443J927863J626760
$$ -24866185 -25131164 -24860832 -23870700 -22135690 -19758640 -17036798 -14513355 -12585492 -10958732
8741a0958732K150382L179847L978946M343620M610410M790307M293003K694301
$$ -10958732 -8808350 -5628503 -1649557 2694063 7304473 12094780 16387783 19082084
8733A9082084L81072j735220k880223k808246j978386j412838j859567k857232
$$ 19082084 19463156 17727936 14847713 12039467 10061081 8648243 6788676 3931444
8725C931444l070947j837878K6934J271540J609045J631166J726021J765333J765637
$$ 3931444 860497 -977381 -950447 321093 1930138 3561304 5287325 7052658 8818295
8716H818295K162474L174784M281619M609056L694975J766429n45075k590360
$$ 8818295 10980769 14155553 18437172 23046228 26741203 28507632 27962557 25372197
8708B5372197l911041m285688l718742k446405r07866M40245J371634J895872
$$ 25372197 21461156 17175468 13456726 11010321 10102455 10542700 11914334 13810206
8700A3810206K006372J587507O84482k68912o67683j85583R90979K237091K767952
$$ 13810206 15816578 17404085 18088567 17819655 17151972 16966389 17957368 20194459 22962411
8691B2962411K103313M78895j301708k566539l219335l423910l146245k297743
$$ 22962411 25065724 25544619 24242911 21676372 18457037 15033127 11886882 9589139
8683I589139j120819l3378Q55437J707036K426804K562877J873187P07391l53732
$$ 9589139 8468320 8434942 9290379 10997415 13424219 15987096 17860283 18567674 18213942
8674A8213942j019039j252888r31489J12739J644730K862940K907924J577297
$$ 18213942 17194903 15942015 15010526 15123265 16767995 19630935 22538859 24116156
8666B4116156n22471k523684l886555m446245m171586l219722k142934j582652
$$ 24116156 23593685 21070001 17183446 12737201 8565615 5345893 3202959 1620307
8658A620307j574198j475679p87753K95421J426059K771868M569497O186100O310011
$$ 1620307 46109 -1429570 -2217323 -1921902 -495843 2276025 6845522 13031622 19341633
8649A9341633M268429P60240k844921n553364o982758p076303o048111m464986
$$ 19341633 23610062 24370302 21525381 15972017 8989259 1912956 -4135155 -8600141
8641h600141l009354k054757j469961p14717Q39285L333352N957618P325306O635502
$$ -8600141 -11609495 -13664252 -15134213 -15848930 -15009645 -11676293 -5718675 1606631 8242133
8632H242133M408247J915805O2254r63973j210090o86286L13916J059906R53083
$$ 8242133 12650380 14566185 14628439 13664466 12454376 11768090 12082006 13141912 14094995
8623A4094995K15692k40623K56298J417571K286801K234400J564036J093307J240130
$$ 14094995 14310687 14070064 14326362 15743933 18030734 20265134 21829170 22922477 24162607
8614B4162607J656608J723843J229860M91799q0052m40869r40903j886623l054033
$$ 24162607 25819215 27543058 28772918 29264717 29184665 28743796 27802893 25916270 22862237
8605B2862237l780482l745246l584699m397040o502237q919287j0226294r765650
$$ 22862237 19081755 15336509 11751810 7354770 852533 -8066754 -18293048 -28058698
8597b8058698p907987n449987l066721j132806L97942J993701M054599O237588
$$ -28058698 -35966685 -41416672 -44483393 -45616199 -45218257 -43224556 -39169957 -32932369
8589c2932369P504454P078757N285205L283766K009254J500042J233564R03620
$$ -32932369 -25427915 -18349158 -13063953 -9780187 -7770933 -6270891 -5037327 -4133707
8581d133707O90681Q24158J123220J143419O96522M8607l76885l29930J86575
$$ -4133707 -3443026 -2618868 -1495648 -352229 344293 392900 16015 -313915 -127340
8572a27340Q90659J195445N15035j126289k894065l781017l449741k387256j379075
$$ -127340 763319 1958764 2473799 1347510 -1546555 -5327572 -8777313 -11164569 -12543644
8563a2543644r81499j346806k286739l464240m588315n353470n243708l818569
$$ -12543644 -13525143 -14871949 -17158688 -20622928 -25211243 -30564713 -35808421 -39626990
8555c9626990j483078M14021Q26253K59809K53860J611000L636157N128355N505590
$$ -39626990 -41110068 -40696047 -39869794 -39609985 -39356125 -37745125 -34108968 -28980613 -23475023
8546b3475023M802576L278688J510187L59287K37863O35706Q52506R52143J483946
$$ -23475023 -18672447 -15393759 -13883572 -13524285 -13286422 -12650716 -11798210 -10846067 -9362121
8537i362121K473097L281004L384202K718617J295780q49683l156274m575056
$$ -9362121 -6889024 -3608020 -223818 2494799 3790579 2940896 -215378 -4790434
8529d790434m485278l285610j896074r92685q27931j292301j833266j735554q79958
$$ -4790434 -9275712 -12561322 -14457396 -15450081 -16278012 -17570313 -19403579 -21139133 -22019091
8520b2019091J01216P91741J696449L378358N153192N430807L506472M81897j785153
$$ -22019091 -21917875 -21126134 -19429685 -16051327 -10898135 -5467328 -1960856 -1478959 -3264112
8511c264112k253260j132882O61519K062512K222605R84602q65193k095068k000270
$$ -3264112 -5517372 -6650254 -5988735 -3926223 -1703618 -719016 -1584209 -3679277 -5679547
8502e679547r22999J59617N37219L18869J65432N04798J067047J233414P16748
$$ -5679547 -6602546 -6442929 -5905710 -5586841 -5421409 -4916611 -3849564 -2616150 -1899402
8493a899402k77672j460204k697123l773562m249024l825466k743762j588557
$$ -1899402 -2177074 -3637278 -6334401 -10107963 -14356987 -18182453 -20926215 -22514772
8485b2514772p19763k4795Q16485J958554L259925M385970M969031M684619L268282
$$ -22514772 -23234535 -23259330 -22442845 -20484291 -17224366 -12838396 -7869365 -3184746 83536
8476H3536O94109k444285m876492n440343m145075k184173o41760N97856K359270
$$ 83536 777645 -1666640 -6543132 -11983475 -16128550 -18312723 -18954483 -18356627 -15997357
8467a5997357M787051O871818P393153O030232L492184Q53329j116079k236133
$$ -15997357 -11210306 -4338488 3054665 9084897 12577081 13430410 12314331 10078198
8459A0078198k812241l231671l583072l699945l516575l161226k647238j756271
$$ 10078198 7265957 4034286 451214 -3248731 -6765306 -9926532 -12573770 -14330041
8451a4330041m80117N62508M87468r51056k927596m110178l687097j934010R0610
$$ -14330041 -14810158 -14247650 -13760182 -14711238 -17638834 -21749012 -25436109 -27370119 -27279509
8442b7279509J401755J789545J803474K075803K680956L175669L156257K584118
$$ -27279509 -25877754 -24088209 -22284735 -20208932 -17527976 -14352307 -11196050 -8611932
8434h611932J579648K08301j309319k405926k578388j973880j211242n86016J15108
$$ -8611932 -7032284 -6823983 -8133302 -10539228 -13117616 -15091496 -16302738 -16888754 -16773646
8425a6773646Q58725R86121J07819r71785r33030M67094K089035K799306K598980
$$ -16773646 -15914921 -14928800 -14820981 -15792766 -16725796 -16258702 -14169667 -11370361 -8771381
8416h771381K178847J927856J749529J415781O87136n57692j886334k351052j466470
$$ -8771381 -6592534 -4664678 -2915149 -1499368 -812232 -1369924 -3256258 -5607310 -7073780
8407g073780J02057J314636J942348K391385K631857K166724J113396M59838Q72630
$$ -7073780 -6971723 -5657087 -3714739 -1323354 1308503 3475227 4588623 5048461 5921091
8398E921091J824125K274010J765089N19774j052587k460520l101236k699042
$$ 5921091 7745216 10019226 11784315 12304089 11251502 8790982 5689746 2990704
8390B990704j691603q18574m25597m42678q19742j538586k257992k380464j602184
$$ 2990704 1299101 480527 54930 -387748 -1207490 -2746076 -5004068 -7384532 -8986716
8381h986716k21331J103859J783621J629729J012085N95042O67330Q22247N74119
$$ -8986716 -9208047 -8104188 -6320567 -4690838 -3678753 -3083711 -2416381 -1594134 -1020015
8372a020015J84319M88631J863272L691704M955789N099058M243497K876688J511848
$$ -1020015 -835696 -347065 1516207 5207911 10163700 15262758 19506255 22382943 23894791
8363B3894791M05553o48001k116129m079817n831402o345697n232919l148307
$$ 23894791 24300344 23652343 21536214 17456397 11624995 5279298 46379 -3101928
8355c101928j229599j76222J36793K75380O34892J235195J966619K812702L749883
$$ -3101928 -4331527 -4507749 -4370956 -4095576 -3460684 -2225489 -258870 2553832 6303715
8346F303715M565213M932067M656608L766217K382400O10166j412404l386553
$$ 6303715 10868928 15800995 20457603 24223820 26606220 27216386 25803982 22417429
8338B2417429m818211n232927m615511l656737l315751l931289m867080n204609
$$ 22417429 17599218 12366291 7750780 4094043 778292 -3152997 -8020077 -13224686
8330a3224686m688670l808189l059092k406974j484566p9288J642127L225792
$$ -13224686 -17913356 -21721545 -24780637 -27187611 -28672177 -28751465 -27109338 -23883546
8322b3883546M199151M403962M130755L842867L782243L927978M194461M401612
$$ -23883546 -19684395 -15280433 -11149678 -7306811 -3524568 403410 4597871 8999483
8314H999483M141110L099252J642158P05847Q28589J506952J743663J022795n03398
$$ 8999483 13140593 16239845 17882003 18587850 19416439 20923391 22667054 23689849 23186451
8305B3186451k512666m711473o570202p343318o599236m580983j990470L83766
$$ 23186451 20673785 15962312 9392110 2048792 -4550444 -9131427 -11121897 -10738131
8297a0738131J837112J962733J010241j17226m89798K23168J766998L649368N228180
$$ -10738131 -8901019 -6938286 -5928045 -6045271 -6535069 -6311901 -4544903 -895535 4332645
8288D332645N766592M982838L612152K914838L326857L890088L319710J429258
$$ 4332645 10099237 15082075 18694227 21609065 24935922 28826010 32145720 33574978
8280C3574978p88056k265237k642648k111854j091748k54420l88634j768821l738182
$$ 33574978 32786922 30521685 27879037 25767183 24675435 24421015 24032381 22263560 18525378
8271A8525378n204365n554883m952884l852779k527237j159057j52504k1734q26009
$$ 18525378 13321013 7766130 2813246 -1039533 -3566770 -4725827 -4878331 -4900065 -5726074
8262e726074j839020k034024j005206P31666K427997L821384M908507N298052
$$ -5726074 -7565094 -9599118 -10604324 -9872658 -7444661 -3623277 1285230 6583282
8254F583282M398163K337230J65723j158984j654121j923223k247387k434475
$$ 6583282 10981445 13318675 13484398 12325414 10671293 8748070 6500683 4066208
8246D066208k307165j918465j427063j119119j386858k266372l116322l228490
$$ 4066208 1759043 -159422 -1586485 -2705604 -4092462 -6358834 -9475156 -12703646
8238a2703646k737020k460676k802001l267813l207358k581047j771237j008501
$$ -12703646 -15440666 -17901342 -20703343 -23971156 -27178514 -29759561 -31530798 -32539299
8230c2539299l09193K44816M98540M60710L88734O50771J483951K718745L745677
$$ -32539299 -32848492 -32603676 -32105136 -31644426 -31255692 -30604921 -29120970 -26402225 -22656548
8221b2656548M014794L637029L223604L039859K644203J567877O2234j125953
$$ -22656548 -18641754 -15004725 -11781121 -8741262 -6097059 -4529182 -4466948 -5592901
8213e592901j548758j345082q58861k80497L08198P30938O63877j68315j629272
$$ -5592901 -7141659 -8486741 -9345602 -9626099 -9317901 -8586963 -7923086 -8091401 -9720673
8204i720673l008006l450943k714262j383560k81958J84923P1180m15145j057573
$$ -9720673 -12728679 -16179622 -18893884 -20277444 -20559402 -20374479 -20303299 -20718444 -21776017
8195b1776017j679946k269716k915172l460772l402512k327075l46527J999932
$$ -21776017 -23455963 -25725679 -28640851 -32101623 -35504135 -37831210 -38177737 -36177805
8187c6177805M073739N281905N252832M158378K644922J225524m087q95183j011369
$$ -36177805 -32104066 -26822161 -21569329 -17410951 -14766029 -13540505 -13544592 -14439775 -15451144
8178a5451144l20251L42877J87664m29993n78957k66169m75311j585737k664357
$$ -15451144 -15771395 -15428518 -15240854 -15670847 -16249804 -16515973 -16991284 -18577021 -21241378
8169b1241378k750753k131318j768208j969219k254921k242095k009294j626784
$$ -21241378 -23992131 -26123449 -27891657 -29860876 -32115797 -34357892 -36367186 -37993970
8161c7993970q27303O90496K769888M623659N225326M224196K607722K018682
$$ -37993970 -38821273 -38130777 -35360889 -30737230 -25511904 -21287708 -18679986 -16661304
8153a6661304L054893M564342N012011M220204L248354K825882K604166J956287
$$ -16661304 -13606411 -9042069 -4030058 190146 3438500 6264382 8868548 10824835
8145A0824835Q51704k89357j140112j598353j702132j659832j737893j947970
$$ 10824835 11676539 11387182 10247070 8648717 6946585 5286753 3548860 1600890
8137A600890k061556k059475k291887k988002l823186m197555l803874k747126
$$ 1600890 -460666 -2520141 -4812028 -7800030 -11623216 -15820771 -19624645 -22371771
8129b2371771j256179N15022K473156M509741O377255P609258P760619O838652
$$ -22371771 -23627950 -23112928 -20639772 -16130031 -9752776 -2143518 5617101 12455753
8121A2455753N304909L548525J631424k75156j583747j848260j412173r99565
$$ 12455753 17760662 21309187 22940611 22665455 21081708 19233448 17821275 16821710
8113A6821710p48415k09269O44121J050604M74862m80856p16256K2653R76451
$$ 16821710 16073295 15864026 16508147 17558751 18033613 17552757 16836501 16859154 17835605
8104A7835605J513558J885168K618655L555818L894068L080187J342248o86273
$$ 17835605 19349163 21234331 23852986 27408804 31302872 34383059 35725307 35039034
8096C5039034k588517m231466n359363n438534m119589j821445L39573J345525
$$ 35039034 32450517 28219051 22859688 17421154 13301565 11480120 11819693 13165218
8088A3165218R94614j70737j458696k334767k261902p08048K337994N960343Q723442
$$ 13165218 14159832 13989095 12530399 10195632 7933730 7225682 9563676 15524019 24247461
8079B4247461R595132Q468061N961632K976684L65991j376766k360140l099048
$$ 24247461 33842593 42310654 48272286 51248970 51614961 50238195 47878055 44779007
8071D4779007l926881m700279n141066n226077n045384m520781l621185k747854
$$ 44779007 40852126 36151847 31010781 25784704 20739320 16218539 12597354 9849500
8063I849500k483892k885504l365115l435813l312811l593621m535013n808847
$$ 9849500 7365608 4480104 1114989 -2320824 -5633635 -9227256 -13762269 -19571116
8055a9571116o772521o782222n449176k930461J6262K464106L864872M185486
$$ -19571116 -26343637 -33125859 -38575035 -41505496 -41489234 -39025128 -35160256 -30974770
8047c0974770L711054K886967K158282J657378J114462L48015k18772J43330J620374
$$ -30974770 -27263716 -24376749 -22218467 -20561089 -19446627 -19098612 -19317384 -19174054 -17553680
8038a7553680L572600N122073N732815N184997L397768N78028k617414n295356
$$ -17553680 -13981080 -8859007 -3126192 2058805 5456573 6034601 3417187 -1878169
8030a878169o697278o445383m770692k641858j316517j392481k333068l033175
$$ -1878169 -8575447 -15020830 -19791522 -22433380 -23749897 -25142378 -27475446 -30508621
8022c0508621k696726j136086J331539L897931N481650N479691M307185K879021
$$ -30508621 -33205347 -34341433 -33009894 -29111963 -23630313 -18150622 -13843437 -10964416
8014a0964416J669823O49346m0294K5897Q67998J829615K265940K164485J876602
$$ -10964416 -9294593 -8645247 -8685541 -8659644 -7791646 -5962031 -3696091 -1531606 344996
8005C44996J595890J378676J345809J484246J462453J041979N62668O17592J224696
$$ 344996 1940886 3319562 4665371 6149617 7612070 8654049 9216717 9834309 11059005
$$ [...]
##END NTUPLES=NMR SPECTRUM
##END=
