##TITLE=31Pdec_LR-772-BK1
  CDCl3
  24 sc
 23.10.2023
##JCAMPDX= 6.0         $$ Bruker NMR JCAMP-DX V2.0
##DATA TYPE= NMR SPECTRUM
##DATA CLASS= NTUPLES
##ORIGIN= UXNMR, Bruker Analytische Messtechnik GmbH
##OWNER= root
$$ XWIN-NMR		Version 3.5
$$ Mon Oct 23 14:57:30 2023 Russian Standard Time (UT+4h)  she@DPX200
##.OBSERVE FREQUENCY= 81.013821
##.OBSERVE NUCLEUS= ^31P
##.ACQUISITION MODE= SIMULTANEOUS
##.ACQUISITION SCHEME= undefined
##.AVERAGES= 24
##.DIGITISER RES= 16
##SPECTROMETER/DATA SYSTEM= spect
##.PULSE SEQUENCE= zgpg30
##.SOLVENT NAME= CDCl3
##.SHIFT REFERENCE= (INTERNAL, CDCl3, 0, 248.564)
##AUDIT TRAIL= $$ (NUMBER, WHEN, WHO, WHERE, WHAT)
$$ ##TITLE= Audit trail, XWIN-NMR		Version 3.5
$$ ##JCAMPDX= 5.01
$$ ##ORIGIN= Bruker BioSpin GmbH
$$ ##OWNER= she
$$ F:/spectra/data/she/nmr/P31/1/pdata/1/auditp.txt
$$ ##AUDIT TRAIL=  $$ (NUMBER, WHEN, WHO, WHERE, WHAT)
(   1,<2023-10-23 14:56:25.21 +0400>,<she>,<DPX200>,
      <created by zg, POWCHK disabled, PULCHK disabled
       configuration hash MD5:
       00 E9 B6 7A A2 85 ED C7 34 08 36 98 17 FE 4E 26
       data hash MD5: 32K
       96 D3 63 14 26 26 80 A6 FC 64 0F 06 08 48 9A 22>)
(   2,<2023-10-23 14:56:27.71 +0400>,<she>,<DPX200>,
      <Start of raw data processing
       efp BC_mod = 2 LB = 5 FT_mod = 6 PKNL = 1 PHC0 = -10675.19 PHC1 = 76.0864 SI = 64K 
       data hash MD5: 64K
       4C 2C A9 4A 98 7D C6 6B 38 D8 1E 19 30 1E 6C 2A>)
(   3,<2023-10-23 14:56:43.12 +0400>,<she>,<DPX200>,
      <pk PHC0 = 23.53815 PHC1 = 0 
       data hash MD5: 64K
       9B 38 F6 FE 79 5B D3 1C FA F0 3A BA D5 E7 7C BE>)
(   4,<2023-10-23 14:56:55.59 +0400>,<she>,<DPX200>,
      <pk PHC0 = 0.1999994 PHC1 = 0 
       data hash MD5: 64K
       6E D5 BB 51 B4 24 2A 7E 6F 78 0A 3F BF 66 17 8F>)
(   5,<2023-10-23 14:57:06.18 +0400>,<she>,<DPX200>,
      <abs ABSG = 5 
       data hash MD5: 64K
       60 A0 88 1F 8C C8 AA 4F CB 58 AD 11 DB CB 4E E6>)
$$ ##END=
$$ 
$$ hash MD5
$$ 4A 64 A0 0A 07 13 87 00 D1 CA 83 D6 49 10 04 39
##$RELAX= 
##$RELAX= 
##$RELAX= 
##$RELAX= 
##$RELAX= 
##$RELAX= 
##$RELAX= 
##$RELAX= 
##$RELAX= 
$$ Bruker specific parameters
$$ --------------------------
##$DU= <F:/spectra>
##$EXPNO= 1
##$NAME= <P31>
##$PROCNO= 1
##$TYPE= <nmr>
##$USER= <she>
##$AMP= (0..31)
100 100 100 100 100 100 100 100 100 100 100 100 100 100 100 100 100 100 
100 100 100 100 100 100 100 100 100 100 100 100 100 100 
##$AQSEQ= 0
##$AQ_mod= 1
##$AUNM= <au_zg>
##$AUTOPOS= <>
##$BF1= 81.014009
##$BF2= 200.13
##$BF3= 200.13
##$BF4= 200.13
##$BF5= 200.13
##$BF6= 200.13
##$BF7= 200.13
##$BF8= 200.13
##$BYTORDA= 1
##$CFDGTYP= 0
##$CFRGTYP= 5
##$CHEMSTR= <none>
##$CNST= (0..31)
1 1 145 1 1 1 1 1 1 1 1 1 1 1 1 1 1 1 1 1 1 1 1 1 1 1 1 1 1 1 1 1 
##$CPDPRG= <waltz16>
##$CPDPRG1= <>
##$CPDPRG2= <waltz16>
##$CPDPRG3= <>
##$CPDPRG4= <mlev>
##$CPDPRG5= <mlev>
##$CPDPRG6= <mlev>
##$CPDPRG7= <mlev>
##$CPDPRG8= <mlev>
##$CPDPRGB= <>
##$CPDPRGT= <>
##$D= (0..31)
$$ [...]
##$SUBNAM3= <"">
##$SUBNAM4= <"">
##$SUBNAM5= <"">
##$SUBNAM6= <"">
##$SUBNAM7= <"">
##$SUBNAM8= <"">
##$SUBNAM9= <"">
##$SW= 501.771253377433
##$SWIBOX= (0..15)
0 1 3 0 0 0 0 0 0 0 0 0 0 0 0 0 
##$SW_h= 40650.406504065
##$TD= 32768
##$TD0= 1
##$TE= 0
##$TE2= 300
##$TE3= 300
##$TEG= 300
##$TL= (0..7)
0 120 53 12 22 120 120 120 
##$TP= (0..7)
150 150 150 150 150 150 150 150 
##$TP07= 0
##$TPNAME0= <>
##$TPNAME1= <>
##$TPNAME2= <>
##$TPNAME3= <>
##$TPNAME4= <>
##$TPNAME5= <>
##$TPNAME6= <>
##$TPNAME7= <>
##$TPOAL= (0..7)
0.5 0.5 0.5 0.5 0.5 0.5 0.5 0.5 
##$TPOFFS= (0..7)
0 0 0 0 0 0 0 0 
##$TUNHIN= 0
##$TUNHOUT= 0
##$TUNXOUT= 0
##$USERA1= <user>
##$USERA2= <user>
##$USERA3= <user>
##$USERA4= <user>
##$USERA5= <user>
##$V9= 5
##$VALIST= <valist>
##$VCLIST= <CCCCCCCCCCCCCCC>
##$VD= 0
##$VDLIST= <DDDDDDDDDDDDDDD>
##$VPLIST= <PPPPPPPPPPPPPPP>
##$VTLIST= <TTTTTTTTTTTTTTT>
##$WBST= 1024
##$WBSW= 4
##$XGAIN= (0..3)
0 0 0 0 
##$XL= 0
##$YL= 0
##$YMAX_a= 1670
##$YMIN_a= -4041
##$ZGOPTNS= <>
##$ZL1= 120
##$ZL2= 120
##$ZL3= 120
##$ZL4= 120
##$ABSF1= 248.5645
##$ABSF2= -253.2056
##$ABSG= 5
##$ABSL= 3
##$ALPHA= 0
##$AQORDER= 0
##$ASSFAC= 0
##$ASSFACI= 0
##$ASSFACX= 0
##$ASSWID= 0
##$AUNMP= <proc_1d>
##$AZFE= 0.1
##$AZFW= 0.5
##$BCFW= 0
##$BC_mod= 2
##$BYTORDP= 0
##$COROFFS= 0
##$CY= -3
##$DATMOD= 1
##$DC= 0
##$DFILT= <>
##$DTYPP= 0
##$F1P= 0
##$F2P= 0
##$FCOR= 1
##$FTSIZE= 65536
##$FT_mod= 6
##$GAMMA= 0
##$GB= 0
##$INTBC= 1
##$INTSCL= 6.047779e-11
##$ISEN= 30
##$LB= 5
##$LEV0= 0
##$LPBIN= 0
##$MAXI= 10000
##$MC2= 0
##$MEAN= 0
##$ME_mod= 0
##$MI= 50
##$NCOEF= 0
##$NC_proc= -9
##$NLEV= 6
##$NOISF1= 182.463
##$NOISF2= 159.3651
##$NSP= 0
##$NTH_PI= 0
##$NZP= 0
##$OFFSET= 248.5645
##$PC= 4
##$PHC0= -10651.45
##$PHC1= 76.0864
##$PH_mod= 1
##$PKNL= yes
##$PPARMOD= 0
##$PSCAL= 0
##$PSIGN= 0
##$REVERSE= no
##$SF= 81.0140089999694
##$SI= 65536
##$SIGF1= 159.3651
##$SIGF2= -187.1042
##$SINO= 113.3802
##$SIOLD= 16384
##$SREGLST= <1H.CDCl3>
##$SSB= 0
##$STSI= 65536
##$STSR= 0
##$SW_p= 40650.406504065
##$SYMM= 0
##$S_DEV= 0
##$TDeff= 32768
##$TDoff= 0
##$TI= <>
##$TILT= no
##$TM1= 0
##$TM2= 0
##$TOPLEV= 0
##$USERP1= <user>
##$USERP2= <user>
##$USERP3= <user>
##$USERP4= <user>
##$USERP5= <user>
##$WDW= 1
##$XDIM= 65536
##$YMAX_p= 335397630
##$YMIN_p= -14644969
$$ End of Bruker specific parameters
$$ ---------------------------------
##NTUPLES= NMR SPECTRUM
##VAR_NAME=  FREQUENCY,     SPECTRUM/REAL,   SPECTRUM/IMAG
##SYMBOL=    X,             R,               I
##VAR_TYPE=  INDEPENDENT,   DEPENDENT,       DEPENDENT
##VAR_FORM=  AFFN,          ASDF,            ASDF
##VAR_DIM=   65536,         65536,           65536
##UNITS=     HZ,            ARBITRARY UNITS, ARBITRARY UNITS
##FACTOR=    0.620285442955139, 1,           1
##FIRST=     20137.2065510682, 0,            0
##LAST=      -20513.1999529968, 0,           0
##MIN=       -20513.1999529968, -14644969,   0
##MAX=       20137.2065510682, 335397630,    0
$$ Real data points
##PAGE= N=1
##DATA TABLE= (X++(R..R)), XYDATA
$$ [...]
45740 3668523 4104022 4004654 3457519 2602476 1521590 282532 -974081 -2093417 -3056069
45731 -3056069 -3976367 -4904473 -5680723 -6026089 -5744070 -4823029 -3419853 -1814206 -336617
45722 -336617 751933 1346778 1474896 1232494 784203 364099 174751 258041 499275 749407
45712 749407 898232 851278 531566 -42287 -718589 -1306132 -1715020 -1999273 -2259138 -2486586
45702 -2486586 -2500965 -2088381 -1277498 -476326 -257842 -945434 -2382240 -4057635 -5406855
45693 -5406855 -6050042 -5922966 -5301230 -4643282 -4280010 -4204822 -4177728 -4019493 -3784825 -3693797
45683 -3693797 -3957314 -4648608 -5662632 -6768578 -7738604 -8453377 -8884669 -9008948 -8793760
45674 -8793760 -8265828 -7533011 -6725366 -5971600 -5449356 -5360981 -5745166 -6314476 -6584218 -6246981
45664 -6246981 -5423165 -4514135 -3810515 -3264571 -2633349 -1789882 -855209 -55965 478301
45655 478301 759693 849440 788778 620644 439304 398885 659167 1273525 2085724 2768659
45645 2768659 3038525 2850785 2361842 1730336 1034193 371524 -83858 -207067 -38111
45636 -38111 303119 773894 1409710 2218772 3175024 4285832 5535695 6738693 7576247
45627 7576247 7876037 7799954 7678363 7682099 7703458 7510028 6935377 5948814 4655060 3281497
45617 3281497 2115505 1389024 1195454 1479912 2047795 2575084 2701195 2224028 1241795
45608 1241795 75231 -971663 -1772996 -2329560 -2626173 -2600934 -2248305 -1686470 -1072469
45599 -1072469 -470253 140275 708517 1019075 809375 -13927 -1299442 -2781428 -4244562
45590 -4244562 -5558557 -6624255 -7374050 -7843432 -8188105 -8579810 -9084379 -9654869 -10216507
45581 -10216507 -10703628 -11000026 -10903020 -10231501 -9009489 -7518203 -6112255 -4945279 -3873061
45572 -3873061 -2645435 -1203071 225115 1319448 1937443 2173421 2204151 2152003 2100098
45563 2100098 2151199 2400641 2869623 3496241 4160805 4699977 4978107 5044057 5185652 5704739
45553 5704739 6592946 7484816 7946515 7763254 6979546 5806273 4553580 3524714 2821924
45544 2821924 2262864 1571729 651508 -370931 -1313065 -2060996 -2559703 -2795348 -2819060
45535 -2819060 -2727486 -2592615 -2424428 -2162536 -1650883 -685710 775325 2434624 3795149
45526 3795149 4532412 4678957 4450255 3995444 3347947 2507264 1496352 404368 -590531
45517 -590531 -1342263 -1947023 -2727764 -3900253 -5313043 -6604092 -7544493 -8137416 -8480375
45508 -8480375 -8693424 -8931370 -9270259 -9547106 -9453604 -8831966 -7772351 -6414193 -4818759
45499 -4818759 -3117349 -1647161 -805291 -801578 -1595625 -2974820 -4602982 -6082871 -7119920
45490 -7119920 -7651357 -7794193 -7736373 -7736818 -8120997 -9100516 -10556791 -12053021 -13043689 -13060788
45480 -13060788 -11855131 -9576957 -6823053 -4308065 -2379248 -916559 283015 1165851
45472 1165851 1533497 1360625 878763 412044 228947 469398 1044822 1594234 1677199 1101708
45462 1101708 53113 -1087538 -1993819 -2484540 -2501241 -2111998 -1530706 -1051346 -893730
45453 -893730 -1072397 -1394965 -1601617 -1549198 -1293803 -1001606 -776049 -562781 -203430 423507
45443 423507 1283295 2170694 2824757 3092129 2988822 2614999 2068768 1492119 1140831 1278417
45433 1278417 1949834 2921296 3886923 4690618 5320754 5773554 6018559 6070726 6001749 5874938
45423 5874938 5748810 5757499 6087607 6796514 7687358 8425512 8769839 8665447 8173144 7415054
45413 7415054 6595290 5955808 5611256 5445554 5237672 4892667 4507050 4214688 4029570
45404 4029570 3860244 3621564 3278192 2800230 2138817 1277297 301802 -587755 -1155613
45395 -1155613 -1267513 -998406 -606220 -371549 -450098 -870892 -1623700 -2676482 -3904358
45386 -3904358 -5076541 -5970245 -6480872 -6597729 -6319000 -5662166 -4751778 -3811122 -3004743
45377 -3004743 -2310931 -1601678 -851747 -226560 60027 -45872 -390193 -746644 -967385
45368 -967385 -1021024 -952903 -846627 -782729 -772522 -733272 -577513 -339678 -173706 -202578 -401205
45357 -401205 -652506 -883061 -1091925 -1254174 -1255750 -961886 -340266 498559 1372820 2133670
45347 2133670 2727387 3202863 3674576 4244556 4916392 5581578 6119591 6519327 6873656
45338 6873656 7248157 7605278 7892803 8148771 8431693 8668752 8695002 8495810 8317791 8440027
45328 8440027 8862860 9296759 9434107 9154796 8495418 7554090 6495949 5579380 5077554
45319 5077554 5144649 5748050 6694117 7725411 8673313 9560999 10491217 11372251 11828589
45310 11828589 11503097 10441951 9078087 7815299 6716499 5625006 4483814 3453561
45302 3453561 2783040 2663647 3183934 4311233 5856750 7478749 8754320 9295667 8893124
45293 8893124 7634313 5878339 4046900 2407232 1039258 -71841 -1004833 -1916321
45285 -1916321 -2927393 -3930505 -4602229 -4694591 -4280863 -3672236 -3154080 -2868617 -2885869
45276 -2885869 -3251461 -3919488 -4690924 -5262031 -5358506 -4888941 -4038477 -3197597 -2722551 -2722100
45266 -2722100 -3059684 -3498570 -3783138 -3643791 -2886934 -1572606 -56914 1224409 2059516
45257 2059516 2588180 3163052 4049036 5163732 6063293 6220365 5379808 3705495 1662882
45248 1662882 -199052 -1450678 -1949717 -1877544 -1539390 -1088155 -487216 283446 1125957
45239 1125957 1973117 2880486 3831584 4539432 4612732 3924216 2704204 1269233 -231715
45230 -231715 -1779998 -3301090 -4578399 -5317720 -5289765 -4482328 -3161879 -1751156 -595639
45221 -595639 178316 632543 923245 1234974 1706521 2336616 2964519 3376003 3438771 3154381
45211 3154381 2623843 1977213 1295154 562262 -295355 -1314046 -2440055 -3557541 -4527877
45202 -4527877 -5204029 -5479986 -5387650 -5114611 -4844930 -4546896 -3953386 -2804342 -1130312
45193 -1130312 711091 2288693 3387696 4062823 4458996 4645808 4633407 4476039 4286649
45184 4286649 4153354 4085083 4044390 4004652 3968420 3946487 3919121 3807516 3494915 2895244
45174 2895244 2001772 877758 -357690 -1511650 -2335649 -2633971 -2373612 -1679550 -741254
45165 -741254 268229 1241830 2178220 3163193 4263351 5436786 6558198 7481401 8037960
45156 8037960 8049784 7448138 6362597 5012513 3540344 2040867 696080 -296655 -967245
45147 -967245 -1590589 -2373472 -3217873 -3867132 -4193852 -4260621 -4185735 -4059666 -3937391 -3796379
45137 -3796379 -3521088 -3023901 -2375433 -1740518 -1192128 -649783 19358 913006 2088801
45128 2088801 3546098 5172995 6757193 8081494 9010032 9517580 9683019 9631032 9423779
45119 9423779 9029791 8458955 7887280 7524499 7327749 6959862 6131647 4960244 3919964
45110 3919964 3432348 3528161 3891844 4188860 4333271 4461123 4684859 4914903 4936445 4628275
45100 4628275 4061899 3396321 2731677 2081374 1429444 760573 53095 -704867 -1488745
45091 -1488745 -2272668 -3111694 -4146304 -5466144 -6960132 -8342458 -9359332 -9964018 -10285207
45082 -10285207 -10463177 -10556410 -10574454 -10512182 -10306747 -9805864 -8853797 -7450450 -5833049
45073 -5833049 -4382443 -3396870 -2901357 -2671588 -2473202 -2280877 -2251212 -2520292 -3088492
45064 -3088492 -3874983 -4778302 -5649577 -6291496 -6549890 -6380930 -5827981 -5020210 -4223473
45055 -4223473 -3763891 -3771764 -4034764 -4193383 -4053789 -3646403 -3059771 -2369273 -1724514 -1350497
45045 -1350497 -1371785 -1674323 -1970870 -1981750 -1589121 -913697 -261234 89787 100304 -45859
45035 -45859 -151005 -130453 52343 465590 1169479 2143170 3264957 4310884 4993557 5124930
45025 5124930 4781898 4204472 3477787 2433740 957601 -722430 -2196366 -3265412 -4028024
45016 -4028024 -4601704 -4924847 -4878099 -4476175 -3861096 -3176149 -2518279 -1977953 -1665970 -1697496
45006 -1697496 -2140706 -2925391 -3787916 -4388041 -4561802 -4453219 -4364418 -4495732 -4847804 -5308300
44996 -5308300 -5745108 -6028711 -6059008 -5817829 -5364102 -4759056 -4026341 -3196116 -2355862 -1651909
44986 -1651909 -1273959 -1415486 -2149105 -3297347 -4516611 -5591285 -6580154 -7580840 -8434548
44977 -8434548 -8847304 -8813578 -8734079 -9015499 -9674651 -10445445 -11166138 -11899155 -12707933 -13477974
44967 -13477974 -13989692 -14064963 -13618796 -12671887 -11378298 -9996879 -8790013 -7945731 -7546106
44958 -7546106 -7513187 -7578403 -7414697 -6875527 -6077817 -5234386 -4462509 -3774680 -3165983 -2633287
44948 -2633287 -2158147 -1761994 -1578974 -1802723 -2506581 -3494729 -4335333 -4604184 -4195336
44939 -4195336 -3417889 -2716067 -2251636 -1807374 -1114845 -188309 709745 1319522 1487305
44930 1487305 1106916 147054 -1223479 -2655410 -3828063 -4593196 -4915129 -4784592 -4269501
44921 -4269501 -3590766 -3058669 -2921110 -3267109 -3998192 -4826585 -5364631 -5353440 -4865535 -4245878
44911 -4245878 -3817712 -3651913 -3611587 -3563820 -3511524 -3558816 -3814531 -4335275 -5099389 -5982575
44901 -5982575 -6777919 -7303661 -7519866 -7506453 -7300496 -6804960 -5939628 -4879014 -4031106
44892 -4031106 -3691300 -3755152 -3862569 -3815297 -3751695 -3885494 -4182080 -4376842 -4242403 -3732437
44882 -3732437 -2909012 -1875204 -808300 66936 622381 880790 859453 423338 -604485
44873 -604485 -2187750 -3993784 -5570547 -6587782 -6962607 -6851152 -6537586 -6254068 -6034560
44864 -6034560 -5719785 -5100519 -4077545 -2755157 -1446794 -567106 -430635 -1092020 -2348881
44855 -2348881 -3856035 -5228350 -6130601 -6405337 -6160116 -5691434 -5297356 -5141035 -5203559
44846 -5203559 -5276586 -5051611 -4364764 -3404607 -2598493 -2236230 -2219571 -2159450 -1659140 -546941
44836 -546941 1021200 2631991 3882186 4652869 5102528 5421704 5704415 6039277 6515947
44827 6515947 7022674 7189180 6706585 5647400 4344476 3031830 1760056 593598 -339714
44818 -339714 -1040450 -1696167 -2443998 -3175879 -3673900 -3879288 -3951498 -4098773 -4406754 -4798038
44808 -4798038 -5094636 -5116638 -4748322 -3923600 -2588488 -755891 1374748 3416611 4985815
44799 4985815 5902029 6197183 5971241 5292764 4233428 2942312 1638113 514382 -341665
44790 -341665 -930948 -1257123 -1290896 -1032035 -574838 -73864 349746 642924 775347 699618
44780 699618 368221 -224231 -1012537 -1864292 -2638631 -3285584 -3887374 -4564624 -5329567 -6049394
44770 -6049394 -6555630 -6778189 -6791923 -6764783 -6842297 -7023311 -7127519 -6921996 -6314143 -5426226
44760 -5426226 -4498962 -3759143 -3373701 -3449540 -3982491 -4778691 -5474311 -5705682 -5310080 -4378128
44750 -4378128 -3125649 -1748194 -412519 676849 1315383 1452961 1271544 1063892 1024162
44741 1024162 1123793 1130052 756954 -97015 -1207019 -2191216 -2880671 -3450301 -4122708 -4841422
44731 -4841422 -5349966 -5508009 -5365081 -4965436 -4289027 -3433763 -2672649 -2209082 -1974091
44722 -1974091 -1765737 -1502636 -1226775 -923753 -489116 115775 776882 1329415 1689533
44713 1689533 1873316 1957192 2066981 2360634 2939786 3738551 4516796 5007172 5103711 4916524
44703 4916524 4648020 4436495 4320000 4287477 4284177 4171341 3770058 3010597 2027822 1084378
44693 1084378 404449 71030 27599 130954 214684 151921 -94383 -444738 -720446 -739640
44683 -739640 -466230 -75967 166329 120183 -136116 -390532 -437190 -170747 357934 936500
44673 936500 1290485 1243067 793068 65360 -765005 -1502237 -1949538 -1948187 -1415082 -393643
44663 -393643 870490 1941863 2405920 2133361 1316275 257871 -812054 -1749044 -2464687
44654 -2464687 -2940249 -3178743 -3108767 -2656145 -1978817 -1493335 -1518404 -1942169 -2356838 -2472070
44644 -2472070 -2279401 -1878372 -1339032 -774351 -379284 -271528 -340673 -333918 -81761 386065
44634 386065 912817 1361954 1704996 1993172 2258781 2465656 2566406 2570122 2513464 2398108
44624 2398108 2216187 2010256 1818581 1548359 990804 24162 -1220093 -2416700 -3252935
44615 -3252935 -3587599 -3480198 -3117580 -2691125 -2307340 -2007828 -1847073 -1881920 -2058535 -2176873
44605 -2176873 -2043153 -1651634 -1171998 -770683 -496721 -335857 -298912 -411020 -656977 -990134
44595 -990134 -1365562 -1697279 -1799243 -1471297 -694296 326468 1370571 2390855 3411211
44586 3411211 4303936 4817110 4831388 4454065 3824177 2976790 1999483 1191725 891686 1161369
44576 1161369 1760159 2414252 3006028 3527626 4009827 4551307 5291456 6243192 7188539
44567 7188539 7814519 7951489 7654580 7080612 6326219 5380798 4212522 2893469 1637187
44558 1637187 702574 253820 290202 651577 1060966 1234711 1060068 677449 326154 109173
44548 109173 -26469 -92546 40604 485151 1133831 1670966 1762331 1237138 179867 -1075673
44538 -1075673 -2085760 -2531583 -2370033 -1781037 -1018314 -324428 103281 189975 57181
44529 57181 -43603 66502 331283 486027 252392 -449505 -1433087 -2373851 -3018213 -3284864
44519 -3284864 -3201702 -2808305 -2159485 -1401700 -789978 -578945 -856347 -1465485 -2120460 -2643953
44509 -2643953 -3092025 -3615823 -4222390 -4734632 -4984993 -4968601 -4774865 -4445170 -3968546 -3387470
44499 -3387470 -2852176 -2577868 -2759971 -3467850 -4546959 -5638463 -6360528 -6501418 -6055015
44490 -6055015 -5139067 -3947382 -2746905 -1811601 -1289524 -1129564 -1135967 -1088880 -852376 -437134
44480 -437134 9898 299135 311985 44373 -434169 -1048107 -1756357 -2536031 -3308312 -3880644
44470 -3880644 -4015231 -3603000 -2759305 -1731802 -749518 19052 445645 502214 354574
44461 354574 303940 563644 1090309 1638741 1972357 2045291 2038441 2240506 2854918 3866157
44451 3866157 5043819 6035020 6469335 6090152 4920237 3327843 1853498 897093 536015
44442 536015 591595 805090 957376 911534 624650 145383 -395668 -805078 -897809 -620587
44432 -620587 -99686 488482 1089918 1762514 2511061 3225145 3803452 4249856 4590196 4758523
44422 4758523 4636200 4176903 3452335 2615212 1862356 1381842 1253191 1401834 1701142
44413 1701142 2108330 2655177 3329866 4043546 4727096 5397789 6085706 6710712 7063464
44404 7063464 6928978 6260783 5264545 4298271 3638894 3300512 3057585 2640464 1936183
44395 1936183 1054801 226044 -402619 -896887 -1441274 -2088267 -2637605 -2809740 -2515272
44386 -2515272 -1914104 -1253473 -725933 -458589 -511675 -811830 -1136411 -1242279 -1033558 -606885
44376 -606885 -154709 175688 373508 551679 833627 1243035 1721710 2245764 2865579 3601926
44366 3601926 4359331 5013708 5573520 6176062 6877575 7471780 7565794 6862920 5382190
44357 5382190 3427097 1386554 -413019 -1726690 -2396997 -2423407 -1981322 -1278260 -376015
44348 -376015 786567 2176860 3527590 4449445 4672344 4189474 3234710 2160419 1282531
44339 1282531 749694 509241 388587 216756 -94966 -532984 -1019951 -1492064 -1928285
44330 -1928285 -2266865 -2327631 -1926244 -1105438 -164903 605648 1162083 1618777 2015672 2286582
44320 2286582 2409697 2452283 2464860 2455829 2500813 2763795 3344870 4170744 5071736 5890206
44310 5890206 6473666 6663927 6393305 5744235 4831283 3674984 2299052 919064 -119529
44301 -119529 -661828 -925582 -1289787 -1930424 -2707902 -3369551 -3790160 -4034619 -4290328 -4787222
44291 -4787222 -5691551 -6937628 -8143295 -8822497 -8815631 -8510051 -8551494 -9307085 -10631862
44282 -10631862 -12105377 -13362846 -14171662 -14365859 -13901495 -12960167 -11837900 -10674077 -9379567
44273 -9379567 -7872844 -6279637 -4805655 -3490215 -2233963 -1076946 -304330 -176304
44265 -176304 -612794 -1251560 -1811519 -2303399 -2856999 -3439182 -3832030 -3854647 -3524164 -3011128
44255 -3011128 -2521249 -2223960 -2187019 -2304758 -2335788 -2080368 -1522035 -799292 -113852 292538
44245 292538 175260 -561472 -1754457 -3109987 -4427278 -5611426 -6522783 -7003308 -7103731
44236 -7103731 -7108491 -7201618 -7215561 -6858693 -6116593 -5250051 -4411921 -3450332 -2148275 -521389
44226 -521389 1198284 2763993 4007120 4822122 5190886 5201164 4947302 4427380 3619993
44217 3619993 2637285 1683312 832182 -49516 -1088102 -2165350 -2967529 -3253355 -3024259
44208 -3024259 -2452020 -1711122 -908686 -134919 473704 746569 559617 -85365 -1042628
44199 -1042628 -2071714 -2927143 -3460841 -3692621 -3779857 -3878312 -4018573 -4137991 -4221961 -4351465
44189 -4351465 -4573887 -4768618 -4705781 -4250839 -3488011 -2641231 -1887973 -1230934 -508495 475563
44179 475563 1785958 3266464 4599776 5476276 5748487 5479119 4884378 4231086 3741514
44170 3741514 3530555 3580142 3761356 3920261 3995189 4059031 4215565 4449353 4617750 4613021
44160 4613021 4505236 4503532 4787399 5358560 5998045 6368815 6267242 5849248 5538557 5615522
44150 5615522 5934017 6123470 6000409 5641226 5097748 4261022 3081983 1750201 512904
44141 512904 -575374 -1571432 -2382735 -2767163 -2605132 -2038590 -1306082 -547256 187356
44132 187356 841913 1366613 1780120 2133595 2407446 2492930 2293066 1826751 1233689 691229
44122 691229 323136 165950 198108 385532 703759 1141625 1698543 2353829 3003516 3439146
44112 3439146 3451461 3011237 2351461 1830418 1665473 1774716 1876479 1741303 1338554 761665
44102 761665 87480 -635519 -1311879 -1812732 -2074941 -2116038 -1951030 -1590921 -1139912 -754735
44092 -754735 -407487 210955 1402869 3095347 4855281 6237193 7013700 7125666 6612266
44083 6612266 5661244 4581521 3601869 2742583 1940716 1221798 663027 247779 -137803
44074 -137803 -575878 -1056409 -1528312 -1936217 -2207292 -2272710 -2131169 -1864134 -1582511 -1377681
44064 -1377681 -1308100 -1390080 -1593272 -1860941 -2119744 -2254084 -2127074 -1713820 -1213994 -942653
44054 -942653 -1053152 -1394111 -1655519 -1604341 -1154909 -311427 815351 1921617 2573336
44045 2573336 2476721 1693802 559770 -576481 -1479142 -1961583 -1862730 -1177378 -137483
44036 -137483 946605 1933054 2885173 3873550 4802577 5434637 5527276 4937960 3665660
44027 3665660 1849490 -278103 -2455879 -4418466 -5898214 -6685722 -6741889 -6243617 -5503561
44018 -5503561 -4835222 -4441731 -4349160 -4426098 -4525018 -4626710 -4791016 -4949373 -4838156 -4221756
44008 -4221756 -3150196 -1933585 -890818 -185114 131272 20262 -553543 -1584799 -3003005
43999 -3003005 -4655821 -6307880 -7696237 -8618449 -8975952 -8773228 -8137917 -7330642 -6627518
43990 -6627518 -6104926 -5566451 -4764713 -3717431 -2755180 -2224481 -2170462 -2334493 -2417179 -2278642
43980 -2278642 -1913605 -1365548 -750429 -284105 -139271 -244370 -312777 -121232 282683 664452
43970 664452 825245 712345 398227 42228 -158310 -71173 283960 760768 1177598 1377054
43960 1377054 1266453 873826 338033 -222688 -817328 -1499715 -2199719 -2707606 -2829090
43951 -2829090 -2511062 -1843326 -1018698 -280712 200389 459735 707359 1140796 1809937
43942 1809937 2631371 3432808 3968134 4016931 3573792 2896300 2285309 1832193 1425248 960283
43932 960283 471466 76994 -122478 -84021 161647 484067 670769 530846 30914 -645176
43922 -645176 -1192915 -1410643 -1375002 -1376682 -1646077 -2140443 -2597557 -2753690 -2486511 -1815704
43912 -1815704 -865417 162013 1053625 1694569 2123893 2480498 2886191 3350425 3765905
43903 3765905 4022518 4155002 4342267 4697624 5067676 5110251 4605793 3669064 2652388
43894 2652388 1875844 1440539 1223815 1002693 622266 115910 -310589 -418694 -81933
43885 -81933 645181 1520711 2179914 2317590 1894627 1129710 226373 -844596 -2201851
43876 -2201851 -3723016 -4987747 -5607473 -5552704 -5129102 -4713703 -4559390 -4737724 -5112048
43867 -5112048 -5368169 -5211126 -4609851 -3807375 -3071814 -2503537 -2099069 -1871786 -1787672 -1654752
43857 -1654752 -1253448 -614017 -35727 241205 284683 300364 297040 71091 -475271 -1129515
43847 -1129515 -1537669 -1508342 -1115836 -587963 -165595 -13560 -159488 -490249 -834421 -1041730
43837 -1041730 -977879 -521240 339651 1431352 2527473 3572800 4678021 5853520 6850661
43828 6850661 7353465 7268198 6741310 5955791 5036859 4129669 3388599 2793408 2081936 1010235
43818 1010235 -316875 -1465859 -2063764 -2142559 -2098232 -2348792 -3028740 -3942486 -4742481
43809 -4742481 -5156127 -5109510 -4708250 -4137669 -3563921 -3067857 -2615339 -2091736 -1411976 -618439
43799 -618439 160484 870346 1608102 2484592 3421840 4151440 4438739 4274380 3840517 3358649
43789 3358649 3020091 2995015 3378015 4071508 4769987 5111807 4871078 4060268 2942394
43780 2942394 1966348 1578790 1950529 2824966 3661420 3983410 3662199 2950588 2278948
43771 2278948 1956753 1972743 2038403 1833119 1230022 337035 -592295 -1251144 -1371438 -852570
43761 -852570 160880 1357279 2412777 3063369 3112821 2514759 1492767 489260 -103910
43752 -103910 -194195 16979 257157 404182 529326 737998 955268 895604 302926 -772260
43742 -772260 -1967191 -2859945 -3190740 -2899496 -2088919 -989620 140467 1152151 2013440
43733 2013440 2705616 3223222 3680985 4247158 4870670 5209972 4970601 4220899 3243721
43724 3243721 2192264 1095408 129756 -394951 -396812 -165996 -31249 -15375 72536 328876
43714 328876 682399 1051332 1415663 1739027 1937244 1955309 1819427 1605722 1393361 1223672
43704 1223672 1048809 745522 260305 -252044 -508080 -354074 78492 483731 623452
43695 623452 478925 234819 138980 311642 624123 782972 594827 161627 -215927 -324786
43685 -324786 -184321 96974 526300 1205121 2125596 3086000 3850248 4334659 4589429 4645267
43675 4645267 4455660 3985132 3292119 2510657 1787159 1232856 882855 676648 511526
43666 511526 336356 171689 32757 -129529 -392243 -796636 -1340583 -2000408 -2723203 -3410351
43656 -3410351 -3941913 -4226558 -4228463 -3965674 -3501126 -2922771 -2299041 -1626717 -819650 212508
43646 212508 1405275 2434197 2846603 2407367 1327906 84829 -1003703 -1966375 -2959719
43637 -2959719 -3987406 -4911577 -5650405 -6237806 -6704893 -7010988 -7112591 -7022244 -6772864
43628 -6772864 -6396236 -5982961 -5703820 -5692615 -5912693 -6198519 -6447975 -6735430 -7206017 -7883383
43618 -7883383 -8628288 -9294684 -9888429 -10543242 -11359950 -12297536 -13197327 -13858064 -14085984
43609 -14085984 -13747383 -12850777 -11598342 -10337423 -9425396 -9073249 -9235636 -9619065 -9833182
43600 -9833182 -9579510 -8725326 -7270057 -5350369 -3292914 -1529787 -335865 331296 666086
43591 666086 743857 521575 73638 -334916 -478750 -378652 -202500 -32790 180261 484046
43581 484046 841847 1168506 1354417 1255780 768225 -37691 -920686 -1671155 -2281510 -2877701
43571 -2877701 -3520634 -4124175 -4532017 -4609224 -4288074 -3625284 -2838062 -2194997 -1802903 -1535009
43561 -1535009 -1213442 -826792 -524844 -449662 -652013 -1145332 -1920215 -2843422 -3601670 -3834176
43551 -3834176 -3362932 -2313068 -1030326 128609 976861 1518951 1816550 1863579 1624679
43542 1624679 1170612 705941 441791 478850 807775 1340893 1906617 2296849 2409295 2317928
43532 2317928 2139195 1853751 1324096 460587 -708148 -2105147 -3634126 -5122017 -6351364
43523 -6351364 -7226549 -7836849 -8276357 -8463904 -8248231 -7659608 -6923447 -6193019 -5384143
43514 -5384143 -4353261 -3163022 -2068960 -1272368 -779641 -489539 -303514 -114981 203233
43505 203233 701204 1263436 1676001 1773485 1505390 930374 233621 -282546 -353408 26768
43495 26768 556609 833072 622498 -21353 -839780 -1566185 -2101516 -2523495 -2903182 -3125201
43485 -3125201 -2946185 -2250417 -1215464 -219215 390990 467311 90363 -528304 -1202346
43476 -1202346 -1841965 -2362974 -2600492 -2439673 -2032131 -1738377 -1778468 -2017953 -2146053 -1967571
43466 -1967571 -1463237 -696239 203204 1032235 1641758 2058717 2394352 2675396 2873374
43457 2873374 3052497 3343767 3775986 4261208 4750673 5268585 5765631 6078028 6100300 5909765
43447 5909765 5678388 5558643 5688097 6158051 6855719 7418842 7485064 6992294 6183089 5348361
43437 5348361 4612075 3900682 3036752 1900618 588849 -599915 -1403427 -1807035 -1975299
43428 -1975299 -2033033 -2002255 -1895534 -1714737 -1339538 -574465 591631 1857770 2858431
43419 2858431 3519232 4074778 4720818 5317563 5480713 4949997 3851979 2615974 1643307
43410 1643307 1028411 545334 -124684 -1114122 -2226636 -3019623 -3074589 -2284531 -930846
43401 -930846 532739 1801801 2862065 3868087 4935153 6033330 7008150 7667822 7903560
43392 7903560 7788114 7540222 7329378 7097496 6609894 5711970 4534479 3442988 2783397
43383 2783397 2645312 2822018 2981262 2905794 2612820 2272012 2030826 1920913 1890608 1874479
43373 1874479 1836978 1803428 1861818 2084054 2422894 2734523 2929761 3046543 3129549 3103514
43363 3103514 2852880 2403730 1948010 1699128 1794718 2309648 3226885 4333984 5234448
43354 5234448 5557818 5173245 4209458 2924565 1561254 233402 -1113579 -2585250 -4133603
43345 -4133603 -5515318 -6492544 -7011814 -7131550 -6859025 -6178533 -5217800 -4267870 -3592766
43336 -3592766 -3251467 -3101972 -2943345 -2674723 -2362122 -2131797 -1969114 -1684814 -1153012
43327 -1153012 -522314 -78424 73780 71807 59442 38566 -20776 -84051 -155967 -364729 -830061
43316 -830061 -1515735 -2312924 -3203949 -4211344 -5202004 -5886313 -6089897 -5984599 -5994555 -6454718
43306 -6454718 -7334871 -8260634 -8806935 -8817445 -8478584 -8094854 -7786576 -7384522 -6592085 -5255486
43296 -5255486 -3519732 -1755451 -329528 573953 942394 816440 249390 -632626 -1614398
43287 -1614398 -2476241 -3063411 -3270853 -3040334 -2437139 -1691055 -1082275 -758843 -670459 -659267
43277 -659267 -586652 -384910 -31182 487048 1154957 1885812 2545492 3066341 3506118 3936268
43267 3936268 4299637 4464593 4416758 4298309 4229490 4180598 4056889 3809097 3389552 2691096
43257 2691096 1647755 376427 -857179 -1801152 -2309850 -2341934 -1964280 -1339062 -618897
43248 -618897 157848 1022742 1937698 2734861 3169023 3005854 2142127 738519 -810123
43239 -810123 -2153328 -3233392 -4172757 -4949050 -5330927 -5178653 -4687863 -4250782 -4129080
43230 -4129080 -4307854 -4601895 -4837311 -4970048 -5091046 -5301754 -5550573 -5615700 -5283704 -4537017
43220 -4537017 -3571108 -2680839 -2139238 -2087970 -2439842 -2895449 -3131900 -3009418 -2590728 -1997448
43210 -1997448 -1314727 -641558 -157221 -51604 -354684 -851562 -1211615 -1247343 -1060643 -920104
43200 -920104 -991543 -1207588 -1396952 -1492024 -1570383 -1719844 -1927153 -2126954 -2328582 -2642786
43190 -2642786 -3154397 -3777334 -4274123 -4461631 -4414382 -4448436 -4875038 -5744091 -6808493 -7726072
43180 -7726072 -8303504 -8580538 -8730849 -8912257 -9179831 -9460156 -9561364 -9258196 -8452641
43171 -8452641 -7262016 -5904492 -4514694 -3143677 -1917669 -1054689 -655243 -581871 -637760
43162 -637760 -771759 -988570 -1149925 -1059962 -744409 -458166 -354555 -292143 -52122 370986
43152 370986 786880 1005080 890535 318465 -739784 -2065188 -3248144 -3952145 -4083191
43143 -4083191 -3721054 -2986480 -2004992 -905299 228322 1374560 2497494 3480912 4202656
43134 4202656 4668737 5003257 5263094 5299873 4873134 3918707 2666988 1473288 566601
43125 566601 -9812 -282131 -285000 -123142 25029 52840 30467 90414 227954 279249 86077
43114 86077 -378831 -1037405 -1769064 -2416334 -2801519 -2813661 -2474615 -1891360 -1170819 -421902
43104 -421902 204639 595797 849154 1285734 2176360 3445103 4719560 5694086 6371729
43095 6371729 6922989 7410063 7744325 7846261 7712639 7340383 6731024 6021965 5499540
43086 5499540 5388788 5671285 6153628 6650346 7046929 7269221 7302962 7217355 7071487 6797367
43076 6797367 6253300 5403679 4391495 3435789 2714179 2333811 2325876 2618836 3048366 3422280
43066 3422280 3577339 3413814 2945438 2315931 1694354 1130459 570032 34123 -287093
43057 -287093 -173764 429881 1410310 2633896 4019818 5446542 6648459 7289193 7195289
43048 7195289 6527945 5685080 4987592 4456427 3905934 3214465 2444582 1722298 1095955
43039 1095955 551569 99913 -208897 -330148 -255269 -35469 198070 285586 153205 -155850
43029 -155850 -583902 -1118153 -1686054 -2072408 -2072244 -1725746 -1296482 -993293 -794175 -557690
43019 -557690 -197329 320479 1057291 2052157 3182591 4152198 4657145 4569647 3996605 3212455
43009 3212455 2523047 2120215 2013049 2095759 2285233 2581297 2996266 3453153 3775242 3785718
42999 3785718 3441847 2904362 2465905 2342848 2472336 2522306 2168318 1407055 583635 80712
42989 80712 -13720 81948 121417 52408 -39329 -119320 -271597 -618329 -1242725 -2168511 -3334242
42978 -3334242 -4586838 -5785113 -6934353 -8137502 -9370777 -10392145 -10951107 -11028214 -10769652
42969 -10769652 -10229256 -9308802 -7967796 -6366145 -4736685 -3214287 -1883379 -918937
42961 -918937 -525564 -694917 -1111309 -1371686 -1285826 -935422 -484425 -12053 455468 836569
42951 836569 1019209 1005732 966275 1107722 1519753 2166362 2961904 3789370 4495036 4975531
42941 4975531 5282168 5557559 5856120 6114242 6315302 6559836 6888163 7136780 7115908 6904689
42931 6904689 6835691 7158141 7803095 8496437 9002922 9215824 9108227 8696357 8017702 7067992
42921 7067992 5778854 4132078 2294363 567939 -813421 -1792682 -2396601 -2633483 -2559894
42912 -2559894 -2385616 -2376930 -2616218 -2941377 -3179100 -3369579 -3679757 -4142777 -4591744 -4843362
42902 -4843362 -4836083 -4568487 -4029542 -3274892 -2488364 -1855080 -1389222 -950318 -400298 306737
42892 306737 1124140 1897846 2390546 2453293 2195574 1891762 1697730 1541344 1301463 990545
42882 990545 727268 634073 814868 1324208 2062196 2774987 3274427 3632783 4073497 4685635
42872 4685635 5314049 5699413 5643395 5071053 4065439 2889651 1889545 1296273 1126349
42863 1126349 1271541 1629377 2123820 2669998 3197913 3704994 4234598 4795949 5337946
42854 5337946 5803306 6163523 6371870 6316069 5877267 5050980 3975475 2825652 1715138
42845 1715138 720173 -66921 -591522 -930224 -1248917 -1647812 -2101558 -2554524 -2993484
42836 -2993484 -3394246 -3678853 -3793287 -3779595 -3705577 -3552023 -3223409 -2648965 -1840080 -894168
42826 -894168 8344 664093 987924 1087994 1159008 1331341 1655454 2146246 2737030 3245062
42816 3245062 3518730 3611623 3690378 3772532 3692062 3352032 2874564 2441940 2114715 1893371
42806 1893371 1851556 2088782 2610488 3364856 4361658 5645653 7153840 8680254 9997615
42797 9997615 10979430 11624350 12007923 12190194 12133031 11749680 11085741 10388596 9898910 9602188
42787 9602188 9299295 8930032 8718343 8949658 9668281 10624034 11447233 11834787 11642139
42778 11642139 10897956 9757060 8419143 7079356 5925351 5118207 4744782 4814352 5305786
42769 5305786 6157491 7175232 8021174 8408263 8346103 8151849 8167832 8451213 8741764 8737135
42759 8737135 8402790 8011307 7876303 8054236 8307074 8332703 8013776 7477405 6973303 6694362
42749 6694362 6645184 6629429 6373520 5692086 4558827 3078110 1466663 46642 -883779
42740 -883779 -1289130 -1475196 -1835336 -2503888 -3299360 -3980533 -4476713 -4863573 -5207564 -5497447
42730 -5497447 -5695539 -5808103 -5910380 -6117151 -6507047 -7048241 -7594602 -7956282 -7986826 -7659182
42720 -7659182 -7117807 -6624175 -6346520 -6172596 -5810066 -5111511 -4214935 -3302169 -2321392
42711 -2321392 -1085999 386962 1785835 2783389 3304529 3488730 3504150 3474577 3494963
42702 3494963 3589376 3658368 3553819 3227983 2772753 2317313 1930057 1620036 1389630 1265589
42692 1265589 1290379 1483289 1805456 2183348 2576493 2983697 3357110 3565920 3510708 3238851
42682 3238851 2867546 2418473 1838159 1191924 706035 530468 536581 456644 199690 -63850
42672 -63850 -136481 -37735 13602 -174773 -567511 -886677 -795720 -160168 823298 1763656
42662 1763656 2371451 2647997 2827510 3180982 3861087 4843359 5928851 6806945 7195782
42653 7195782 6998551 6351078 5509764 4677604 3925006 3262331 2763568 2592248 2893668
42644 2893668 3660652 4693143 5666973 6253525 6247465 5671804 4791607 3977432 3478130 3271846
42634 3271846 3120346 2787760 2254548 1757755 1613566 1955526 2614972 3257746 3646917
42625 3646917 3783609 3823929 3900489 4031937 4169310 4292337 4451757 4723449 5125178 5584370
42615 5584370 5987253 6238244 6256717 5953553 5275184 4279651 3118940 1930690 800234
42606 800234 -150836 -728648 -823919 -589223 -356457 -334149 -439971 -469079 -373588 -311577
42596 -311577 -448319 -796701 -1282022 -1890162 -2656321 -3492740 -4106000 -4177953 -3661065 -2871908
42586 -2871908 -2271908 -2151152 -2492096 -3062194 -3587040 -3876804 -3879287 -3658616 -3310086 -2885386
42576 -2885386 -2406221 -1922759 -1501632 -1148539 -800899 -428591 -89961 166356 416302
42567 416302 791074 1278862 1665533 1725065 1449853 1063059 822969 840081 1045845 1261910
42557 1261910 1284765 981705 383920 -326614 -989872 -1642278 -2462012 -3505901 -4549670
42548 -4549670 -5254203 -5480201 -5381656 -5185079 -4939125 -4516578 -3814970 -2887387 -1870951
42539 -1870951 -835766 262930 1500591 2884204 4334256 5722767 6896200 7688819
42531 7688819 7985757 7813154 7342088 6775587 6247148 5833711 5599070 5546874 5547506 5388088
42521 5388088 4917818 4123844 3107891 2072970 1303652 1001730 1048975 1010175 475867
42512 475867 -599573 -1914733 -3091558 -3863983 -4104578 -3848363 -3336892 -2935213 -2915043
42503 -2915043 -3298269 -3881927 -4375783 -4553346 -4360223 -3899279 -3270740 -2444583 -1358902
42494 -1358902 -124885 978770 1756739 2259877 2644436 2935320 2999588 2725819 2175787
42485 2175787 1567148 1123949 911967 797506 595433 262029 -106702 -457598 -846270
42476 -846270 -1257103 -1464158 -1213197 -530970 256326 835736 1171567 1450494 1839960 2331049
42466 2331049 2757832 2919267 2710485 2195232 1584157 1145380 1099747 1519187 2256026 2991439
42456 2991439 3436867 3537184 3469215 3436412 3473208 3425763 3082144 2337633 1309446 336501
42446 336501 -167251 65887 1007457 2340326 3599625 4377738 4504831 4090852 3386554
42437 3386554 2596918 1835209 1218712 921892 1082592 1675047 2511511 3382742 4213142
42428 4213142 5102747 6211040 7566277 8986088 10216256 11143896 11826907 12308685 12474126
42419 12474126 12142300 11269834 10015804 8632565 7348863 6337116 5687955 5331858 4999703
42410 4999703 4343317 3171401 1597777 -45460 -1449249 -2495647 -3228856 -3727593 -4039368
42401 -4039368 -4195358 -4216208 -4088882 -3781213 -3299500 -2706433 -2076700 -1473626 -982732 -715941
42391 -715941 -735818 -1003217 -1451370 -2097327 -3015191 -4178662 -5383713 -6382490 -7086371
42382 -7086371 -7592902 -8002188 -8249630 -8163604 -7680146 -6958529 -6271596 -5813081 -5628643 -5689531
42372 -5689531 -5962873 -6385421 -6804926 -7008737 -6867324 -6477240 -6124648 -6020061 -6026439 -5708598
42362 -5708598 -4735928 -3247147 -1781761 -846033 -537800 -515020 -248091 639553 2111077
42353 2111077 3700472 4804129 5061859 4492916 3350834 1974631 768165 118002 154911
42344 154911 628088 1124505 1412949 1532740 1623299 1787498 2089085 2531771 2990813 3264070
42334 3264070 3259494 3083316 2896266 2724215 2458888 2024476 1505665 1110976 1008839 1170966
42324 1170966 1365796 1328184 941209 242439 -699814 -1822178 -2965431 -3844477 -4218521
42315 -4218521 -4090786 -3712648 -3416518 -3454100 -3908122 -4653020 -5406289 -5906204 -6075606 -5979978
42305 -5979978 -5629482 -4888806 -3620434 -1891042 -18135 1565584 2505862 2676877 2233021
42296 2233021 1520961 880196 466535 222950 -17950 -413822 -1052720 -1953703 -3097380
42287 -3097380 -4451176 -5961475 -7529163 -9020192 -10312190 -11309066 -11904828 -11986535 -11532873
42278 -11532873 -10705480 -9802519 -9116275 -8842122 -9069082 -9765259 -10751884 -11753873 -12514717
42269 -12514717 -12849146 -12616543 -11746506 -10339005 -8669783 -7033394 -5618850 -4567636
42261 -4567636 -4048598 -4141652 -4663669 -5233380 -5558985 -5621006 -5578175 -5567083 -5604097 -5599770 -5423706
42250 -5423706 -5009049 -4442595 -3925417 -3609278 -3479750 -3401246 -3248130 -2991324 -2688458 -2380136
42240 -2380136 -1960057 -1193344 25606 1421245 2461850 2809201 2581254 2124398 1618180
42231 1618180 991777 155295 -815304 -1719786 -2375913 -2725589 -2875521 -3037350 -3360397
42222 -3360397 -3793846 -4124761 -4133529 -3701328 -2836728 -1680327 -461534 622993 1489227
42213 1489227 2099336 2383880 2325253 2082599 1917710 1985396 2270143 2698582 3188404 3585598
42203 3585598 3710646 3543063 3251951 2958509 2557442 1881688 997536 233437 -77682
42194 -77682 173476 862380 1745448 2565294 3124609 3340435 3257978 3006511 2713219 2428367
42184 2428367 2138004 1867799 1736600 1834445 2053062 2130744 1909139 1485339 1073099 778985
42174 778985 564205 359676 141014 -74644 -233272 -262498 -148688 1100 2940 -303702
42164 -303702 -987309 -1976826 -3038346 -3874015 -4326898 -4459200 -4391653 -4156032 -3803982 -3575901
42154 -3575901 -3786520 -4517506 -5523403 -6442526 -7003243 -7057058 -6597895 -5825595 -5044004
42145 -5044004 -4362023 -3556083 -2335968 -719007 933641 2219842 2971626 3284269 3386811
42136 3386811 3491335 3675187 3855734 3903377 3795658 3638215 3528340 3428167 3197661 2753951
42126 2753951 2190443 1724326 1509868 1510993 1580492 1642903 1732836 1842323 1821599 1512414
42116 1512414 944138 318945 -184697 -519887 -692863 -681557 -485820 -188277 121271 466837
42106 466837 954731 1601185 2250183 2710697 2947702 3081481 3201579 3242989 3073235 2651206
42096 2651206 2055779 1404450 818658 444591 397681 635225 940135 1082826 982769 716317
42086 716317 452467 432107 911357 1969214 3331986 4472414 4964416 4771445 4213632
42077 4213632 3677017 3329255 3062718 2691834 2207842 1819943 1735168 1946956 2281609 2584793
42067 2584793 2757169 2642862 2059433 1044124 -6176 -564583 -372427 408279 1401942
42058 1401942 2329935 3154803 4014793 5057242 6292113 7557461 8625226 9361380 9789087
42049 9789087 9996494 10009033 9796426 9411966 9058612 8936889 9031633 9124689 9029903 8720401
42039 8720401 8182025 7275643 5901191 4252453 2735400 1602727 804886 243210 14290
42030 14290 287433 1034146 2005627 2928422 3606251 3864334 3542563 2610365 1247431 -215718
42020 -215718 -1432773 -2162229 -2330518 -2004549 -1297878 -317303 815176 1968454 3062585
42011 3062585 4037423 4714429 4819444 4284581 3460125 2867643 2753194 2992595 3361185
42002 3361185 3687742 3752662 3300536 2291959 990018 -323134 -1577209 -2737223 -3560831
41993 -3560831 -3767599 -3417264 -2920249 -2640940 -2624911 -2734951 -2897723 -3118497 -3334957 -3375792
41983 -3375792 -3096188 -2542325 -1972224 -1679733 -1749389 -1975712 -2040905 -1772146 -1243776 -698259
41973 -698259 -395609 -445493 -684128 -754454 -408726 274313 1034423 1736817 2420684 3081664
41963 3081664 3574354 3770986 3678130 3333828 2727089 1934240 1235087 929008 1027053 1220376
41953 1220376 1173951 811358 335959 42739 98239 414168 690554 621046 102242 -742314
41943 -742314 -1719055 -2708231 -3659343 -4507113 -5151147 -5526093 -5661873 -5648122 -5539440 -5314053
41933 -5314053 -4930559 -4398508 -3764444 -3038739 -2172639 -1124365 59395 1234373 2248217
41924 2248217 3081106 3909518 4963481 6250413 7454439 8193932 8368526 8168875 7764685
41915 7764685 7125637 6203282 5151598 4231546 3547767 3003883 2511217 2136968 2025396
41906 2025396 2253500 2798584 3580028 4461928 5217498 5543165 5173146 4047089 2399815
41897 2399815 657073 -820234 -1938145 -2852351 -3769257 -4733228 -5542625 -5860481 -5474451
41888 -5474451 -4500453 -3310959 -2252991 -1481919 -1054722 -1034139 -1378631 -1807702 -1938062
41879 -1938062 -1578162 -815483 153627 1155381 2001429 2476909 2464279 2032208 1363750
41870 1363750 652243 82592 -193148 -155017 43031 188026 146154 -119888 -581193 -1115861
41860 -1115861 -1512043 -1594522 -1334494 -772683 119720 1388722 2902077 4328173 5388837
41851 5388837 6087664 6631112 7160555 7628542 7922423 8026554 8025432 7998651 7972463 7955658
41841 7955658 7950125 7899642 7685630 7239927 6663254 6196164 6061029 6331329 6917596 7631327
41831 7631327 8267003 8670028 8755274 8479112 7848884 7006118 6244836 5825662 5722038 5602632
41821 5602632 5112058 4169112 3014709 2023268 1446064 1228856 1025206 454135 -586370
41812 -586370 -1862892 -3041937 -3902512 -4318755 -4185675 -3484202 -2353148 -977025 573175
41803 573175 2292190 4054819 5575576 6561344 6855357 6485902 5695979 4918979 4582083
41794 4582083 4850203 5598733 6638561 7877276 9231125 10494393 11413153 11877962 11978285
41785 11978285 11859591 11559193 10990460 10078482 8907346 7722936 6778705 6189716 5935224
41776 5935224 5940210 6100198 6284910 6415637 6511890 6553442 6320678 5537737 4237325 2855896
41766 2855896 1874762 1451316 1464713 1776639 2279292 2770999 3016979 2997309 2963946 3184360
41756 3184360 3710308 4434209 5251112 6053298 6628745 6716032 6220233 5334648 4421294 3785734
41746 3785734 3549927 3660278 3949951 4226640 4400502 4570263 4925193 5501062 6059705
41737 6059705 6261545 5932194 5114191 3923020 2478793 969166 -379277 -1470524 -2379424
41728 -2379424 -3143074 -3604003 -3562619 -3012981 -2109108 -951980 444302 1979470 3399971
41719 3399971 4452090 5024967 5128775 4832783 4271772 3630989 3048740 2550204 2096380
41710 2096380 1664937 1279705 1017680 1002926 1330505 1958494 2709580 3395374 3903040 4171258
41700 4171258 4170617 3949603 3631936 3306678 2948413 2477030 1860148 1130677 344556 -452119
41690 -452119 -1248134 -2060115 -2833363 -3347509 -3341033 -2809298 -2103558 -1648317 -1605122 -1861718
41680 -1861718 -2242351 -2602058 -2797971 -2769113 -2677302 -2817287 -3300686 -3890718 -4187038 -3917673
41670 -3917673 -3053903 -1767363 -356329 864173 1705225 2139410 2174530 1754654 846564
41661 846564 -426456 -1816512 -3096008 -4112667 -4746433 -4926143 -4710974 -4268389 -3721402
41652 -3721402 -3064989 -2268584 -1406239 -622750 6645 525999 1016711 1519387 2037439
41643 2037439 2552938 3001629 3278547 3333985 3261537 3231442 3305163 3353913 3216542 2939432
41633 2939432 2804752 3076540 3734111 4497699 5111672 5547337 5909787 6217881 6356636
41624 6356636 6225900 5852570 5347989 4835998 4449306 4301920 4381687 4514251 4512957 4348650
41614 4348650 4123220 3927092 3814018 3883841 4262373 4961791 5836415 6700607 7421752 7890548
41604 7890548 8008106 7766000 7275234 6666202 6016454 5406607 4950705 4686615 4493634
41595 4493634 4198987 3727277 3088403 2290224 1364171 431793 -372387 -1044183 -1690781
41586 -1690781 -2372133 -3034438 -3584361 -3943141 -4042897 -3877703 -3570790 -3281692 -2999071 -2503275
41576 -2503275 -1587013 -269809 1221755 2614771 3700849 4373430 4641149 4594624 4325852
41567 4325852 3887265 3316797 2641023 1841225 893812 -111957 -966120 -1518853 -1832741
41558 -1832741 -2086568 -2342697 -2468582 -2289290 -1774158 -1065837 -356947 245086 741385
41549 741385 1153042 1445618 1570805 1556710 1493406 1415725 1248617 883082 255825 -660739
41539 -660739 -1870949 -3288160 -4677959 -5729636 -6210844 -6079821 -5505093 -4788781 -4187355
41530 -4187355 -3722957 -3180985 -2336560 -1163911 210283 1707389 3355483 5133429 6825170
41521 6825170 8080713 8621524 8389381 7530615 6274654 4841022 3439996 2296294 1591255
41512 1591255 1350766 1421403 1587270 1704469 1726301 1647899 1476525 1257736 1100851 1140273
41502 1140273 1421846 1802132 2012394 1899850 1593355 1353392 1267902 1198485 1037346 882963
41492 882963 888842 1047061 1216756 1269594 1082306 471331 -673220 -2172157 -3628336 -4781399
41482 -4781399 -5710698 -6643732 -7644605 -8549690 -9147182 -9339469 -9139494 -8569225 -7602290
41473 -7602290 -6223085 -4536766 -2778221 -1176687 157634 1171226 1749216 1779309 1364468
41464 1364468 883072 757235 1160854 1959206 2884306 3730676 4424114 4989768 5507014
41455 5507014 6078276 6772500 7535312 8166281 8466053 8451054 8374304 8485738 8808982 9187214
41445 9187214 9467279 9541324 9263044 8473858 7153931 5470452 3654505 1888396 295803
41436 295803 -1072254 -2274063 -3397614 -4388452 -5033481 -5166846 -4819447 -4121358 -3158549
41427 -3158549 -2016043 -872292 97064 902449 1716899 2659501 3695134 4760345 5870216
41418 5870216 7023232 8079209 8855552 9352827 9789614 10355975 10972644 11342415 11207959
41409 11207959 10512520 9369871 8008440 6752165 5889513 5436472 5106600 4629669 4031947
41400 4031947 3472555 2886840 2020370 848004 -252093 -856808 -896733 -596208 -154040
41391 -154040 367950 940974 1550537 2274746 3224034 4357735 5449430 6268331 6743377
41382 6743377 6949234 6996133 6938317 6729964 6264448 5510467 4611783 3798379 3192291 2744923
41372 2744923 2363172 2049341 1917805 2116079 2712813 3597143 4484401 5088415 5323699
41363 5323699 5323707 5277902 5296876 5413904 5626785 5893926 6128369 6231956 6134008 5813502 5320964
41352 5320964 4771348 4274100 3868689 3546599 3293140 3046864 2659035 1996973 1096213
41343 1096213 131871 -756429 -1512137 -2036612 -2172842 -1913253 -1530014 -1366031 -1496200
41334 -1496200 -1652956 -1466465 -736848 474030 1914239 3278464 4328497 4938037 5076249
41325 5076249 4805989 4287666 3692225 3066086 2353739 1598493 1022286 804762 847650 878672
41315 878672 757273 558854 382720 231802 117851 147304 417620 908560 1545914 2298481
41305 2298481 3127120 3886628 4368280 4432673 4058732 3307615 2316892 1311263 532835
41296 532835 131657 142699 529452 1170863 1821616 2208846 2248928 2125165 2082887 2162237
41286 2162237 2187323 2010815 1702008 1458798 1370407 1316969 1103931 659787 89713 -429065
41276 -429065 -763184 -842995 -622015 -73756 737201 1574001 2058019 1882716 1099507 194538
41266 194538 -218223 122471 921531 1599035 1753893 1398807 853421 489812 527766 949114
41256 949114 1550128 2104471 2508995 2793015 3035109 3310859 3677808 4128876 4555115 4812071
41246 4812071 4827599 4601687 4131360 3430288 2619780 1878672 1249839 592532 -202292 -1027276
41236 -1027276 -1665491 -2008696 -2081957 -1936089 -1665478 -1507624 -1751605 -2468963 -3412081 -4232078
41226 -4232078 -4743640 -4947258 -4871970 -4476373 -3684978 -2470340 -901056 870140 2676705
41217 2676705 4406484 5977061 7234808 7922402 7806007 6871539 5415756 3935289 2853576
41208 2853576 2256808 1864142 1300447 435125 -544479 -1363696 -1908138 -2255068 -2551222
41199 -2551222 -2911016 -3383463 -3953111 -4570789 -5193711 -5768783 -6173076 -6236553 -5882132 -5221116
41189 -5221116 -4462680 -3735054 -3026895 -2297317 -1611501 -1148863 -1057510 -1274844 -1504576 -1421079
41179 -1421079 -910780 -85167 917211 2052471 3283378 4477087 5455405 6070800 6172643
41170 6172643 5605461 4379661 2805476 1314052 121354 -844480 -1689388 -2348908 -2675168
41161 -2675168 -2624021 -2285086 -1786929 -1235144 -697844 -184230 345324 897183 1377224 1638213
41151 1638213 1594243 1280647 826805 394105 117939 68410 250337 639703 1214105 1949698
41141 1949698 2797004 3647367 4304969 4524482 4154816 3291959 2273612 1495654 1213597
41132 1213597 1460512 2059095 2684297 3007548 2898293 2518008 2186498 2135639 2379818 2781453
41122 2781453 3195682 3559089 3887035 4217585 4561241 4902919 5246689 5638321 6125705
41113 6125705 6695758 7249603 7633192 7707092 7425162 6860617 6131236 5293072 4350517 3392930
41103 3392930 2656187 2357187 2457210 2657043 2672615 2501400 2407050 2681844 3460462 4723056
41093 4723056 6368451 8199754 9863910 10926573 11123016 10564740 9662872 8830132 8272941
41084 8272941 8040782 8152732 8564311 9051119 9286514 9136284 8825821 8718889 8932073
41075 8932073 9247077 9422352 9502865 9742745 10258301 10851935 11197790 11133450 10734890 10171991
41065 10171991 9575046 9037816 8675218 8624805 8988363 9771761 10866470 12087901 13246983
41056 13246983 14192167 14794415 14944650 14633191 14038510 13476215 13205685 13278360 13569533
41047 13569533 13923936 14253154 14530089 14740522 14850747 14812063 14609797 14326103 14133789
41038 14133789 14185627 14498342 14964559 15477466 16012443 16575801 17111599 17502945 17665595
41029 17665595 17614009 17434522 17222259 17048832 16944700 16866659 16700357 16352578 15858369 15363260
41019 15363260 14989601 14760212 14662822 14718775 14927750 15192704 15390784 15519197 15696552 16004985
41009 16004985 16396597 16778484 17123474 17453560 17763851 18013279 18160231 18170905 18031559
41000 18031559 17797790 17594302 17514541 17562318 17762959 18288109 19345323 20911562 22670962
40991 22670962 24285409 25687550 27071027 28657109 30546410 32755794 35280385 38076089
40983 38076089 41056961 44194639 47619481 51565532 56180740 61401324 67023816 72879038
40975 72879038 78912813 85131798 91558929 98294495 105575190 113691261 122829444 133031477
40967 133031477 144283633 156555194 169716797 183519437 197771095 212535894 228080034
40960 228080034 244577210 261854680 279354281 296218010 311371089 323629320 331896793
40953 331896793 335397630 333817098 327297261 316324745 301594164 283940000 264357454
40946 264357454 243989322 223941268 205007948 187566713 171720287 157465411 144698756
40939 144698756 133184927 122675757 113075143 104409998 96656403 89704213 83511170 78175856
40931 78175856 73785408 70256253 67387605 65010596 63006040 61222280 59482270 57683251
40923 57683251 55817493 53874736 51783020 49481530 47018537 44540794 42195020 40060730
40915 40060730 38173008 36581954 35357562 34514409 33935026 33395765 32696616 31784678 30777429
40906 30777429 29888638 29305573 29072757 29070202 29141453 29254112 29478081 29777453 29899293 29559559
40896 29559559 28734825 27717394 26885342 26445422 26359025 26445124 26561109 26748895 27214036
40887 27214036 28116672 29386897 30792159 32168511 33521955 34933878 36491119 38339531
40879 38339531 40671028 43532902 46684906 49747206 52515014 55112450 57880928 61168250
40871 61168250 65170923 69858239 75009754 80402842 86035162 92148746 98988235 106527918
40863 106527918 114457987 122443640 130384798 138425330 146735189 155295009 163845937 171955783
40855 171955783 179070183 184531945 187663059 187947284 185217940 179726383 172055441 162929439
40847 162929439 153003286 142716657 132280027 121790957 111389006 101321317 91856827
40840 91856827 83126210 75061199 67528358 60532452 54255383 48872865 44355406 40469747
40832 40469747 36953687 33672256 30641670 27954135 25684922 23847602 22421939 21395040
40824 21395040 20731218 20315373 20004352 19748975 19566741 19348365 18819414 17822667 16564435
40815 16564435 15433027 14604437 13958321 13328585 12634841 11757739 10525581 8964405 7421910
40806 7421910 6290326 5658449 5316431 5015519 4624266 4116832 3544848 2996071 2487197
40797 2487197 1923998 1233615 479002 -233558 -874852 -1396125 -1584814 -1202510 -292488
40788 -292488 781107 1645111 2194144 2569270 2989184 3629978 4529673 5504595 6222774
40779 6222774 6466798 6339217 6176114 6247664 6523210 6687937 6393184 5550105 4413636
40770 4413636 3369488 2645703 2241599 2067646 2045029 2070776 2008939 1794548 1509825 1326252
40760 1326252 1409200 1877434 2754095 3882357 4948875 5694238 6119343 6445852 6868412
40751 6868412 7363716 7726388 7763206 7467347 7046665 6797318 6922091 7419536 8089441 8610947
40741 8610947 8649948 7984922 6614351 4775510 2847782 1189250 -11514 -785025 -1283429
40732 -1283429 -1605400 -1718242 -1559536 -1180668 -755096 -465978 -401833 -499705 -531492 -211030
40722 -211030 572692 1631162 2652956 3462652 4001487 4120655 3623630 2598554 1536771
40713 1536771 967283 1037379 1540670 2244864 3032669 3785628 4343922 4653221 4839561 5061144
40703 5061144 5331625 5527174 5523749 5295652 4920766 4533103 4255800 4144411 4180011 4313489
40693 4313489 4517135 4808282 5234230 5819975 6516368 7213940 7822157 8320491 8722309
40684 8722309 9016380 9169160 9172148 9075220 8988088 9041092 9298417 9705317 10182159 10782820
40674 10782820 11663103 12821593 13943892 14600960 14568664 13876712 12612013 10832623 8700564
40665 8700564 6565355 4815945 3657861 3028824 2669029 2277891 1711353 1096516 709608
40656 709608 698082 952563 1255911 1479825 1600692 1616771 1539781 1417466 1268882 1016309
40646 1016309 568144 -28159 -584882 -930757 -1007007 -810852 -342240 330698 1010771 1471197
40636 1471197 1640523 1654229 1704581 1857128 2027289 2112876 2107680 2073941 2045013 2007161 1972073
40625 1972073 2005826 2149881 2350399 2513555 2609830 2662425 2623667 2320796 1573358 365559
40615 365559 -1099993 -2493566 -3494992 -3900317 -3689486 -3040776 -2251197 -1574007 -1084939
40606 -1084939 -703545 -363273 -159454 -303961 -919741 -1900513 -2993925 -4000730 -4853299
40597 -4853299 -5515469 -5886791 -5867302 -5495129 -4959329 -4456901 -4056693 -3696700 -3263982 -2648911
40587 -2648911 -1770640 -638259 573856 1557342 2057979 2081866 1914481 1919558 2309407 3083055
40577 3083055 4112908 5214341 6141209 6622135 6502937 5861254 4943159 3994005 3178285
40568 3178285 2615418 2383983 2455184 2698274 3005916 3360633 3728225 3957907 3886460 3507918
40558 3507918 2937192 2228383 1367417 474290 -138859 -233781 85608 460354 590167 396168
40548 396168 -37121 -529908 -840182 -801721 -499835 -215939 -144726 -242180 -372185 -463871
40538 -463871 -435452 -102074 656920 1672962 2591052 3210509 3600460 3873586 4002243 3929970
40528 3929970 3750179 3681563 3927195 4599089 5661669 6839147 7671575 7830645 7393854
40519 7393854 6723893 6107654 5618644 5290675 5237977 5519307 5986171 6358438 6414799 6080698
40509 6080698 5414183 4588112 3850320 3422836 3411136 3775860 4312743 4657443 4456533 3671383
40499 3671383 2682141 1985715 1779359 1875848 1961641 1830995 1407660 709479 -124588 -859083
40489 -859083 -1309809 -1455236 -1370044 -1099037 -665511 -180254 154892 212539 87037 24450
40479 24450 188517 518478 824606 974929 940801 706156 241093 -411851 -1121504 -1794755
40469 -1794755 -2444227 -3066412 -3537373 -3734035 -3696021 -3532694 -3201134 -2542845 -1582181 -648446
40459 -648446 -103894 -3406 -67306 74418 642420 1603641 2700990 3622048 4216095 4538031
40449 4538031 4662714 4535737 4086904 3434316 2859449 2567534 2542634 2646656 2790895 2978769
40439 2978769 3227443 3499311 3719731 3848576 3909837 3923862 3826433 3519854 3027880 2526439
40429 2526439 2148346 1800958 1274901 537078 -173274 -579805 -637146 -502017 -264041 218257
40419 218257 1175571 2646108 4370981 5966112 7166191 7914480 8314245 8583724 9002254
40410 9002254 9728698 10583563 11095656 10886004 10022466 8958676 8137431 7678858 7405114
40401 7405114 7084548 6636380 6143180 5696279 5250294 4668884 3922701 3182100 2668268
40392 2668268 2455073 2460973 2572449 2683734 2642469 2267440 1463253 280731 -1142088 -2663796
40382 -2663796 -4175527 -5602356 -6872937 -7866606 -8423286 -8449472 -7978975 -7086484 -5821984
40373 -5821984 -4345405 -3064264 -2435053 -2543075 -2978725 -3203018 -2979243 -2425301 -1762580
40364 -1762580 -1109524 -450109 311197 1265349 2414707 3671402 4936547 6113757 7023976
40355 7023976 7430358 7276512 6858572 6622885 6750035 6991696 6927091 6336961 5346186 4289992
40345 4289992 3481202 3059707 3009266 3289578 3920462 4919813 6196878 7553470 8770789
40336 8770789 9654169 10033957 9819709 9079821 8009039 6789581 5525460 4328561 3407837
40327 3407837 3011386 3275610 4138005 5378977 6745936 8072383 9300141 10373247 11115840
40318 11115840 11264857 10658764 9375842 7666827 5774300 3834172 1910512 67732
40310 67732 -1596214 -2957526 -3910671 -4444454 -4690781 -4866901 -5123966 -5427143 -5586670
40301 -5586670 -5428136 -4952794 -4328964 -3714660 -3103964 -2379013 -1498508 -567600 308194
40292 308194 1173978 2154871 3247511 4240714 4837973 4807770 4045876 2623296 853878
40283 853878 -762115 -1799969 -2174604 -2128851 -1958625 -1763423 -1436406 -844037 -15485
40274 -15485 796348 1237403 1099209 494351 -215770 -671430 -686961 -232568 624471 1692337
40264 1692337 2656967 3249237 3435915 3380672 3209793 2892930 2379500 1761850 1221804 862735
40254 862735 693518 767862 1214560 2052773 3043026 3825480 4205519 4228591 3980447 3436380
40244 3436380 2585981 1619232 848072 434484 294905 292203 416771 721722 1174844 1681091
40234 1681091 2213350 2815749 3473295 4059234 4433271 4536871 4375596 3960685 3295948
40225 3295948 2390363 1267945 -6941 -1312602 -2520246 -3566595 -4428743 -5024766 -5221406
40216 -5221406 -4994512 -4525207 -4059736 -3691025 -3340077 -2933408 -2508420 -2112043 -1667283
40207 -1667283 -1015605 -82403 1050678 2237251 3369734 4359344 5071610 5382202 5329396
40198 5329396 5144748 5059748 5089469 5051577 4782908 4276697 3611222 2833438 1972475 1123451
40188 1123451 448616 97527 161940 685297 1637296 2835351 3925360 4508363 4339518
40179 4339518 3438106 2035862 445793 -1024177 -2096474 -2570734 -2410498 -1756894 -799311
40170 -799311 363795 1694885 3072475 4259923 5041372 5322365 5075973 4295519 3098664
40161 3098664 1815038 816021 195993 -321917 -1119488 -2336037 -3769229 -5048773 -5877979
40152 -5877979 -6170882 -6041361 -5687593 -5268703 -4862337 -4490029 -4124508 -3671980 -3023102
40143 -3023102 -2187675 -1367603 -852847 -832046 -1292595 -2046829 -2807740 -3294662 -3386235 -3219992
40133 -3219992 -3083367 -3146805 -3314711 -3357173 -3151945 -2768568 -2369628 -2104129 -2073346 -2296212
40123 -2296212 -2657232 -2937919 -2957378 -2686650 -2229245 -1729064 -1304273 -1000577 -740968 -339912
40113 -339912 374407 1434695 2727132 4061717 5216706 5978062 6235790 6046988 5535185
40104 5535185 4726105 3561734 2093411 569076 -737945 -1747001 -2571104 -3333861 -4021310
40095 -4021310 -4476279 -4502934 -4029407 -3232908 -2474894 -2043300 -1962121 -2089862 -2354167 -2792442
40085 -2792442 -3371888 -3891596 -4133141 -4059903 -3819959 -3591729 -3470620 -3464120 -3526054 -3599049
40075 -3599049 -3686310 -3908601 -4452079 -5406482 -6626605 -7756423 -8428014 -8501181 -8154068
40066 -8154068 -7734083 -7491885 -7452024 -7538979 -7786914 -8360967 -9353044 -10602665 -11769185
40057 -11769185 -12578513 -12970611 -13016548 -12751979 -12137402 -11157019 -9891508 -8464633 -6951272
40048 -6951272 -5379745 -3817606 -2410859 -1314615 -601351 -252018 -210848 -405440 -711733
40039 -711733 -953182 -991281 -830493 -620025 -545981 -711407 -1078437 -1481369 -1713430 -1672308
40029 -1672308 -1454648 -1268307 -1219918 -1224066 -1153405 -1027191 -982738 -1084684 -1241205 -1311344
40019 -1311344 -1223724 -978341 -611202 -195746 189231 550505 988627 1546148 2076022 2337609
40009 2337609 2234301 1915146 1635666 1539745 1560506 1499606 1219140 794267 459320 358837
39999 358837 375153 269058 -15771 -262286 -196847 292122 1176168 2407256 3898851 5425759
39989 5425759 6667517 7396996 7589804 7354098 6821307 6122203 5390104 4712783 4091964
39980 4091964 3489526 2905026 2381473 1952252 1614960 1339230 1054343 635676 -38714
39971 -38714 -994078 -2156226 -3458623 -4902187 -6459972 -7952863 -9096720 -9707022 -9831319
39962 -9831319 -9650381 -9251214 -8517202 -7261541 -5482730 -3483288 -1710800 -463411 250771
39953 250771 592155 693289 602897 346276 -45764 -543931 -1069433 -1440824 -1478863 -1217604
39943 -1217604 -937975 -909826 -1110580 -1231386 -932043 -68307 1251384 2720458 3946112
39934 3946112 4622677 4689075 4323462 3762711 3124530 2390959 1519062 534702 -464805 -1362645
39924 -1362645 -2068015 -2533635 -2752816 -2745141 -2541464 -2188096 -1774310 -1439224 -1305840 -1377934
39914 -1377934 -1519735 -1566267 -1451663 -1232312 -1036923 -1029469 -1344642 -1937394 -2493277 -2604985
39904 -2604985 -2101110 -1154580 -62913 975769 1834509 2353000 2407117 2038929 1402993
39895 1402993 606733 -304048 -1248237 -2135635 -2986430 -3882861 -4761333 -5372770 -5519155
39886 -5519155 -5251337 -4782501 -4294158 -3889248 -3628826 -3480125 -3260698 -2765815 -1988424
39877 -1988424 -1147908 -474193 -4886 391841 838163 1311007 1646688 1647346 1203359 358709
39867 358709 -709667 -1770685 -2623066 -3146559 -3301467 -3081228 -2470314 -1470698 -177198
39858 -177198 1199012 2403804 3233648 3573096 3409569 2874562 2244179 1798002 1597697
39849 1597697 1405290 875578 -113624 -1293872 -2170266 -2374170 -1880625 -918255 273316
39840 273316 1558959 2831395 3925443 4657973 4904832 4594749 3687854 2264611 643891
39831 643891 -693289 -1394230 -1455680 -1133064 -662103 -127257 411491 766660 686127 63828
39821 63828 -950776 -2036201 -2848895 -3131730 -2801682 -2008091 -1054342 -180834 578353
39812 578353 1300693 1984655 2517971 2802880 2824211 2597821 2152440 1597078 1108403 755115
39802 755115 355668 -412335 -1721902 -3397160 -4973749 -5971015 -6191983 -5833639 -5299190
39793 -5299190 -4866892 -4535432 -4168983 -3715585 -3242243 -2830754 -2534211 -2414232 -2525323
39784 -2525323 -2837929 -3230993 -3580385 -3826708 -3977268 -4114859 -4408101 -5011422 -5875812
39775 -5875812 -6694151 -7108689 -6987873 -6483062 -5839355 -5196859 -4569522 -3958655 -3442362
39766 -3442362 -3151290 -3163815 -3419286 -3729861 -3890055 -3802528 -3532417 -3266933 -3214671 -3492489
39756 -3492489 -4048575 -4670950 -5093612 -5136439 -4774446 -4086205 -3139020 -1927377 -429385
39747 -429385 1276465 2964372 4346342 5203499 5429814 4983725 3880931 2293637 613821
39738 613821 -699977 -1421159 -1689049 -1799282 -1864442 -1726146 -1207532 -393261 395457 894010
39728 894010 1119947 1298005 1592683 1938363 2118005 1975584 1540670 975017 441542 29531
39718 29531 -249951 -459296 -719255 -1134990 -1703613 -2319531 -2881486 -3352370 -3696698 -3826485
39708 -3826485 -3676756 -3302833 -2831823 -2334637 -1822659 -1363709 -1097531 -1084418 -1202270 -1257141
39698 -1257141 -1172874 -1040979 -1023079 -1241558 -1715193 -2327862 -2870799 -3181905 -3269655 -3291449
39688 -3291449 -3427324 -3781190 -4327862 -4857685 -4995635 -4410968 -3094020 -1392696 262842
39679 262842 1633353 2652748 3242951 3285594 2796004 2029902 1352798 1023174 1109869 1547378
39669 1547378 2200542 2910201 3573486 4210850 4896904 5587465 6062583 6100757 5693794 5031963
39659 5031963 4274965 3398364 2300208 1019212 -209570 -1122319 -1620141 -1786142 -1734423
39650 -1734423 -1472878 -925454 -74379 944739 1895130 2567773 2857624 2763474 2377586
39641 2377586 1876327 1454217 1220325 1181706 1353685 1838650 2718724 3866101 4933287
39632 4933287 5583765 5711652 5409373 4769419 3802450 2557696 1231663 70507 -825773
39623 -825773 -1532299 -2102465 -2380437 -2070441 -1037916 437126 1731175 2283853 2018011
39614 2018011 1362898 815368 474979 48609 -715584 -1697063 -2524951 -2932368 -2939204 -2786027
39604 -2786027 -2787072 -3168812 -3895030 -4630252 -4974011 -4765561 -4122340 -3224181 -2164055 -985010
39594 -985010 287747 1693730 3286065 4959163 6425119 7440988 7985526 8154975 7994526
39585 7994526 7533209 6880896 6141754 5290884 4296998 3336075 2692113 2399751 2141565
39576 2141565 1585382 714964 -253552 -1169021 -2029965 -2839643 -3531413 -4047970 -4377470
39567 -4377470 -4477471 -4265602 -3756676 -3145834 -2667494 -2381974 -2155356 -1827636 -1330011
39558 -1330011 -656235 157161 955442 1461835 1472537 1052129 459716 -100762 -563213 -851419
39548 -851419 -809196 -378510 230833 659725 679519 314276 -249377 -779647 -1064936 -994575
39538 -994575 -634718 -189036 139666 251138 171102 51244 115698 492576 1061909 1547791
39528 1547791 1807862 1980597 2313688 2906905 3667534 4443728 5096228 5449740 5291025
39519 5291025 4508414 3236155 1816275 582858 -328763 -968451 -1395144 -1553561 -1339779
39510 -1339779 -757655 24670 764761 1272552 1480622 1450626 1317126 1169474 949842 481966
39500 481966 -374318 -1583632 -2919826 -4057364 -4707386 -4755788 -4336559 -3765566 -3368260
39491 -3368260 -3345677 -3760404 -4569372 -5613247 -6600508 -7183937 -7126189 -6431623 -5329471
39482 -5329471 -4115526 -2985357 -2007615 -1248286 -881938 -1122083 -2005015 -3241296 -4300661
39473 -4300661 -4692065 -4250652 -3236191 -2160451 -1453615 -1229750 -1336632 -1597890 -1979199
39464 -1979199 -2542738 -3306183 -4181373 -5021636 -5687763 -6068884 -6079589 -5688737 -4987965 -4222842
39454 -4222842 -3698072 -3596012 -3875669 -4342554 -4777075 -4983054 -4800740 -4191454 -3315655
39445 -3315655 -2429237 -1650099 -876929 16560 947178 1642372 1899289 1797010 1644815
39436 1644815 1734061 2153632 2839984 3744425 4848987 5992114 6804047 6965870 6531387
39427 6531387 5883343 5353034 4974141 4617640 4231563 3865315 3554252 3294745 3097503
39418 3097503 2975172 2895334 2822452 2800682 2932603 3269905 3755748 4251765 4579570 4570529
39408 4570529 4152623 3405358 2502566 1615881 893998 463164 333426 300076 43447 -611004
39398 -611004 -1558532 -2536606 -3299880 -3646001 -3381252 -2405524 -852985 936183 2641373
39389 2641373 4146780 5498406 6727345 7756537 8448556 8684609 8410530 7694776 6787781
39380 6787781 6053825 5737577 5766885 5812901 5545996 4829267 3738680 2510701 1475136
39371 1475136 911898 876882 1192999 1644171 2121657 2540862 2715058 2459577 1841756 1230998
39361 1230998 1036116 1399187 2133729 2898433 3403253 3508385 3214266 2596541 1737375
39352 1737375 696009 -460366 -1595006 -2488310 -2930521 -2861769 -2411180 -1783403 -1136878
39343 -1136878 -599235 -337140 -503489 -1105007 -2000990 -3042745 -4126311 -5096375 -5736704
39334 -5736704 -5959030 -5927514 -5887249 -5899182 -5825768 -5548459 -5122720 -4744148 -4623935 -4841981
39324 -4841981 -5218652 -5361108 -4954263 -4019033 -2811721 -1504138 -90214 1397453 2748930
39315 2748930 3750142 4409294 4923655 5462917 6041889 6568622 6966841 7269916 7609836
39306 7609836 8070092 8535561 8753192 8577691 8099556 7491877 6799499 5951586 4944756
39297 4944756 3936104 3146720 2695167 2499771 2315093 1900884 1209565 409236 -289724
39288 -289724 -804155 -1166892 -1409921 -1523127 -1519264 -1505093 -1694949 -2351993 -3642684 -5465925
39278 -5465925 -7422098 -9004422 -9873364 -10009001 -9677315 -9259850 -9016483 -8915148 -8697184
39269 -8697184 -8153173 -7334204 -6503225 -5947573 -5846301 -6180268 -6647607 -6752852 -6167528
39260 -6167528 -5046622 -3900541 -3144245 -2844858 -2858506 -3020421 -3131318 -2935338 -2304728
39251 -2304728 -1428053 -687070 -316855 -242608 -247715 -229396 -256111 -413993 -647175 -770540
39241 -770540 -638673 -281261 149712 543454 890259 1190190 1389915 1456616 1450908 1457999
39231 1457999 1483010 1485384 1498841 1647560 2041670 2703321 3576948 4540236 5405140 5991620
39221 5991620 6240202 6210587 5962325 5510627 4929116 4398451 4050218 3793447 3392875 2722332
39211 2722332 1857994 907230 -151467 -1373020 -2630772 -3591530 -3935807 -3580954 -2709192
39202 -2709192 -1653112 -774250 -345306 -403625 -686104 -806530 -596337 -276594 -261465 -798185
39192 -798185 -1799933 -2949849 -3876136 -4273315 -4024310 -3302514 -2483812 -1859501 -1443074
39183 -1443074 -1092159 -757334 -530233 -494490 -642097 -927070 -1280550 -1543153 -1499927 -1066889
39173 -1066889 -388970 306904 906833 1409905 1811734 2096639 2323947 2611113 2994316
39164 2994316 3362528 3561177 3532405 3345190 3124556 2965461 2887627 2861157 2888153 3041030
39154 3041030 3374987 3804929 4131293 4228083 4181724 4211699 4456745 4842435 5131181 5077644
39144 5077644 4554398 3579650 2280751 866153 -389809 -1222382 -1521590 -1412671 -1158168
39135 -1158168 -978190 -978280 -1195142 -1607491 -2078222 -2375394 -2328529 -1951077 -1381929 -743702
39125 -743702 -99339 491090 947419 1223519 1351469 1409155 1445005 1437265 1334833 1150412
39115 1150412 1000556 1021453 1250550 1631871 2123597 2713826 3299011 3643778 3554021 3044064
39105 3044064 2246105 1203933 -111450 -1580067 -2875648 -3716958 -4105556 -4244684 -4289424
39096 -4289424 -4268658 -4209027 -4208474 -4347107 -4589030 -4808925 -4877348 -4700026 -4229688 -3501602
39086 -3501602 -2649793 -1843361 -1196724 -762649 -602377 -803479 -1373287 -2111054 -2627316
39077 -2627316 -2547211 -1754539 -490043 768826 1565465 1692999 1252379 519017 -255870
39068 -255870 -941148 -1477857 -1812465 -1932418 -1948569 -2064211 -2404045 -2879962 -3257216 -3357786
39058 -3357786 -3192099 -2917825 -2711643 -2671490 -2774847 -2886684 -2846203 -2615528 -2356015 -2316399
39048 -2316399 -2623197 -3198015 -3880327 -4588347 -5329938 -6082457 -6701432 -6947730 -6597909
39039 -6597909 -5572865 -4031897 -2362956 -1026196 -326545 -280060 -668859 -1214233 -1710391
39030 -1710391 -2027192 -2037578 -1612654 -745817 328933 1225649 1684918 1758004 1684276 1617888
39020 1617888 1532266 1366150 1159188 998583 904488 849007 867260 1062335 1452541 1842323
39010 1842323 1911769 1491897 763812 146786 -52366 121483 382161 490654 369862 -12212
39000 -12212 -721094 -1747940 -2910685 -3961204 -4767194 -5323261 -5616707 -5580523 -5204725
38991 -5204725 -4636596 -4131411 -3910096 -4053363 -4494758 -5102619 -5784602 -6508330 -7203401
38982 -7203401 -7675537 -7692905 -7195101 -6388157 -5599953 -5047883 -4752786 -4633948 -4619061 -4648155
38972 -4648155 -4643758 -4571152 -4535658 -4722509 -5146892 -5482523 -5226132 -4067432 -2080381 404248
38962 404248 3005932 5365672 7162984 8203789 8481673 8092117 7120429 5676087 3989831
38953 3989831 2375800 1086273 241126 -152551 -211053 -186018 -347296 -806577 -1494918
38944 -1494918 -2287330 -3054071 -3603060 -3721210 -3353940 -2668208 -1880220 -1093813 -358482
38935 -358482 222540 567293 754712 962680 1251293 1486051 1488219 1195138 663366 -7240
38925 -7240 -709457 -1349794 -1910425 -2487952 -3212827 -4096595 -4974648 -5622166 -5914432 -5851119
38915 -5851119 -5455939 -4736728 -3773867 -2760439 -1857186 -1033048 -138946 868999 1871678
38906 1871678 2754361 3524765 4227268 4834544 5283573 5549034 5627806 5520001 5280455 5016184
38896 5016184 4769905 4484938 4165273 3986357 4125699 4520007 4890736 4977144 4662312 3950843
38886 3950843 2981442 2033056 1341540 878533 448852 24464 -184688 -48367 269846
38877 269846 529631 701005 876015 985217 789554 155321 -787950 -1767454 -2541420 -2956093
38867 -2956093 -2947886 -2536952 -1761655 -612340 889551 2525229 3886088 4632109 4739110
38858 4739110 4475278 4163426 3967406 3835645 3586478 3073985 2336179 1593589 1067700
38849 1067700 783539 561544 201816 -346155 -997834 -1668946 -2331481 -2922843 -3272204
38840 -3272204 -3210388 -2761415 -2148472 -1572213 -1049897 -531514 -98435 81669 -6676 -164499
38830 -164499 -217273 -231546 -410732 -818326 -1281470 -1546630 -1460622 -1016513 -318356 451171
38820 451171 1066978 1314674 1039003 202928 -1021798 -2228876 -2954857 -2987148 -2508395
38811 -2508395 -1912802 -1490734 -1291775 -1216153 -1141844 -961873 -587780 12873 776600 1548813
38801 1548813 2133273 2382766 2309476 2105878 1979041 1921711 1696423 1091377 153334 -872964
38791 -872964 -1775598 -2460014 -2840567 -2781863 -2209264 -1213663 13822 1317653 2600731
38782 2600731 3744325 4573338 4917575 4687970 3906369 2700163 1269531 -180906 -1505485
38773 -1505485 -2610575 -3394746 -3737440 -3578635 -2994275 -2152415 -1179141 -90306 1118982
38764 1118982 2326741 3263320 3665741 3456656 2776081 1863383 928888 120079 -436100
38755 -436100 -594754 -215122 754988 2191614 3790241 5165039 5968523 5957631 5046638
38746 5046638 3398660 1459978 -208148 -1233663 -1601278 -1534797 -1255224 -860343 -370043
38737 -370043 187028 735144 1164147 1377699 1347248 1117690 765908 391253 154071 246253
38727 246253 733577 1427381 1976882 2122822 1868377 1452116 1213318 1437692 2191771 3228006
38717 3228006 4120947 4607510 4814880 5107166 5694099 6421534 6948238 7075248 6862912
38708 6862912 6466121 5943354 5265308 4456034 3648253 2991101 2549943 2308450 2226979 2285284
38698 2285284 2517659 3031048 3922920 5108102 6255147 6986096 7180694 7064643 6993701
38689 6993701 7163354 7494760 7733855 7644033 7155883 6381137 5492964 4592524 3680524 2713725
38679 2713725 1656226 520636 -568748 -1367162 -1649506 -1399010 -832851 -243946 157379
38670 157379 306740 316404 453126 946518 1729405 2440022 2760445 2700247 2484317 2239289
38660 2239289 1894872 1338734 533166 -518730 -1797135 -3216368 -4635294 -5953421 -7134698
38651 -7134698 -8120891 -8809741 -9166299 -9282390 -9265725 -9134560 -8901493 -8714128 -8800820 -9252195
38641 -9252195 -9914596 -10518024 -10864650 -10882795 -10567916 -9946377 -9101541 -8189671 -7392266 -6834340
38631 -6834340 -6529263 -6379622 -6224946 -5911696 -5358206 -4584314 -3683321 -2750154 -1823331
38622 -1823331 -892723 42008 932339 1702935 2302919 2732176 3031926 3260073 3454763
38613 3454763 3585313 3534234 3169143 2475562 1617990 838409 274863 -123349 -514887 -1015867
38603 -1015867 -1602992 -2110430 -2310289 -2050457 -1364177 -442360 507424 1345125 1949243
38594 1949243 2184649 2016886 1629679 1329516 1311614 1558988 1929958 2242006 2297279 2007066
38584 2007066 1584128 1480181 1973463 2844217 3569528 3828054 3724202 3537933 3372277
38575 3372277 3077253 2440119 1417644 239919 -691443 -1067448 -876638 -337076 351989
38566 351989 1131713 1983041 2822036 3546488 4111187 4500287 4684449 4666223 4520173 4323840
38556 4323840 4085327 3802474 3556718 3461725 3519007 3596741 3572444 3451089 3327215 3268984
38546 3268984 3256114 3205695 3055034 2855719 2798992 3109431 3874655 4972441 6156628 7194456
38536 7194456 7939448 8346274 8473063 8442405 8328018 8053312 7437867 6380987 4997355
38527 4997355 3557116 2295125 1278021 424259 -385691 -1209046 -1993228 -2596979 -2890900
38518 -2890900 -2881507 -2735240 -2656385 -2746062 -2997974 -3404238 -3999455 -4770920 -5562532 -6121856
38508 -6121856 -6268974 -6030407 -5621183 -5292238 -5154984 -5100692 -4865807 -4197150 -3006221
38499 -3006221 -1415261 320647 1939745 3246962 4112118 4471938 4385247 4041786 3606849
38490 3606849 3015296 1997645 389037 -1616030 -3572389 -5111190 -6099832 -6545458 -6495813
38481 -6495813 -6080517 -5531793 -5048041 -4640095 -4158295 -3470929 -2607541 -1753097 -1109134
38472 -1109134 -719190 -412102 37685 660931 1234110 1492432 1367351 987142 489236
38463 489236 -109866 -866487 -1773971 -2690276 -3407977 -3817515 -3996718 -4105465 -4203758 -4234721
38453 -4234721 -4180377 -4126470 -4114026 -4010406 -3618277 -2872921 -1864508 -726075 392209
38444 392209 1267772 1661558 1484537 860533 16167 -835328 -1514507 -1890783 -1942954 -1762460
38434 -1762460 -1453122 -1052824 -571758 -60944 399668 763113 1044640 1316387 1696760
38425 1696760 2312387 3214060 4296803 5291735 5853617 5727636 4919130 3714878 2473208
38416 2473208 1350754 261469 -886315 -1981226 -2799031 -3261762 -3513621 -3711488 -3801377
38407 -3801377 -3565079 -2883743 -1908671 -945933 -189281 407618 1002370 1641979 2183868
38398 2183868 2419189 2259879 1815672 1298015 840197 411071 -79829 -606713 -1009204
38389 -1009204 -1167661 -1147112 -1131442 -1258278 -1555791 -1970802 -2358264 -2472101 -2103068 -1288170
38379 -1288170 -312274 565484 1351655 2228033 3240511 4138675 4544585 4260229 3407243
38370 3407243 2306301 1268841 499577 104425 65792 178870 110589 -376239 -1253942
38361 -1253942 -2303366 -3295845 -4044772 -4360540 -4115980 -3402273 -2528550 -1796220 -1279743
38352 -1279743 -816063 -160824 821079 2022646 3123226 3815726 4027742 3868523 3388095
38343 3388095 2523923 1325524 93307 -818739 -1279163 -1384678 -1266567 -990616 -593816
38334 -593816 -104131 468178 1085548 1663558 2188211 2819566 3744436 4886765 5855125
38325 5855125 6240587 5940303 5180346 4283471 3451009 2715671 2021305 1308727 536909
38316 536909 -327013 -1269426 -2161754 -2793290 -3042656 -3007912 -2920077 -2932094 -3021955 -3075742
38306 -3075742 -3011545 -2833039 -2616687 -2449580 -2338664 -2182618 -1870962 -1406656 -899488 -458786
38296 -458786 -138676 31801 26144 -177226 -620862 -1371131 -2403619 -3470263 -4171373 -4229609
38286 -4229609 -3684410 -2816906 -1932419 -1220876 -740521 -442214 -189636 207361 916353
38277 916353 1953862 3079860 3866831 3965486 3326969 2151235 683692 -849952 -2184353
38268 -2184353 -3096889 -3622933 -4055280 -4625864 -5262431 -5734736 -5955586 -6046656 -6190366 -6531342
38258 -6531342 -7148354 -7958250 -8653688 -8893241 -8615327 -8084195 -7598047 -7238411 -6935381
38249 -6935381 -6664674 -6482595 -6420714 -6448885 -6536453 -6661540 -6726765 -6531052 -5909652 -4929207
38239 -4929207 -3910510 -3211922 -2971212 -3055593 -3229364 -3316137 -3208144 -2821106 -2133848 -1258664
38229 -1258664 -405410 241845 600956 682840 560930 328337 17458 -444030 -1147821 -2072405
38219 -2072405 -3075864 -4003298 -4737867 -5168102 -5226417 -5017936 -4826347 -4896714 -5221991 -5579305
38209 -5579305 -5735330 -5568558 -5049012 -4208557 -3153966 -2043322 -1010618 -134036 519371
38200 519371 867829 876182 637150 366767 303464 590879 1223817 2078156 2989906 3829012
38190 3829012 4530170 5068594 5392861 5371895 4843512 3769155 2338315 860237 -477206
38181 -477206 -1707407 -2931522 -4123687 -5138449 -5874905 -6374171 -6766043 -7159784 -7560048
38172 -7560048 -7828358 -7743279 -7185528 -6306774 -5486558 -5100432 -5326477 -6111090 -7198550
38163 -7198550 -8154881 -8484361 -7886993 -6469131 -4685804 -3060427 -1939491 -1439672 -1513927
38154 -1513927 -1995609 -2594547 -2931235 -2675044 -1724675 -272586 1330237 2791722 3975161
38145 3975161 4829842 5303365 5351638 4993095 4317541 3463725 2605368 1912219 1470140 1248139
38135 1248139 1171503 1200280 1298500 1369458 1311594 1159604 1112260 1382952 2036408 2961432
38125 2961432 3939394 4707492 5021112 4761214 4034258 3149099 2446513 2101659 2059369 2151363
38115 2151363 2273987 2443915 2693063 2964155 3155605 3237933 3254233 3202569 2994482 2571516
38105 2571516 2007201 1427147 844510 133030 -830453 -2038931 -3381919 -4755188 -6096806
38096 -6096806 -7309112 -8182503 -8453719 -7986537 -6905946 -5536998 -4200484 -3066917 -2181886
38087 -2181886 -1572784 -1290741 -1364151 -1746363 -2322947 -2978437 -3674099 -4457091 -5357706 -6268186
38077 -6268186 -6974355 -7351250 -7493376 -7589547 -7676922 -7580223 -7105157 -6235968 -5118248 -3909202
38067 -3909202 -2714770 -1657004 -916236 -641218 -819241 -1268164 -1767299 -2177751 -2431448
38058 -2431448 -2452802 -2162741 -1575799 -840322 -139247 431776 869865 1195554 1430410 1604911
38048 1604911 1698554 1567031 1026606 74805 -1018756 -1901166 -2394602 -2531344 -2383762
38039 -2383762 -1951257 -1220245 -253377 826307 1898776 2859146 3608934 4098259 4378694
38030 4378694 4573084 4777023 5003466 5217068 5386520 5486475 5477790 5324807 5033860 4644986
38020 4644986 4169674 3559877 2773543 1869054 990098 224894 -490127 -1271482 -2095558
38011 -2095558 -2767138 -3110422 -3135640 -2959933 -2611934 -2023319 -1237843 -532445 -232672 -400247
38001 -400247 -744989 -868609 -609390 -174749 59079 -83403 -377306 -393602 67462 749289
37991 749289 1167842 1050807 539565 17514 -189016 25948 560993 1220461 1864978 2515202
37981 2515202 3308329 4324893 5447672 6381241 6798006 6494793 5480634 3961972 2231582
37972 2231582 539465 -954101 -2142151 -2942600 -3320428 -3313090 -3029462 -2642282 -2355436
37963 -2355436 -2303061 -2442645 -2577110 -2504510 -2129166 -1443287 -480196 665242 1816934
37954 1816934 2788314 3488154 3948780 4259977 4471539 4535338 4353660 3921740 3390240 2897482
37944 2897482 2346533 1472677 175109 -1340146 -2816463 -4203461 -5518486 -6565968
37936 -6565968 -7013848 -6754867 -6024571 -5135052 -4248469 -3459547 -2919841 -2720090 -2703321 -2518723
37926 -2518723 -1874136 -707185 829396 2452200 3815259 4588438 4568438 3780108 2496369
37917 2496369 1126885 20894 -662574 -925265 -855410 -645740 -599146 -941826 -1584523
37908 -1584523 -2182879 -2493020 -2574803 -2590936 -2528703 -2246345 -1732813 -1188930 -860258 -887734
37898 -887734 -1308712 -2077447 -3022353 -3843809 -4228615 -3998427 -3182837 -1995559 -743127
37889 -743127 284941 878492 911463 367543 -583233 -1574484 -2200111 -2227865 -1671146 -692625
37879 -692625 516113 1781552 2948320 3880199 4479104 4724621 4692207 4482154 4104500
37870 4104500 3485034 2624194 1690130 886875 277468 -181785 -475726 -511518 -258765 202036
37860 202036 789082 1474484 2199814 2850458 3392013 3951582 4662124 5460499 6134740 6569868
37850 6569868 6864896 7174034 7477279 7548571 7145512 6219229 4956986 3660318 2606058
37841 2606058 1988939 1899695 2277758 2902275 3502796 3904401 4046107 3889718 3389330 2557876
37831 2557876 1484261 253524 -1082433 -2424309 -3605912 -4535249 -5299246 -6036489 -6733001
37822 -6733001 -7230891 -7419526 -7317634 -6970587 -6408575 -5796934 -5537872 -6058252 -7419569
37813 -7419569 -9159363 -10551214 -11045757 -10521365 -9213158 -7483494 -5659686 -4009500
37805 -4009500 -2762092 -2072226 -1941880 -2201491 -2604553 -2960393 -3180052 -3213981 -2997431
37796 -2997431 -2504853 -1851470 -1289923 -1071202 -1303455 -1916333 -2693024 -3317838 -3488956
37787 -3488956 -3105130 -2355919 -1566657 -945938 -526271 -313348 -364338 -660946 -992526 -1062640
37777 -1062640 -709587 -10128 756978 1183529 859061 -389741 -2296979 -4243058 -5620449
37768 -5620449 -6174063 -6061880 -5665825 -5338683 -5231938 -5271549 -5273922 -5093015 -4666448 -3961147
37758 -3961147 -2944048 -1639172 -184157 1209751 2368989 3246180 3931000 4583921 5322006
37749 5322006 6114502 6760434 6984975 6620034 5760381 4752004 3963366 3513839 3239877
37740 3239877 2940395 2599284 2325455 2152249 2002644 1816940 1588707 1276801 829800
37731 829800 356347 142826 393361 1021092 1788666 2587297 3464767 4428441 5365719 6174606
37721 6174606 6863674 7495723 8127282 8838891 9723118 10749980 11673414 12145350 11952511
37712 11952511 11160667 10068533 9025802 8234345 7670495 7197372 6748236 6368598 6091642
37703 6091642 5851888 5562405 5215890 4845433 4418715 3835034 3012393 1925053 576159
37694 576159 -991452 -2644722 -4185769 -5468269 -6463010 -7189975 -7623365 -7701232 -7406322
37685 -7406322 -6789440 -5912196 -4819402 -3611996 -2530669 -1900253 -1926476 -2524251 -3358996
37676 -3358996 -4079159 -4534512 -4805274 -5053372 -5349586 -5623826 -5763262 -5738151 -5598376 -5336983
37666 -5336983 -4816004 -3907760 -2712546 -1562655 -767305 -379648 -226470 -118566 -6563
37657 -6563 15166 -193775 -688766 -1361084 -2010359 -2528829 -2984082 -3486636 -4019021 -4442846
37647 -4442846 -4626847 -4504054 -4058970 -3372531 -2675256 -2240640 -2173144 -2348429 -2569536 -2708601
37637 -2708601 -2679434 -2374196 -1720584 -788943 201825 991052 1411074 1480179 1382930 1304276
37627 1304276 1252821 1085055 709830 207202 -259917 -555040 -557633 -176874 508003 1206447
37617 1206447 1668213 1952849 2298902 2707735 2813617 2268746 1185161 102309 -457770
37608 -457770 -355854 163925 694242 859229 432852 -558539 -1786837 -2738754 -2983668
37599 -2983668 -2398518 -1184865 275461 1576354 2410203 2679378 2511151 2077595 1380218
37590 1380218 313021 -1013768 -2137157 -2571620 -2260640 -1610758 -1098284 -926722 -1032428
37581 -1032428 -1277566 -1580843 -1946300 -2430846 -3050710 -3699214 -4204154 -4477957 -4550307 -4443429
37571 -4443429 -4106372 -3522864 -2809631 -2138342 -1605993 -1236702 -1050553 -1043706 -1131553 -1206039
37561 -1206039 -1259404 -1392100 -1693906 -2164819 -2744718 -3356808 -3909922 -4313867 -4519539 -4518179
37551 -4518179 -4304357 -3889633 -3361206 -2867150 -2509556 -2293045 -2207616 -2304649 -2615776 -3009669
37541 -3009669 -3216326 -3059147 -2668728 -2445543 -2786444 -3813699 -5331686 -7012037 -8593743
37532 -8593743 -9911185 -10813717 -11194044 -11153021 -11037248 -11163943 -11475899 -11549589 -10982877 -9721400
37522 -9721400 -7998631 -6084390 -4205994 -2638530 -1679668 -1446067 -1743782 -2173206 -2334031
37513 -2334031 -1969891 -1064753 110018 1129255 1729452 2011181 2277182 2677240 3055245
37504 3055245 3120472 2710809 1916193 1039460 461410 465309 1107849 2219090 3496248 4594632
37494 4594632 5213440 5219866 4731646 4030063 3364046 2847698 2496939 2258599 1983457 1477801
37484 1477801 670510 -289899 -1136229 -1652615 -1746893 -1449082 -908593 -332382 169098 662983
37474 662983 1250874 1849006 2179378 2001080 1317764 355410 -623894 -1476735 -2188676 -2771769
37464 -2771769 -3184654 -3401191 -3577793 -4084907 -5262362 -7096206 -9162570 -10908045 -11979493
37455 -11979493 -12321962 -12063458 -11387625 -10496251 -9595949 -8824365 -8144855 -7333941 -6143694
37446 -6143694 -4547390 -2839429 -1455786 -663478 -421782 -533819 -885337 -1494480 -2352057
37437 -2352057 -3289066 -4049684 -4468824 -4531004 -4276539 -3737134 -3003429 -2279296 -1761647 -1448133
37427 -1448133 -1118160 -532171 353728 1336233 2082217 2343138 2152351 1807479 1545501
37418 1545501 1196447 265188 -1555432 -3992479 -6351455 -8005915 -8713066 -8593766 -7956324
37409 -7956324 -7099691 -6149145 -5059040 -3823224 -2620263 -1641401 -827599 66044 1145686
37400 1145686 2269000 3268755 4099770 4687402 4812114 4310452 3302003 2062992 729677
37391 729677 -712034 -2158708 -3288109 -3802905 -3690116 -3180497 -2518104 -1834406 -1199691
37382 -1199691 -702677 -447941 -503429 -869771 -1486676 -2247959 -3014575 -3650828 -4089907 -4371128
37372 -4371128 -4591490 -4811370 -5008537 -5095674 -4945225 -4425636 -3497897 -2307647 -1129378
37363 -1129378 -185890 448870 783418 850677 770430 775808 1066948 1654569 2400522 3155748
37353 3155748 3781702 4114314 4061750 3744623 3418565 3237822 3197574 3306406 3649180 4193258
37343 4193258 4662846 4751156 4429597 3969504 3705933 3856355 4496598 5558704 6821354
37334 6821354 7999533 8901941 9482447 9753714 9718576 9402360 8898839 8353377 7910565
37325 7910565 7654128 7545396 7426643 7139425 6642937 5979417 5161832 4191659 3178145
37316 3178145 2306243 1626637 987631 276248 -345291 -571120 -313484 157002 438811
37307 438811 306064 -191194 -832799 -1406233 -1855323 -2305089 -2914691 -3693143 -4494723 -5188455
37297 -5188455 -5756759 -6200449 -6429462 -6327686 -5898014 -5270681 -4557043 -3729755 -2662183
37288 -2662183 -1293355 217747 1498775 2182847 2173059 1677928 980215 236829 -458519
37279 -458519 -927323 -972352 -586529 22735 629451 1092101 1246002 873638 -65429 -1244607
37269 -1244607 -2162678 -2542261 -2476022 -2233443 -2052774 -2104925 -2483621 -3133733 -3877406 -4597782
37259 -4597782 -5340779 -6171941 -7007906 -7683013 -8119082 -8303442 -8132483 -7440948 -6240993
37250 -6240993 -4818520 -3507857 -2423086 -1460069 -497730 464179 1303750 1834351 1916693
37241 1916693 1617116 1240152 1108206 1293085 1621757 1925693 2185300 2421164 2566931
37232 2566931 2534624 2356338 2201725 2286950 2790386 3773745 5091018 6406055 7406498
37223 7406498 8044896 8548452 9190044 10053309 10963667 11580926 11597442 10962119 9954178
37214 9954178 8969774 8177894 7407494 6397727 5123898 3845283 2872179 2345419 2234832
37205 2234832 2484046 3106878 4145067 5550450 7107370 8461881 9247444 9243788 8480479
37196 8480479 7206754 5727776 4229767 2747578 1287077 -52481 -1089811 -1669534
37188 -1669534 -1748469 -1420295 -902220 -473851 -357883 -615477 -1145349 -1768076 -2312127 -2676015
37178 -2676015 -2871131 -2993280 -3101622 -3135799 -3007677 -2766309 -2599889 -2655955 -2916185 -3261370
37168 -3261370 -3584974 -3799843 -3800351 -3501548 -2919632 -2189413 -1516910 -1112248 -1092918 -1383724
37158 -1383724 -1742032 -1952842 -2007231 -2064387 -2269557 -2660594 -3217515 -3897973 -4575144 -4994217
37148 -4994217 -4867635 -4055265 -2674138 -1045781 482803 1714284 2640538 3333830 3817877
37139 3817877 4042118 3941143 3484811 2693533 1657551 557724 -361213 -880409 -923686
37130 -923686 -639093 -356569 -374503 -714047 -1110653 -1298636 -1265411 -1158424 -994846 -607596
37120 -607596 76142 813280 1206453 1070299 579304 65219 -274134 -451979 -531006 -458628
37110 -458628 -118710 458368 1019045 1297741 1280837 1180917 1157892 1166651 1102972 976720 843986
37099 843986 647227 265395 -267618 -700552 -772766 -438388 150029 838033 1594860 2447303
37089 2447303 3340462 4114384 4629168 4875202 4919520 4768671 4356103 3673007 2826399 1914997
37079 1914997 917120 -213591 -1379218 -2363967 -3035908 -3449632 -3741651 -4000976 -4265651
37070 -4265651 -4563261 -4884206 -5146661 -5252118 -5181117 -5001934 -4775039 -4464269 -3961961 -3226799
37060 -3226799 -2412950 -1837741 -1768362 -2209579 -2898704 -3503199 -3831468 -3909403 -3910715 -3988123
37050 -3988123 -4101406 -4009597 -3494508 -2598884 -1590818 -703589 14169 612474 1150632
37041 1150632 1755056 2638839 3937231 5564860 7307108 8975683 10377719 11242253 11398393
37032 11398393 11058164 10743979 10819468 11150972 11279094 10844985 9806958 8370922 6861704
37023 6861704 5625993 4883575 4568322 4357849 3943314 3299048 2672079 2298643 2151560
37014 2151560 1995606 1686544 1365976 1326088 1711770 2395327 3108259 3626099 3843804 3779424
37004 3779424 3564019 3379428 3344890 3457408 3632056 3759601 3733506 3496442 3089051 2593078
36994 2593078 2005068 1244043 317006 -628631 -1498495 -2396174 -3433140 -4436502 -5007829
36985 -5007829 -4911991 -4309097 -3572679 -2971377 -2560882 -2276523 -2036956 -1802017 -1609226 -1542917
36975 -1542917 -1616353 -1687904 -1525558 -958977 20098 1257201 2509443 3568664 4362645
36966 4362645 4930722 5302392 5461727 5465057 5513761 5807385 6335681 6896286 7313732 7552004
36956 7552004 7597901 7351634 6734655 5868229 5047655 4518647 4320690 4344765 4478820 4666224
36946 4666224 4868125 5018459 5012430 4728781 4098942 3196086 2245234 1508384 1147751 1183198
36936 1183198 1508207 1883004 1974968 1555830 724588 -128986 -636792 -705950 -481804 -183112
36926 -183112 -38010 -253711 -880994 -1722641 -2503231 -3135480 -3706940 -4198075 -4353017 -3893196
36916 -3893196 -2757232 -1066170 1028099 3323565 5456554 6988704 7692215 7711641 7408141
36907 7408141 7060280 6722249 6335381 5927048 5663176 5695986 5998304 6406792 6825739 7313780
36897 7313780 7935100 8596213 9105755 9366991 9436925 9393032 9193046 8677441 7691565 6233106
36887 6233106 4529031 2948286 1763566 965335 329975 -333541 -1037706 -1692949 -2242236
36878 -2242236 -2669585 -2918654 -2879165 -2491002 -1860488 -1256819 -959678 -1071234 -1466442 -1943135
36868 -1943135 -2425716 -3006577 -3778311 -4628324 -5200571 -5075493 -4043489 -2274400 -254093
36859 -254093 1465193 2514473 2811632 2527491 1986735 1524447 1325041 1353447 1451129 1489032
36849 1489032 1417154 1230580 987206 856378 1030298 1506614 2015589 2256802 2206794 2130363
36839 2130363 2288272 2700311 3205519 3656774 3969414 4035642 3739339 3112081 2381493 1777866
36829 1777866 1347475 1049958 980619 1326384 2060180 2826966 3246603 3261163 3093543 2936186
36819 2936186 2800884 2631068 2413468 2152061 1834193 1458883 1028720 497399 -193675
36810 -193675 -996340 -1747747 -2326228 -2767318 -3197522 -3703694 -4289381 -4897308 -5434306 -5815183
36800 -5815183 -6007442 -5994610 -5701319 -5046166 -4106400 -3140206 -2372286 -1813517 -1358165 -1001826
36790 -1001826 -876142 -1090824 -1610486 -2275539 -2898781 -3368883 -3706779 -3988925 -4169719
36781 -4169719 -4027845 -3356821 -2174982 -683310 938162 2605511 4245557 5758154
36773 5758154 7076805 8175028 8993736 9441487 9489611 9200845 8643691 7832594 6755092
36764 6755092 5396794 3757614 1948675 286621 -831108 -1218054 -1008439 -456297 267237
36755 267237 1028813 1635309 1943772 2029165 2107740 2291071 2509569 2667771 2763883 2835988
36745 2835988 2889851 2920750 2922065 2813087 2427139 1663866 649320 -316158 -994796 -1395021
36735 -1395021 -1745744 -2324668 -3296848 -4646909 -6186517 -7593442 -8480237 -8515028 -7566782
36726 -7566782 -5780480 -3515468 -1197156 801371 2196499 2805809 2606588 1820407 901650
36717 901650 332395 318282 662405 985076 1079417 1004800 841012 473705 -276742 -1368924
36707 -1368924 -2499774 -3353036 -3807325 -3906326 -3738616 -3397682 -2974328 -2503556 -1942321
36698 -1942321 -1247545 -452947 363806 1149080 1854444 2375752 2576267 2385645 1858272
36689 1858272 1148669 448977 -93344 -470721 -842886 -1422324 -2296297 -3349598 -4334787
36680 -4334787 -4999335 -5197133 -4970496 -4554254 -4245633 -4216532 -4441314 -4785127 -5110444 -5291385
36670 -5291385 -5204873 -4794231 -4143191 -3433088 -2803585 -2275495 -1814709 -1430806 -1165098 -978456
36660 -978456 -697934 -131128 744637 1724768 2529540 3012747 3217314 3251188 3149636 2876168
36650 2876168 2443012 2004535 1805396 2011778 2588897 3362622 4201970 5105974 6098370
36641 6098370 7090044 7898760 8378892 8480268 8207907 7599976 6742498 5730269 4604490
36632 4604490 3407713 2315167 1603431 1409206 1575279 1806539 1932093 1941730 1821950
36623 1821950 1487592 903620 188420 -459707 -915710 -1194547 -1399067 -1621136 -1879566
36614 -1879566 -2147957 -2433085 -2771174 -3102556 -3210094 -2895718 -2235143 -1567844 -1189882
36605 -1189882 -1115105 -1172740 -1260500 -1415527 -1666293 -1905226 -1933601 -1599239 -892451 43904
36595 43904 978620 1709244 2170498 2439544 2609100 2634076 2314042 1455675 62837 -1642096
36585 -1642096 -3369216 -4894484 -6062068 -6763564 -7004682 -6951966 -6812869 -6654784 -6393176
36576 -6393176 -5937078 -5266774 -4388664 -3340593 -2281467 -1459205 -1001510 -799565 -667539
36567 -667539 -558618 -555493 -713387 -1004787 -1373188 -1741645 -1997779 -2075984 -2046500 -2022837
36557 -2022837 -1976687 -1744125 -1238423 -569791 78231 619452 1090496 1595177 2273101 3245100
36547 3245100 4509830 5918636 7289964 8505970 9458512 9961235 9795166 8836937 7119759
36538 7119759 4827777 2298840 -20835 -1753469 -2773296 -3185606 -3141654 -2753874 -2199818
36529 -2199818 -1785657 -1780685 -2184327 -2725403 -3115122 -3269735 -3286305 -3268565 -3235061 -3166714
36519 -3166714 -3057830 -2888395 -2606726 -2201513 -1762673 -1394391 -1056153 -555601 256447
36510 256447 1307148 2338716 3097089 3473473 3521667 3407224 3329078 3421864 3696228 4079084
36500 4079084 4504995 4947100 5377829 5757018 6081596 6403678 6748536 7016086 7006610 6582907
36490 6582907 5819230 4977214 4308463 3863249 3502018 3111495 2794040 2791838 3183063 3672985
36480 3672985 3761917 3192495 2243226 1538523 1533290 2182941 3101496 3962651 4670679 5187214
36470 5187214 5350809 4978856 4113932 3080221 2273217 1912642 1968974 2253290 2545736
36461 2545736 2679107 2561005 2159888 1501898 694396 -70820 -578115 -683133 -385660
36452 -385660 142660 602295 719647 439839 -38089 -455521 -700022 -787387 -716766 -465512
36442 -465512 -115166 153138 236781 183803 30689 -331488 -1036682 -2054076 -3208282 -4332922
36432 -4332922 -5301766 -5955738 -6147671 -5900790 -5443158 -5052082 -4908219 -5083711 -5564198
36423 -5564198 -6226210 -6847382 -7196114 -7121531 -6597831 -5753281 -4837298 -4051563 -3385853 -2706927
36413 -2706927 -2022318 -1528809 -1346378 -1350772 -1391865 -1559825 -2056116 -2848501 -3633599 -4142755
36403 -4142755 -4325790 -4224899 -3864512 -3353705 -2922512 -2682508 -2418618 -1779356 -686549
36394 -686549 525748 1369676 1531683 983523 -98889 -1463066 -2875463 -4153724 -5149807
36385 -5149807 -5772492 -6084220 -6330031 -6763679 -7412313 -8063049 -8492618 -8652577 -8613584 -8398972
36375 -8398972 -7927476 -7092901 -5873878 -4406218 -2981710 -1920566 -1353232 -1100080 -801760
36366 -801760 -199476 700304 1708609 2655712 3495355 4242558 4869596 5309083 5546928
36357 5546928 5644024 5620452 5365863 4753626 3853516 2948969 2284950 1824669 1291049 434149
36347 434149 -745905 -1984179 -2918954 -3330136 -3290796 -3084889 -2934574 -2813312 -2548654
36338 -2548654 -2067132 -1476525 -931827 -501697 -178824 42594 126209 -4177 -415678 -1057405
36328 -1057405 -1695962 -2045743 -2017809 -1795928 -1627784 -1584204 -1555655 -1419972 -1144376 -764305
36318 -764305 -343674 52596 406822 757550 1106048 1340872 1337354 1122680 845171 563130
36308 563130 168203 -430677 -1146006 -1826465 -2463917 -3158945 -3888495 -4430888 -4575804 -4345002
36298 -4345002 -3960142 -3641728 -3481640 -3454912 -3472856 -3438055 -3337662 -3324796 -3658001 -4498039
36288 -4498039 -5754948 -7144494 -8374143 -9256918 -9696490 -9663904 -9240394 -8633612 -8070311
36279 -8070311 -7646362 -7302849 -6952447 -6603107 -6349700 -6267204 -6320409 -6352222 -6148288 -5556104
36269 -5556104 -4605992 -3542014 -2712051 -2387336 -2648148 -3401316 -4472823 -5676049 -6814204
36260 -6814204 -7658726 -7976681 -7630211 -6680032 -5390658 -4114571 -3146813 -2653665 -2679233
36251 -2679233 -3157166 -3895392 -4589722 -4927156 -4741919 -4099739 -3226623 -2347070 -1588484
36242 -1588484 -1016816 -698112 -666070 -844608 -1072596 -1244541 -1414322 -1760039 -2475819 -3677014
36232 -3677014 -5310464 -7088532 -8572785 -9439073 -9695729 -9606383 -9403890 -9126530 -8714930
36223 -8714930 -8170156 -7557455 -6895518 -6099197 -5036785 -3647477 -2048843 -557533 443562
36214 443562 736653 410349 -215882 -805540 -1188784 -1429123 -1759841 -2396737 -3324353 -4255774
36204 -4255774 -4847566 -4961115 -4687502 -4141535 -3305985 -2106296 -589500 1018088 2423649
36195 2423649 3425860 3997128 4266183 4439521 4708115 5171205 5798126 6453806 6999608
36186 6999608 7409053 7779258 8201136 8622051 8860208 8747259 8235042 7394388 6380748
36177 6380748 5404704 4640615 4085715 3542315 2812795 1913211 1052032 419893 71416
$$ [...]
##END NTUPLES=NMR SPECTRUM
##END=
