##TITLE=31Pdec_LR-768-C2
 CDCl3, 24 sc
 11.7.2023
##JCAMPDX= 6.0         $$ Bruker NMR JCAMP-DX V2.0
##DATA TYPE= NMR SPECTRUM
##DATA CLASS= NTUPLES
##ORIGIN= UXNMR, Bruker Analytische Messtechnik GmbH
##OWNER= root
$$ XWIN-NMR		Version 3.5
$$ Tue Jul 11 14:26:15 2023 Russian Standard Time (UT+4h)  she@DPX200
##.OBSERVE FREQUENCY= 81.013821
##.OBSERVE NUCLEUS= ^31P
##.ACQUISITION MODE= SIMULTANEOUS
##.ACQUISITION SCHEME= undefined
##.AVERAGES= 24
##.DIGITISER RES= 16
##SPECTROMETER/DATA SYSTEM= spect
##.PULSE SEQUENCE= zgpg30
##.SOLVENT NAME= CDCl3
##.SHIFT REFERENCE= (INTERNAL, CDCl3, 0, 248.564)
##AUDIT TRAIL= $$ (NUMBER, WHEN, WHO, WHERE, WHAT)
$$ ##TITLE= Audit trail, XWIN-NMR		Version 3.5
$$ ##JCAMPDX= 5.01
$$ ##ORIGIN= Bruker BioSpin GmbH
$$ ##OWNER= she
$$ F:/spectra/data/she/nmr/P31/1/pdata/1/auditp.txt
$$ ##AUDIT TRAIL=  $$ (NUMBER, WHEN, WHO, WHERE, WHAT)
(   1,<2023-07-11 14:25:18.14 +0400>,<she>,<DPX200>,
      <created by zg, POWCHK disabled, PULCHK disabled
       configuration hash MD5:
       00 E9 B6 7A A2 85 ED C7 34 08 36 98 17 FE 4E 26
       data hash MD5: 32K
       35 1C 04 B2 CB DE D2 31 ED 75 8C 9B 3F 13 B2 0F>)
(   2,<2023-07-11 14:25:21.45 +0400>,<she>,<DPX200>,
      <Start of raw data processing
       efp BC_mod = 2 LB = 1 FT_mod = 6 PKNL = 1 PHC0 = -10645.28 PHC1 = -4.515289 SI = 64K 
       data hash MD5: 64K
       BC FC CF 01 D5 1E 37 C5 15 85 A0 12 C7 5C 3B DE>)
(   3,<2023-07-11 14:25:39.96 +0400>,<she>,<DPX200>,
      <pk PHC0 = 1.261711 PHC1 = 0 
       data hash MD5: 64K
       8E 6A 1C C8 4A 88 77 84 DD DB 16 F8 BA 08 78 95>)
(   4,<2023-07-11 14:25:45.92 +0400>,<she>,<DPX200>,
      <abs ABSG = 5 
       data hash MD5: 64K
       49 EA D6 E7 B3 24 FE AA A1 09 4F 4B 86 50 68 49>)
$$ ##END=
$$ 
$$ hash MD5
$$ E5 59 2C 87 4D F7 44 1F 50 37 DA FC 53 AC 51 B2
##$RELAX= 
##$RELAX= 
##$RELAX= 
##$RELAX= 
##$RELAX= 
##$RELAX= 
##$RELAX= 
##$RELAX= 
##$RELAX= 
$$ Bruker specific parameters
$$ --------------------------
##$DU= <F:/spectra>
##$EXPNO= 1
##$NAME= <P31>
##$PROCNO= 1
##$TYPE= <nmr>
##$USER= <she>
##$AMP= (0..31)
100 100 100 100 100 100 100 100 100 100 100 100 100 100 100 100 100 100 
100 100 100 100 100 100 100 100 100 100 100 100 100 100 
##$AQSEQ= 0
##$AQ_mod= 1
##$AUNM= <au_zg>
##$AUTOPOS= <>
##$BF1= 81.014009
##$BF2= 200.13
##$BF3= 200.13
##$BF4= 200.13
##$BF5= 200.13
##$BF6= 200.13
##$BF7= 200.13
##$BF8= 200.13
##$BYTORDA= 1
##$CFDGTYP= 0
##$CFRGTYP= 5
##$CHEMSTR= <none>
##$CNST= (0..31)
1 1 145 1 1 1 1 1 1 1 1 1 1 1 1 1 1 1 1 1 1 1 1 1 1 1 1 1 1 1 1 1 
##$CPDPRG= <waltz16>
##$CPDPRG1= <>
##$CPDPRG2= <waltz16>
##$CPDPRG3= <>
##$CPDPRG4= <mlev>
##$CPDPRG5= <mlev>
##$CPDPRG6= <mlev>
##$CPDPRG7= <mlev>
##$CPDPRG8= <mlev>
##$CPDPRGB= <>
##$CPDPRGT= <>
##$D= (0..31)
0 1 0 0 0 0 0 0 0 0 0 0.03 2e-05 3e-06 0 0 0 0 0 0 0 0 0 0 0 0 0 0 0 0 
0 0 
##$DATE= 1689071117
##$DBL= (0..7)
120 120 120 11 120 120 24 19 
##$DBP= (0..7)
150 150 150 150 150 150 150 150 
##$DBP07= 0
##$DBPNAM0= <>
##$DBPNAM1= <>
$$ [...]
##$SUBNAM3= <"">
##$SUBNAM4= <"">
##$SUBNAM5= <"">
##$SUBNAM6= <"">
##$SUBNAM7= <"">
##$SUBNAM8= <"">
##$SUBNAM9= <"">
##$SW= 501.771253377433
##$SWIBOX= (0..15)
0 1 3 0 0 0 0 0 0 0 0 0 0 0 0 0 
##$SW_h= 40650.406504065
##$TD= 32768
##$TD0= 1
##$TE= 0
##$TE2= 300
##$TE3= 300
##$TEG= 300
##$TL= (0..7)
0 120 53 12 22 120 120 120 
##$TP= (0..7)
150 150 150 150 150 150 150 150 
##$TP07= 0
##$TPNAME0= <>
##$TPNAME1= <>
##$TPNAME2= <>
##$TPNAME3= <>
##$TPNAME4= <>
##$TPNAME5= <>
##$TPNAME6= <>
##$TPNAME7= <>
##$TPOAL= (0..7)
0.5 0.5 0.5 0.5 0.5 0.5 0.5 0.5 
##$TPOFFS= (0..7)
0 0 0 0 0 0 0 0 
##$TUNHIN= 0
##$TUNHOUT= 0
##$TUNXOUT= 0
##$USERA1= <user>
##$USERA2= <user>
##$USERA3= <user>
##$USERA4= <user>
##$USERA5= <user>
##$V9= 5
##$VALIST= <valist>
##$VCLIST= <CCCCCCCCCCCCCCC>
##$VD= 0
##$VDLIST= <DDDDDDDDDDDDDDD>
##$VPLIST= <PPPPPPPPPPPPPPP>
##$VTLIST= <TTTTTTTTTTTTTTT>
##$WBST= 1024
##$WBSW= 4
##$XGAIN= (0..3)
0 0 0 0 
##$XL= 0
##$YL= 0
##$YMAX_a= 2469
##$YMIN_a= -2123
##$ZGOPTNS= <>
##$ZL1= 120
##$ZL2= 120
##$ZL3= 120
##$ZL4= 120
##$ABSF1= 248.5645
##$ABSF2= -253.2056
##$ABSG= 5
##$ABSL= 3
##$ALPHA= 0
##$AQORDER= 0
##$ASSFAC= 0
##$ASSFACI= 0
##$ASSFACX= 0
##$ASSWID= 0
##$AUNMP= <proc_1d>
##$AZFE= 0.1
##$AZFW= 0.5
##$BCFW= 0
##$BC_mod= 2
##$BYTORDP= 0
##$COROFFS= 0
##$CY= -3
##$DATMOD= 1
##$DC= 0
##$DFILT= <>
##$DTYPP= 0
##$F1P= 0
##$F2P= 0
##$FCOR= 1
##$FTSIZE= 65536
##$FT_mod= 6
##$GAMMA= 0
##$GB= 0
##$INTBC= 1
##$INTSCL= 6.047779e-11
##$ISEN= 30
##$LB= 1
##$LEV0= 0
##$LPBIN= 0
##$MAXI= 10000
##$MC2= 0
##$MEAN= 0
##$ME_mod= 0
##$MI= 50
##$NCOEF= 0
##$NC_proc= -8
##$NLEV= 6
##$NOISF1= 182.463
##$NOISF2= 159.3651
##$NSP= 0
##$NTH_PI= 0
##$NZP= 0
##$OFFSET= 248.5645
##$PC= 4
##$PHC0= -10644.02
##$PHC1= -4.515289
##$PH_mod= 1
##$PKNL= yes
##$PPARMOD= 0
##$PSCAL= 0
##$PSIGN= 0
##$REVERSE= no
##$SF= 81.0140089999694
##$SI= 65536
##$SIGF1= 159.3651
##$SIGF2= -187.1042
##$SINO= 113.3802
##$SIOLD= 16384
##$SREGLST= <1H.CDCl3>
##$SSB= 0
##$STSI= 65536
##$STSR= 0
##$SW_p= 40650.406504065
##$SYMM= 0
##$S_DEV= 0
##$TDeff= 32768
##$TDoff= 0
##$TI= <>
##$TILT= no
##$TM1= 0
##$TM2= 0
##$TOPLEV= 0
##$USERP1= <user>
##$USERP2= <user>
##$USERP3= <user>
##$USERP4= <user>
##$USERP5= <user>
##$WDW= 1
##$XDIM= 65536
##$YMAX_p= 476260953
##$YMIN_p= -31744809
$$ End of Bruker specific parameters
$$ ---------------------------------
##NTUPLES= NMR SPECTRUM
##VAR_NAME=  FREQUENCY,     SPECTRUM/REAL,   SPECTRUM/IMAG
##SYMBOL=    X,             R,               I
##VAR_TYPE=  INDEPENDENT,   DEPENDENT,       DEPENDENT
##VAR_FORM=  AFFN,          ASDF,            ASDF
##VAR_DIM=   65536,         65536,           65536
##UNITS=     HZ,            ARBITRARY UNITS, ARBITRARY UNITS
##FACTOR=    0.620285442955139, 1,           1
##FIRST=     20137.2065510682, 0,            0
##LAST=      -20513.1999529968, 0,           0
##MIN=       -20513.1999529968, -31744809,   0
##MAX=       20137.2065510682, 476260953,    0
$$ Real data points
##PAGE= N=1
##DATA TABLE= (X++(R..R)), XYDATA
$$ [...]
39643B7220494o35921j799289m706723m469371J65548L349222J463444q09256
39635A9778148J182547L688874J049546m022540m139024J349442N876521N377116
39627C0140630J884381j864384m947492n582084k418506J053555k10713m349059
39619A3706328m204880J179331M242310J064785k016161P88910M393831R00175
39611B0054629o975212r423892m174245J362373K474879K994332O438974Q857586
39603B1609424N187466k058821n684831l177509J126860K415827N01792j640453
39595A8279755j975643j002035k17581r2694l5769k2577r75570k830539l584777
39586G542570j733233J369590L215868L206457K239860N37264j753623k961359
$$ y = [27220494, 26584573, 24785284, 20078561, 15609190, 15774738, 19123960, 20587404, 19778148, 20960695, 24649569, 25699115, 21676575, 17537551, 18886993, 24763514, 30140630, 32025011, 30160627, 25213135, 19631051, 17212545, 18266100, 18055387, 13706328, 9501448, 10680779, 14923089, 15987874, 13971713, 14760623, 19154454, 20054629, 13079417, 3655525, -518720, 843653, 3318532, 6312864, 12751838, 21609424, 26796890, 24738069, 19053238, 15875729, 17002589, 19418416, 19920208, 18279755, 16304112, 15302077, 15084496, 14991802, 14956033, 14933456, 13957886, 11127347, 7542570, 5809337, 7178927, 10394795, 13601252, 15841112, 16378376, 14624753, 11663394]
39578A1663394j744682L13931Q79954O03981J326699J785542m81724l669451l380131
39569G297513N0081J540228l90702j253313J337086L257605Q89247k920221l927523
39560E880001k662153j263607J027441M325226M715956J75473m200652l119626
39552D878059M34247M27555j940432r64080L140952N066644M141092M252709M669846
39543B4106592N90582o354977q121765l104819Q35161k74575k27288M872592P813517
39534B0135020K144143n442974m765125J626138L055670j727105l334663K196368
39526A3887472P260891N242783J5657j533392L93538J023184j007850l198652
39518B2083631l889294l173516q98635K643140N058414L935748L37321j935482
$$ y = [11663394, 9918712, 10232643, 11112597, 11716578, 13043277, 14828819, 14347095, 10677644, 7297513, 7347594, 8887822, 8497120, 7243807, 8580893, 11838498, 12727745, 9807524, 5880001, 3217848, 1954241, 2981682, 7306908, 12022864, 12198337, 7997685, 4878059, 5312306, 5739861, 3799429, 2835349, 5976301, 11042945, 15184037, 19436746, 24106592, 24697174, 18342197, 10220432, 7115613, 7950774, 7676199, 7448911, 12321503, 20135020, 22279163, 16836189, 12071064, 13697202, 16752872, 15025767, 11691104, 13887472, 21148363, 26391146, 26406803, 24873411, 25266949, 26290133, 25282283, 22083631, 18194337, 15020821, 14122186, 16765326, 21823740, 25759488, 26096809, 24161327]
39510B4161327o81453K300255L224717L27597l905344m770938n54573M716679
39502B4818267N379706Q45544l849750m323195j150248K768149O113258Q429831
39494C9031562P996169L557607k671881o489443o185003l621529j088219P45014
39486C1274277J588182O49172j879199m101405m506394l674843k818182j886316
39478A4645292o14279j88565j609400l041455j567810K168294L941964J637698
39470A5371739j765881k621834j381853m65021J78013J946076L836875L835729
39462A8933843K912384L224507L144183n46646n399534m704465J836630N470403
39454B4871305N43289o597800o746648j253205J083180k203164m828151k768968
$$ y = [24161327, 23479874, 25780129, 29004846, 29332443, 25427099, 20656161, 20101588, 24818267, 30197973, 31043517, 27193767, 22870572, 21720324, 24488473, 30601731, 39031562, 47027731, 50585338, 47913457, 41424014, 35239011, 31617482, 30529263, 31274277, 32862459, 33511631, 31632432, 27531027, 23024633, 19349790, 16531608, 14645292, 14031013, 13842448, 12233048, 9191593, 7623783, 9792077, 13734041, 15371739, 13605858, 10984024, 9602171, 9137150, 9315163, 11261239, 15098114, 18933843, 21846227, 25070734, 28214917, 27668271, 22268737, 17564272, 19400902, 24871305, 25414594, 18816794, 12070146, 10816941, 11900121, 9696957, 4868806, 2099838]
39446B099838L73511Q51817O30968K396592M114549K723262m19250j763021p98668
39437A0209598K83184K78810m68021j499293j921205n17604J690245J332705k302598
39428G085821m704910j999517K774495L451872m21169l137053j159800K590570
39420D480309L916778K906627K176760K337887J860674J64074j359640j129213
39412A5354256R68156L514339M702626L953233K463310J528027O78686j258560
39404C1904073l610882m336921l284080k703467l559271l580778p99854K727677
39396A2756497L193564K05946k809505l292304k259168j749718j732772j020253
39388C292287J30404L01747m83667l02335J820761L847736K904785p24425l227127
$$ y = [2099838, 2473349, 3325166, 3956134, 6352726, 10467275, 13190537, 12771287, 11008266, 10209598, 10492782, 10771592, 10303571, 8804278, 6883073, 6365469, 8055714, 9388419, 7085821, 2380911, 381394, 3155889, 6607761, 6186592, 3049539, 1889739, 4480309, 8397087, 11303714, 13480474, 15818361, 17679035, 17843109, 16483469, 15354256, 16322412, 19836751, 24539377, 28492610, 30955920, 32483947, 33162633, 31904073, 28293191, 23956270, 20672190, 17968723, 14409452, 10828674, 10028820, 12756497, 15950061, 16156007, 13346502, 10054198, 7795030, 6045312, 4312540, 3292287, 3422691, 3724438, 3240771, 2938436, 4759197, 8606933, 11511718, 10787293, 7560166]
39379G560166j586324K618760M850948K734120j637686m546026m494829k630464
39371B868665n60552Q91533J202543m5326k284514l628435k295901J332858M271526
39362A752397L221033j806001o217665m635792K955339R796035Q792861K89536
39354A4147743q139885r828572n246069M34931L772254N044436N203852L945692
39346I334382J442634l45061J73067J720765J457474j306560l879844l117524
39338E479333Q58928M296663L443874j275524n194326m355233j95839K232464
39330E290340P96926j278617o61490J097124O15351j350427j204344R28273R18756
39321E151892k151991l617960o51188K644930J603959j435391j121286K215670
$$ y = [7560166, 5973842, 8592602, 13443550, 16177670, 14539984, 9993958, 5499129, 2868665, 2308113, 3199646, 4402189, 4356863, 2072349, -1556086, -3851987, -2519129, 1752397, 4973430, 3167429, -3050236, -7686028, -4730689, 5065346, 13858207, 14147743, 6007858, -3820714, -9066783, -8631852, -4859598, 184838, 5388690, 9334382, 10777016, 10431955, 10605022, 12325787, 13783261, 12476701, 8596857, 5479333, 6338261, 10634924, 14078798, 12803274, 7608948, 3253715, 3057876, 5290340, 6087266, 4808649, 4147159, 5244283, 5859634, 4509207, 3304863, 4233136, 5151892, 2999901, -618059, -1269247, 1375683, 2979642, 1544251, 422965, 2638635]
39313B638635L914564L239275L435839M065850Q78136n395671p833741l969129
39305I73758l21048j740167l243997R90198O474713M846534k222477n006741m65455
39296B85318M151833L179481m42613k188137k373549k282949m79169K903249L617667
39287F371131m96652n088957n267367k225803J1225O62591Q05874l70495l083328
39278h681781l787825L32074N948802P620861N302414K942338J526542r89548
39270A0213877m030151m447364k062317M668O54755J621719K834851J948546r35278
39261E803306k869175l071232l500902l720263p14632M479974N729635N22589
39253B659300n175212m736502L38902L685841K956224P74350r38417k460962k835569
$$ y = [2638635, 6553199, 9792474, 13228313, 17294163, 18172299, 12776628, 4942887, 973758, 652710, -1087457, -4331454, -3341256, 3133457, 7979991, 5757514, 750773, 285318, 4437151, 7616632, 7174019, 4985882, 2612333, 329384, -149785, 2753464, 6371131, 5874479, 785522, -4481845, -6707648, -6696423, -6033832, -5227958, -5598453, -8681781, -12469606, -12137532, -6188730, 1432131, 6734545, 9676883, 11203425, 10213877, 6183726, 1736362, -325955, -321287, 333468, 1955187, 4790038, 6738584, 5803306, 2934131, -137101, -3638003, -7358266, -8072898, -3592924, 2136711, 2659300, -2515912, -7252414, -6913512, -3227671, -271447, 502903, -435514, -2896476, -5732045]
39244e732045R5456N179366P191462K767094m648002p820556l497329M026862
39236b437692P513180M266953j944061o043496o580617m692369r72663L748650
39228g142115O436554M623080N45701j309891n45297o92459k782816l787401k236239
39219f890883m25397N16866K634759N854165N962684J476344k285568o59762K800058
39210H983266J719202k998398m605171q58706L038855K394879r23582k065396
39202D684949L10391L027033K617126n39271k451419m27553K791683K073733k864837
39193I221835o609728n361439j186653K537052N228335O220783L191420k607840
39185A0633765m959951j612341Q74892k406807n182346K10641Q225536O764572
$$ y = [-5732045, -5636589, -457223, 6734239, 9501333, 4853331, -2967225, -6464554, -2437692, 5075488, 9342441, 7398380, 1354884, -5225733, -9918102, -10890765, -7142115, -705561, 3917519, 4463220, 3153329, 2608032, 1915573, -867243, -4654644, -6890883, -7316280, -6799414, -4164655, 1689510, 7652194, 9128538, 6842970, 6183208, 8983266, 10702468, 7704070, 3098899, 2240193, 5279048, 7673927, 6750345, 4684949, 4995340, 8022373, 10639499, 10100228, 7648809, 7221256, 10012939, 12086672, 9221835, 2612107, -2749332, -3935985, -1398933, 3829402, 10050185, 13241605, 10633765, 5673814, 4061473, 4936365, 2529558, -2652788, -2442147, 5783389, 12547961]
39177A2547961l462982q747762k821965M680448M185862n75113j727123k65030
39169C814296j466557l929983k381099K247825M001001J521784p23797l66664
39161B716806o9723j941829l940320l306354n04500J626096J200697p72105j369979
39152f361211Q22460L466461L309627Q99370l89634J18181j95558j839724k030616
39143b200644k87168J02397j516776j007378K962503N060040J674963k444187
39135B343750j719437J237742J002570p93099R24748M497167L965403l7674j088846
39126A0332324J593509J814304k298985m775476k371253j80787k393825m868744
39118c148933k528733J743393K057036p78595j272089J334951K334028j91168
$$ y = [12547961, 9084979, 337217, -2484748, 2195700, 6381562, 5806449, 4079326, 3814296, 2347739, -1582244, -3963343, -1715518, 2285483, 3807267, 3083470, 2716806, 2647083, 705254, -3235066, -6541420, -7045920, -5419824, -4219127, -4991232, -6361211, -5538751, -2072290, 1237337, 2136707, 1747073, 1865254, 1669696, -170028, -2200644, -2487812, -2385415, -3902191, -4909569, -1947066, 3112974, 4787937, 2343750, 624313, 1862055, 2864625, 2071526, 2996274, 7493441, 11458844, 11421170, 10332324, 11925833, 13740137, 11441152, 6665676, 4294423, 4113636, 1719811, -3148933, -5677666, -3934273, -1877237, -2655832, -3927921, -2592970, -258942, -450110]
39110d50110k382670j252970N01065p15577k829624n90415N697722Q468721K805404
39101I251546n111844m963015K965297P067966R46520o853946n631773J384841
39093i44408K906072k405881m985688p68527L156951J775245n2214J966539L179305
39084C827394q06522m664045j711237M256043M777784L55170j273499J637945
39076F399033K863901m94960l456009j955087P70462j82625m138897o481266m710135
39067a1385583m84674K785893L136170J751348J433224K593829K327169q90664
39059A266712l890662l040665L46625K323938K149070J888758J803827M75602
39051C323205j515498k236468j815703j332073J85156L256883M387677M73621
$$ y = [-450110, -2832780, -4085750, -3584685, -4300262, -7129886, -7720301, -2022579, 6446142, 9251546, 4139702, -823313, 2141984, 9209950, 10156470, 3302524, -2329249, -944408, 1961664, -444217, -5429905, -6198432, -3041481, -1266236, -1318450, 648089, 3827394, 3020872, -1643173, -3354410, 901633, 5679417, 6034587, 4761088, 6399033, 9262934, 8767974, 5311965, 3356878, 4127340, 3944715, -194182, -6675448, -11385583, -11870257, -9084364, -5948194, -4196846, -2763622, -169793, 2157376, 1266712, -2623950, -5664615, -5317990, -2994052, -844982, 1043776, 2847603, 3323205, 1807707, -428761, -2244464, -3576537, -3391381, -134498, 4253179, 4726800]
39043D726800m791018n142613j256658Q72453K53998J487061M734266M300465
39035E184754n50332k698699Q60972L195702o11384m160099k59955O219132N551186
39026A2731277j451841n353143k969134l49256j369522k854611k396176k453781
39018f466187l898965k846873K253974O368475N114741J548595R90974K718078
39010E782812K037523j542098l661667k213302j76520k65159p69336Q75640L153659
39001C221552K494436q32984k539404o45859J406939L124l097001l620518j234106
38992d843821Q46381J575359K712620L865274K158892j961868l875934j918141
38984a441238k08667j380358j833668J461803M516648K441546k004920k612497
$$ y = [4726800, -64218, -5206831, -6463489, -5591036, -5337038, -3849977, 884289, 5184754, 4634422, 1935723, 2796695, 5992397, 5381013, 1220914, 960959, 7180091, 12731277, 11279436, 5926293, 2957159, 2607903, 1238381, -1616230, -4012406, -6466187, -10365152, -13212025, -10958051, -4589576, 525165, 2073760, 3064734, 5782812, 7820335, 6278237, 2616570, 403268, 226748, -38411, -807747, 67893, 3221552, 5715988, 4883004, 2343600, 1697741, 3104680, 3107804, 10803, -3609715, -4843821, -3997440, -2422081, 290539, 4155813, 6314705, 4352837, 476903, -1441238, -1649905, -3030263, -4863931, -3402128, 1114520, 3556066, 1551146, -1061351]
38976a061351M10094J830381P77794J228687L741389M249438J720461q4745J10203
38967A2922351j140785m791175o244007k596843K464259M297796L169708J392714
38959I474018q48648l408105m034249j932410j9737l88846r12772N53055K179108
38950F61414J707073M83436M75481P14335K75425J093825L717613M047453p15122
38941A2460933o138744o133132j877529O50345M8651J07914K146284L191439J959773
38932F415934P77186P17917L0405j532622j607966K59737J323175J83270j347746
38923E219290k064860k942531l627575j722088K522234M902370L073578M8102
38915E408520p10132l14437j527108l633586l745841j493226P65989J459254J009328
$$ y = [-1061351, -651257, 1179124, 1956918, 3185605, 6926994, 11176432, 12896893, 12812148, 12922351, 11781566, 6990391, 746384, -1850459, 613800, 4911596, 8081304, 9474018, 8625370, 5217265, 1183016, -749394, -769131, -1157977, -2070749, -1517694, 661414, 2368487, 2851923, 3327404, 4041739, 4317164, 5410989, 9128602, 13176055, 12460933, 6322189, 189057, -1688472, -1038127, -989476, -881562, 1264722, 4456161, 6415934, 7193120, 7911037, 7941442, 6408820, 4800854, 5060591, 6383766, 6567036, 5219290, 3154430, 211899, -3415676, -5137764, -2615530, 2286840, 5360418, 5408520, 4698388, 4383951, 2856843, -776743, -4522584, -6015810, -5249821, -3790567, -2781239]
38906b781239J91972p26502j560875k043087j594205Q13316M903883P231786M057172
38897H492221k860933o647071l556276K182914M401169K897328J749037K155832
38889H814221J587492q59085k873039l100713l000238l456498k829110k8126K922551
38880b822545L314713J250881q94650j489547p77534K51547Q49161O52950j57889
38871A77087p30933o2482K049801M454111N133129K829934j335982m346512m132820
38862D035333j740538M3653k0475o49834l79667K27144m83388k530360l587731
38853e085863j657718J995722L822402K371749M10541J251338L879450L972554
38845A0960175j64865n000195o005445k685910J696147L889291L038629O85199
$$ y = [-2781239, -2589267, -3315769, -4876644, -6919731, -8513936, -7700620, -2796737, 4435049, 8492221, 5631288, -1015783, -4572059, -2389145, 2012024, 4909352, 6658389, 8814221, 10401713, 9542628, 6669589, 3568876, 568638, -2887860, -5716970, -5745096, -2822545, 492168, 1743049, 848399, -641148, -1418682, -1167135, -317974, 334976, 177087, -553846, -616328, 1433473, 5887584, 11020713, 13850647, 12514665, 8168153, 4035333, 2294795, 2338448, 2317973, 1668139, 1288472, 1515616, 1032228, -1498132, -5085863, -6743581, -4747859, -925457, 1446292, 1856833, 3108171, 6987621, 10960175, 10795310, 5795115, -210330, -2896240, -1200093, 2689198, 5727827, 6413026]
38837F413026n58224M66723J719743N22633j832515j123606K861003M336743m40635
38828A2364891o720502p422387l142836l38600r24525l37764L440524N644731
38820B563532K305030l239708n215528l003126j3831K001246L447564L829009
38812B674188K314767K80883j89995M09035K05643m79226J13534J487300J190332
38803H006461j240465l473977l657879k083153K92428K459108K691769J59295
38795C153587k651694k172476J009707K296658l84145l319463k293666J465503
38787b895989L327307J615496r91548j833644j322826j166404j500701r38774
38779e707083J260808L990619N346117M621874K999719K053545J799620Q12371
$$ y = [6413026, 5854802, 6321525, 8041268, 8563901, 6731386, 5607780, 8468783, 12805526, 12364891, 5644389, -1777998, -4920834, -5259434, -6183959, -6521723, -3081199, 2563532, 4868562, 1628854, -3586674, -6589800, -6603631, -4602385, -1154821, 2674188, 4988955, 5269838, 5079843, 5488878, 5694521, 5215295, 5328829, 6816129, 8006461, 6765996, 3292019, -365860, -2449013, -2156585, 302523, 2994292, 3153587, 501893, -1670583, -660876, 1635782, 1251637, -2067826, -4361492, -2895989, 431318, 2046814, 1055266, -778378, -2101204, -3267608, -4768309, -5707083, -4446275, -455656, 4890461, 9512335, 12512054, 14565599, 16365219, 17177590]
38771A7177590j602057l963293l978189j409223R38492l5342l647560n250594
38763a770176j656403L991469N318001R18919l626360l273848K34554K126485
38755B262641J414247K05860j145852l290892l942795m44212M111232L460670
38747B630899k179074n178420j379647L992307M635992J875349M65564M32247
38739E295217j024047k663669p69523L628893N068774J429092l362103n019948
38731B582686l430432q84485P86761O11579j076949k033290m60944J876729J607924
38722d20421j093247k335360q9228K953271L243014Q20151j450858j631336n41729
38713e45743l92441j906961k876887p54104K959380L370912j075673n308240m003603
$$ y = [17177590, 15575533, 11612240, 7634051, 6224828, 7163320, 7127978, 3480418, -1770176, -3426579, 564890, 5882891, 6801810, 3175450, -98398, 136156, 2262641, 3676888, 3882748, 2736896, -553996, -4496791, -4941003, -829771, 2630899, 451825, -4726595, -6106242, -2113935, 2522057, 4397406, 4862970, 5295217, 4271170, 1607501, 837978, 4466871, 9535645, 10964737, 7602634, 2582686, -847746, -1732231, -945470, -333891, -1410840, -3444130, -3905074, -2028345, -420421, -1513668, -3849028, -3938256, -984985, 2258029, 3078180, 1627322, -4014, -545743, -938184, -2845145, -5722032, -6476136, -3516756, -145844, -1221517, -6529757, -10533360]
38704a0533360J198309M602916M445648L402430K660324P70258j998175l321602
38696A226748l068860l122792k853580R6993M126041M405017M93467k365922j261058
38687b323946O61614O24336N78227K100202K503179l689k087591n42304K341180
38678C851208K898020J723936Q97163n48439l570043n087852k338914J571207
38670f03714J874429m13995p07347J353204J927405k52774k429044k687087j700410
38661c639333o4377J957205K694450J093338m19390Q70448L053663K224195j153651
38652F616548l186099k789358j959317p36048K477901N842085N179443P12489
38644A2157644k764091l166279l085213l553030j831296K527820N004005K522062
$$ y = [-10533360, -9335051, -4732135, -286487, 3115943, 5776267, 6546525, 4548350, 1226748, -1842112, -4964904, -7818484, -7721491, -3595450, 809567, 1303034, -1062888, -2323946, -1662332, -1037996, -459769, 1640433, 4143612, 4139923, 2052332, 1510028, 3851208, 6749228, 8473164, 9370327, 8821888, 5251845, 163993, -2174921, -603714, 1270715, 856720, 149373, 1502577, 3429982, 3177208, 748164, -1938923, -3639333, -3703710, -1746505, 947945, 2041283, 1621893, 2492341, 5546004, 7770199, 6616548, 3430449, 641091, -1318226, -2054274, 423627, 6265712, 11445155, 12157644, 9393553, 6227274, 3142061, -410969, -2242265, 285555, 5289560, 7811622]
38636G811622j846837l528713k124954N6490J590349J622333o21368l564436l633684
38627d239198j29279L177956L131798P31133j861426l938191m095217r4793O219082
38618a098135Q282637K897479m583926o921989l617158P42551L206060L262430
38610B169949L87913m003190m836346O62089O975936O126818j282365o600065
38602c99261m716720N04934L284103L014698K219712J824173J322500P76484J49224
38593G979847j303119l114690l128283p74645J150669K09190j728534r00246K633126
38584A023315M485450J772869k801035m350294k011357O48246J283689J774443
38576A825326L855495M636033M03085o251803q031405k648436L602461M301099
$$ y = [7811622, 5964785, 2436072, 311118, 367608, 1957957, 3580290, 2958922, -605514, -4239198, -4368477, -1190521, 1941277, 2672410, 810984, -3127207, -7222424, -7317217, -1098135, 7184502, 10081981, 5498055, -1423934, -5041092, -4298541, -1092481, 2169949, 2557862, -1445328, -6281674, -5619585, 1356351, 7483169, 6200804, -399261, -5115981, -4611047, -1326944, 1687754, 3907466, 5731639, 7054139, 7830623, 7979847, 6676728, 3562038, 433755, -340890, 809779, 1018969, -709565, -1609811, 1023315, 5508765, 7281634, 4480599, 130305, -1881052, -1232806, 50883, 1825326, 5680821, 10316854, 10719939, 4468136, -3563269, -6211705, -2609244, 1691855]
38568A691855Q94007j158798p87665j175057l065849l286171q5362L906558M972114
38559A905632K247020j953498m111677k299639J464575K879907J025008O1133
38551A218461K703749N100612K618804k042964k637956L70497O99173k657355
38543E373021l501811K71425J953631k690795o985957l289470M189966N203165
38535E23175q13844m075573M37209N812897M029717k622001n541483j571476L888775
38526F7396M406959k44335m807800m850788j339801J301458J021200J25992Q18442
38517c501277J579094M87539m81563J398609L822667J998594l300140n835523
38509c832000l145142o1641o09781j786905O59728M661293N049584J545499j546259
$$ y = [1691855, 2585862, 1427064, 639399, -535658, -3601507, -6887678, -6973040, -3066482, 1905632, 4152652, 2199154, -1912523, -4212162, -2747587, 132320, 1157328, 1218461, 3922210, 9022822, 11641626, 9598662, 6960706, 7331203, 8030376, 5373021, 1871210, 2142635, 4096266, 1405471, -5580486, -8869956, -4679990, 523175, -290669, -4366242, -3929033, 1883864, 5913581, 3291580, -2249903, -3821379, 67396, 4474355, 4230020, -577780, -5428568, -6768369, -5466911, -4445711, -4319719, -3501277, -1922183, -1434644, -1916207, -517598, 3305069, 5303663, 2003523, -3832000, -6977142, -7038783, -7648564, -9435469, -8775741, -4114448, 935136, 2480635, 934376]
38500I34376k049050j644435j739788j839622j685153j403300J3381K949291M654374
38491a809926K353151j669309k326982R37232L444697K417264M12443M45874J812070
38482F016514K483255K093793P57771j797117m169437l583330r9065K540784K045281
38473F288449M03530j48645m16487j304875j308927K57061J058618q4174l41927
38464D402623K131169L803163Q67113m114653n714054l690361k216732k434388
38456f966120j448825J424912K844384R32742j723799k092786n91180M02825j71579
38447g389426j101454q8992L607208O766009M618709k255828o466053k831927
38439e141754M061918O099768K730536k07798p25231k242707n150392m726567
$$ y = [934376, -1114674, -2759109, -4498897, -6338519, -8023672, -9426972, -9413591, -6464300, -1809926, 543225, -1126084, -3453066, -2515834, 928863, 3346127, 3758570, 4204444, 6016514, 8499769, 10593562, 11351333, 9554216, 5384779, 1801449, 1702384, 4243168, 6288449, 6691979, 6543334, 6126847, 4821972, 3513045, 3770106, 4828724, 4744550, 4402623, 6533792, 10336955, 11204068, 7089415, 1375361, -2315000, -4531732, -6966120, -8414945, -6990033, -4145649, -3212907, -4936706, -7029492, -7620672, -7217847, -7389426, -8490880, -8579872, -4972664, 1793345, 6412054, 4156226, -2309827, -5141754, -1079836, 5019932, 7750468, 7542670, 6817439, 4574732, -575660, -5302227]
38431e302227N59858N405650N137432J402936k037626l990821l933753q17696
38423c576247L409098M143996Q40923j620366q78594n92777k739536k982469J380721
38414b615251N126379L081566j017196r52161J253430m81410m565981l695966
38406c866590K414412N771099K815117l33403J531922M327337J757217m459772
38398I957339p061270l365897K014342L943925K515320J276908J805960J735892
38390A2822519j440473n625594n535458Q9756N317755L950429k120237n273676
38382B185021k200067K588554L762358J638281n7663K51988J042654N26545j528532
38373H209139l899652m692319k918284k323J267879j73576k571421l544946k266138
$$ y = [-5302227, -4742369, 663281, 5800713, 7203649, 5166023, 1175202, -2758551, -3576247, -167149, 3976847, 4817770, 3197404, 2318810, 1726033, -1013503, -3995972, -2615251, 2511128, 5592694, 4575498, 3623337, 4876767, 4395357, -170624, -3866590, -1452178, 4318921, 7134038, 6800635, 8332557, 12659894, 14417111, 9957339, 2896069, -469828, 1544514, 5488439, 8003759, 9280667, 11086627, 12822519, 11382046, 5756452, 220994, 310750, 5628505, 9578934, 7458697, 2185021, -15046, 2573508, 6335866, 7974147, 7916484, 8168472, 9211126, 9737671, 8209139, 4309487, -382832, -3301116, -3303439, -2035560, -2209136, -4780557, -8325503, -10591641]
38364a0591641N80738L529760M774076L452998J060487K37902J574455K792769
38356G411544J730302r09018k490177j503903P99933J581225o79880m096698m827436
38347b984108j431827K940073L937108J016452k354738l058905j255354Q69566
38339b321733J536523L16852j827406k902830j380315K060495M820750M698450
38331E000786J770960j686225k949760j315409Q19615N12879j637894j871355
38323a356403J167078L694654K011359j724917k433155M53208K530502J173233
38315E515559j385860k372717j887342o68015J655635L930765K842392j893878
38307E736539m866411j745036L458330L092920k908720o379350k759884K297224
$$ y = [-10591641, -10010903, -6481143, -1707067, 1745931, 2806418, 3044320, 4618775, 7411544, 9141846, 8232828, 5742651, 4238748, 5038681, 6619906, 5940026, 1843328, -2984108, -4415935, -1475862, 2461246, 3477698, 1122960, -1935945, -3191299, -2321733, -785210, -468358, -2295764, -5198594, -6578909, -4518414, 302336, 5000786, 6771746, 5085521, 2135761, 820352, 1639967, 2152846, 514952, -1356403, -189325, 3505329, 5516688, 3791771, 1358616, 1811824, 4342326, 5515559, 4129699, 1756982, -130360, -798375, 857260, 4788025, 7630417, 5736539, 870128, -874908, 2583422, 5676342, 2767622, -3611728, -6371612, -4074388]
38299d074388J827162j844158j362249L481037N206977N68919m249361l205802
38291c651863J064970K902421K658450L860392N006897J816937l788348m931183
38283D938673o01082K334314k7962k971860j798924N19621o53255l303720k533201
38274d097396R09846K052258l12066k574416k152796K86391L392405N562343M000970
38265G067539j964545p367014o259511P6879M153564K043083k168248k808196
38257g226449L91202L550976L917353J727731j343856l568465l667257j368463
38249g587228K147778M523032L682755J95922k262947q46834K231995K297791
38241D382264q01410k338914m47236P26095j751018m224773k420134J619652L443913
$$ y = [-4074388, -2247226, -4091384, -5453633, -1972596, 3234381, 3803300, -446061, -3651863, -2586893, 315528, 2973978, 6834370, 11841267, 13658204, 9869856, 4938673, 4337591, 6671905, 6643943, 3672083, 1873159, 2392780, 1739525, -1564195, -4097396, -3187550, -1135292, -1447358, -4021774, -6174570, -5888179, -2495774, 3066569, 7067539, 5102994, -2264020, -8523531, -8446652, -4293088, -2250005, -4418253, -7226449, -6835247, -3284271, 633082, 2360813, 1016957, -2551508, -6218765, -7587228, -5439450, -916418, 2766337, 2962259, 699312, -147522, 2084473, 4382264, 3580854, 1241940, 794704, 1520799, -230219, -4454992, -6875126, -5255474, -1811561]
38232a811561L154494L021914J799034k210957n276072k456021L933602O768174
38224F922607L873690q98470m766401p328045o347515j93371O040068N146396
38216B448959j033674l335246Q78233M239755J772902j990059j705635R50478
38208B225713K352554K723108K468487n83996n536674o335612n89353N159425
38200A883652M359730m99800l171155k924864k561220j629775J702624N075914
38192B235106M504533N97610k764674l883293l155078l93771L295658M027947
38184D464038L09668l269640k339721M84246L83068j538697j062609J161947J306802
38175a00898j27395L06211J564358l63802m041993l580459J229753L551956L59073
$$ y = [-1811561, 1342933, 4364847, 6163881, 3952924, -1323148, -3779169, 154433, 6922607, 10796297, 9897827, 5131426, -2196619, -8544134, -8737505, -2697437, 2448959, 1415285, -1919961, -1041728, 3198027, 4970929, 2980870, 1275235, 2225713, 4578267, 7301375, 9769862, 9185866, 3649192, -2686420, -3275773, 1883652, 6243382, 5743582, 2572427, -352437, -2913657, -4543432, -2840808, 2235106, 6739639, 7337249, 4572575, 689282, -2465796, -2859567, 436091, 4464038, 4773706, 1504066, -835655, -351409, 31659, -1507038, -2569647, -1407700, -100898, -228293, 77918, 1642276, 1278474, -2763519, -6343978, -5114225, -1562269, -1203196]
38166a203196k613758k52230L851967L481664n26396k088907R59084M527295M665396
38157A0800919K346174Q58192Q25438k22439l586943o501480n207823m13650K970570
38148A868958K313020M80432P56598J821554R65673o99485o39509j96100k155982
38139D515159m449217k475095K401489L414868j003417l883266k74854M902477
38131C148144M550731J20139j719923p1837j35492l346441m747156j886457N17010
38122c571282j373705l428345k14339N086573M629823j587510m948176j088483
38114f495444M039760M339247K602723L550994L923254j982925j0278544j0826479
38106a1127414k449435M593024L397799q84812q68055K290896L336277J983545
$$ y = [-1203196, -3816954, -4069184, -217217, 3264447, 2738051, 649144, 1608228, 6135523, 10800919, 13147093, 14005285, 14830723, 14608284, 11021341, 4519861, -687962, -1101612, 1868958, 4181978, 4662410, 5419008, 7240562, 8206235, 7506750, 6867241, 6671141, 4515159, 65942, -2409153, -7664, 3407204, 2403787, -1479479, -1754333, 3148144, 7698875, 7819014, 6099091, 6027254, 5891762, 2545321, -2201835, -4088292, -3571282, -4944987, -8373332, -8587671, -3501098, 1128725, -458785, -5406961, -6495444, -2455684, 1883563, 4486286, 8037280, 11960534, 9977609, -300935, -11127414, -13576849, -8983825, -5586026, -6470838, -7338893, -5047997, -1711720, 271825]
38098B71825J221113R16456n97247j682249n2169K176982J607145m96237q09997
38089B555622k45386j670915l227337o86785M221492M884772l5954m072541k481368
38080g58400J443381K398723O89096K16499J931963K873332N19131m144357p454407
38071b285039o360203j733963J986148J999762Q98509K550285N500212M747619
38063G303330k2502l069467j024254K112395J365792j785866k457979j95640R66439
38054C192248n99186j733861J28825K805482K676784M0337j419610R2158K128877
38045G312054J558782j289020l449993l302012j955870r79361n72392k82737Q2327
38036b878222P50354J789316K296783J376439J85773R49476L312514L991500J194278
$$ y = [271825, 1492938, 2409394, 1812147, 129898, 77729, 2254711, 3861856, 3365619, 2555622, 2310236, 639321, -2588016, -3274801, 946691, 5831463, 5795509, 1722968, -758400, 684981, 3083704, 3772800, 3989299, 5921262, 8794594, 9313725, 5169368, -2285039, -8645242, -10379205, -8393057, -6393295, -5494786, -2944501, 2555711, 7303330, 7280828, 4211361, 3187107, 5299502, 6665294, 4879428, 2421449, 2225809, 3192248, 2593062, 859201, 988026, 3793508, 6470292, 6510629, 5091019, 5183177, 7312054, 8870836, 7581816, 4131823, 829811, -1126059, -2105420, -2677812, -2960549, -2878222, -2127868, -338552, 1958231, 3334670, 3520443, 4469919, 7782433, 11773933, 12968211]
38027A2968211k791283m716236l908401j396013J887732M107010K459174k989064
38019E621130p302327n654604O40292N587089N196199O96472l840565n024731
38011d081045k317540J410985K402712L93728j064443J57835J698249Q46967r37236
38002a489788n51380J777742L072551J690763j594612m896407n577126j844936
37994i413193L647643M943524N62056l352428j519700K592212K503056j018868
37986a055698j872584J276536L736668K929133J147198K2279j487193k827429
37978A868910j559188J324293J373514k151250m140886r95072M163180O109587
37970E993088L880144K36472k307960k820279j569919l6510K04822o87615j414580
$$ y = [12968211, 10176928, 5460692, 1552291, 156278, 2044010, 6151020, 8610194, 5621130, -1681197, -7335801, -6695509, -1108420, 4087779, 4784251, 943686, -4081045, -6398585, -4987600, -2584888, -2191160, -3255603, -3097768, -1399519, -552552, -1489788, -2041168, -263426, 2809125, 4499888, 2905276, -1991131, -7568257, -9413193, -5765550, -822026, -259970, -3612398, -5132098, -2539886, -36830, -1055698, -2928282, -1651746, 2084922, 5014055, 6161253, 6183532, 4696339, 1868910, 309722, 1634015, 3007529, 856279, -3284607, -4279679, -116499, 5993088, 9873232, 10109704, 7801744, 4981465, 3411546, 3375036, 3579858, 2892243, 1477663]
37961A477663j487846q09746J333053M171665M151744m88562n444931n176944
37953b273904p23086K296108K209635J911862J768911j011181n223983n121813
37945f167451O73321N964104N542803J576600j352356k427130k770094k194146
37937a154349r90041q30001j191549P90505M387305M250062j299124o002197m103021
37928f142410J263288L113408O32858j231408j2272J733209J401807l92721j686572
37919a320813j541866m50792J56009o70599j788643j159026R83005K324935K174291
37910a293499K089271K362391J421164m21635o46328P36151M90733j977090k761427
37901b69o9493K041545R2447k923769k354968Q55594K335351J173075Q4472K99193
$$ y = [1477663, -10183, -819929, 513124, 4684789, 8836533, 8347971, 2903040, -2273904, -2996990, -700882, 1508753, 3420615, 5189526, 4178345, -1045638, -6167451, -5494130, 469974, 6012777, 7589377, 6237021, 3809891, 1039797, -1154349, -2144390, -2974391, -4165940, -3375435, 1011870, 5261932, 3962808, -2039389, -6142410, -4879122, -1765714, -1132856, -2364264, -2376536, -643327, 758480, 365759, -1320813, -2862679, -3313471, -3157462, -3828061, -5616704, -6775730, -5792725, -3467790, -1293499, 795772, 3158163, 4579327, 4157692, 3511364, 4247515, 4738248, 2761158, -269, -69762, 1971783, 2064230, -859539, -3214507, -2358913, -23562, 1149513, 1233985, 1533178]
37891A533178M01884n07430j638365j969625r37618J239051K666319J180942k156275
37882a87939l596920k010172m00417n64595j64114K464655M576161L323470L44007
37873C784136j380258k118669l316370l764118j552840K246091M914530N166776
37865C979278K838878j620082n343486m502357j00154J887548q21439k782442
37857f464256N10337M851704L760658j229988l132369o4742K955797J979277j221168
37848A945250k556835m04177K887114K882636j807606n892499k987143M327500
37840a605760O257007j7821n472308k974708K235682K474978J02364J122475L074639
37831E196548J21275m610592l418353K172924L643336k4191j569188J277204L095491
$$ y = [1533178, 1935062, 1427632, -210733, -2180358, -3117976, -1878925, 787394, 1968336, -187939, -3784859, -5795031, -6195448, -6760043, -6924157, -4459502, 116659, 3440129, 3784136, 2403878, 285209, -3031161, -6795279, -8348119, -6102028, -1187498, 3979278, 6818156, 5198074, -145412, -4647769, -4747923, -2860375, -3681814, -6464256, -5953919, -1102215, 2658443, 1428455, -1703914, -1768656, 1187141, 3166418, 1945250, -611585, -1015762, 1871352, 4753988, 2946382, -2946117, -5933260, -1605760, 4651247, 4633426, -838882, -3813590, -1577908, 897070, 999434, 2121909, 5196548, 5317823, 707231, -2711122, -538198, 3105138, 3080947, 1511759, 2788963, 5884454]
37822E884454J921694J986561L783478K104068l621131p050593n651362l998682
37814d641513l764998o91524N002154N916068J59725l603762r9475L376885n03729
37805A149831o202776m423307K556135M893689M74363l505007k326842J228405
37797f155509L131931K693044P72668j625626k853292k024377l29825J133180
37789e257806K865100M457419L724965N52678k004820k609623l202809l582913
37781e057809m18869N030565N298173j888217p604797m225128K502074K548158
37773c815850k668836l922900J58179K361387L95826j90509K657217L779924P95075
37764d50487j451389K96145K455552J817775Q86456K104564L025371J257989j221888
$$ y = [5884454, 7806148, 9792709, 13576187, 15680255, 12059124, 5008531, -642831, -4641513, -8406511, -9098035, -4095881, 1820187, 1979912, -1623850, -1723325, 1653560, 1149831, -5052945, -9476252, -6920117, -2026428, -1552065, -5057072, -7383914, -6155509, -3023578, -330534, 442134, -1183492, -4036784, -6061161, -6390986, -5257806, -2392706, 2064713, 5789678, 6342356, 4337536, 1727913, -1474896, -5057809, -5476678, -446113, 4852060, 2963843, -4640954, -8866082, -6364008, -3815850, -6484686, -10407586, -10249407, -7888020, -7492194, -7682703, -5025486, -1245562, -450487, -1901876, -1605731, 849821, 2667596, 3554052, 5658616, 8683987, 9941976, 8720088]
37755H720088k360525l402622m572517k909855J679826L731676K32484l706112
37747b587557k357932J925188L176488J096095k87826k75436j351609l158834
37739c821423k798369l72330J197374J373291K077301L076397K178529k43367
37731B667403j637537j936891l067357m022936j688335L000699N072379K840052
37723A227477J90413J27900R87690Q46601O68255P40665r93500m114341m179759
37714d498599L24086M172237K921318k04158k45742P73351k129868o852118o065395
37705a1804888J204797P333809O865216L039919J093793P49167r07794l363307
37697D210712l873381k250085n40771O35311K055563L068049J964423q34823k553711
$$ y = [8720088, 6359563, 2956941, -1615576, -4525431, -2845605, 886071, 1118555, -2587557, -4945489, -3020301, 156187, 1252282, 964456, 689020, -662589, -3821423, -6619792, -6992122, -5794748, -4421457, -2344156, 732241, 2910770, 2667403, 1029866, -907025, -3974382, -7997318, -9685653, -6684954, -1612575, 1227477, 1417890, 1545790, 2533480, 3380081, 4048336, 4789001, 3795501, -318840, -4498599, -4174513, -2276, 2919042, 2714884, 2469142, 3242493, 1112625, -5739493, -11804888, -10600091, -3266282, 3598934, 6638853, 7732646, 8481813, 7574019, 4210712, 337331, -1912754, -2453525, -1818214, 237349, 3305398, 5269821, 4434998, 1881287]
37688A881287j667982L7634j6921j690123k371426o32693J640825J715557j99948
37679a303790j400963p84788o1401j23646Q16418L411124M416329J175430l227158
37670B917555l510727J88738K712206J585928k96947k81158L25511k94426j186722
37661B159958r46717l92722q37175j785102j874684n04470K000751M009616K816181
37652D645636j880054n434264l234312K130965L659029J63302k132434M37419
37644a644713L785231L529019J332341r3431k253776n959726o562594o22092O544581
37635a945160O959834J286800k671424j406508R36971M74504j215933j042775
37627A376309R19773K340559J624681p40242k285917o57879K904294L934366N31130
$$ y = [1881287, 213305, 250939, 234018, -1456105, -3827531, -4460224, -2819399, -1103842, -1303790, -2704753, -3489541, -3550942, -3674588, -2858170, 552954, 4969283, 6144713, 2917555, -593172, -404434, 2307772, 3893700, 3596753, 3315595, 3641106, 3346680, 2159958, 1213241, 820519, -16656, -1801758, -3676442, -4180912, -2180161, 1829455, 4645636, 2765582, -2668682, -5902994, -3772029, -113000, 50302, -2082132, -1644713, 2140518, 5669537, 7001878, 6908447, 4654671, -1305055, -7867649, -8489741, -1945160, 5014674, 6301474, 3630050, 2223542, 3160513, 3635017, 2419084, 1376309, 2296082, 4636641, 6261322, 5521080, 3235163, 2577284, 5481578, 9415944, 9947074]
37618I947074l638854m586991l245764k251526r45872J910510L535684Q49683
37610A573944l227564l090069J021919L515490J987029k42819j99784J263258
37602B601404K496514L011367J974586j138646m163507m341666k585199j798529
37594c943676j739057j25629J883931P66486k692710l349891O43970N140092O262064
37585B845580M756389K605352j71484l175931l875151q66906L289891M482174
37577I889914J299628l553431n343146j806510L377329L903459p54892l950068
37569C062283j655963J332058j62527k580579l88268K876760J25825n788708n435597
37560h614716J220296M211035K22757k318708J606947N067091J637093l763691
$$ y = [9947074, 6308220, 1721229, -1524535, -3776061, -4721933, -2811423, 724261, 1573944, -1653620, -4743689, -3721770, -206280, 1780749, 1537930, 1338146, 2601404, 5097918, 8109285, 10083871, 8945225, 4781718, 440052, -2145147, -3943676, -5682733, -5808362, -3924431, -3157945, -5850655, -9200546, -8556576, -3416484, 2845580, 7601969, 10207321, 10035837, 6859906, 2984755, 2117849, 5407740, 9889914, 11189542, 7636111, 2292965, 486455, 3863784, 7767243, 7012351, 3062283, 1406320, 2738378, 2575851, -4728, -392996, 2483764, 2609589, -3179119, -8614716, -7394420, -3183385, -2960628, -5279336, -3672389, 1394702, 3031795, -731896]
37552g31896l849653n22380M63021k46661J161376L165142J636359k187497l400274
37543d512463q97375K275370L826663L146683J30387l030780k262131K353460
37535A029814M842026J678363k532515k361297N7881m11584l019658l199246o28428
37526d544644J094199R41108R50013J635545J831257J794427K257454K013123
37518G972482K02580j161234n88575k36228j764279k407724K87972L267442K687995
37509H260431N12630O09725J413049r09585m417616l845639J25714J415744j568582
37500A595871l470045o33749L598918M203458P92627l149339m359422k139803
37492c561484J187983K240776Q01726N53255L137415M201630l98419o766288o979197
$$ y = [-731896, -4581549, -5103929, -4640908, -4887569, -3726193, -561051, 1075308, -1112189, -4512463, -5409838, -3134468, 692195, 3838878, 3969265, 938485, -1323646, 1029814, 5871840, 7550203, 5017688, 2656391, 2714272, 2302688, -716970, -3916216, -4544644, -3450445, -2509337, -1559324, 76221, 1907478, 3701905, 5959359, 7972482, 8175062, 7013828, 6425253, 6189025, 4424746, 2017022, 2304994, 5572436, 8260431, 8773061, 9382786, 10795835, 9886250, 5468634, 1622995, 1748709, 3164453, 1595871, -1874174, -2507923, 1090995, 5294453, 6087080, 2937741, -1421681, -3561484, -2373501, -132725, 669001, 1222256, 4359671, 8561301, 8162882, 1396594, -5582603]
37483e582603k49028N542894M234393j324917l915370o56616M557747N757036
37475H363536J310176m016740m410211m09488J978836J82385j584671l1791J738556
37466C120588N68073n17815J785452L858691R95566l541881l362824R7950K51015
37457C254815k766641k304907K689469N087695J028530m136348m368098r18977
37449b434462J457401J202530j08385p81032P6128J793780J833923p79404k679093
37440d18614p71335K121161J534578o65134N82864L814976K666246k790222n103479
37431I71041j383214K385666J651469j99742P10387K203322J267689n35279j192225
37422E879114k054136l569238k867777M39189J833969m75568j348610K958849
$$ y = [-5582603, -5831631, -288737, 3945656, 2620739, -1294631, -1951247, 2606500, 8363536, 9673712, 5656972, 1246761, 837273, 2816109, 2998494, 1413823, 1382032, 3120588, 3688661, 3170846, 4956298, 8814989, 9810555, 6268674, 2905850, 3003800, 3254815, 488174, -1816733, 872736, 5960431, 6988961, 2852613, -1515485, -2434462, -977061, 225469, 117084, -663948, -587820, 1205960, 3039883, 2260479, -418614, -1189949, 931212, 2465790, 1800656, 2383520, 6198496, 8864742, 6074520, 971041, -412173, 1973493, 3624962, 3425220, 4135607, 6338929, 7606618, 7071339, 5879114, 3824978, 255740, -2612037, -2172848, -338879, -814447, -2163057, 795792]
37414G95792P778044O890907J680701k241875l405545l755969l234240r52453
37406C555362J024323M97841o30596K78240J607310N76097j357267j085531O34694
37397E100473J108997O72937Q00192j51701l792136o522246l590739K912578O033251
37388B571606L421352n97880k148893j711178p34663O11660J581873J030166P6653
37379D100696P71383J939580N37322k579822k919731N06302K872656M63216l854381
37370A837221m721059j214219K849625L813474J378355j823449k446562N21817
37362A95203L949808L416070j029733l953510j245977L982204N014058M13486
37354A0741609l930531k604868K314322M517377K028604j032722j205791k34755
$$ y = [795792, 8573836, 15464743, 17145444, 14903569, 11498024, 7742055, 4507815, 3555362, 4579685, 5077526, 4446930, 4725170, 6332480, 6908577, 5551310, 4465779, 5100473, 6209470, 6882407, 7682599, 7530898, 3738762, -2783484, -6374223, -3461645, 2571606, 5992958, 5395078, 3246185, 1535007, 800344, 1412004, 2993877, 4024043, 4100696, 4872079, 6811659, 7348981, 4769159, 1849428, 2355730, 5228386, 5691602, 1837221, -2883838, -4098057, -1248432, 2565042, 3943397, 2119948, -326614, 195203, 4145011, 7561081, 6531348, 2577838, 1331861, 5314065, 10328123, 10741609, 6811078, 4206210, 6520532, 11037909, 13066513, 12033791, 10828000, 10593245]
37346A0593245j005596k409671j730019Q4162j92416k307669k601222j9960K130732
37337B541586J433574l77787p85538J61946J305099K123520J660241j176816m729292
37328B156533n156934j593598K271890L331578K519723J562412Q5335j793618
37320C383321j850906M06415J846252O68427l41381J135316K400057L87544k521689
37311E513356k150548O50376J833215P89071J04391J81622p85340k267340j698331
37302B170472Q38969K399842J620627j26696j610270k460406j801761M19345J697528
37293C147650Q3593k114460j514106P73156J017979q26284j415397K1918Q03136
37284b2815k27884j271403j125447j92334J564447L624550L064721j419700n000613
$$ y = [10593245, 9587649, 7177978, 5447959, 5532121, 5339705, 3032036, 430814, 410854, 2541586, 3975160, 3597373, 2811835, 2973781, 4278880, 6402400, 8062641, 6885825, 2156533, -3000401, -4593999, -2322109, 1009469, 3529192, 5091604, 5176939, 3383321, 1532415, 1938830, 3785082, 4453509, 4112128, 5247444, 7647501, 8035045, 5513356, 3362808, 4013184, 5846399, 6635470, 6739861, 6921483, 6136143, 3868803, 2170472, 3009441, 5409283, 7029910, 6903214, 5292944, 2832538, 1030777, 1450122, 3147650, 3231243, 1116783, -397323, 375833, 1393812, 567528, -847869, -825951, -22815, -250699, -1522102, -2647549, -2839883, -1275436, 2349114, 5413835, 3994135, -1006478]
37275a006478k155333M286016O244366K205742j532118j780275k175820m242250
37267a56150l799521K3912J040046l245707n224664J269503R708686R638689J898997
37258A1153791l807944l424342j587912j639374j466849J26426N78692j088643
37250a156155j991288l43201J881940K576563J804577j10544k654276l097307
37242c089691P17090N014809L099588m573176q935130m065614M313750O306700
37234a211674N31185n222746m374018J592884O447852O276994K510368n55447
37226E995398n00627J003149R96684o07379j491651j103507j469945l191087l642332
37217d011297r00535K863822L961750J593078j947702l993467l059654O04653
$$ y = [-1006478, -3161811, 1124205, 7368571, 9574313, 8042195, 6261920, 4086100, -156150, -3955671, -3931759, -2891713, -6137420, -11362084, -10092581, -383895, 9254794, 11153791, 7345847, 3921505, 2333593, 694219, -772630, -646204, -67512, -1156155, -3147443, -3490644, -1608704, 967859, 2772436, 2661892, 7616, -3089691, -2372601, 2642208, 5741796, 1168620, -7766510, -11832124, -7518374, -1211674, -680489, -5903235, -10277253, -8684369, -2236517, 4040477, 6550845, 5995398, 5494771, 6497920, 7494604, 6887225, 5395574, 4292067, 2822122, -368965, -4011297, -4911832, -2048010, 1913740, 3506818, 1559116, -2434351, -5494005, -4889352]
37209d889352M426857N044253K036618j258709j928333p06034L15775Q82317J403467
37200E326859P87945j749528m196646l905034j321991R42791J879152K399799
37192A63347K704981J976985M01939p36080p88296N3357J517315K628254J697322
37183I619124j023338k363695n64581J209092q42784m838429n513074k229130
37175f546815J10340j171222k440424M96403N922497Q212083M783479r74873l537644
37166D853824j428351Q63193j437408n914307m988287K595828P477625K135415
37158D157532o829229o908924K157938Q126586M456425j371799q84750L418476
37150F322255M600462K228654J66390j013734k731713l581251j961298k96986
$$ y = [-4889352, -462495, 4581758, 6618376, 5359667, 3431334, 2725300, 3041075, 3923392, 5326859, 6114804, 4365276, 168630, -3736404, -5058395, -4115604, -2236452, 163347, 2868328, 4845313, 5247252, 4511172, 3722876, 3776233, 5293548, 7921802, 9619124, 8595786, 6232091, 5667510, 6876602, 6033818, 1195389, -4317685, -6546815, -6436475, -7607697, -10048121, -9551718, -3629221, 4582862, 9366341, 8391468, 4853824, 3425473, 4288666, 2851258, -3063049, -8051336, -5455508, 2022117, 4157532, -2671697, -9580621, -7422683, 703903, 5160328, 3788529, 2903779, 6322255, 10922717, 13151371, 13317761, 12304027, 9572314, 5991063, 4029765, 3732779]
37142C732779j169343k345851q69573J130533J65926k099287j755075N36662J352748
37133a320481Q35806J409725K148558L76609k527514k748099n38021L46659r38071
37124b954829j603858m92866O68572J008575J346250J660243J283675Q88055J219442
37115C023259J232072K40109k43187M83061M89460p62476n52031J727379K193049
37106G830695p27947k780105j488109n89187j817172m27369M501496M784989k984970
37097F302321q383387l261396L484685J183869l079450K422079J0883347P711506
37089A7263574k681470l882981L625494N253043N65804K027730P788700N561489
37081C5521383K356819J5249662L1739132K3487334P806430M0092609J17313616
$$ y = [3732779, 2563436, 217585, -651988, 478545, 644471, -1454816, -3209891, -2673229, -1320481, -484675, 925050, 3073608, 3450217, 922703, -1825396, -2363417, -2016758, -2954829, -4558687, -5051553, -4382981, -3374406, -2028156, -367913, 915762, 1803817, 3023259, 4255331, 4495440, 4252253, 4735314, 5224774, 4462298, 3910267, 5637646, 7830695, 7102748, 4322643, 2834534, 2245347, 428175, 806, 4502302, 9287291, 6302321, -2081066, -5342462, -1857777, -673908, -3753358, -1331279, 9552068, 17263574, 14582104, 10699123, 14324617, 19577660, 20143464, 22171194, 29959894, 35521383, 37878202, 53127864, 84866996, 108354330, 116160760, 156253369, 273566985]
37074B73566985J45661420N7032548q2339966j44295975r8317356l1118850j4411249
37067A05777557k6358956j9693485J59731K877365q193544r680022k642485l739425
37059C8506736r721371n679598L398856J036286q884270q107829K745917M796728
37051A8091455n877353j1538759k919445O593628M052265m053874n145663N93079
37043b04667M469302L459146J376123J036360J857897K570763K404364J332957
37035A8302245O68575J433547K108284O16413j974366k685484q65149J592803
37027A9196868L167515L233377J340643j384921k283315j146871j179757l247398
37019A7696141l356437K96945K716864R8860k442538J388882P403543O110817
$$ y = [273566985, 419228405, 476260953, 393920987, 249625012, 151307656, 120188806, 105777557, 79418601, 59725116, 59884847, 62762212, 54568668, 44888646, 42246161, 38506736, 28785365, 23105767, 26504623, 27540909, 18656639, 10548810, 13294727, 18091455, 12214102, 675343, -2244102, 4349526, 8401791, 4347917, -797746, -204667, 4264635, 7723781, 9099904, 10136264, 11994161, 14564924, 16969288, 18302245, 18970820, 20404367, 22512651, 23129064, 21154698, 18469214, 17604065, 19196868, 22364383, 25597760, 26938403, 25553482, 23270167, 22123296, 20943539, 17696141, 14339704, 14636649, 17353513, 17452373, 15009835, 16398717, 23802260, 29913077]
37011B9913077k121872o817624l034702J946412M58928m905404o988484m514328
37003C936003j595599n12113r6310M47780L75608l62541p33158n98549r79034
36994a17913j921348j719470O72396L288544K941879k66931k238553l94333K030287
36985B274558M61900l492689l674905J262938N408247M272144O98029r10931j242311
36976E056980k637697l370361q90885K205248J421333k041023k702997P00673
36968b258729L484136K145163j341414l335332k964153j518918j56249N46451
36960e399045M13459j41245m66845r6433J383159L624756M525256K305365q97251
36951E251176q31347K341898L462398L16615k637821j749919k74835k137904m237397
$$ y = [29913077, 27791205, 20973581, 17938879, 19885291, 20344219, 15438815, 8450331, 3936003, 2340404, 1828291, 1731981, 2179761, 2555369, 2192828, 1459670, 861121, -117913, -2039261, -3758731, -3086335, 202209, 3144088, 2877157, 638604, 244271, 2274558, 2736458, -756231, -4431136, -3168198, 2240049, 6512193, 7210222, 6299291, 5056980, 2419283, -951078, -1841963, 363285, 1784618, -256405, -2959402, -2258729, 1225407, 3370570, 2029156, -1306176, -4270329, -5789247, -5945496, -5399045, -4985586, -5126831, -5593676, -5690109, -4306950, -682194, 3843062, 6148427, 5251176, 4419829, 6761727, 10224125, 10540740, 7902919, 6153000, 5878165, 3740261, -497136]
36942d97136j372547M351500O025521K207953j830802k332396n62324J466952
36934G456721L226179L665047J776725r91888k759934m226488n612452l489965
36926i56055L490285Q626272M620752m616282q081638l177409J772521J214067
36918B892513p98772K1020J016547p48629k143084K55973L589349L249842m072
36909G330687k027041j366506J76469N91695j026056l692951m096907k75013M170995
36900b14628M080137O41002o86665K29146j368404m547286k469051M522632O458671
36891F645554k88295n421856r44416N240760K446694m709911m322352K540285
36883A186463M048802k197613n651790o33912N357105M804265P31360r77561r46639
$$ y = [-497136, -1869683, 2481817, 8507338, 10715291, 8884489, 6552093, 5989769, 7456721, 10682900, 14347947, 16124672, 15132784, 12372850, 8146362, 2533910, -956055, 2534230, 11160502, 15781254, 11164972, 3083334, -94075, 1678446, 2892513, 2093741, 2114761, 3131308, 2382679, 239595, 495568, 4084917, 7334759, 7330687, 5303646, 3937140, 4113609, 4705304, 3679248, -13703, -4110610, -4385623, -214628, 3865509, 4506511, 3819846, 4048992, 2680588, -1866698, -4335749, 186883, 6645554, 6357259, 935403, -9013, 5231747, 7678441, 2968530, -1353822, 1186463, 5235265, 3037652, -2614138, -3248050, 2109055, 6913320, 7644680, 6667119, 5720480]
36874E720480k033023k474078L15400L614675K949362q93006l117944j518246
36866B563620J784977L922996L720206J427069j710198l909740m147971k857337
36858G93622j153070P7431O48668J410961L268526M970054L545570j421270n873124
36849F267368n842957k112997J825152L977283L497033m43716n644248o332909
36841d809991o58744M616079K838378k416964l124102L51921J142370j270019
36833c331072o03259L611210M145163p34969l191037O55840L553010l17746n091155
36824a304015l350525J539048K120249o09744q64451O68569q25218l887218k562238
36815i075543K898369N997472M123583R11473j054024k439206k438728O41634
$$ y = [5720480, 3687457, 1213379, 1528779, 5143454, 8092816, 7199810, 4081866, 2563620, 4348597, 8271593, 11991799, 13418868, 11708670, 7798930, 3650959, 793622, -359448, -282017, 366651, 1777612, 5046138, 10016192, 13561762, 12140492, 6267368, 424411, -1688586, 136566, 4113849, 7610882, 7167166, 1522918, -4809991, -5468735, -852656, 1985722, -431242, -3555344, -3203423, -2061053, -3331072, -3934331, -323121, 3822042, 3087073, -103964, 551876, 4104886, 3787140, -1304015, -4654540, -3115492, -995243, -1604987, -2469438, -1800869, -2626087, -6513305, -9075543, -6177174, -179702, 3943881, 4855354, 3801330, 1362124, -1076604, -434970]
36807d34970L942469K536140k063633l074577Q64479L382933N77469l272447k834175
36798c76312J153774M535643M707307J026777m888324p864984l673531L595837
36790a783813M772093j586053o256014k572830M078182M817586m27668m963286
36782c921803n237670k679854J117997N106300O724868M335435L18144k130920
36774C632497l118052l407482j146399L852177O090185J148650n887761o005842
36766d842027P71922N470071L355920o54255j470695j100655k708330l802132
36758d980181q04107L632263L609993j496190o228131o073544j711848L297378
36750a0754367N891594M683635O43292k888080k929046j41538K064929J820865
$$ y = [-434970, 3507499, 6043639, 3980006, 905429, 1769908, 5152841, 5730310, 2457863, -376312, 777462, 5313105, 10020412, 11047189, 6158865, -1706119, -5379650, -1783813, 2988280, 1402227, -4853787, -7426617, -3348435, 1469151, 1041483, -3921803, -9159473, -11839327, -10721330, -5615030, 1109838, 5445273, 5763417, 3632497, 514445, -2893037, -4039436, -187259, 5902926, 7051576, 1163815, -4842027, -4070105, 1399966, 4755886, 4101631, 2630936, 1530281, -1178049, -4980181, -5784288, -2152025, 1457968, -38222, -6266353, -12339897, -14051745, -10754367, -4862773, -179138, 464154, -2423926, -5352972, -5494510, -3429581, -1608716]
36742a608716N40267J01713J79917n06142j646316j706567m37320N86066K95772
36733d201326k46651N47246K352121L295272K503366J003496j04159j099519k537037
36724A512809l577240k519158J010802M911257N948445K714264k377992m785741
36716B837446k594451J033037J690657o05238j897707k61209J798774J769382
36708C770691O41755L6795j077762l717193n301390k725122K046022L545352K04695
36699b576157l362553k545026J587916M373381L450399P81128m75340L19549J027759
36690B581056j13859j835377j489209P66455J575964p76133l410386k812156J57101
36681e356544J913591J359616L07300k97576j047615j331957L77042L080096L534864
$$ y = [-1608716, -1068449, -966736, -786819, -1292961, -2939277, -4645844, -5083164, -4497098, -4201326, -4447977, -3900731, -1548610, 1746662, 4250028, 5253524, 5149365, 4049846, 1512809, -2064431, -4583589, -3572787, 1338470, 7286915, 10001179, 7623187, 2837446, 242995, 1276032, 2966689, 2361451, 463744, 202535, 2001309, 3770691, 4412446, 4449241, 3371479, -345714, -5647104, -8372226, -6326204, -2780852, -2576157, -5938710, -8483736, -6895820, -2522439, 927960, 1709088, 1233748, 1553297, 2581056, 2467197, 631820, -857389, -90934, 1485030, 708897, -2701489, -5513645, -5356544, -3442953, -2083337, -1776037, -2073613, -3121228, -4453185, -4076143, -996047, 2538817]
36672B538817R06573j887021k528365k099400k225496k209386q33173J132576
36664g204875K069898J667370O50325j51447L58027K647387M598928K949601j781960
36655E803254m416562j518215L458066M348089K19841m032512m426650j956367
36647b521056M38856J873497K871814K834127O42231k626906l856175j665326
36639b008938J376863J820047j53227j286217j87875Q93753J48129q04094j39077
36630c40636N77997o52505j753845N46724M250096L729147j444711m559024j033221
36621f79978M786196N671429J182162k860712k754954n39515L40039p08819k190142
36612B245706k900400k393400o44362J608119K870728K082459j97442k037134
$$ y = [2538817, 3445390, 1558369, -969996, -3069396, -5294892, -7504278, -8337451, -7204875, -5134977, -3467607, -2817282, -2968729, -2610702, 36685, 4635613, 7585214, 5803254, 1386692, -131523, 3326543, 7674632, 7894473, 3861961, -564689, -2521056, -2082200, -208703, 2663111, 5497238, 6139469, 3512563, -343612, -2008938, -632075, 1187972, 1034745, -251472, -439347, 454406, 602535, -201559, -340636, 237361, -415144, -2168989, -1622265, 2627831, 6356978, 4912267, 353243, -679978, 4106218, 9777647, 10959809, 8099097, 5344143, 4804628, 5144667, 4435848, 2245706, -654694, -3048094, -3692456, -2084337, 786391, 2868850, 2671408, 634274]
36604F34274j819944J30884J906674K268146J875699J663946J096243o11005k571104
36595D573813l381452l247685k800310j007371K679694N146564K749509k467650
36587B245112m349414j293633J515455L06408j903776j169925Q73091P18905m69648
36578c527425P89527L594710L508251o24060m996988n868995l029338J349166
36570h805152M449902M010770M96503k563359k669416j539301j880301k922023
36562a1422377k232321j6387J971823L859852N967236N762165J431451l208615
36554B112827l064698R7490K41929k712008k597776K194159N471291L420405M18318
36545E581937N36109M47948l348849o475154l313559K681194L569989o38522k504417
$$ y = [634274, -1185670, -1054786, 851888, 3120034, 4995733, 6659679, 7755922, 7144917, 4573813, 1192361, -2055324, -4855634, -5863005, -3183311, 1963253, 4712762, 2245112, -2104302, -3397935, -1882480, -1576072, -3479848, -4649773, -3776682, -3057777, -3527425, -2737898, 856812, 4365063, 3741003, -1255985, -7124980, -10154318, -8805152, -4355250, -344480, 152023, -2411336, -5080752, -6620053, -8500354, -11422377, -13654698, -13671085, -11699262, -7839410, -1872174, 3889991, 5321442, 2112827, -951871, -854381, -612452, -3324460, -5922236, -3728077, 1743214, 5163619, 5581937, 6118046, 6565994, 3217145, -3258009, -6571568, -3890374, -320385, -958907, -3463324]
36536c463324P07686L639979K414200o5186n56326m16525j006407k48018K329218
36527C335297K551586j597387m819560j925183L183914K692689k957642n363231
36519d899517o79511N071383N102584M75258l343847l931800k391104J28198K614306
36510a854050L265242J797879Q75136K249806L432026J432713k038251k900884
36502F259617r71576J10349j318532l107304l246589k059738j74604K287524M025859
36493A805006L264960P14182j089960j595508k181183k373187k61524K794720
36485A077506K676584p33072k225026P23124L449799J406301k341080j909496
36477B124640K134836L964943J479778j449555j622373m39996k72310r70788j556181
$$ y = [-3463324, -2755638, 884341, 3298541, 3233355, 2677029, 2260504, 1254097, 1006079, 3335297, 5886883, 4289496, -530064, -2455247, 728667, 3421356, 463714, -4899517, -5579028, -507645, 4594939, 5070197, 1726350, -2205450, -4596554, -4468356, -1854050, 1411192, 3209071, 4084207, 6334013, 9766039, 11198752, 9160501, 6259617, 5288041, 5398390, 4079858, 972554, -2274035, -4333773, -4508377, -2220853, 1805006, 5069966, 5784148, 4694188, 3098680, 917497, -1455690, -1717214, 1077506, 3754090, 3021018, 795992, 1519116, 4968915, 6375216, 4034136, 2124640, 4259476, 8224419, 9704197, 8254642, 6632269, 6192273, 5919963, 4949175, 3392994]
36468C392994k297656l338422l433861j786562K65883Q73123J57571j19411R49303
36459e337038K201290J990935N64152q3488P58240Q07487k100046n852089n727616
36450a2778173p07879M560965N330248K017017j371254j868487P36229M479206
36442C97872N962122K872765k552590m985818k543976R39976J923162J765790
36434C779303K555536K304061j288225n300638n041704j285561J066967N47517
36426b662744K62635J768482K728799J349139q69011j700664n26273K143751M685419
36417G179533M306053J39815m115574m072546n98599J731145J318648L77143k79596
36408E986022k061836l871686k128932K761358N026900J350239l913366m461670
$$ y = [3392994, 1095338, -2243084, -5676945, -7463507, -7197624, -6324501, -6166930, -6286341, -5337038, -3135748, -1144813, -580661, -664149, 94091, 901578, -1198468, -7050557, -12778173, -13486052, -8925087, -3594839, -1577822, -2949076, -4817563, -4081334, 397872, 6359994, 9232759, 6680169, 1694351, -849625, 90351, 2013513, 3779303, 6334839, 8638900, 7350675, 2050037, -2991667, -4277228, -3210261, -2662744, -2400109, -631627, 2097172, 3446311, 2577300, 876636, 350363, 2494114, 7179533, 11485586, 11625401, 7509827, 3437281, 2838682, 4569827, 5888475, 6265618, 5986022, 3924186, 52500, -2076432, 684926, 5711826, 7062065, 3148699, -1312971]
36400a312971j53068L596955K750756j393867m232924k590049J860320L979950
36392B505102J259342k614994k786299k39400L32128j393760r90472K545887M250368
36383B867902J032415l174488l263042J88487L108706L503220J825985j060543
36375E028642l510227l631798k422140k865919l992277q27456O525021R638491
36367C942337L184848n467847n586638J395389M461938j51613m314346j812142
36359d348074K416436J548375j906834j078299L393168M180705j148032o371641
36351c314196n724441j260714J583436J723489J952336L064635K725762o2019
36343F88288k869393l083110r04293J706654L115031K376184l14665k549785j330539
$$ y = [-1312971, -1466039, 2130916, 4881672, 3487805, -745119, -3335168, -1474848, 2505102, 3764444, 1149450, -1636849, -1876249, -1544121, -2937881, -3928353, -1382466, 2867902, 3900317, 725829, -2537213, -2348726, 759980, 4263200, 6089185, 5028642, 1518415, -2113383, -4535523, -7401442, -11393719, -12221175, -5696154, 3942337, 7127185, 1659338, -3927300, -2531911, 1930027, 1778414, -2535932, -4348074, -1931638, -383263, -2290097, -3368396, 24772, 4205477, 3057445, -3314196, -9038637, -10299351, -8715915, -6992426, -5040090, -1975455, 750307, 688288, -2181105, -5264215, -6168508, -4461854, -1346823, 1029361, 714696, -1835089, -3165628]
36334c165628K778250N177474K695499k285504n026349l999271j257508R93532
36326d089505J889593J436241O82891R22405J146415j147016m624717l542346
36318g326039L584424Q760534M148459n629502q301404n73820P657085P116317
36310I436054K07694m608218l766279k00897J961767Q31287k436843l960523q17487
36301c353445M233693M945755j87712n530999n691501j545391K850566N392429
36293A113395N688367L387108m52327k990562k813443j371704k08305N47204N13956
36284C413689o54885j192067M75135J678644r28497m290793k502193K442837K384236
36275H26106k866321l703041K756683N790044j638827r470059n492929M792566
$$ y = [-3165628, -387378, 4790096, 7485595, 5200091, 173742, -3825529, -5083037, -4089505, -2199912, -763671, -80780, 841625, 1988040, 841024, -3783693, -7326039, -3741615, 5018919, 9167378, 3537876, -4763528, -5337348, 2319737, 9436054, 9643748, 5035530, 1269251, 1068354, 3030121, 3861408, 1424565, -2535958, -3353445, 880248, 5826003, 5638291, 107292, -5584209, -7129600, -4279034, 1113395, 6801762, 10188870, 9736543, 6745981, 3932538, 2560834, 2352529, 2899733, 3413689, 2758804, 1566737, 2041872, 3720516, 2792019, -1498774, -4000967, -1558130, 826106, -2040215, -5743256, -2986573, 2803471, 1164644, -8305415, -13798344, -9005778]
36267i005778O734732m25008l844304J376308N768430K507879k483144k188367
36259a559252O58882P84284P2465K748598O433139N292058o61140n365059m799990
36250C603985j115906J019130m75143l599996m595860j958619J762948L073048
36242b286413J858837Q35240J209189J288980n34152l484007n238608l764829
36234a0115763R42527N625280N939941J825955j472529l30606K026847R16540
36226E358192j994395j505045K232684L631637K60980m032810n211984l447804
36218d708545p00362J738285K565623J284181R2395J251642K906553J714528j230744
36209D913556k266214j974202l656100n422668j766765N771836Q201050K559983
$$ y = [-9005778, -2271046, -2696054, -6540358, -5164050, 604380, 3112259, 629115, -1559252, -900370, -116086, -43621, 2704977, 9138116, 14430174, 13769034, 8403975, 3603985, 2488079, 3507209, 3032066, -567930, -5163790, -7122409, -5359461, -2286413, -427576, 407664, 1616853, 2905833, 2371681, -1112326, -6350934, -10115763, -9173236, -3547956, 2391985, 4217940, 2745411, 2414805, 4441652, 5358192, 3363797, 1858752, 4091436, 7723073, 7984053, 3951243, -1260741, -4708545, -5408907, -3670622, -1104999, 179182, 271577, 1523219, 4429772, 6144300, 4913556, 2647342, 673140, -2982960, -8405628, -10172393, -4400557, 3800493, 6360476]
36201F360476k704471q52995K785364O76504l751527k254128L458720L896535
36193G614478k510024o526979k712507K644734K493797K0060J968868O237893
36185I230320M559391l907720r887902o788504M03697L030297O57077o26267J135264
36176b194347J859250o3579o46746J903722K781354j540907o115768m146023K475951
36167e687093N722884K842278j252942k472170j907588r68127J482848M845631
36159B605721N068696O29676l717140k900802J374129L103854P3887l834529m132693
36150a729201r65447J862634J785038Q4321o55853m44095j256595k830571k225841
36141f375610J224915L879874L001847P70378J17953j5571j372519j802047R28069
$$ y = [6360476, 3656005, 2803010, 5588374, 6264878, 2513351, 259223, 3717943, 7614478, 5104454, -1422525, -4135032, -1490298, 1003499, 1023559, 2992427, 9230320, 13789711, 9881991, -5911, -6794415, -6390718, -3360421, -2703344, -3329611, -2194347, -335097, -398676, -1045422, 858300, 3639654, 2098747, -4017021, -8163044, -5687093, 35791, 2878069, 1625127, -847043, -2754631, -3722758, -2239910, 2605721, 7674417, 8304093, 4586953, 1686151, 3060280, 6164134, 6238021, 2403492, -1729201, -2694648, -832014, 953024, 1037345, 381492, -62603, -1319198, -4149769, -6375610, -5150695, -1270821, 1731026, 2501404, 2619357, 2603786, 1231267, -570780, 357289]
36132C57289L750776K680981R7038R06387L384489J595190l906326o185824l175296
36123d95296k67683j83825R64557M598803N359711M65873m280597l488024p01126
36114A972393j743184m979002m939803j525612J193826K407255M180992N529215
36106B096080L228873j914152m942668l340757R0885J450669Q2027j695077j462647
36097f406767Q65220K917734K716822J288786P80789Q65607l1816q99262K48731
36088B345844J611628j78615l262685k442658J535341K102764j933239l605846
36080c827466M38727L926865J719300j673698q09612J088581r96376m061063k786972
36071f981714M41940K47876j666589m56045J876193K05212l194076k006479K511464
$$ y = [357289, 4108065, 6789046, 6886084, 7792471, 11176960, 12772150, 8865824, 2680000, -495296, -762979, -946804, 17753, 4616556, 9976267, 10442140, 6161543, 2673519, 1972393, 229209, -4749793, -9689596, -11215208, -10021382, -7614127, -3433135, 2096080, 5324953, 3410801, -1531867, -4872624, -4781739, -3331070, -3249043, -4944120, -6406767, -5541547, -2623813, 93009, 1381795, 2162584, 3028191, 2996375, 2097113, 2345844, 3957472, 3778857, 516172, -1926486, -391145, 1711619, -221620, -3827466, -3388739, 538126, 2257426, 583728, -225884, 862697, -133679, -4194742, -6981714, -6539774, -6291898, -7958487, -8414532, -6538339, -6333127, -9527203, -11533682, -9022218]
36062i022218L577408J037387R39098L609916L003977j487504l319044n58669
36054b219649J025020p79088m85764M125680O444170J565388n555283p810999
36046c690525n109698j053697L055609O029310M819543q5579k804756m52610K066452
36037B774049L47726k396980j942257o81870k054496k905478P85788M981451L072890
36028A980823k547686l428449J518373M400498R11147l538786k717928J779760
36020a642248M125786K084302j888934m424161l683062j65427L219728L563881
36012A189865J339458l52955k02575n0259j369681k968161l243435k513294j767976
36003i939013q01067J018875L145266M094237K859721p9805k549810j960987J850735
$$ y = [-9022218, -5444810, -4407423, -3468325, 141591, 3145568, 1658064, -1660980, -2219649, -1194629, -1973717, -2459481, 1666199, 8110369, 9675757, 4120474, -3690525, -8800223, -9853920, -6798311, -769001, 4050542, 3964963, 1160207, 707597, 2774049, 3121775, 724795, -1217462, -1899332, -3953828, -6859306, -6073518, -1092067, 1980823, -566863, -3995312, -2476939, 1923559, 2834706, -704080, -3422008, -1642248, 2483538, 4567840, 2678906, -1745255, -5428317, -5593744, -2374016, 1189865, 2529323, 2176368, 1973793, 1923534, 553853, -2414308, -5657743, -8171037, -9939013, -10740080, -9721205, -6575939, -2481702, 378019, 298214, -2251596, -4212583, -2361848]
35994b361848N408314M894221O12426l454686m375268k688825k97382J594068
35986f68980J963452l3342l283966m908989l613337j250161J51027J061934K525177
35977h057185L360569J726092j427929k881243j054551K318060M350579L504103
35969A838495L49962k657509k665297N41764L332693K026683k234306m526636
35961c994151k237486J975629L725431J464081k832892n571727l907763J534623
35953i844255O088113N714189K262165Q13569J878914J024168k768767m392976
35945G75120j195384J912815O75099j090068J208450L628945K73167m932824l466085
35936b210765K811210L555068k735540n576834M3104N096326J594804m448235
$$ y = [-2361848, 3046466, 7940687, 8553113, 5098427, 723159, -1965666, -2263048, -668980, 1294472, 1261130, -2022836, -6931825, -10545162, -11795323, -11644296, -10582362, -8057185, -4696616, -2970524, -4398453, -7279696, -8334247, -6016187, -1665608, 1838495, 2188457, -469052, -3134349, -2592585, 740108, 2766791, 532485, -3994151, -6231637, -4256008, -530577, 933504, -1899388, -7471115, -11378878, -9844255, -3756142, 1958047, 4220212, 5033781, 6912695, 7936863, 5168096, 775120, -420264, 1492551, 2167650, 1077582, 2286032, 5914977, 6188144, 1255320, -2210765, 600445, 4155513, 1419973, -4156861, -4113757, 982569, 2577373, -1870862]
35928a870862l700251J416091K380190q68978j705756P07235J298575l99269L92068
35919b350957M023385N108311J831619j244754j136856l61028j229875k280671
35911B359174k151185j743590j139023O71994K114026M68617k147108l35674N342679
35902C439910P032966N56258p845891r644214m522200J238251L297964K114152
35894d332804j03578j382174m76465J694866K368155O57786q04346K65256K431812
35885C18508L025813J845769K27715j496050l216612l568603j801123K96577Q14468
35876c553538P66044K037035L352192J598420k735759m773818j537062L345357
35868a501129L971689K96554j566024J831811N738971L799270k395536n512200
$$ y = [-1870862, -5571113, -4155022, -1774832, -2643810, -4349566, -3642331, -2343756, -2743025, -2350957, 1672428, 6780739, 8612358, 7367604, 6230748, 5869720, 4639845, 2359174, 207989, -1535601, -2674624, -2002630, 111396, 580013, -1567095, -1902769, 3439910, 10472876, 11029134, 3183243, -6460971, -10983171, -9744920, -6446956, -4332804, -4436382, -5818556, -6295021, -4600155, -2232000, -1574214, -2378560, -2113304, 318508, 3344321, 5190090, 5417805, 3921755, 705143, -2863460, -4664583, -4368006, -3553538, -2787494, -750459, 2601733, 4200153, 1464394, -3309424, -4846486, -1501129, 2470560, 2767114, 1201090, 3032901, 8771872, 12571142, 10175606, 4663406]
35860D663406l384972j320456k271316j866864K801402O157898K461759l836634
35852C404223m115243J038128L216315j37203k529699K0691K767182P64179l257831
35843A170742l863477j024695R75983r7031k404476k769571J40248M061406M720622
35834I09751J160876j971745p02829J926421O79484k955639l249364j09335J369813
35825b942567O54663K108516M890988K495458m946028q021161k406647L552244
35817d614534J853895l092811k971004J114936K397101Q2163j495280j485433
35809h210967k023908j966509J132354M844320M768456J986724J131008K492442
35801D153920K304184k03260j860439j060948N97316J343110J13211l663198p479853
$$ y = [4663406, 1278434, -42022, -2313338, -4180202, -1378800, 4779098, 7240857, 3404223, -711020, 327108, 3543423, 3406220, 876521, 897212, 3664394, 4428573, 1170742, -2692735, -3717430, -2741447, -2838478, -5242954, -8012525, -7872277, -3810871, 909751, 2070627, 98882, -603947, 1322474, 2001958, -953681, -4203045, -4312380, -2942567, -2287904, -179388, 4711600, 7207058, 2261030, -5760131, -8166778, -4614534, -2760639, -5853450, -8824454, -7709518, -5312417, -5230254, -6725534, -8210967, -10234875, -12201384, -11069030, -6224710, -1456254, 530470, 1661478, 4153920, 6458104, 6254844, 4394405, 3333457, 3930773, 5273883, 5387094, 1723896, -5755957]
35792e755957o064083J234741O931775M680617j481920l282280j28850K156405
35784a709552J565715R80815R08511p71654k624114r49980K920456L780901R03369
35775E004467j569149k200745l108964l575798n48672M106808M714338J179080
35767D001365m74347J578353K007217j954772n473316m115640k62927J953021
35759b741046K276143J705532j43982k011873q11245K617347L170964k65806k331473
35750A464561k16497J449822q53185k711574N78696N129694M215746j032765l839510
35741D184988k196240j98774k64508m64748M04025O29380n98532j354732j95520
35732e4661J638599K173753R82656q36481j609534k53197K317828L537053K000796
$$ y = [-5755957, -11820040, -10585299, -3653524, 1027093, -454827, -3737107, -3865957, -1709552, -143837, 836978, 1745489, 973835, -1650279, -2600259, 320197, 4101098, 5004467, 3435318, 1234573, -1874391, -5450189, -5998861, -1892053, 2822285, 4001365, 3527018, 5105371, 7112588, 5157816, -315500, -4431140, -4694067, -2741046, -464903, 1240629, 1096647, -915226, -1726471, 890876, 4061840, 3796034, 1464561, 1248064, 2697886, 1844701, -866873, -288177, 4841517, 9057263, 8024498, 4184988, 1988748, 1789974, 1525466, 1060718, 1464743, 2094123, 1495591, 140859, -54661, 1583938, 3757691, 4740347, 3903866, 2294332, 2041135, 4358963, 7896016, 9896812]
35723I896812q91647k937966l459182k701645o56145K007579L225671J484072
35715E967549k155741m961056m900056j955082J772481L307531J698805m70136
35707a695705k19234J683386K021485l6605k285774l144256k689525o25826K868036
35698d124018M731566K110810k220100k737370K64604R92778k040201l516301
35690f538232r49736O28945k141083m115661r7738N561790N206355L259j919333
35681d361434K169186O286666M925979k24005l904084l627478j108702L68309
35673E24437o46035k169884j369514J108834J939429P21488P09442K457103J866440
35664E141740k362492m723358j057939M040921L826611l90640k120136o8749J100725
$$ y = [9896812, 9005165, 6067199, 2608017, -93628, -749773, 1257806, 4483477, 5967549, 3811808, -1149248, -6049304, -8004386, -6231905, -2924374, -1225569, -1695705, -1914939, -231553, 1789932, 1753327, -532447, -3676703, -6366228, -6992054, -4124018, 607548, 2718358, 498258, -2239112, -1974508, -981730, -3021931, -6538232, -7487968, -6859023, -9000106, -13115767, -13213505, -7651715, -2445360, -2442101, -4361434, -2192248, 4094418, 9020397, 8796392, 4892308, 1264830, 156128, 524437, -121598, -2291482, -3660996, -2552162, -612733, 108755, 818197, 3275300, 5141740, 2779248, -1944110, -3002049, 1038872, 4865483, 4474843, 2354707, 2285958, 3386683]
35655C386683j073771m159848n569078m713740j368216L255365N197718K484089
35647b560798o00791P30658L898326L043142j022626k247785L05121J348927j151747
35638A742427k990174j445180Q90405J630829J713050J491855k55003k074896
35630G03313p30186K357263K015449j878355l483039p89397J200261j43616n05317
35621a253624K404042L257820j547094n860802k465064N205913P715597K784564
35613A0241352l404071n969140n604327m034390j356863J679183L183479K547997
35605b716780P69131j165255k277829j572369M2238O1491j415149r02851K648738
35596f528635N057264L147682k31498j315835j295170k359180k263760J237599
$$ y = [3386683, 2312912, -1846936, -7416014, -12129754, -13497970, -10242605, -5044887, -2560798, -3161589, -2430931, 1467395, 4510537, 3487911, 1240126, 1545247, 2894174, 1742427, -1247747, -2692927, -1802522, -171693, 1541357, 3033212, 2778209, 703313, -26873, 2330390, 4345839, 2467484, -1015555, -1804952, -604691, -748307, -1253624, 1150418, 4408238, 2861144, -2999658, -5464722, -258809, 7456788, 10241352, 6837281, 868141, -4736186, -8770576, -10127439, -8448256, -5264777, -2716780, -1947649, -3112904, -5390733, -6963102, -6920864, -6859373, -8274522, -9177373, -6528635, -1471371, 1676311, 1444813, 128978, -1166192, -3525372, -5789132, -4551533]
35588d551533M433470K902736n70178o84383Q18414j226168m614686k611719L144839
35579b959208L597736k336889m676211J230903O132959J642765n702081m517901
35571g587927L714317P543683K919844k678272l047563q88421p83890k087470
35563b895699k115108j068470k02615J181923L518716M406274J604025k895854
35555A533192m744974k638567M68172J490355O45955J84633J030932J937964J722955
35546A630617J012493R32361R40848m08865k643252l281150j337620R48071J257001
35537i49496M04080N33127J493201J443862K75569k32677N10600J228489J287662
35528E994417J333846J087935o98328l295111l964037k242794j184770k239724
$$ y = [-4551533, -118063, 2784673, 2214495, 1530112, 2348526, 1122358, -3492328, -6104047, -2959208, 638528, -1698361, -6374572, -5143669, 989290, 2632055, -3070026, -7587927, -3873610, 3670073, 6589917, 3911645, 864082, -24339, -808229, -2895699, -5010807, -6079277, -6281892, -5099969, -1581253, 2825021, 4429046, 1533192, -3211782, -5850349, -5382177, -3891822, -3245867, -3061234, -2030302, -92338, 1630617, 2643110, 3575471, 4516319, 4107454, 1464202, -1816948, -3154568, -2206497, -949496, -545416, -12289, 1480912, 2924774, 3200343, 2967666, 3478266, 4706755, 5994417, 7328263, 8416198, 7717870, 4422759, 458722, -1784072, -2968842, -5208566]
35520e208566k146244J712203N662266M239543j106969l341319n5457L287666
35512C043123K011015j328172k331166j705686k190246k429970K15212L244242
35504a471648K051959j584520j191854L574113N203759J01820m950608k849527
35496a116506L098282M779892J469960q98852l63416q54955l542321m073829p10954
35487b212699J491440j432017n375815l991789J765331N198007L508785P91546
35479b57211J093060K808817J971514j445662l274334r21647K702715K518914
35471E196166j931352n217754k929992K093646L518499N68182j102062J485987
35463A681320L622773L90917m895792n107784j09520L083077J070304j372253
$$ y = [-5208566, -7354810, -5642607, 19659, 4259202, 3152233, -189086, -244543, 3043123, 5054138, 3725966, 1394800, -310886, -2501132, -4931102, -4715890, -1471648, 580311, -1004209, -2196063, 1378050, 6581809, 6683629, 1733021, -1116506, 1981776, 6761668, 8231628, 7332776, 6969360, 6114405, 2572084, -1501745, -2212699, -721259, -2153276, -7529091, -11520880, -9755549, -4557542, -1048757, -257211, 835849, 3644666, 5616180, 4170518, 896184, -25463, 2677252, 5196166, 3264814, -1952940, -4882932, -2789286, 729213, 1297395, 195333, 1681320, 5304093, 5695010, 799218, -4308566, -4418086, -1335009, -264705, -1636958]
35455a636958J24258K180507k53689m418780l006365M021478P786777K797924
35447G595152m818666n751376l09481L050353M00347l073045k203985O81800Q58604
35438c570297j093166j529771m30674l65983p89370P74542K846143J611932j538471
35429d085115r47910L473137M640983l06722m228364q25497N012977M695492r74751
35420F454230m238587k805282j105010n98673J890523N575040M535096k125611
35412G581726o803153l977656K139431M653351K967571L56136k110644m246458
35404E60304l925402p62093J287326o4801r48982J797128L844041K84335m708566
35395b636710l559180J934342K939390j958026m482815l34673M328396L493175
$$ y = [-1636958, -1512700, 667807, 414118, -4004662, -7011027, -2989549, 4797228, 7595152, 2776486, -2974890, -3284371, -234018, 166329, -2906716, -5110701, -4428901, -3570297, -4663463, -6193234, -6623908, -6989891, -7779261, -7004719, -4158576, -2546644, -4085115, -5033025, -1559888, 3081095, 2774373, -1453991, -2279488, 2733489, 7428981, 6454230, 2215643, -589639, -1694649, -2293322, -402799, 5172241, 9707337, 7581726, 778573, -3199083, -1059652, 3593699, 6561270, 6917406, 4806762, 560304, -3365098, -4127191, -2839865, -2904666, -3853648, -2056520, 1787521, 2071856, -2636710, -6195890, -4261548, -1322158, -3280184, -7762999, -8097672, -3769276, -276101]
35387b76101m746j123512p69007j644335j937272N42850K682122J067840j182823
35378b644984N55426L685704K174239k846287m231019k90944K769058J135897
35370C07090j334654q56009J9893j863796l702074j369287K893826L238612r77816
35361c644215m442093l557354j87191K662547M573339N761736N096509K343255
35353H606533j65376m92614J24091k63533q87505j29366P27637o38043k640459
35344D241365j254779K866600L734777j043072n432134l337994K100061L379543
35336E254367J27871j426497M40232N20439l150653m852495q67305L459561K033325
35327A538845k152476k111157K240450N206163M428008J948706j474813n774797
$$ y = [-276101, -280847, -1404359, -2173366, -3817701, -5754973, -5212123, -2530001, -1462161, -2644984, -2089558, 1596146, 3770385, 924098, -3306921, -3597865, -828807, 307090, -1027564, -1883573, -1863680, -3727476, -7429550, -8798837, -5905011, -2666399, -3644215, -8086308, -11643662, -11830853, -9168306, -4594967, 1166769, 6263278, 8606533, 8441157, 7948543, 8072634, 7809101, 6921596, 6792230, 7519867, 6881824, 4241365, 2986586, 5853186, 9587963, 8544891, 3112757, -225237, 1874824, 5254367, 5382238, 3955741, 4395973, 4916412, 1765759, -3086736, -3954041, -494480, 1538845, -613631, -2724788, -484338, 4721825, 9149833, 11098539, 9623726, 3848929]
35319C848929p109423k141422L970442K617670m621610o546620J203747R324877
35311E46590Q503756J539962l561557n053750n306624l613210R77364M194645
35303a772824J922699k080180j397870K685031L664378O10200j507040j082834
35295A041560j233307k111323k49959L499769L615261n11940k526913M22442K754625
35286D700215m431l795901l264081k98155N91180K96417J886451L396699J129069
35277D637463k408563j381421L508190N251079J124255l477613l510846r95149
35269B747395n40400k429286l470527k154646N8844J332876J209448M09866O0298
35260b776132O38814J357836J299215Q54681Q12650O76268k03921n52293J045946
$$ y = [3848929, -3260494, -5401916, -1431474, 1186196, -3435414, -9982034, -8778287, 546590, 9050346, 10590308, 7028751, 1975001, -3331623, -6944833, -5967469, -1772824, 149875, -1930305, -3328175, -643144, 3021234, 3631434, 2124394, 1041560, -191747, -2303070, -2553029, 946740, 4562001, 4050061, 1523148, 1945590, 4700215, 4695784, 899883, -2364198, -2662353, -2071173, -1774756, 111695, 3508394, 4637463, 2228900, 847479, 4355669, 9606748, 10731003, 7253390, 3742544, 2747395, 2206995, -222291, -3692818, -5847464, -5788620, -4455744, -3246296, -2836430, -2776132, -2137318, -779482, 519733, 1374414, 2187064, 2863332, 2659411, 2107118, 3153064]
35251C153064K627664O19951m255036o515640k990415K910756O066388N626149
35243G242881L503682J70847m064323n950085k461013L573444N737937K292993
35235A0046363k091145l538295l297625l181200j482635K994228O458763M400543
35227A0308997j431626m858618l442715o67614P955q78999j596734k102493k401893
35218g063740j222615J453017L005141J730263j28901N64267L104400L837967
35210E279799J127219k830936m890608l851118o72936K527912L626854J943074
35202B259260j108109l281226l273944j222410J590912L232620K624786J024073
35194A845962N56227J022243K84412j778941k698447j810519j544568k405122
$$ y = [3153064, 5780728, 6400679, 2145643, -4369997, -7360412, -4449656, 1616732, 7242881, 10746563, 10917410, 6853087, 903002, -1558011, 2015433, 7753370, 10046363, 7955218, 4416923, 1119298, -2061902, -3544537, -550309, 5908454, 10308997, 8877371, 4018753, 576038, -91576, -83621, -962620, -2559354, -4661847, -7063740, -8286355, -6833338, -3828197, -2097934, -2226835, -1662568, 1441832, 5279799, 6407018, 3576082, -1314526, -5165644, -5838580, -3310668, 316186, 2259260, 1151151, -2130075, -5404019, -6626429, -5035517, -1802897, 821889, 1845962, 2402189, 3424432, 3708844, 1929903, -768544, -2579063, -4123631, -6528753]
35186f528753j014902L455368N439602Q58816m844228l432924L513443O470214
35178C916636K016285l060308l051766q39171r41841k008236q70433J212715J424913
35169b201206O96380J389200K567092J901334K3599q38832o16108n09296l25164
35160B086999L72403M97460n49746j314832r10653m42678M2124K117668M258591
35151F157336J820966m608407o848414p75954N491501K816920m442364m929265
35143e317681J704065M663157j80465m087490l47607N032921L520321k859862
35135B127359n779409k968851O53517J511376J022116J697818L812359N509928
35127G586213L991385j798865p903449p697354k24969O874783O388564P47831
$$ y = [-6528753, -7543655, -4088287, 1351315, 2210131, -2634097, -6067021, -2553578, 3916636, 5932921, 2872613, -179153, -1018324, -1960165, -3968401, -4838834, -3626119, -2201206, -1504826, -115626, 2451466, 4352800, 4376399, 3537567, 2921459, 2412163, 2086999, 2459402, 2956862, 2407116, 1092284, 181631, -261047, -218923, 1898745, 6157336, 7978302, 3369895, -3478519, -4254473, 1237028, 4053948, -388416, -5317681, -3613616, 1049541, 869076, -3218414, -3566021, 1466900, 4987221, 2127359, -3652050, -6620901, -5967384, -4456008, -3433892, -1736074, 2076285, 7586213, 11577598, 9778733, 1875284, -5822070, -6047039, 827744, 7216308, 7964139]
35119G964139k165683k45114J378667m24514k159745l27180K279804Q84791l392073
35110C793092m731759j317984J783415K17136l043599k385514J543570K844861
35102a296782k7111j571993J768164N453940L807760j214216l596349k588863
35094G34550k313028l705449l415571o46418J135583L90332r7259J341463K289312
35085d286485Q12287j065714o36207J872697M436642N164616K524857k949072
35077E873621o917227n238774k4519K755115J768901R79578J523529j41853m164593
35068c586222m792521L94775N452225M887069J476492R1057n01492l374633n932505
35059e885755l920718M49006J649803j31012j05773K460357L617849K174058J127460
$$ y = [7964139, 5798456, 5553342, 6932009, 6507495, 4347750, 4020570, 6300374, 7185165, 3793092, -938667, -2256651, -473236, -256100, -3299699, -5685213, -4141643, -1296782, -1323893, -2895886, -1127722, 4326218, 8133978, 6919762, 3323413, 734550, -1578478, -5283927, -8699498, -9345916, -8210333, -7820001, -7917260, -6575797, -4286485, -3474198, -4539912, -5176119, -3303422, 1133220, 6297836, 8822693, 5873621, -1043606, -6282380, -6306899, -3551784, -1782883, -803305, 720224, 578371, -3586222, -8378743, -7983968, -2531743, 2355326, 3831818, 3922875, 3421383, 46750, -5885755, -9806473, -9357467, -7707664, -7838676, -7944449, -5484092, -1866243, 307815, 1435275]
35050A435275J334927k1878l301358m232341l04078M679085N255710J228928k488869
35041C585401k034825J097850K237593m80406l570528k922731K53532J251112
35033e83002r32032k446350j179357L48544K78007N60408K271410K686817K62482
35024A266927k007074j555008j01550O11538J886704L490366J890053k780902
35016B701054m461655r11259J352897j849714l972242J254885P687428N884130
35008G685524j575303n090527l427131k175100j187670L182800O523165J589817
35000E525575o430106n255003L681422N846390k668978q601933l622454L167188
34992h357899K335905j229744l79451R49995k313727m497351M40268O109699M048195
$$ y = [1435275, 2770202, 2748324, -553034, -4785375, -5089453, -410368, 4845342, 6074270, 3585401, 1550576, 2648426, 4886019, 4405613, 835085, -2087646, -1834114, -583002, -1515034, -3961384, -5140741, -4792197, -4514190, -3953782, -1682372, 1004445, 1266927, -740147, -2295155, -2396705, -1785167, 101537, 3591903, 5481956, 2701054, -1760601, -2671860, -1318963, -3168677, -7140919, -5886034, 1801394, 7685524, 6110221, 1019694, -2407437, -4582537, -5770207, -2587407, 3935758, 5525575, -904531, -6159534, -2478112, 3368278, 699300, -7902633, -11525087, -8357899, -6021994, -7251738, -7631189, -6681194, -8994921, -13492272, -13052004, -6942305, -2894110]
34983b894110j065890J23336M510316K136258n409121o959858n59416L875462
34975f243023J476643r85628J687591M706219K766859j081033j580848L22205
34967A068985P47268n1574Q52782L186650L626837J018799j744476j533221Q44692
34958H016742J464404j434897m359398k958172J263693K434529j034799m009662
34950f17560k642874K48761Q95367N88837J683529K203364k87681l198318k854077
34941c980652p16272o1385L63009L162777N620322L184614k149920m052887j570499
34932b00893K77840o17693q57573J380683K946745J201378j973545l428990k428912
34923c700960q2259J900131J680268p34587k565670j855800k86713M54138K056902
$$ y = [-2894110, -3960000, -3836664, 673652, 2809910, -2599211, -9559069, -10118485, -6243023, -4766380, -5752008, -4064417, 641802, 3408661, 2327628, 746780, 1068985, 1816253, 1764679, 2617461, 5804111, 9430948, 10449747, 8705271, 7172050, 8016742, 9481146, 8046249, 3686851, 728679, 1992372, 4426901, 3392102, -617560, -3260434, -3011673, -2116306, -1527469, 156060, 2359424, 2071743, -1126575, -3980652, -4696924, -4758309, -4395300, -1232523, 4387799, 7572413, 5422493, 1369606, -200893, 76947, -540746, -1398319, -17636, 2929109, 4130487, 2156942, -1272048, -3700960, -3783219, -1883088, -202820, -937407, -3503077, -5358877, -5645590, -5191452, -3134550]
34914c134550N141812N223511o45899o388495l864170M434141Q007447L156970
34906A1930767l288158n403842m628008l270093k07455L982480N169002K343803
34898F628496l90710j247113l182373o044904m270285L122891Q009144M640620
34890G265766j128342j129269K406480J675465l194576m547166K27254M824667
34882F400279L629849j231243m284671l575688j073739Q47782J479927J637906
34874C830402K252271K720652J376522j745846m120504l917150k376768j581814
34866c562235j520935r91823J09933J042941J506916J485446J114983J290492
34858D75718K497959K829571P8977l739400l893051k11135J755723o75945k476562
$$ y = [-3134550, 2007262, 7230773, 6584874, 196379, -3667791, 766350, 8773797, 11930767, 8642609, 3238767, -1389241, -4659334, -4866789, -884309, 4284693, 6628496, 6237786, 4990673, 1808300, -4236604, -8506889, -5383998, 2625146, 7265766, 6137424, 5008155, 7414635, 9090100, 5895524, 1348358, 1575612, 6400279, 10030128, 8798885, 4514214, 938526, -135213, 712569, 2192496, 3830402, 6082673, 8803325, 10179847, 8434001, 4313497, 396347, -1980421, -3562235, -5083170, -6074993, -5965060, -4922119, -3415203, -1929757, -814774, 475718, 2973677, 5803248, 5882225, 2142825, -1750226, -1961361, -205638, -881583, -3358145]
34849c358145J224448O662823O436632L80357m540059m178961j386855r0073l86265
34840G63902q45928j465077k201356j453678J708359N321090O301046L827962
34832A1956320L7067k259144k070910p00040J1140m19659j389023k769366m695944
34823b299559n875549m180809K68375M367630N398094L773908J720570O61443
34815C834103M43439l20349l164294p115626p754497k158578N573458Q143608
34807b518736M742836J546184J393631j19224m902912o320023M94454Q350587
34799B666797P013989j090182m209715Q02534M459487L81885n033433l689357
34791A302005J477749K027192k617588n086665j545901L612695M960796K569687
$$ y = [-3358145, -2133697, 4529126, 10965758, 11346115, 6806056, 2627095, 1240240, 1150167, 763902, -82026, -1547103, -3748459, -5202137, -3493778, 1827312, 8128358, 11956320, 11993387, 9734243, 7663333, 6963293, 6974433, 6554774, 5165751, 2396385, -2299559, -8175108, -12355917, -12087542, -7719912, -2321818, 1452090, 3172660, 3834103, 4277542, 3957193, 792899, -6322727, -14077224, -16235802, -10662344, -2518736, 2224100, 3770284, 5163915, 5044691, 141779, -6178244, -5683790, 2666797, 9680786, 8590604, 4380889, 5183423, 9642910, 10024795, 4991362, 1302005, 2779754, 4806946, 2189358, -2897307, -4443208, -830513, 4130283, 6699970]
34783F699970k49419j855220k556145k331842r39085M52412k3304k163807l165762
34774f132202r65731K630797L683928J075981j878921j694404Q02934J927642
34766e49976L71579j150741M8572K651860K841793o30849m285673l668817J208055
34757c164197N557320N420492K036282p84367j945474k902127l278162q97675
34749D2092L137247L935403k39087m438216l845823p50874l42241k232594j727809
34740f461902J677958L217348Q68808j358556l05126J254057j54461k384368j154526
34731d800768K508280L389758J87735k329813n31038K718327K619744l21661j385606
34722B054958R66156K860248J093135k172749l138417j997981j449872j428486
$$ y = [6699970, 6450551, 4595331, 2039186, -292656, -1231741, -779329, -802633, -2966440, -6132202, -7097933, -4467136, -783208, 292773, -1586148, -3280552, -2477618, -549976, -178397, -1329138, -1280566, 1371294, 4213087, 3582238, -703435, -4372252, -3164197, 2393123, 7813615, 9849897, 9065530, 7120056, 4217929, 939767, 42092, 3179339, 7114742, 6875655, 2437439, -1408384, -2159258, -2501499, -4734093, -6461902, -4783944, -1566596, -697788, -2056344, -2361470, -1107413, -1261874, -3646242, -4800768, -2292488, 1097270, 1285005, -1044808, -1575846, 1142481, 3762225, 3440564, 2054958, 3021114, 5881362, 6974497, 4801748, 1663331, -334650, -1784522, -3213008]
34714c213008L78057L220560L172063n55331l319834j278727L248503N090103
34706F742386K497783k029662m959585l926799O94619M540960K689406l382838
34698B866270n992622j560302L529729K117740k811705l192800R22123J739470
34690b382097k919151n578015j136639M853413M859638N75580o53419K736928
34682C56238M997438K119541k854455m500156j555628K619303M226314K371440
34674G780035r83084l368672l831029k906191j470691k25316N09659J395940L390931
34665B91582N287797L804097j496584n368771k874557K976702M533328M03718
34657G557312k662608l35336K810483R24252m043362n943557l679269j235916
$$ y = [-3213008, -2834951, 385609, 3557672, 3002341, -317493, -1596220, 1652283, 6742386, 9240169, 7210507, 2250922, -1675877, -981258, 3559702, 6249108, 2866270, -3126352, -4686654, -1156925, 960815, -1850890, -5043690, -4121567, -2382097, -5301248, -10879263, -12015902, -7162489, -2302851, -1727271, -2380690, 356238, 5353676, 7473217, 4618762, 118606, -1437022, 1182281, 5408595, 7780035, 6796951, 3428279, -402750, -3308941, -4779632, -5004948, -4495289, -3099349, 291582, 5579379, 9383476, 7886892, 2518121, -356436, 2620266, 7153594, 7557312, 4894704, 4559368, 7369851, 8294103, 4250741, -1692816, -5372085, -6608001]
34649f608001l62028J064556L688961M881438L244712R23858P9430J42560p8317
34640F977169j69366M80412J032097N16554n18185r85915j005746j570502k852270
34631A904248l529927j954536J765419M851945M163725K17423k439260m99601
34623D479436L499187M016697n04420n793863o998198l683820Q05363L165190
34615a014428K668504J161443R15499J769581J156687j730131l465565r99840
34607D61750K640329J768207k928162m266797O99105N452304L388108k330533
34599D884311l815564j44200K456078P52158j745886j550186J94418J284504J656931
34590C972564J327890m03027k072621q95708J841086J282096k806718l983525
$$ y = [-6608001, -6970029, -5905473, -2216512, 2664926, 5909638, 6833496, 6912926, 7055486, 6977169, 6807803, 7288215, 8320312, 8836866, 8318681, 7332766, 6327020, 4756518, 1904248, -1625679, -3580215, -1814796, 3037149, 7200874, 7418297, 4979037, 4479436, 7978623, 11995320, 11490900, 5697037, -1301161, -4984981, -4179618, -1014428, 1654076, 2815519, 3731018, 5500599, 6657286, 4927155, 1461590, 461750, 3102079, 4870286, 1942124, -2324673, -1625568, 3826736, 7214844, 4884311, 1068747, 924547, 3380625, 4132783, 2386897, 836711, 1031129, 2315633, 3972564, 5300454, 4897427, 2824806, 1929098, 3770184, 5052280, 2245562, -1737963]
34582a737963J096735O381332M917776j100315m608466l857150j817798Q33446
34574A07597M502166N368056N4665n954926m017427L734644O163455J76095m583741
34565E550584j578739K669464N58291m020650l316159J227482K721179O66463
34557D477915j56628O54975n18013l215095l392965j039682R5505l86702L52251
34548c128439J941332J433415j91168P94171L484007L294818K37199j128915k02709
34539F533711r72604l401985k591200J627441K788403j480872m947023k861114
34531e305243J058206K160532K033149L037325K732691l26438j724361J328949
34523D994810L571304r2076n250855m657216K32020K524163J015358l16884q56473
$$ y = [-1737963, -641228, 5740104, 10657880, 9557565, 4949099, 1091949, -725849, 107597, 4609763, 9977819, 10032484, 4077558, 60131, 3794775, 9958230, 10134325, 5550584, 3971845, 6641309, 7199600, 3178950, -137209, 1090273, 3811452, 4477915, 4321287, 4976262, 4458249, 1243154, -2149811, -3189493, -3093988, -3480690, -3128439, -1187107, 246308, 55140, 849311, 4333318, 7628136, 7865335, 6736420, 6533711, 5561107, 2159122, -432078, 1195363, 3983766, 2502894, -2444129, -5305243, -4247037, -2086505, -53356, 2983969, 5716660, 5390222, 3665861, 4994810, 8566114, 8474038, 3223183, -1434033, -1202013, 1322150, 2337508, 2020624, 1164151]
34514A164151k657538l608461l77186L427108J432728m003735m278431J403134
$$ y = [1164151, -1493387, -5101848, -5479034, -2051926, -619198, -4622933, -8901364, -7498230]
$$ [...]
##END NTUPLES=NMR SPECTRUM
##END=
