##TITLE=31Pdec_LR-768-C1
 CDCl3, 24 sc
 6.7.2023
##JCAMPDX= 6.0         $$ Bruker NMR JCAMP-DX V2.0
##DATA TYPE= NMR SPECTRUM
##DATA CLASS= NTUPLES
##ORIGIN= UXNMR, Bruker Analytische Messtechnik GmbH
##OWNER= root
$$ XWIN-NMR		Version 3.5
$$ Thu Jul  6 14:01:31 2023 Russian Standard Time (UT+4h)  she@DPX200
##.OBSERVE FREQUENCY= 81.013821
##.OBSERVE NUCLEUS= ^31P
##.ACQUISITION MODE= SIMULTANEOUS
##.ACQUISITION SCHEME= undefined
##.AVERAGES= 24
##.DIGITISER RES= 16
##SPECTROMETER/DATA SYSTEM= spect
##.PULSE SEQUENCE= zgpg30
##.SOLVENT NAME= CDCl3
##.SHIFT REFERENCE= (INTERNAL, CDCl3, 0, 248.564)
##AUDIT TRAIL= $$ (NUMBER, WHEN, WHO, WHERE, WHAT)
$$ ##TITLE= Audit trail, XWIN-NMR		Version 3.5
$$ ##JCAMPDX= 5.01
$$ ##ORIGIN= Bruker BioSpin GmbH
$$ ##OWNER= she
$$ F:/spectra/data/she/nmr/P31/1/pdata/1/auditp.txt
$$ ##AUDIT TRAIL=  $$ (NUMBER, WHEN, WHO, WHERE, WHAT)
(   1,<2023-07-06 14:00:28.39 +0400>,<she>,<DPX200>,
      <created by zg, POWCHK disabled, PULCHK disabled
       configuration hash MD5:
       00 E9 B6 7A A2 85 ED C7 34 08 36 98 17 FE 4E 26
       data hash MD5: 32K
       EF 4C 3D 30 DF 28 40 B1 C9 D7 24 B5 45 F7 2A BF>)
(   2,<2023-07-06 14:00:31.01 +0400>,<she>,<DPX200>,
      <Start of raw data processing
       efp BC_mod = 2 LB = 1 FT_mod = 6 PKNL = 1 PHC0 = -10743.8 PHC1 = 246.4848 SI = 64K 
       data hash MD5: 64K
       02 BE 36 7E BE CA 43 15 1A 7C 94 14 A1 B4 04 FE>)
(   3,<2023-07-06 14:00:50.81 +0400>,<she>,<DPX200>,
      <pk PHC0 = 68.39205 PHC1 = -182.4 
       data hash MD5: 64K
       90 94 F4 58 13 70 7C DE 7F 39 2E 76 B5 9D 0C E4>)
(   4,<2023-07-06 14:00:57.29 +0400>,<she>,<DPX200>,
      <abs ABSG = 5 
       data hash MD5: 64K
       8B 82 D4 B5 63 B2 F5 19 BD 72 C3 EF E0 8A BB 27>)
$$ ##END=
$$ 
$$ hash MD5
$$ D4 3A 6F 14 35 69 10 F7 8A 0E 19 3B BC ED 8F 3E
##$RELAX= 
##$RELAX= 
##$RELAX= 
##$RELAX= 
##$RELAX= 
##$RELAX= 
##$RELAX= 
##$RELAX= 
##$RELAX= 
$$ Bruker specific parameters
$$ --------------------------
##$DU= <F:/spectra>
##$EXPNO= 1
##$NAME= <P31>
##$PROCNO= 1
##$TYPE= <nmr>
##$USER= <she>
##$AMP= (0..31)
100 100 100 100 100 100 100 100 100 100 100 100 100 100 100 100 100 100 
100 100 100 100 100 100 100 100 100 100 100 100 100 100 
##$AQSEQ= 0
##$AQ_mod= 1
##$AUNM= <au_zg>
##$AUTOPOS= <>
##$BF1= 81.014009
##$BF2= 200.13
##$BF3= 200.13
##$BF4= 200.13
##$BF5= 200.13
##$BF6= 200.13
##$BF7= 200.13
##$BF8= 200.13
##$BYTORDA= 1
##$CFDGTYP= 0
##$CFRGTYP= 5
##$CHEMSTR= <none>
##$CNST= (0..31)
1 1 145 1 1 1 1 1 1 1 1 1 1 1 1 1 1 1 1 1 1 1 1 1 1 1 1 1 1 1 1 1 
##$CPDPRG= <waltz16>
##$CPDPRG1= <>
##$CPDPRG2= <waltz16>
##$CPDPRG3= <>
##$CPDPRG4= <mlev>
##$CPDPRG5= <mlev>
##$CPDPRG6= <mlev>
##$CPDPRG7= <mlev>
##$CPDPRG8= <mlev>
##$CPDPRGB= <>
##$CPDPRGT= <>
##$D= (0..31)
0 1 0 0 0 0 0 0 0 0 0 0.03 2e-05 3e-06 0 0 0 0 0 0 0 0 0 0 0 0 0 0 0 0 
0 0 
##$DATE= 1688637627
##$DBL= (0..7)
120 120 120 11 120 120 24 19 
##$DBP= (0..7)
150 150 150 150 150 150 150 150 
##$DBP07= 0
##$DBPNAM0= <>
##$DBPNAM1= <>
$$ [...]
##$SUBNAM3= <"">
##$SUBNAM4= <"">
##$SUBNAM5= <"">
##$SUBNAM6= <"">
##$SUBNAM7= <"">
##$SUBNAM8= <"">
##$SUBNAM9= <"">
##$SW= 501.771253377433
##$SWIBOX= (0..15)
0 1 3 0 0 0 0 0 0 0 0 0 0 0 0 0 
##$SW_h= 40650.406504065
##$TD= 32768
##$TD0= 1
##$TE= 0
##$TE2= 300
##$TE3= 300
##$TEG= 300
##$TL= (0..7)
0 120 53 12 22 120 120 120 
##$TP= (0..7)
150 150 150 150 150 150 150 150 
##$TP07= 0
##$TPNAME0= <>
##$TPNAME1= <>
##$TPNAME2= <>
##$TPNAME3= <>
##$TPNAME4= <>
##$TPNAME5= <>
##$TPNAME6= <>
##$TPNAME7= <>
##$TPOAL= (0..7)
0.5 0.5 0.5 0.5 0.5 0.5 0.5 0.5 
##$TPOFFS= (0..7)
0 0 0 0 0 0 0 0 
##$TUNHIN= 0
##$TUNHOUT= 0
##$TUNXOUT= 0
##$USERA1= <user>
##$USERA2= <user>
##$USERA3= <user>
##$USERA4= <user>
##$USERA5= <user>
##$V9= 5
##$VALIST= <valist>
##$VCLIST= <CCCCCCCCCCCCCCC>
##$VD= 0
##$VDLIST= <DDDDDDDDDDDDDDD>
##$VPLIST= <PPPPPPPPPPPPPPP>
##$VTLIST= <TTTTTTTTTTTTTTT>
##$WBST= 1024
##$WBSW= 4
##$XGAIN= (0..3)
0 0 0 0 
##$XL= 0
##$YL= 0
##$YMAX_a= 1977
##$YMIN_a= -2261
##$ZGOPTNS= <>
##$ZL1= 120
##$ZL2= 120
##$ZL3= 120
##$ZL4= 120
##$ABSF1= 248.5645
##$ABSF2= -253.2056
##$ABSG= 5
##$ABSL= 3
##$ALPHA= 0
##$AQORDER= 0
##$ASSFAC= 0
##$ASSFACI= 0
##$ASSFACX= 0
##$ASSWID= 0
##$AUNMP= <proc_1d>
##$AZFE= 0.1
##$AZFW= 0.5
##$BCFW= 0
##$BC_mod= 2
##$BYTORDP= 0
##$COROFFS= 0
##$CY= -3
##$DATMOD= 1
##$DC= 0
##$DFILT= <>
##$DTYPP= 0
##$F1P= 0
##$F2P= 0
##$FCOR= 1
##$FTSIZE= 65536
##$FT_mod= 6
##$GAMMA= 0
##$GB= 0
##$INTBC= 1
##$INTSCL= 6.047779e-11
##$ISEN= 30
##$LB= 1
##$LEV0= 0
##$LPBIN= 0
##$MAXI= 10000
##$MC2= 0
##$MEAN= 0
##$ME_mod= 0
##$MI= 50
##$NCOEF= 0
##$NC_proc= -6
##$NLEV= 6
##$NOISF1= 182.463
##$NOISF2= 159.3651
##$NSP= 0
##$NTH_PI= 0
##$NZP= 0
##$OFFSET= 248.5645
##$PC= 4
##$PHC0= -10675.41
##$PHC1= 64.08481
##$PH_mod= 1
##$PKNL= yes
##$PPARMOD= 0
##$PSCAL= 0
##$PSIGN= 0
##$REVERSE= no
##$SF= 81.0140089999694
##$SI= 65536
##$SIGF1= 159.3651
##$SIGF2= -187.1042
##$SINO= 113.3802
##$SIOLD= 16384
##$SREGLST= <1H.CDCl3>
##$SSB= 0
##$STSI= 65536
##$STSR= 0
##$SW_p= 40650.406504065
##$SYMM= 0
##$S_DEV= 0
##$TDeff= 32768
##$TDoff= 0
##$TI= <>
##$TILT= no
##$TM1= 0
##$TM2= 0
##$TOPLEV= 0
##$USERP1= <user>
##$USERP2= <user>
##$USERP3= <user>
##$USERP4= <user>
##$USERP5= <user>
##$WDW= 1
##$XDIM= 65536
##$YMAX_p= 118844699
##$YMIN_p= -430048953
$$ End of Bruker specific parameters
$$ ---------------------------------
##NTUPLES= NMR SPECTRUM
##VAR_NAME=  FREQUENCY,     SPECTRUM/REAL,   SPECTRUM/IMAG
##SYMBOL=    X,             R,               I
##VAR_TYPE=  INDEPENDENT,   DEPENDENT,       DEPENDENT
##VAR_FORM=  AFFN,          ASDF,            ASDF
##VAR_DIM=   65536,         65536,           65536
##UNITS=     HZ,            ARBITRARY UNITS, ARBITRARY UNITS
##FACTOR=    0.620285442955139, 1,           1
##FIRST=     20137.2065510682, 0,            0
##LAST=      -20513.1999529968, 0,           0
##MIN=       -20513.1999529968, -430048953,  0
##MAX=       20137.2065510682, 118844699,    0
$$ Real data points
##PAGE= N=1
##DATA TABLE= (X++(R..R)), XYDATA
$$ [...]
$$ plain form
13266 1399061 1192217 332317 49084 964682 1924120 1687668 573586 -415799 -1076779
13257 -1076779 -1681526 -1964435 -1447151 -390947 364520 341919 -240874 -829760 -935129
13248 -935129 -505605 -103164 -304174 -831769 -852912 -229179 278221 235298 60180 -52993
13238 -52993 -721404 -2169535 -3318439 -3063446 -1889503 -1180212 -1254158 -1134581 -187461
13229 -187461 1000814 1567659 1424160 1042021 730176 482081 221857 -118364 -617453
13220 -617453 -1236975 -1736166 -1869702 -1671382 -1437730 -1373698 -1335433 -1078505 -730355 -720939
13210 -720939 -1109554 -1324361 -895890 -177304 75501 -379847 -1219853 -2157945 -3002994 -3305180
13200 -3305180 -2672762 -1442572 -387021 236411 694756 951885 706734 281650 466130
$$ packed form
13266A399061k06844q59900k83233R15598R59438k36452j114082r89385o60980
13257a076779o04747k82909N17284J056204P55467k2601n82793n88886j05369
13248i35129M29524M02441k01010n27595k1143O23733N07400m2923j75118j13173
13238e2993o68411j448131j148904K54993J173943P09291p3946J19577R47120
13229a87461J188275N66845j43499l82139l11845k48095k60224l40221m99089
13220f17453o19522m99191j33536J98320K33652O4032L8265K56928L48150R416
13210g20939l88615k14807M28471P18586K52805m55348q40006r38092q45049l02186
13200c305180O32418J230190J055551O23432M58345K57129k45151m25084J84480
$$ plain form
13191 466130 1235416 1617403 1201687 778487 967584 1210986 814019 70851 -442992 -841439
13181 -841439 -1279130 -1140733 19121 1345323 1670535 1192488 985849 1216673 1159235
13172 1159235 804311 1002612 1839130 2238255 1659331 993476 1077310 1302596 645986 -540482
13162 -540482 -833044 273966 1547523 1486245 177671 -736652 42867 1927610 3117138
13153 3117138 2714217 1584898 883421 448615 -563649 -1911479 -2252044 -984969 873126
13144 873126 2023464 2291787 2205066 1883398 1121228 200098 -187309 167089 718942 891756
13134 891756 674322 398450 260862 256904 359173 497304 433297 -61045 -800399 -1181181
13124 -1181181 -821057 -86651 336602 364225 571878 1218140 1710104 1411600 594579 70743
$$ packed form
13191D66130P69286L81987m15716m23200J89097K43402l96967p43168n13843l98447
13181h41439m37691J38397J159854J326202L25212m78047k06639K30824n7438
13172A159235l54924J98301Q36518L99125n78924o65855Q3834K25286o56610j186468
13162e40482k92562J107010J273557o1278j308574r14323P79519J884743J189528
13153C117138m02921j129319p01477m34806j012264j347830l40565J267075J858095
13144H73126J150338K68323q6721l21668p62170r21130l87407L54398N51853J72814
13134H91756k17434k75872j37588l958J02269J38131o4007m94342p39354l80782
13124a181181L60124P34406M23253K7623K07653O46262M91964k98504q17021n23836
$$ plain form
13114 70743 91717 155570 -164192 -690730 -970471 -756916 -182129 241616 -81153 -1130844
13104 -1130844 -2023394 -1953426 -1246523 -872467 -1022054 -943796 -266133 381919 404271 121447
13094 121447 119745 348213 452026 491527 669240 729135 343763 -135671 -42400 570535
13084 570535 945444 740295 526860 961692 1907537 2634612 2610244 1881180 879018 38222
13074 38222 -479999 -768830 -855109 -517049 358219 1311933 1562080 845219 -225666 -814123
13064 -814123 -721698 -425745 -357152 -382904 -112185 421605 667342 297815 -186422 -17859
13054 -17859 661924 736167 -407176 -1757520 -1710087 -122025 1384492 1423537 524981 254703
13044 254703 1027800 1614949 955893 -292601 -648868 105155 582461 -293283 -1795670
$$ packed form
13114G0743K0974O3853l19762n26538k79741K13555N74787M23745l22769j049691
13104a130844q92550O9968P06903L74056j49587P8258O77663O48052K2352k82824
13094A21447j702K28468J03813L9501J77713N9895l85372m79434R3271O12935
13084E70535L74909k05149k13435M34832R45845P27075k4368p29064j002162q40796
13074C8222n18221k88831q6279L38060Q75268R53714K50147p16861j070885n88457
13064h14123R2425K95953O8593k5752K70719N33790K45737l69527m84237J68563
13054a7859O79783P4243j143343j350344M7433J588062J506517L9045q98556k70278
13044B54703P73097N87149o59056j248494l56267P54023M77306q75744j502387
$$ plain form
13035 -1795670 -2390695 -1714950 -746374 -208664 228885 975856 1659717 1766562 1478565
13026 1478565 1239390 972874 402277 -245245 -582774 -816457 -1355501 -1841708 -1446356
13017 -1446356 -189742 847503 864157 258510 -42890 325741 968180 1210618 668372
13008 668372 -307171 -775761 -236055 646291 922940 726926 890807 1392464 1344538 590659
12998 590659 -11708 -223925 -907229 -2228090 -2849369 -1953030 -755790 -672780 -1096824
12989 -1096824 -617300 418213 440691 -661265 -1303208 -660784 344791 762030 788617
12980 788617 848780 832265 726900 874424 1170292 1038351 528060 376234 683467 675973
12970 675973 134067 -155394 178760 461023 319355 406115 1066461 1516806 1203225 839529
$$ packed form
13035a795670n95025O75745R68576N37710M37549P46971O83861J06845k87997
13026A478565k39175k66516n70597o47522l37529k33683n39044m86207L95352
13017a446356J256614J037245J6654o05647l01400L68631O42439K42438n42246
13008F68372r75543m68590N39706Q82346K76649j96014J63881N01657m7926p53879
12998E90659o02367k12217o83304j320861o21279Q96339J197240Q3010m24044
12989a096824M79524J035513K2478j101956o41943O42424J005575M17239K6587
12980G88617O0163j6515j05365J47524K95868j31941n10291j51826L07233p494
12970F75973n41906k89461L34154K82263j41668Q6760O60346M50345l13581l63696
$$ plain form
12960 839529 1153063 1661865 1708101 1689733 2147499 2544517 2145673 1330297 872082 674268
12950 674268 387226 469079 1314760 2086715 1852801 1205091 1189574 1281560 275659 -1203353
12940 -1203353 -1157096 714383 2340770 2135145 855046 50039 153608 792812 1651491
12931 1651491 2245966 1950720 972646 337999 353339 160725 -583787 -832953 164329 1439104
12921 1439104 1683622 1135790 856999 873878 431104 -346388 -514720 18793 251578 -217560
12911 -217560 -440270 354457 1392087 1335773 169076 -738942 -356302 925496 2038159
12902 2038159 2419513 2094795 1177875 33288 -369887 717299 2474206 2975601 1535491
12893 1535491 -263239 -616452 211381 652141 240321 -84283 178191 377703 25102
$$ packed form
12960H39529L13534N08802M6236j8368M57766L97018l98844q15376m58215j97814
12950F74268k87042Q1853Q45681P71955k33914o47710j5517R1986j005901j479012
12940a203353M6257J871479J626387k05625j280099q05007J03569O39204Q58679
12931A651491N94475k95246r78074o34647J5340j92614p44512k49166R97282J274775
12921A439104K44518n47832k78791J6879m42774p77492j68332N33513K32785m69138
12911b17560k22710P94727J037630n6314j166697r08018L82640J281798J112663
12902B038159L81354l24718r16920j144587m03175J087186J756907N01395j440110
12893A535491j798730l53213Q27833M40760m11820l24604K62474J99512l52601
$$ plain form
12884 25102 -451144 -661622 -904151 -1350497 -1492078 -980534 -313033 -123946 -332977 -415104
12874 -415104 -17346 967067 2344441 3387520 3317091 2283206 1197835 431027 -433426
12865 -433426 -1312403 -1274478 -109333 867878 525770 -449439 -691643 -214306 -126801 -737002
12855 -737002 -1189229 -883111 -157537 516372 1111106 1630260 1842107 1653573 1254847 769083
12845 769083 170077 -414541 -721069 -707274 -574741 -477471 -502303 -802514 -1379656 -1844256
12835 -1844256 -1782043 -1291420 -813610 -514921 -193535 252072 603962 596068 191607 -388361
12825 -388361 -778925 -711910 -264694 230687 540992 602761 333387 -218520 -580424 -297320
12815 -297320 265347 252420 -367555 -633919 -103522 362086 -44186 -738960 -633362 247155
$$ packed form
12884B5102m76246k10478k42529m46346j41581N11544O67501J89087k09031q2127
12874d15104L97758R84413J377374J043079p0429j033885j085371p66808q64453
12865d33426q78977L7925J165145R77211l42108r75209k42204M77337Q7505o10201
12855g37002m52227L06118P25574O73909N94734N19154K11847j88534l98726m85764
12845G69083n99006n84618l06528J3795J32533R7270k4832l00211n77142m64600
12835a844256O2213M90623M77810K98689L21386M45607L51890p894m04461n79968
12825c88361l90564O7015M47216M95381L10305O1769k69374n51907l61904K83104
12815b97320N62667j2927o19975k66364N30397M65608m06272o94774J05598Q80517
$$ plain form
12805 247155 945362 932679 396096 -443151 -1364977 -1804534 -1401324 -669119 -265786 64037
12795 64037 834565 1521689 1237962 518708 886616 2402698 3174188 1918371 -275269
12786 -275269 -1525429 -1394726 -678631 16661 419214 131322 -776907 -1257402 -541868
12777 -541868 490675 394337 -692950 -1271860 -734118 24801 413237 1067493 2359119
12768 2359119 3313716 3013178 2104054 1782091 1964381 1670510 775186 127589 106179 265143
12758 265143 422384 921106 1641441 1893900 1615972 1589273 2050714 2190076 1607657 1175701
12748 1175701 1661063 2489389 2797975 2756096 2737090 2115614 334291 -1494662 -1705449
12739 -1705449 -515719 273083 -54645 -416827 -71276 249328 -77979 -391345 -51209
$$ packed form
12805B47155O98207j2683n36583q39247r21826m39557M03210P32205M03333L29823
12795F4037P70528O87124k83727p19254L67908J516082P71490j255817k193640
12786b75269j250160J30703P16095O95292M02553k87892r08229m80495P15534
12777e41868J032543r6338j087287n78910N37742P58919L88436O54256J291626
12768B359119R54597l00538r09124l21963J82290k93871q95324o47597k1410J58964
12758B65143J57241M98722P20335K52459k77928k6699M61441J39362n82419m31956
12748A175701M85362Q28326L08586m1879j9006o21476j781323j828953k10787
12739a705449J189730P88802l27728l62182L45551L20604l27307l13366L40136
$$ plain form
12730 -51209 319291 -60076 -752185 -947285 -951867 -1631545 -2751113 -3031819 -1880140 -206280
12720 -206280 661000 340468 -493113 -1029380 -1134987 -1267224 -1653153 -1809055 -1164500 39757
12710 39757 974997 1276200 1316223 1417393 1380742 931392 152744 -610963 -899695 -317953
12700 -317953 891946 1670475 1252390 262470 -120432 162413 268515 134065 565959
12691 565959 1566932 2031291 1523569 1015411 1281478 1772389 1697982 1121804 407444 -326797
12681 -326797 -713626 -313812 248680 -245353 -1443677 -1406152 368071 1685422 707027
12672 707027 -1417202 -2496883 -2314993 -1902069 -1257410 36062 1002921 416155 -902448
12663 -902448 -1151261 -446376 -421870 -1248651 -1394275 -390205 443672 387457 334847 868045
$$ packed form
12730e1209L70500l79367o92109j95100m582o79678j119568k80706J151679J673860
12720b06280Q67280l20532q33581n36267j05607j32237l85929j55902O44555J204257
12710C9757R35240L01203M0023J01170l6651m49350p78648p63707k88732N81742
12700c17953J209899P78529m18085r89920l82902K82845J06102j34450M31894
12691E65959J000973M64359n07722n08158K66067M90911p4407n76178p14360p34241
12681c26797l86829L99814N62492m94033j198324L7525J774223J317351r78395
12672G07027k124229j079681J81890M12924O44659J293472R66859n86766j318603
12663i02448k48813P04885K4506q26781j45624J004070Q33877n6215n2610N33198
$$ plain form
12653 868045 1226240 895456 536023 582354 475347 53325 177714 1068443 1469647 581062
12643 581062 -457987 -307096 399117 124359 -966008 -1138168 188656 1351003 702680
12634 702680 -992052 -1456881 22515 1502283 890767 -1243553 -2489619 -1876006 -786623
12625 -786623 -334129 339076 2000239 3227854 2298110 160389 -676634 205691 858684
12616 858684 314421 -145633 389359 809653 74310 -866357 -692350 52063 -85664 -1098663
12606 -1098663 -1627825 -1057422 -196543 71740 -183170 -356297 -37502 799482 1844586
12597 1844586 2560037 2539675 1857997 958355 235447 -205047 -473294 -668236 -714827 -487266
12587 -487266 -103166 118052 69958 -58593 -200703 -476483 -712490 -501644 25915 251113
$$ packed form
12653H68045L58195l30784l59433M6331j07007m22022J24389Q90729M01204q88585
12643E81062j039049J50891P06213k74758j090367j72160J326824J162347o48323
12634G02680j694732m64829J479396J479768o11516k134320j246066O13613J089383
12625g86623M52494O73205J661163J227615r29744k137721q37023Q82325O52993
12616H58684n44263m60054N34992M20294p35343r40667J74007P44413j37727j012999
12606a098663n29162N70403Q60879K68283k54910j73127L18795Q36984J045104
12597A844586P15451k0362o81678q99642p22908m40494k68247j94942m6591K27561
12587d87266L84100K21218m8094j28551j42110k75780k36007K10846N27559K25198
$$ plain form
12577 251113 222955 792021 2023794 2643720 1976971 1192323 1309634 1251380 -268711 -1982371
12567 -1982371 -1601210 387497 1124079 -281163 -1460751 -582896 1023691 1316474 571520
12558 571520 322726 735497 784358 178392 -430729 -695784 -849850 -1042518 -1228241 -1399514
12548 -1399514 -1391549 -919261 -181104 244179 414486 1016394 1937830 2003021 833211 -200052
12538 -200052 114996 977790 835079 -291751 -1073262 -981482 -778528 -1041542 -1422298 -1527090
12528 -1527090 -1567547 -1798578 -1953553 -1642041 -1008981 -660797 -931543 -1391785 -1314513 -662840
12518 -662840 -199409 -311769 -276697 629701 1785980 2003593 1357219 1015573 1299391 1258360
12508 1258360 416748 -406135 -512629 -360424 -570082 -961286 -1213572 -1509772 -1878113
$$ packed form
12577B51113k8158N69066J231773O19926o66749p84648J17311n8254j520091j713660
12567a982371L81161J988707P36582j405242j179588Q77855J606587K92783p44954
12558E71520k48794M12771M8861o05966o09121k65055j54066j92668j85723j71273
12548a399514P965M72288P38157M25283J70307O01908R21436O5191j169810j033263
12538b00052L15048Q62794j42711j126830p81511R1780K02954k63014l80756j04792
12528a527090m0457k31031j54975L11512O33060L48184k70746m60242P7272O51673
12518f62840M63431j12360L5072R06398J156279K17613o46374l41646K83818m1031
12508A258360q41612q22883j06494J52205k09658l91204k52286k96200l68341
$$ plain form
12499 -1878113 -1801095 -1097258 -344513 73115 404039 596358 104025 -800776 -831351 380725
12489 380725 1446181 1290719 768628 1004404 1393491 798654 -262327 -368688 484870
12480 484870 1033053 853546 705391 896447 866186 490693 424025 879323 1217893 1060666
12470 1060666 846134 955663 1083060 824047 317442 28437 257284 925316 1553116
12461 1553116 1582085 1017409 452671 138460 -418515 -1391700 -1870094 -1061476 290823
12452 290823 807400 440018 318964 802153 1036060 624969 391659 940894 1583997 1456936
12442 1456936 881557 749540 1101048 1225334 932648 870913 1501401 2375332 2643696 1939535
12432 1939535 623721 -543740 -851955 -79152 1259344 2256254 2380817 1768713 716166
$$ packed form
12499a878113P7018P03837P52745M17628L30924J92319m92333r04801l0575J212076
12489C80725J065456j55462n22091K35776L89087n94837j060981j06361Q53558
12480D84870N48183j79507j48155J91056l0261l75493o6668M55298L38570j57227
12470A060666k14532J09529J27397k59013n06605k89005K28847O68032O27800
12461A553116K8969n64676n64738l14211n56975r73185m78394Q08618J352299
12452B90823N16577l67382j21054M83189K33907m11091k33310N49235O43103j27061
12442A456936n75379j32017L51508J24286k92686o1735O30488Q73931K68364p04161
12432A939535j315814j167461l08215P72803J338496R96910J24563o12104j052547
$$ plain form
12423 716166 -668422 -2006690 -2410946 -1462175 -135278 189633 -410961 -543634 403274
12414 403274 1456973 1673440 1294498 753298 -85971 -837462 -223244 1893471 3434520
12405 3434520 2706889 952543 455459 1131295 1188851 391318 121306 553627 426226
12396 426226 -308056 -236620 752282 1062459 325844 130633 980418 1193970 43329 -633840
12386 -633840 420472 1534417 853810 -651338 -1068309 -621802 -592003 -698921 -5701
12377 -5701 761780 298765 -696627 -456914 854314 1396211 664963 89414 592410 1464484
12367 1464484 1853611 1779193 1464027 986546 694412 810651 722664 -164709 -1066433 -620238
12357 -620238 1019812 2205817 2014574 1270797 1137070 1656203 2005200 1570749 583567
$$ packed form
12423G16166j384588j338268m04256R48771J326897L24911o00594j32673R46908
12414D03274J053699K16467l78942n41200q39269p51491O14218K116715J541049
12405C434520p27631j754346m97084O75836N7556p97533k70012M32321j27401
12396D26226p34282P1436R88902L10177p36615j95211Q49785K13552j150641o77169
12386f33840J054312J113945o80607j505148m16971M46507K9799j06918O93220
12377e701P67481m63015r95392K39713J311228N41897p31248n75549N02996Q72074
12367A464484L89127p4418l15166m77481k92134J16239q7987q87373r01724M46195
12357f20238J640050J186005j91243p43777j33727N19133L48997m34451r87182
$$ plain form
12348 583567 -17197 483255 1575412 1987822 1421877 983873 1415774 1956296 1746292
12339 1746292 1282831 1420500 1878233 1900466 1579151 1379446 1158051 756470 668423 964726
12329 964726 602683 -834894 -1810574 -897882 762609 921658 -546452 -1749558 -1639988
12320 -1639988 -915642 -336365 103337 401660 429633 479309 750056 712774 162952 141788
12310 141788 1345796 2490968 2041422 760496 515963 1241064 1351515 687391 546426
12301 546426 952893 484691 -923283 -1471004 -373851 931152 1175393 908006 977817
12292 977817 1110478 843275 438933 152264 -187816 -412300 -54586 575275 639215 194858
12282 194858 -19561 -121676 -682906 -903392 621966 3026759 3426543 852026 -2227839
$$ packed form
12348E83567o00764N00452J092157M12410n65945m38004M31901N40522k10004
12339A746292m63461J37669M57733K2233l21315j99705k21395m01581q8047K96303
12329I64726l62043j437577r75680R12692J660491J59049j468110j203106J09570
12320a639988P24346N79277M39702K98323K7973M9676K70747l7282n49822k1164
12310A41788J204008J145172m49546j280926k44533P25101J10451o64124j40965
12301E46426M06467m68202j407974n47721J097153J305003K44241k67387O9811
12292I77817J32661k67203m04342k86669l40080k24484L57714O29861O3940m44357
12282A94858k14419j02115n61230k20486J525358K404793L99784k574517l079865
$$ plain form
12273 -2227839 -3329822 -2841878 -2234009 -1418212 282465 1980882 2096626 763742 -264388
12264 -264388 114070 1325935 2203072 2197277 1541901 754886 88206 -537997 -984641 -747601
12254 -747601 116288 573901 93007 -153373 1040444 2623442 2503660 784376 -305572
12245 -305572 163003 660928 4953 -835547 -719695 -257350 -487573 -1062800 -1024190 -352033
12235 -352033 335205 825688 1251177 1677390 2232507 2876658 2885880 1633123 -47165 -622935
12225 -622935 -76766 242656 91712 658215 1975128 2245052 721244 -853027 -1007722
12216 -1007722 -802953 -1678373 -2723150 -2076006 39933 1599663 1503999 476684 -337565
12207 -337565 -400841 249676 1043234 1160703 443238 -385942 -775354 -910944 -947793 -693495
$$ packed form
12273b227839j101983M87944O07869Q15797J700677J698417J15744j332884j028130
12264b64388L78458J211865Q77137n795o55376p87015o66680o26203m46644K37040
12254g47601Q63889M57613m80894k46380J193817J582998j19782j719284j089948
12245c05572M68575M97925o55975q40500J15852M62345k30223n75227L8610O72157
12235c52033O87238M90483M25489M26213N55117O44151R222j252757j680288n75770
12225f22935N46169L19422j50944N66503J316913K69924j523808j574271j54695
12216a007722K04769q75420j044777O47144K115939J559730r5664j027315q14249
12207c37565o3276O50517P93558J17469p17465q29180l89412j35590l6849K54298
$$ plain form
12197 -693495 -427127 -832127 -1625860 -1566844 -413455 532146 523132 487666 1166282 1663642
12187 1663642 968030 -433948 -1547824 -2181154 -2267832 -1325352 294816 1072055 422704
12178 422704 -314520 -143333 43109 -470866 -538451 644437 1498031 475966 -1052413
12169 -1052413 -871288 403884 483230 -667667 -991796 -7630 618801 197288 -80477
12160 -80477 244870 -12566 -1244802 -2049979 -1677808 -1386013 -2087473 -2444180 -916971
12151 -916971 1552715 2679449 2034343 1442425 2199378 3306378 3066263 1544005 418455
12142 418455 541490 778051 -110903 -1376090 -1376564 -312406 -98548 -1298255 -2072521 -1034364
12132 -1034364 625234 1220676 1236889 2089202 3323780 3183538 1516199 114693 139762
$$ packed form
12197f93495K66368m05000p93733N9016J153389R45601r014l5466O78616M97360
12187A663642o95612j401978j113876o33330q6678R42480J620168P77239o49351
12178D22704p37224J71187J86442n13975o7585J182888Q53594j022065j528379
12169a052413J81125J275172P9346j150897l24129R84166O26431m21513k77765
12160h0477L25347k57436j232236q05177L72171K91795p01460l56707J527209
12151i16971K469686J126734o45106n91918P56953J107000k40115j522258j125550
12142D18455J23035K36561q88954j265187m74J064158K13858j199707p74266J038157
12132a034364J659598N95442J6213Q52313J234578j40242j667339j401506K5069
$$ plain form
12123 139762 864379 1174219 927514 542012 334319 522216 1057503 1408639 1206385 872191
12113 872191 845224 680752 -31945 -404898 666430 2442424 2956185 1759707 519147
12104 519147 556134 1254046 1490283 1340141 1446740 1611868 1083786 -87500 -826557 -251585
12094 -251585 1248358 2310655 1993575 824720 212837 771639 1691130 1974174 1642808
12085 1642808 1248532 910181 634841 977355 2285659 3584275 3383091 1673894 133582
12076 133582 101327 1169668 2104731 2424968 2503129 2545382 2222836 1448419 966866 1547004
12066 1547004 2630218 2582536 771373 -1353045 -2121705 -1923642 -2306792 -3246288 -3074724
12057 -3074724 -1232462 758246 1591257 1699349 1746701 1392101 618523 561443 1599207
$$ packed form
12123A39762P24617L09840k46705l85502k07693J87897N35287L51136k02254l34194
12113H72191k6967j64472p12697l72953J071328J775994N13761j196478j240560
12104E19147L6987O97912K36237j50142J06599J65128n28082j171286p39057N74972
12094b51585J499943J062297l17080j168855o11883N58802R19491K83044l31366
12085A642808l94276l38351k75340L42514J308304J298616k01184j709197j540312
12076A33582l2255J068341R35063L20237P8161M2253l22546p74417m81553N80138
12066A547004J083214m7682j811163k124418p68660J98063l83150r39496J71564
12057c074724J842262J990708Q33011J08092M7352l54600p73578n7080J037764
$$ plain form
12048 1599207 2137798 928304 -698439 -690909 670867 1409370 713520 -645070 -2065893
12039 -2065893 -3406145 -3967107 -3048215 -1362500 -349208 -239084 -159630 161169 199475
12030 199475 -186363 -738251 -1547857 -2470459 -2386600 -660102 1205463 1184743 -346503
12021 -346503 -1182493 -562862 77301 -383253 -1435464 -2310906 -2829532 -2603503 -1168520
12012 -1168520 698041 1414110 724755 -114736 -473505 -913813 -1348669 -658630 1110193
12003 1110193 2071945 1129177 -286347 -308313 814000 1496075 1091781 132613 -888295
11994 -888295 -1725107 -1910444 -1231668 -434428 -543818 -1559420 -2445573 -2358975 -1461759 -577487
11984 -577487 -321447 -557055 -634770 -174990 546293 1053452 1106662 507317 -832154 -2148273
$$ packed form
12048A599207N38591j209494j626743P530J361776P38503o95850j358590j420823
12039b065893j340252n60962R18892J685715J013292J10124P9454L20799L8306
12030A99475l85838n51888q09606r22602Q3859J726498J865565k0720j531246
12021c46503q35990O19631O40163m60554j052211q75442n18626K26029J434983
12012a168520J866561P16069o89355q39491l58769m40308m34856O90039J768823
12003A110193R61752r42768j415524k1966J122313O82075m04294r59168j020908
11994h88295q36812j85337O78776P97240j09390j015602q86153Q6598Q97216Q84272
11984e77487K56040k35608p7715M59780P21283N07159N3210n99345j339471j316119
$$ plain form
11974 -2148273 -2027380 -254984 1300936 854197 -830582 -1495726 -506385 604099 540198
11965 540198 -357853 -1228997 -1771378 -1923187 -1660127 -1367760 -1412733 -1325159 -508632 347753
11955 347753 -77753 -1642793 -2731183 -2537467 -1970911 -1997104 -2421319 -2673727 -2558661
11946 -2558661 -1899458 -627438 538763 702388 195274 88606 343424 54236 -471551
11937 -471551 112130 1603837 2065628 1010446 529095 1934772 3347165 2419328 -108485
11928 -108485 -1575685 -1038138 227614 1128396 1690508 1854804 1142684 -212565 -1041636
11919 -1041636 -528214 928904 2212358 2370838 1195134 -540590 -1553979 -1216868 -145741
11910 -145741 552267 337713 -517569 -1227137 -943379 438863 1831489 2045124 1372119
$$ packed form
11974b148273J20893J772396J555920m46739j684779o65144R89341J110484o3901
11965E40198q98051q71144n42381j51809K63060K92367m4973Q7574Q16527Q56385
11955C47753m25506j565040j088390J93716N66556k6193m24215k52408J15066
11946b558661O59203J272020J166201J63625n07114j06668K54818k89188n25787
11937d71551N83681J491707M61791j055182m81351J405677J412393r27837k527813
11928a08485j467200N37547J265752R00782N62112J64296p12120j355249q29071
11919a041636N13422J457118J283454J58480j175704j735724j013389L37111J071127
11910a45741O98008k14554q55282p09568K83758J382242J392626K13635o73005
$$ plain form
11901 1372119 1131442 1594796 1655738 869380 319252 717610 1083903 411047 -572920 -643512
11891 -643512 -172395 -541468 -1977284 -3261804 -3351443 -2289204 -765500 408519 729239
11882 729239 617126 1126607 2360694 2909818 1808698 254919 66576 1002479 1186541
11873 1186541 4319 -1092421 -953007 -364536 -586991 -1409760 -1673479 -1053885 -289012
11864 -289012 100571 345691 609190 504310 -113872 -490583 157576 1367391 1860512
11855 1860512 1284088 625628 609569 686946 283859 60547 810786 1829928 1765096 714481
11845 714481 28931 158682 187884 -408252 -1043200 -1325725 -1607792 -1788366 -1033134 657043
11835 657043 1927358 1878245 1209577 834902 585938 129631 -74757 247384 402840 41834
$$ packed form
11901A372119k40677M63354O0942p86358n50128L98358L66293o72856r83967p0592
11891f43512M71117l69073j435816j284520q9639J062239J523704J174019L20720
11882G29239j12113N09481J234087N49124j101120j553779j88343R35903J84062
11873A186541j182222j096740J39414N88471k22455q22769k63719O19594P64873
11864b89012L89583K45120K63499j04880o18182l76711O48159J209815M93121
11855A860512n76424o58460j6059P7377m03087k23312P50239J019142o4832j050615
11845G14481o85550J29751K9202n96136o34948k82525k82067j80574P55232J690177
11835F57043J270315m9113o68668l74675k48964m56307k04388L22141J55456l61006
$$ plain form
11825 41834 153074 1460627 2808499 2642937 1406470 887201 1576006 2187661 1698614
11816 1698614 499867 -564231 -1140823 -1134775 -481406 501475 1126859 963868 182067
11807 182067 -670948 -1000912 -540569 331603 992549 1475622 2354351 3476723 3749030
11798 3749030 2782614 1781879 1877012 2438977 2184071 1228043 718632 921525 1080819
11789 1080819 933966 978218 1283448 1345529 1173111 1262255 1370768 628715 -815007 -1547989
11779 -1547989 -876381 54086 -116446 -1060603 -1336424 -325372 1174040 1992476 1649293
11770 1649293 594039 -176475 29425 803145 997744 188452 -664817 -491185 372346
11761 372346 648013 -74552 -812441 -637017 65803 242030 -372795 -1031005 -1044832 -506703
$$ packed form
11825D1834J11240J307553J347872j65562j236467n19269O88805O11655m89047
11816A698614j198747j064098n76592O048O53369R82881O25384j62991p81801
11807A82067q53015l29964M60343Q72172O60946M83073Q78729J122372K72307
11798C749030r66416j000735R5133N61965k54906r56028n09411K02893J59294
11789A080819j46853M4252L05230O2081j72418Q9144J08513p42053j443722p32982
11779a547989O71608R30467j70532r44157k75821J011052J499412Q18436l43183
11770A649293j055254p70514K05900P73720J94599q09292q53269J73632Q63531
11761C72346K75667p22565p37889J75424P02820J76227o14825o58210j3827N38129
$$ plain form
11751 -506703 116917 609542 1008683 1382533 1907041 2851522 4086370 4793724 4129314
11742 4129314 2185213 -26571 -1550962 -2162008 -2103051 -1588493 -792113 -107506 -95576
11733 -95576 -1016282 -2407841 -3295693 -3063224 -2090806 -1242265 -745079 -45074 1127689
11724 1127689 2153965 2339928 1815321 1160061 586706 4839 -502096 -797958 -938420
11715 -938420 -832610 -130786 1019539 1672309 1234420 390812 121600 357589 484447
11706 484447 571948 997949 1351802 973971 258309 114227 351508 -53064 -1186480 -2046710
11696 -2046710 -2117647 -1746383 -994825 399342 1842584 2241087 1772042 1726824 2294195
11687 2294195 2224577 1211127 751005 1720593 2824351 2711946 2161240 2641044 3808521
$$ packed form
11751e06703O23620M92625L99141L73850N24508R44481J234848P07354o64410
11742D129314j944101k211784j524391o11046N8957N14558P96380O84607J1930
11733i5576r20706j391559q87852K32469R72418Q48541M97186P00005J172763
11724A127689J026276J85963n24607o55260n73355n81867n06935k95862j40462
11715i38420J05810P01824J150325O52770m37889q43608k69212K35989J26858
11706D84447Q7501M26001L53853l77831p15662j44082K37281m04572j133416q60230
11696b046710p0937L71264P51558J394167J443242L98503m69045m5218N67371
11687B294195o9618j013450m60122R69588J103758j12405n50706M79804J167477
$$ plain form
11678 3808521 4064693 2939035 1431944 371856 -243058 -478696 -262874 10140 -356174
11669 -356174 -1381717 -2218965 -2129337 -1281258 -458846 -174525 -173230 138893 802797 1186895
11659 1186895 967891 674608 702673 416055 -846564 -2392282 -2973669 -2595341 -2217651
11650 -2217651 -1984060 -1295752 -488884 -641275 -1535521 -1633667 -510979 448065 364813 116084
11640 116084 485000 765742 242896 -424594 -441128 -279911 -765648 -1746495 -2564847 -2929911
11630 -2929911 -2686626 -1753180 -769935 -597769 -799183 -104305 1243681 1453932 98524
11621 98524 -992458 -643164 -16968 -237181 -500756 -33816 181651 -632066 -1310581 -811040
11611 -811040 -147979 -362926 -486383 369881 878721 -80458 -775489 720040 2830176
$$ packed form
11678C808521K56172j125658j507091j060088o14914k35638K15822K73014l66314
11669c56174j025543q37248Q9628Q48079Q22412K84321J295L12123O63904L84098
11659A186895k19004k93283K8065k86618j262619j545718n81387L78328L77690
11650b217651K33591O88308Q06868j52391q94246r8146J122688R59044q3252k48729
11640A16084L68916K80742n22846o67490j6534J61217m85737r80847q18352l65064
11630b929911K43285R33446R83245J72166k01414O94878J347986K10251j355408
11621I8524j090982L49294O26196k20213k63575M66940K15467q13717o78515M99541
11611h11040O63061k14947j23457Q56264N08840r59179o95031J495529K110136
$$ plain form
11602 2830176 2627842 498284 -660889 -110729 217077 -512970 -1062778 -905145 -912745
11593 -912745 -1076444 -396805 727750 814099 234210 926820 2761228 3235936 1575939
11584 1575939 104572 378574 863544 14991 -997404 -606424 343679 294402 -268281
11575 -268281 -33809 448477 -342745 -2044363 -2649864 -1450748 79758 507535 110472
11566 110472 -49898 332542 792422 1057472 1381367 1895958 2066086 1266069 -117992
11557 -117992 -819855 -286898 527083 559300 112643 74892 387726 465332 542442 1181897
11547 1181897 1821964 1392633 259506 -37326 938188 2027806 2412510 2470290 2426263
11538 2426263 1765290 526215 -295341 -304125 -356952 -971885 -1317249 -561897 826094 1879536
$$ packed form
11602B830176k02334k129558j159173N50160L27806p30047n49808J57633p600
11593i12745j63699O79639J124555Q6349n79889O92610J834408M74708j659997
11584A575939j471367K74002M84970q48553j012395L90980R50103m9277n62683
11575b68281K34472M82286p91222j701618o05501J199116J530506M27777l97063
11566A10472j60370L82440M59880K65050L23895N14591J70128q00017j384061
11557a17992p01863N32957Q13981L2217m46657l7751L12834P7606P7110O39455
11547A181897O40067m29331j133127k96832R75514J089618L84704N7780m4027
11538B426263o60973j239075q21556q784n2827o14933l45364P55352J387991J053442
$$ plain form
11528 1879536 2304052 2209633 1609373 842793 625135 1048070 1349339 1196750 1269081 1967884
11518 1967884 2535109 2216819 1445931 1038620 942716 640887 210450 118136 345524 463728
11508 463728 335158 194393 264326 680290 1487075 2361996 2669018 2129622 1188431 500298
11498 500298 323494 527994 872578 1182449 1507351 1991239 2287345 1545847 -296899
11489 -296899 -1648887 -848993 1414444 2529767 1140459 -1239464 -2351045 -1913846 -1363858
11480 -1363858 -1556184 -1813268 -1227060 -88906 451976 -33789 -563756 -29907 1162617
11471 1162617 1588444 929776 436410 801855 930279 -143260 -1349919 -1140407 -36310
11462 -36310 159512 -852237 -1737741 -1871551 -1869254 -1854576 -1185681 -120551 170974 -336322
$$ packed form
11528A879536M24516r4419o00260p66580k17658M22935L01269j52589P2331O98803
11518A967884N67225l18290p70888m07311r5904l01829m30437r2314K27388J18204
11508D63728j28570j40765O9933M15964Q06785Q74921L07022n39396r41191o88133
11498E00298j76804K04500L44584L09871L24902M83888K96106p41498j842746
11489b96899j351988P99894K263437J115323j389308k379923j111581M37199N49988
11480a363858j92326k57084N86208J138154N40882m85765n29967N33849J192524
11471A162617M25827o58668m93366L65445J28424j073539j206659K09512J104097
11462c6310J95822j011749q85504j33810K297J4678O68895J065130K91525n07296
$$ plain form
11452 -336322 -304900 591392 926044 -70316 -1099457 -808726 276107 928851 1063423
11443 1063423 1263389 1501729 1412923 1066748 638151 63887 -340155 166176 1512726
11434 1512726 2471230 2214795 1333653 735723 564698 798114 1730409 3052742 3566188
11425 3566188 2723728 1494245 885404 652495 301947 179855 483933 321233 -948974
11416 -948974 -2302163 -2256116 -791139 1050155 2653322 3701003 3462433 1798151 289574
11407 289574 676803 2364650 3017588 1634012 -379697 -1336609 -1137323 -645337 -323460
11398 -323460 -85267 194478 533022 836719 853518 518513 392280 1210443 2794744 3872814
11388 3872814 3326313 1436417 -365334 -963431 -612925 -411867 -829396 -1179496 -783673
$$ packed form
11452c36322L1422Q96292L34652r96360j029141K90731J084833O52744J34572
11443A063423J99966K38340q8806l46175m28597n74264m04042N06331J346550
11434A512726R58504k56435q81142n97930j71025K33416R32295J322333N13446
11425C566188q42460j229483o08841k32909l50548j22092L04078j62700j270207
11416i48974j353189M6047J464977J841294J603167J047681k38570j664282j508577
11407B89574L87229J687847O52938j383576k013709r56912J99286M91986L21877
11398c23460K38193K79745L38544L03697J6799l35005j26233Q18163J584301J078070
11388C872814n46501j889896j801751n98097L50506K01058m17529l50100L95823
$$ plain form
11379 -783673 -104436 -37517 -462651 -494770 -58625 -29988 -606503 -784999 -16863 756373
11369 756373 544912 -148122 -212323 334995 553434 103925 -417377 -481498 -151633 328830
11359 328830 868514 1453342 2045715 2419038 2065332 819809 -348167 -109146 1263425
11350 1263425 1798856 458518 -1238618 -1344579 -248725 196395 -382056 -654170 -114137
11341 -114137 136879 -448586 -706275 309127 1613582 1714309 788214 134510 53792
11332 53792 -319376 -1247351 -1831835 -1466149 -675566 -33178 718713 1730268 2141354 1208520
11322 1208520 -227059 -675362 -202176 -316367 -1465165 -2074407 -803370 1412267 2620373
11313 2620373 2368032 1814014 1813228 2074500 2087686 1855251 1615957 1582557 1971264 2657599
$$ packed form
11379g83673O79237O6919m25134l2119M36145K8637n76515j78496P68136P73236
11369G56373k11461o93034o4201N47318K18439m49509n21302o4121L29865M80463
11359C28830N39684N84828N92373L73323l53706j245523j167976K39021J372571
11350A263425N35431j340338j697136j05961J095854M45120n78451k72114N40033
11341a14137K51016n85465k57689J015402J304455J00727r26095o53704q0718
11332E3792l73168r27975n84484L65686P90583O42388P51891J011555M11086r32834
11322A208520j435579m48303M73186j14191j148798o09242J271037K215637J208106
11313B620373k52341n54018p86K61272J3186k32435k39294l3400L88707O86335
$$ plain form
11303 2657599 2889352 2032265 573912 -254358 145921 1263295 2240359 2531901 1962796
11294 1962796 806709 -210283 -515899 -258439 87034 392309 737016 1024693 1258781
11285 1258781 1702657 2189186 1902948 572443 -805273 -1244647 -990891 -555289 412687
11276 412687 1963484 2647893 1330493 -560446 -694102 706474 1314820 419290 -248016
11267 -248016 357895 1090434 939517 616027 798888 767250 -39148 -776752 -714186 -492710
11257 -492710 -692932 -595602 314203 928923 115159 -1254546 -1402061 -185041 820343
11248 820343 498092 -595472 -1115732 -398362 887337 1391002 682222 -20560 522681
11239 522681 1578502 1407120 106052 -237394 1403659 3504137 4205353 3450666 2149400
$$ packed form
11303B657599K31753q57087j458353q28270M00279J117374R77064K91542n69105
11294A962796j156087j016992l05616K57460L45473L05275L44707K87677K34088
11285A258781M43876M86529k86238j330505j377716m39374K53756M35602R67976
11276D12687J550797O84409j317400j890939j33656J400576O08346q95530o67306
11267b48016O05911P32539j50917l23490J82861l1638q06398p37604O2566K21476
11257d92710k00222R7330R09805O14720q13764j369705j47515J217020J005384
11248H20343l22251j093564n20260P17370J285699N03665p08780p02782N43241
11239E22681J055821j71382j301068l43446J641053K100478P01216p54687j301266
$$ plain form
11230 2149400 767229 -314327 -453855 212987 588489 283470 202434 755788 1011677
11221 1011677 494402 201952 784005 1339999 1185978 1109200 1544011 1320987 -109815
11212 -109815 -990980 156672 1764803 1338584 -768513 -2060407 -1600309 -690079 -354923
11203 -354923 -401953 -774305 -1754473 -2766129 -2729939 -1719725 -848401 -584219 -472157 -262937
11193 -262937 -17237 526572 1355892 1481482 289799 -996083 -821492 351333 986099
11184 986099 1105085 1847667 2879262 2714701 1580370 1378001 2395993 2586699 948247
11175 948247 -731467 -721221 110932 80724 -660975 -893406 -472353 -69754 299105 906531
11165 906531 1161084 397585 -575420 -234679 1395799 2556827 2058057 740854 242137
$$ packed form
11230B149400j382171j081556j39528O66842L75502l05019q1036N53354K55889
11221A011677n17275k92450N82053N55994j54021p6778M34811k23024j430802
11212a09815q81165J147652J608131m26219k107097j291894M60098R10230L35156
11203c54923m7030l72352r80168j011656L6190J010214Q71324K64182J12062K09220
11193b62937K45700N43809Q29320J25590j191683j285882J74591J172825O34766
11184I86099J18986P42582J031595j64561j134331k02369J017992J90706j638452
11175I48247j679714J0246Q32153l0208p41699k32431M21053M02599L68859O07426
11165I06531K54553p63499r73005L40741J630478J161028m98770j317203m98717
$$ plain form
11156 242137 1011679 2027209 2101304 1076061 -158720 -599477 -55110 807405 1268396
11147 1268396 1262738 1241361 1504313 1833048 1741175 999332 -87138 -937243 -1281241 -1421020
11137 -1421020 -1778141 -2261501 -2328034 -1715154 -864889 -441350 -575661 -833095 -871852 -796472
11127 -796472 -733684 -450559 183239 615330 158407 -885818 -1414752 -1069177 -764159 -1185222
11117 -1185222 -1596426 -974551 342524 1183532 1269128 1268143 1376774 1045849 137212 -750489
11107 -750489 -1267206 -1689431 -2175474 -2488410 -2545217 -2457173 -2079595 -1363249 -944424 -1327164
11097 -1327164 -1709834 -945237 443860 759436 -222429 -765463 182897 1454880 1531895
11088 1531895 576778 -284882 -552008 -304527 434819 1351835 1591273 685781 -745483
$$ packed form
11156B42137P69542J015530P4095j025243j234781m40757N44367Q62515M60991
11147A268396n658k1377K62952L28735r1873p41843j086470q50105l43998j39779
11137a421020l57121m83360o6533O12880Q50265M23539j34311k57434l8757P5380
11127g96472O2788K83125O33798M32091m56923j044225n28934L45575L05018m21063
11117a185222m11204O21875J317075Q41008Q5596r85J08631l30925r08637q87701
11107g50489n16717m22225m86043l12936n6807Q8044L77578P16346M18825l82740
11097a327164l82670P64597J389097L15576r81865n43034R48360J271983P7015
11088A531895r55117q61660k67126K47481P39346R17016K39438r05492j431264
$$ plain form
11079 -745483 -1694558 -1647239 -628266 832563 1669664 1194742 178837 -12787 605878
11070 605878 793286 238514 28370 703655 1466115 1754354 1994532 2254878 1791579 578872
11060 578872 -286825 -344463 -343008 -501802 26246 1288440 2024478 1825962 1845244 2455556
11050 2455556 2318212 919716 -112656 388901 1294191 1425700 1520259 2228597 2300474
11041 2300474 834096 -593271 -304778 666380 496267 -245957 170064 1508244 2206785
11032 2206785 2110181 2094374 1876211 679237 -642765 -585976 453538 902643 728021
11023 728021 1106375 1849794 1578436 282415 -565784 -439621 -198517 -81032 663810
11014 663810 1904145 2307807 1403525 450938 700753 1851408 2652069 2368889 1491366
$$ packed form
11079g45483r49075M7319J018973J460829Q37101m74922j015905j91624O18665
11070F05878J87408n54772k10144O75285P62460K88239K40178K60346m63299j212707
11060E78872q65697n7638J455j58794N28048J262194P36038j98516J9282O10312
11050B455556j37344j398496j032372N01557R05290J31509R4559P08338P1877
11041B300474j466378j427367K88493R71158j70113p42224M16021J338180O98541
11032B206785r6604j5807k18163j196974j322002N6789J039514M49105j74622
11023G28021L78354P43419k71358j296021q48199J26163K41104J17485P44842
11014F63810J240335M03662r04282r52587K49815J150655Q00661k83180q77523
$$ plain form
11005 1491366 1269383 2239522 3158498 2368258 363401 -579229 200669 788061 106612
10996 106612 -128542 1408565 2905940 2260957 670790 557536 1479084 1164752 -456754
10987 -456754 -1340592 -796341 -26718 372709 839465 1159891 809247 558181 1421377 2560967
10977 2560967 2547001 1941356 2112382 2354566 1093277 -727550 -650277 1203085 2226375
10968 2226375 1508599 814851 1172871 1467371 896398 145928 -323325 -728679 -540104
10959 -540104 884433 2225610 1512473 -438587 -854548 537946 1088848 -231770 -1189059
10950 -1189059 -178778 1354407 1719296 1408399 1287015 884238 4666 -222285 588654
10941 588654 998259 160788 -580999 70973 1277590 1580898 1002426 389842 9788
$$ packed form
11005A491366k21983R70139R18976p90240k004857r42630P79898N87392o81449
10996A06612k35154J537107J497375o44983j590167j13254R21548l14332j621506
10987d56754q83838N44251P69623L99427M66756L20426l50644k51066Q63196J139590
10977B560967j3966o05645J71026K42184j261289j820827P7273J853362J023290
10968B226375p17776o93748L58020K94500n70973p50470m69253m05354J88575
10959e40104J424537J341177p13137j951060m15961J392494N50902j320618r57289
10950a189059J010281J533185L64889l10897j21384m02777q79572k26951Q10939
10941E88654M09605q37471p41787O51972J206617L03308n78472o12584l80054
$$ plain form
10932 9788 -175053 -55369 35696 -483546 -1192547 -1015087 -99242 296049 17823 229525
10922 229525 1140365 1637554 1576444 2146148 3344017 3445035 1840556 150689 -404719
10913 -404719 -503721 -663398 -73793 1313611 1871694 921931 139055 803874 1671295 1231701
10903 1231701 227852 105698 536633 329006 -421333 -776070 -583489 -282639 36310
10894 36310 289528 51571 -593931 -887323 -691538 -680991 -759594 45729 1504142 1922987
10884 1922987 824687 -147772 -38171 -109754 -1220914 -1909993 -902588 485433 539523
10875 539523 18240 590133 1840839 2196243 1705628 1537333 1586571 986746 354507 1021987
10865 1021987 2290041 1947752 -234033 -1809361 -1108573 549014 1063328 444765 247431
$$ packed form
10932I788j84841J19684R1065n19242p09001J77460R15845L95291k78226K11702
10922B29525R10840M97189o1110N69704J197869J01018j604479j689867n55408
10913d04719r9002j59677N89605J387404N58083r49763p82876O64819Q67421m39594
10903A231701j003849j22154M30935k07627p50339l54737J92581L00850L18949
10894C6310K53218k37957o45502k93392J95785J0547p8603Q05323J458413M18845
10884A922987j098300r72459J09601p1583j111160o89079J007405J388021N4090
10875E39523n21283N71893J250706L55404m90615j68295M9238n99825o32239O67480
10865A021987J268054l42289k181785j575328P00788J657587N14314o18563j97334
$$ plain form
10856 247431 1087351 2081568 2425042 2351575 2373538 2422945 2201109 1856542 1712442 1581877
10846 1581877 1040392 304706 60769 327557 371950 -4648 -122035 179300 -48948 -1262602
10836 -1262602 -2343697 -2144050 -1123456 -342058 175753 800775 1032210 390304 -245930
10827 -245930 218900 1284028 1713136 1538580 1663161 2138980 2407020 2555559 2789602
10818 2789602 2465789 1280292 461510 1001427 1767335 1352862 623274 1107394 2025935
10809 2025935 1605542 384467 273517 1035546 785408 -448453 -807943 -42693 257950
10800 257950 -164066 74295 1018547 1126065 239698 -103918 418159 565798 279973 844224
10790 844224 2087814 2389058 1697341 1574871 2089368 1817910 1063857 1627020 3067205
$$ packed form
10856B47431Q39920R94217L43474p3467K1963M9407k21836l44567j44100j30565
10846A581877n41485p35686k43937K66788M4393l76598j17387L01335k28248j213654
10836a262602j081095J99647J020594P81398N17811O25022K31435o41906o36234
10827b45930M64830J065128M29108j74556J24581M75819K68040J48539K34043
10818B789602l23813j185497q18782N39917P65908m14473p29588M84120R18541
10809B025935m20393j221075j10950P62029k50138j233861l59490P65250L00643
10800B57950m22016K38361R44252J07518q86367l43616N22077J47639k85825N64251
10790H44224J243590L01244o91717j22470N14497k71458p54053N63163J440185
$$ plain form
10781 3067205 2840388 743496 -465953 308341 965551 294023 -129055 618899 1092842
10772 1092842 653370 850541 2090444 2340913 819653 -354610 88312 449212 -526835
10763 -526835 -1368942 -912527 -431071 -764050 -478574 996259 1546297 23511 -1258814
10754 -1258814 -206594 1602346 1763001 884813 904660 1650390 1706686 1039565 456842
10745 456842 -123754 -979099 -1506921 -1291964 -811941 -119370 1345299 2871895 2716351
10736 2716351 1067031 243949 1057083 1746655 1481626 1779621 3213966 3984086 3304567
10727 3304567 2971096 3839092 3994522 2347047 867072 1171382 1918982 1713186 1612788
10718 1612788 2571036 3244374 2551071 1705175 1681630 1412887 409630 244604 1472229
$$ packed form
10781C067205k26817k096892j209449P74294O57210o71528m23078P47954M73943
10772A092842m39472J97171J239903K50469j521260j174263M42922L60900r76047
10763e26835q42107M56415M81456l32979K85476J474833N50038j522786j282325
10754a258814J052220J808940J60655q78188J9847P45730N6296o67121n82723
10745D56842n80596q55345n27822K14957M80023O92571J464669J526596j55544
10736B716351j649320q23082Q13134O89572k65029K97995J434345P70120o79519
10727C304567l33471Q67996J55430j647475j479975L04310P47600k05796j00398
10718A612788R58248O73338o93303q45896k3545k68743j003257j65026J227625
$$ plain form
10709 1472229 2082317 1021011 187024 923530 1710329 1392391 1357186 2326731 2483807
10700 2483807 1190710 1000653 3272453 5259414 4462249 2558006 2006885 1995459 926691
10691 926691 -81892 542021 1715681 1859650 1677439 2138572 2315115 1666180 1644545
10682 1644545 2724736 2958722 1759935 1608636 3525778 4656316 3147359 1503869
10674 1503869 2002039 2762832 1800734 972145 2104208 3041376 1638034 118180 1213258
10665 1213258 3225675 3194668 1956367 1870272 2364888 1841799 1316819 2237448 3251384
10656 3251384 2758141 1998417 2282578 2142430 483476 -726892 -124863 353781 -342547
10647 -342547 313391 3376293 5241504 3592840 1867460 3270823 5110602 4120236 2650643
$$ packed form
10709A472229O10088j061306q33987P36506P86799l17938l5205R69545J57076
10700B483807j293097j90057K271800J986961p97165j904243n51121j1426j068768
10691I26691j008583O23913J173660J43969j82211M61133J76543o48935k1635
10682A644545J080191K33986j198787j51299J917142J130538j508957j643490
10674A503869M98170P60793r62098q28589J132063R37168j403342j519854J095078
10665A213258K012417l1007j238301q6095M94616n23089n24980R20629J013936
10656C251384m93243p59724K84161j40148j658954j210368O02029M78644o96328
10647c42547O55938L062902J865211j648664j725380J403363J839779r90366j469593
$$ plain form
10638 2650643 3937215 5716271 4592327 2564958 2924280 3650965 1527859 -889850
10630 -889850 613126 4056663 4576470 2760954 2593291 3599919 2346869 -158591 199522
10621 199522 3126597 4391425 2906377 1328302 616808 -348725 -837324 686161 2749887
10612 2749887 2974495 2420877 3296657 4497156 4042632 3309403 4025503 4097040 1555736
10603 1555736 -637187 780704 3328614 3073763 1459488 1912754 3292134 2962608 2661153
10594 2661153 4746151 6400023 4428099 1998200 3433898 6176711 5468811 3159875
10586 3159875 3869554 6089305 5452175 3429780 4220399 6164484 4932073 2287300 2975846
10577 2975846 5692591 5751055 3904117 4004790 5007579 3907691 3143937 6076539 8849023
$$ packed form
10638B650643J286572J779056j123944k027369L59322P26685k123106k417709
10630h89850J502976L443537N19807j815516j67663J006628j253050k505460L58113
10621A99522K927075J264828j485048j578075p11494r65533m88599J523485K063726
10612B749887K24608n53618Q75780J200499m54524p33229P16100P1537k541304
10603A555736k192923J417891K547910k54851j614275M53266J379380l29526l01455
10594B661153K084998J653872j971924k429899J435698K742813p07900k308936
10586C159875P09679K219751o37130k022395P90619J944085j232411k644773O88546
10577B975846K716745N8464j846938J00673J002789j099888p63754K932602K772484
$$ plain form
10568 8849023 6290676 2088303 2994280 6749666 6501241 3557021 4307794 7623656 7187945
10559 7187945 3866050 3866945 6669597 6500127 3905935 4284772 6837715 6438955 4323966
10550 4323966 5473935 7977824 6682380 4291695 6580310 10095819 7676548 2534735
10542 2534735 3023440 7100676 6577410 3059550 4207364 7820700 6019544 1786251
10534 1786251 4111674 9910150 8865327 3307220 4248101 10263041 10284076 5245323 6090577
10525 6090577 11895833 11617880 6398620 7720064 14249166 13740884 7287041 7510993 13350242
10516 13350242 12113382 5876758 8577915 17376446 16194619 7618368 9653035 20281963
10508 20281963 19647856 9004513 10096605 22804224 23957489 12964898 14518608 29273783
$$ packed form
10568H849023k558347m202373R05977L755386k48425k944220P50773L315862m35711
10559G187945l321895Q95K802652j69470k594192L78837K552943l98760k114989
10550D323966J149969K503889j295444k390685K288615L515509k419271n141813
10542B534735M88705M077236n23266l517860J147814L613336j801156m233293
10534A786251K325423N798476j044823n558107R40881O014940K1035n038753Q45254
10525F090577N805256k77953n219260J321444O529102n08282o453843K23952N839249
10516A3350242j236860o236624K701157Q798531j181827q576251K034667J0628928
10508B0281963o34107j0643343J092092J2707619J153265j0992591J553710J4755175
$$ plain form
10500 29273783 30171781 16858067 20157670 40244057 40855696 21915457 28221973 61116386
10492 61116386 63429618 31791066 46621365 118844699 107079192 -94162019 -352803688
10485 -352803688 -430048953 -287227095 -118450027 -74492154 -100442399 -86678119 -41988236
10478 -41988236 -33438455 -54236421 -51165374 -26113629 -20972530 -35240255 -34342606 -18108727
10470 -18108727 -15810577 -27604742 -27554100 -14956750 -12854111 -22427042 -23151314 -13391740
10462 -13391740 -11126758 -17843152 -17625816 -9520367 -8054174 -13656322 -12736829 -5456030
10454 -5456030 -5249611 -12064656 -12533474 -5876123 -4678447 -10359504 -11465933 -6402279
10446 -6402279 -5558489 -10299542 -10815302 -5815593 -4736178 -9139134 -10216771 -6089395
$$ packed form
10500B9273783Q97998j3313714L299603K0086387O11639j8940239O306516L2894413
10492F1116386K313232l1638552J4830299P2223334j1765507k01241211k58641669
10485c52803688p7245265J42821858J68777068M3957873k5950245J3764280M4689883
10478d1988236Q549781k0797966L071047K5051745N141099j4267725Q97649J6233879
10470a8108727K298150j1794165N0642J2597350K102639r572931p24272R759574
10462a3391740K264982o716394K17336Q105449J466193n602148R19493P280799
10454e456030K06419o815045m68818O657351J197676n681057j106429N063654
10446f402279Q43790m741053n15760M999709J079415m402956j077637M127376
$$ plain form
10438 -6089395 -4522197 -7240925 -7543517 -4517316 -4544105 -7897219 -8112962 -5089761 -5143890
10429 -5143890 -8067973 -7507584 -3935536 -4073391 -7742665 -8190843 -5070462 -4442057 -6433313
10420 -6433313 -5459094 -2142191 -2528286 -5924052 -5830401 -2507116 -2407414 -5595466 -5949750
10411 -5949750 -3484836 -4158607 -7587245 -7319950 -3519633 -3054641 -6444014 -6967023 -3689599
10402 -3689599 -3163953 -6635860 -7513564 -3782586 -1607874 -3903330 -5832209 -4471981
10394 -4471981 -3202546 -3840476 -3577134 -2085886 -2877642 -5569062 -5420961 -2299157 -1493584
10385 -1493584 -4083459 -5208226 -3460177 -3131728 -5354462 -5826034 -3375143 -2197402
10377 -2197402 -3480607 -3268025 -816776 -647815 -3847618 -5541923 -3671887 -2410065
$$ packed form
10438f089395J567198k718728l02592L026201k6789l353114k15743L023201n4129
10429e143890k924083N60389L572048j37855l669274m48178L120381O28405j991256
10420f433313R74219L316903l86095l395766R3651L323285R9702l188052l54284
10411e949750K464914o73771l428638K67295L800317M64992l389373n23009L277424
10402c689599N25646l471907q77704L730978K174712k295456j928879J360228
10394d471981J269435o37930K63342J491248p91756k691420J48101L121804Q05573
10385a493584k589875j124767J748049L28449k222734m71572K450891J177741
10377b197402j283205K12582K451249J68961l199803j694305J870036J261822
$$ plain form
10369 -2410065 -4132018 -5574359 -4723097 -4220532 -5184144 -4656589 -1880156 -395453 -1445476
10360 -1445476 -1834641 -476724 -390713 -2152337 -2242640 -99393 86909 -3034710 -5338804
10351 -5338804 -4532794 -3460977 -3842795 -3463652 -1969473 -2603576 -5551761 -6322227 -3509207
10342 -3509207 -1482375 -2544824 -3234271 -1517459 -761186 -2911348 -4344809 -2556502
10334 -2556502 -809967 -1902118 -3073891 -1532616 278657 -566708 -2219726 -1942190
10326 -1942190 -1007477 -1581795 -2553829 -2278660 -1932141 -2738163 -3265602 -2454415 -1899276
10317 -1899276 -2549096 -2767293 -1966147 -2173100 -3713835 -3684937 -1222530 189194 -1570751
10308 -1570751 -3673634 -3381014 -2291636 -2458939 -2554280 -1239878 -374058 -1456696 -2550667
$$ packed form
10369b410065j721953j442341Q51262N02565r63612N27555K776433J484703j050023
10360a445476l89165J357917Q6011j761624r0303K143247J86302l121619k304094
10351e338804Q06010J071817l81818L79143J494179o34103k948185p70466K813020
10342c509207K026832j062449o89447J716812P56273k150162j433461J788307
10334b556502J746535j092151j171773J541275J811273q45365j653018K77536
10326a942190R34713n74318r72034K75169L46519q06022n27439Q11187N55139
10317a899276o49820k18197Q01146k06953j540735K8898K462407J411724j759945
10308a570751k102883K92620J089378j67303r5341J314402Q65820j082638j093971
$$ plain form
10299 -2550667 -1965261 -1418720 -2423010 -3131547 -1944704 -736324 -1345040 -2280394 -1987198
10290 -1987198 -1930123 -3344613 -4397228 -3718122 -3245360 -4318452 -4565794 -2252425 -185754
10281 -185754 -1291966 -3461618 -3073063 -998533 -692120 -2321440 -3155416 -2488081 -2201226
10272 -2201226 -3100487 -3956066 -3820712 -2884995 -1526653 -283146 33863 -488625 -729884
10263 -729884 -463806 -711607 -1434945 -1195709 -14478 166330 -970196 -1133202 499775
10254 499775 1379863 -300478 -2585974 -3019634 -2165106 -1666556 -1430145 -1011507 -1348937
10245 -1348937 -2830181 -3837333 -3280674 -2462181 -2635809 -2968739 -2586319 -2251527 -2409318
10236 -2409318 -2039104 -938319 -520630 -1013230 -814300 61970 -678629 -3260222 -4536504
$$ packed form
10299b550667N85406N46541j004290p08537J186843J208380o08716r35354K93196
10290a987198N7075j414490j052615O79106M72762j073092k47342K313369K066671
10281a85754j106212k169652L88555K074530L06413j629320q33976O67335K86855
10272b201226q99261q55579J35354R35717J358342J243507L17009n22488k41259
10263g29884K66078k47801p23338K39236J181231J80808j136526j63006J632977
10254D99775Q80088j680341k285496m33660Q54528M98550K36411M18638l37430
10245a348937j481244j007152N56659Q18493j73628l32930L82420L34792j57791
10236b409318L70214J100785M17689m92600J98930Q76270p40599k581593j276282
$$ plain form
10227 -4536504 -3004889 -1327165 -1585433 -1954834 -799699 -120223 -1632525 -3038043 -1828123
10218 -1828123 361163 842852 385379 918479 1482400 319353 -1379511 -1600277 -1241704
10209 -1241704 -2107523 -3233546 -2803044 -1767963 -2018602 -2798537 -2397266 -1563395 -1791300
10200 -1791300 -2083553 -953913 169633 -792180 -2559339 -2441914 -837027 -136236 -486007
10191 -486007 -255163 466669 364716 -208599 -184468 -411533 -1988217 -3292545 -2234784
10182 -2234784 -227737 -191639 -1704625 -2004289 -896322 -598330 -1232475 -602045 1532176
10173 1532176 2761325 1925366 358644 -1015284 -2652857 -4130274 -3931475 -2023075
10165 -2023075 -136756 774925 1075130 585241 -1263577 -3471124 -4178741 -3381314 -2645912
$$ packed form
10227d536504J531615J677724k58268l69401J155135O79476j512302j405518J209920
10218a828123K189286M81689m57473N33100N63921j163047j698864k20766L58573
10209a241704q65819j126023M30502J035081k50639p79935M01271Q33871k27905
10200a791300k92253J129640J123546r61813j767159J17425J604887P00791l49771
10191d86007K30844P21832j01953n73315K4131k27065j576684j304328J057761
10182b234784K007047L6098j512986k99664J107967K97992o34145O30430K134221
10173A532176J229149q35959j566722j373928j637573j477417J98799J908400
10165b023075J886319R11681L00205m89889j848818k207547p07617P97427P35402
$$ plain form
10156 -2645912 -2321206 -1420498 -64240 450606 -64918 -650101 -1206248 -2240413 -3002303
10147 -3002303 -2390760 -1350756 -1711020 -2940194 -2899004 -1685940 -1699486 -3588420 -5071608
10138 -5071608 -4450194 -2723900 -1454539 -795181 -408141 -343996 -305355 253597 850658
10129 850658 442564 -610735 -790081 161028 791143 162245 -1074490 -1974173 -2207749
10120 -2207749 -1730673 -966147 -1007292 -2133294 -2726109 -1456200 223835 5887 -1524983
10111 -1524983 -1716934 -110232 989620 340314 -661163 -780095 -699475 -1121777 -1402275
10102 -1402275 -1050950 -676263 -573774 -140056 560971 422988 -690796 -1250966 -335479
10093 -335479 849063 720494 -553068 -1612245 -1746327 -1398380 -1349132 -1851019 -2315060
$$ packed form
10156b645912L24706R00708J356258N14846n15524n85183n56147j034165p61890
10147c002303O11543J040004l60264j229174M1190J213064j3546j888934j483188
10138e071608O21414J726294J269361O59358L87040O4145L8641N58952N97061
10129H50658m08094j053299j79346R51109O30115o28898j236735q99683k33576
10120b207749M77076P64526m1145j126002n92815J269909J680035k17948j530870
10111a524983j91951J606702J099852o49306j001477j18932Q0620m22302k80498
10102a402275L51325L74687J02489M33718P01027j37983j113784n60170R15487
10093c35479J184542j28569j273562j059177j34082L47947M9248n01887m64041
$$ plain form
10084 -2315060 -1913438 -750673 104757 188116 304460 934885 1250837 799797 688477
10075 688477 1561042 1964858 700744 -753812 -588494 35531 -1056735 -2970774 -2994054
10066 -2994054 -1265049 -576791 -1591582 -1881385 -263684 1282519 983401 -371154 -1462702
10057 -1462702 -2211856 -2487343 -1492158 465286 1679689 1396170 539197 -321899 -1500278
10048 -1500278 -2346244 -1490228 449876 1074895 -92545 -806351 102307 947216 397514
10039 397514 -336339 -27288 443835 124806 -217875 29424 -35539 -682122 -354972 1574288
10029 1574288 3114661 2672867 1644588 1894016 2608329 1945236 173991 -1124657 -1684529
10020 -1684529 -2238248 -2654988 -2319685 -1488926 -736506 -1147 651773 637975 291007 970381
$$ packed form
10084b315060M01622J162765Q55430Q3359J16344O30425L15952m51040j11320
10075F88477Q72565M03816j264114j454556J65318O24025j092266j914039k3280
10066b994054J729005O88258j014791k89803J617701J546203k99118j354555j091548
10057a462702p49154k75487R95185J957444J214403k83519q56973q61096j178379
10048a500278q45966Q56016J940104O25019j167440p13806R08658Q44909n49702
10039C97514p33853L09051M71123l19029l42681K47299o4963o46583L27150J929260
10029A574288J540373m41794j028279K49428P14313o63093j771245j298648n59872
10020a684529n53719m16740L35303Q30759P52420P35359O52920j3798l46968O79374
$$ plain form
10010 970381 2526886 2705073 596674 -1518127 -1645745 -1104946 -1800276 -2734024 -2054652
10001 -2054652 -671233 -652211 -1441867 -965325 456039 591404 -775337 -1498818 -558889
9992 -558889 810269 1511255 1730079 1665896 1226981 947284 1335811 1588998 751996 -371622
9982 -371622 -381879 337998 487880 328439 975799 1925035 1774897 868266 676186 1067588
9972 1067588 792774 129976 242872 429472 -865422 -2612814 -2188688 115957 1087150
9963 1087150 -390259 -1745706 -1043894 407600 994076 1275099 2017212 2408647 1831473
9954 1831473 1177268 1010651 503716 -617976 -1187598 -796548 -763749 -1750122 -2438705 -1716165
9944 -1716165 -266758 936034 1811467 2135512 1396441 304524 294857 1116107 1267338
$$ packed form
10010I70381J556505J78187k108399k114801j27618N40799o95330r33748O79372
10001b054652J383419J9022p89656M76542J421364J35365j366741p23481R39929
9992e58889J369158P00986K18824o4183m38915k79697L88527K53187q37002j123618
9982c71622j0257P19877J49882j59441O47360R49236j50138r06631j92080L91402
9972A067588k74814o62798J12896J86600j294894j747392M24126K304645R71193
9963A087150j477409j355447P01812J451494N86476K81023P42113L91435n77174
9954A831473o54205j66617n06935j121692n69622L91050L2799r86373o88583P22540
9944a716165J449407J202792Q75433L24045p39071j091917r667Q21250J51231
$$ plain form
9935 1267338 945699 1668182 2878304 2441622 869888 1059676 3091814 3643890 1743216
9926 1743216 480435 1390950 1975719 889426 591486 2266884 3155838 1871160 1247186
9917 1247186 2714432 3267632 1590147 1335775 4148131 5648565 3253619 1398764 3346528
9908 3346528 4892421 2848703 2039776 5796325 7883375 3914419 1888363 8718995
9900 8718995 15529812 12764358 10907707 23624005 35417601 14894500 -35380740 -71162866
9892 -71162866 -61889965 -29401418 -13343866 -18893350 -22510383 -14590675 -8185399 -10618224
9884 -10618224 -12891249 -9463676 -7356418 -10568778 -12288796 -8407576 -4990199 -6476215
9876 -6476215 -8174381 -6153320 -4269627 -5750708 -6944653 -4958481 -3333375 -4778055
$$ packed form
9935A267338l21639P22483J210122m36682j571734J89788K032138N52076j900674
9926A743216j262781R10515N84769j086293k97940J675398Q88954j284678o23974
9917A247186J467246N53200j677485k54372K812356J500434k394946j854855J947764
9908C346528J545893k043718q08927L756549K087050l968956k026056O830632
9900H718995O810817k765454j856651J2716298J1793596k0523101n0275240l5782126
9892g1162866R272901L2488547J6057552n549484l617033P919708O405276k432825
9884a0618224k273025L427573K107258l212360j720018L881220L417377j486016
9876f476215j698166K021061J883693j481081j193945J986172J625106j444680
$$ plain form
9868 -4778055 -5729328 -3401603 -1358112 -2796192 -4604688 -3401014 -1731164 -2929855
9860 -2929855 -4951022 -4594170 -3325738 -3766500 -4418762 -2845650 -587526 -282539 -1013549
9851 -1013549 -716923 -225943 -1020579 -1898539 -1554614 -1524173 -3074005 -4219904 -3284602
9842 -3284602 -2262212 -3129812 -4056213 -2968161 -1632860 -2246900 -3097337 -1805315 32781
9833 32781 -190478 -1189155 -394554 922733 -120546 -2587486 -3234207 -2015925 -1604846
9824 -1604846 -2579044 -3320305 -3648994 -4464617 -4737556 -2913715 -515502 -394747 -2065967
9815 -2065967 -2610071 -1605732 -1298618 -2276048 -2803487 -2365591 -2303408 -2885201 -2996507 -2730872
9805 -2730872 -3204721 -3904809 -3275201 -1828331 -1648060 -2887713 -3719554 -3622030 -3698319 -3848317
$$ packed form
9868d778055r51273K327725K043491j438080j808496J203674J669850j198691
9860b929855k021167L56852J268432m40762o52262J573112K258124L04987p31010
9851a013549K96626M90980p94636q77960L43925L0441j549832j145899R35302
9842c284602J022390q67600r26401J088052J335301o14040q50437J292022J838096
9833C2781k23259r98677P94601J317287j043279k466940o46721J218282M11079
9824a604846r74198p41261l28689q15623k72939J823841K398213J20755j671220
9815b065967n44104J004339L07114r77430n27439M37896O2183n81793j11306K65635
9805b730872m73849p00088O29608J446870J80271j239653q31841R7524p6289j49998
$$ plain form
9795 -3848317 -2783291 -962978 -402451 -1243927 -1486173 -510628 35677 -598779 -1052027
9786 -1052027 -527579 -115248 -590883 -1167730 -1246427 -1369841 -1723190 -1568688 -814154 -427259
9776 -427259 -770737 -1111709 -1138735 -1410420 -2021183 -2297853 -2023549 -1667287 -1449458 -1398164
9766 -1398164 -1923641 -2979145 -3338965 -2327522 -1428498 -2262009 -3836137 -4010540 -2872086
9757 -2872086 -2201676 -2296788 -2012208 -1436091 -1669401 -2230713 -1602684 -280296 -333233 -1840093
9747 -1840093 -2690497 -2141699 -1589271 -1472696 -555791 1050375 1281064 -425021 -1938966
9738 -1938966 -1905019 -1676435 -2442834 -3015597 -2122122 -692995 -129427 -116321 182112 287394
9728 287394 -645660 -2212478 -3377791 -3768119 -3479481 -2616091 -1685520 -1402712 -1624513
$$ packed form
9795c848317J065026J820313N60527q41476k42246R75545N46305o34456m53248
9786a052027N24448M12331m75635n76847p8697j23414l53349J54502P54534L86895
9776d27259l43478l40972k7026k71685o10763k76670K74304L56262K17829N1294
9766a398164n25477j055504l59820J011443Q99024q33511j574128j74403J138454
9757b872086O70410r5112K84580N76117k33310n61312O28029J322388n2937j506860
9747a840093q50404N48798N52428J16575R16905J606166K30689j706085j513945
9738a938966L3947K28584p66399n72763Q93475J429127N63568J3106K98433J05282
9728B87394r33054j566818j165313l90328K88638Q63390R30571K82808k21801
$$ plain form
9719 -1624513 -1528837 -1016236 -698541 -591688 -392289 -841098 -2810629 -5120284 -5563410
9710 -5563410 -4237032 -3380544 -3659449 -3386224 -1988572 -1215362 -1803467 -1936490 -572100
9701 -572100 485528 -272193 -1366068 -921525 251752 464936 122056 466481 930186
9692 930186 222915 -1086626 -1421511 -759542 -251424 -90514 233835 325151 -453677 -1319893
9682 -1319893 -1067194 -253721 -437998 -1541943 -1937473 -1126247 -472480 -966112 -1804543
9673 -1804543 -1715195 -597385 614450 1003946 355384 -673884 -1053156 -520893 -20291
9664 -20291 -475989 -1504604 -2025009 -1776551 -1391999 -1221757 -1016062 -707396 -580281 -513272
9654 -513272 109121 1356305 2266768 1940202 725542 -308545 -918732 -1887866 -3420917
$$ packed form
9719a624513R5676N12601L17695J06853J99399m48809j969531k309655m43126
9710e563410J326378Q56488k78905K73225J397652P73210n88105j33023J364390
9701e72100J057628p57721j093875M44543J173277K13184l42880L44425M63705
9692I30186p07271j309541l34885O61969N08118J60910L24349R1316p78828q66216
9682a319893K52699Q13473j84277j103945l95530Q11226O53767m93632q38431
9673a804543Q9348J117810J211835L89496o48562j029268l79272N32263N00602
9664b0291m55698j028615n20405K48458L84552J70242K05695L08666J27115O7009
9654e13272O22393J247184R10463l26566j214660j034087o10187r69134j533051
$$ plain form
9645 -3420917 -4212579 -3004632 -574819 1035867 1155283 964340 1225967 1229370 650100
9636 650100 642680 1792027 2572532 1553233 -151735 -552188 181758 473443 242487 672112
9626 672112 1614880 1729469 1042240 931556 1481488 1231161 -159631 -1271363 -1337423 -1113836
9616 -1113836 -955946 -307735 358193 -518309 -2826782 -4204908 -3323479 -1769505 -1476834
9607 -1476834 -2100471 -2239123 -1712528 -1297281 -1364990 -1834156 -2513956 -2859113 -2403844 -1696378
9597 -1696378 -1526901 -1291577 65015 1548386 957659 -1450211 -2840390 -2102322 -1418946
9588 -1418946 -2310049 -3048528 -1923285 -434790 -788772 -2229956 -2480094 -1402230 -733601
9579 -733601 -1109938 -1566990 -1409868 -828128 -169373 136782 -316851 -954294 -578027 393114
$$ packed form
9645c420917p91662J207947K429813J610686J19416j90943K61627L403n79270
9636F50100p420J149347P80505j019299j704968m00453P33946K91685k30956M29625
9626F72112R42768J14589o87229j10684N49932k50327j390792j111732o6060K23587
9616a113836J57890O48211O65928q76502k308473j378126Q81429J553974K92671
9607a476834o23637j38652N26595M15247o7709m69166o79800l45157M55269P07466
9597a696378J69477K35324J356592J483371n90727k407870j390179P38068O83376
9588a418946q91103p38479J125243J488495l53982j441184k50138J077864O68629
9579g33601l76337m57052J57122N81740O58755L06155m53633o37443L76267R71141
$$ plain form
9569 393114 -207682 -2861492 -4762463 -3545152 -827534 241171 -533861 -926503 -216021
9560 -216021 168037 -524933 -1362767 -1506130 -1033172 -102217 1007283 1286437 135756
9551 135756 -1142603 -690506 1224463 2476830 1930295 504190 -541862 -915851 -787686
9542 -787686 -255439 434063 966039 1288494 1313448 696288 -421563 -1049183 -553507 339804
9532 339804 535242 -84827 -1010146 -1950494 -2541763 -2203609 -1247177 -1114156 -2469075 -4042513
9522 -4042513 -4367326 -3532947 -2214174 -414903 1476057 1951245 527641 -699647 318363
9513 318363 2470107 3089483 1754510 264536 -431505 -891168 -1145410 -408825 1085295
9504 1085295 1976342 1727217 1074919 525205 -35661 -300730 270522 1195971 1380248 791735
$$ packed form
9569C93114o00796k653810j900971J217311K717618J068705p75032l92642P10482
9560b16021L84058o92970q37834j43363M72958R30955J109500K79154j150681
9551A35756j278359M52097J914969J252367n46535j426105j046052l73989J28165
9542g87686N32247O89502N31976L22455K4954o17160j117851o27620M95676Q93311
9532C39804J95438o20069r25319r40348n91269L38154R56432J33021j354919j573438
9522d042513l24813Q34379J318773J799271J890960M75188j423604j227288J018010
9513C18363K151744O19376j334973j489974o96041m59663k54242P36585J494120
9504A085295Q91047k49125o52298n49714n60866k65069N71252R25449J84277n88513
$$ plain form
9494 791735 371837 366739 131272 -490693 -941348 -1047741 -1129487 -1164213 -997784 -1095531 -1903611
9483 -1903611 -2825442 -3008035 -2667212 -2439641 -2090956 -1240576 -614217 -978871 -1533775 -1077716
9473 -1077716 -101754 109662 -220025 32790 615154 447453 -37808 486611 1543989
9464 1543989 1292542 -309682 -1294491 -906402 -570651 -1162413 -1708833 -1514201 -1306382
9455 -1306382 -1383426 -730714 979521 2399546 2586956 2347879 2431817 2065938 547560
9446 547560 -1135326 -1638869 -1177635 -904159 -1183107 -1506733 -1508554 -1239532 -864378 -556211
9436 -556211 -303082 246196 1158364 1650712 1044458 -6685 -362730 -121533 -154483 -360576
9426 -360576 -97504 318 -1266261 -3178625 -3612370 -2304277 -1284156 -1566403 -1851780
$$ packed form
9494G91735m19898n098k35467o21965m50655j06393q1746l4726J66429r7747q08080
9483a903611r21831j82593L40823K27571L48685Q50380O26359l64654n54904M56059
9473a077716R75962K11416l29687K52815N82364j67701m85261N24419J057378
9464A543989k51447j602224r84809L88089L35751n91762n46420J94632K07819
9455a306382p7044O52712J710235J420025J87410k39077Q3938l65879j518378
9446E47560j682886n03543M61234K73476k78948l23626j821K69022L75154L08167
9436e56211K53129N49278R12168M92348o06254j051143l56045K41197l2950k06093
9426c60576K63072R7822j266579j912364m33745J308093J020121k82247k85377
$$ plain form
9417 -1851780 -1286403 -951793 -1408363 -1249955 262572 1394308 733733 -154960 876396
9408 876396 3031490 3783661 2558837 952260 30109 -417377 -436573 173760 688882
9399 688882 66365 -1248110 -1690142 -791928 357275 871573 930606 769071 98448 -1111770
9389 -1111770 -2230314 -2679373 -2423485 -1662490 -647525 204983 598010 706499 777708
9380 777708 615024 -1978 -710715 -1030421 -1112967 -1316198 -1367260 -819702 -127087 -278378
9370 -278378 -1314499 -2092953 -1766581 -809806 -286986 -634317 -1474012 -2220222 -2496653 -2163609
9360 -2163609 -1311569 -322423 221056 -70557 -943158 -1584166 -1406882 -683792 -153007 -117611
9350 -117611 -260339 -181666 320406 1303696 2403565 2667740 1461307 -479081 -1735574
$$ packed form
9417a851780N65377L34610m56570J58408J512527J131736o60575q88693J031356
9408H76396K155094P52171j224824j606577r22151m47486j9196O10333N15122
9399F88882o22517j314475m42032Q98214J149203N14298N9033j61535o70623j210218
9389a111770j118544m49059K55888P60995J014965Q52508L93027J08489P1209
9380G77708j62684o17002p08737l19706q2546k03231n1062N47558O92615j51291
9370b78378j036121p78454L26372R56775N22820l47331q39695p46210k76431L33044
9360b163609Q52040R89146N43479k91613q72601o41008J77284P23090N30785L5396
9350a17611j42728P8673N02072R83290J099869K64175j206433j940388j256493
$$ plain form
9341 -1735574 -1994094 -2189391 -2761829 -2969527 -2397422 -1928890 -2341531 -2884894 -2327724 -822051
9331 -822051 315617 340760 -276897 -696889 -467651 298264 882506 434349 -904784 -1805914
9321 -1805914 -1394739 -567667 -760939 -1892813 -2667595 -2584501 -2261931 -1811663 -485721
9312 -485721 1544507 2510134 1169706 -1342383 -2887904 -2878361 -2332058 -1911892 -1282508
9303 -1282508 -323182 394018 623182 749418 670909 -364917 -2087243 -2642036 -942635
9294 -942635 1367733 1826013 421770 -719003 -569934 -157773 -169768 245702 1485565
9285 1485565 2200578 1289250 -240694 -786715 -391733 -96188 -81265 62691 81782 -404128
9275 -404128 -845587 -732897 -831577 -1821877 -2548802 -1605020 11631 118241 -1120906 -1403642
$$ packed form
9341a735574k58520j95297n72438k07698N72105M68532m12641n43363N57170J505673
9331h22051J137668K5143o17657m19992K29238P65915N84242m48157j339133r01130
9321a805914M11175Q27072j93272j131874p74782Q3094L22570M50268J325942
9312d85721K030228R65627j340428k512089j545521R543N46303M20166O29384
9303a282508R59326P17200K29164J26236p8509j035826j722326n54793J699401
9294i42635K310368M58280j404243j140773J49069M12161j1995M15470J239863
9285A485565P15013r11328j529944n46021L94982K95545J4923J43956J9091m85910
9275d04128m41459J12690r8680r90300p26925R43782J616651J06610j239147k82736
$$ plain form
9265 -1403642 -107335 764053 69629 -637217 33368 905848 343257 -1014787 -1435115
9256 -1435115 -756729 -126397 15783 44006 -92166 -662411 -1126807 -696304 304668 780686
9246 780686 380280 -298246 -763850 -944969 -670315 178221 1027906 977862 -71505 -1194109
9236 -1194109 -1412048 -586803 548791 1017182 481814 -356313 -614045 -465955 -801459
9227 -801459 -1569493 -1604349 -627633 -185714 -1523281 -3476985 -3867588 -2447678 -1016752
9218 -1016752 -793817 -1113615 -927508 -319162 31613 -8084 -113622 -233571 -588456 -1124680
9208 -1124680 -1462855 -1419591 -1265328 -1304899 -1374551 -1060580 -444969 -211547 -694992 -1221395
9198 -1221395 -946145 -26275 771307 1329368 2009906 2351345 1326430 -737457 -1923545
$$ packed form
9265a403642J296307Q71388o94424p06846O70585Q72480n62591j358044m20328
9256a435115O78386O30332J42180K8223j36172n70245m64396M30503J000972M76018
9246G80686m00406o78526m65604j81119K74654Q48536Q49685n0044j049367j122604
9236a194109k17939Q25245J135594M68391n35368q38127k57732J48090l35504
9227h01459p68034l4856R76716M41919j337567j953704l90603J419910J430926
9218a016752K22935l19798J86107O08346L50775l9697j05538j19949l54885n36224
9208a124680l38175M3264J54263l9571o9652L13971O15611K33422m83445n26403
9198a221395K75250R19870P97582N58061O80538L41439j024915k063887j186088
$$ plain form
9189 -1923545 -1237896 -110271 -248716 -1070350 -786979 637922 1400634 633959 -425368
9180 -425368 -459130 158259 363819 124073 154282 509810 471184 -304985 -1322885 -2011680
9170 -2011680 -2324455 -2369727 -1988687 -1118868 -246496 28123 -245801 -557280 -805213 -1287212
9160 -1287212 -1710391 -1120457 618090 2050646 1723270 47461 -1341525 -1640955 -1220117
9151 -1220117 -321886 1117637 2360197 2149704 590916 -580832 -255339 698248 1040572
9142 1040572 931959 1134421 1522694 1623326 1841395 2763605 3691766 3290463 1633929
9133 1633929 352284 512557 1334408 1377892 304275 -951128 -1326524 -599715 596896
9124 596896 1491147 1852653 1903115 1671597 897343 -251193 -894267 -363068 883942 1724087
$$ packed form
9189a923545O85649J127625j38445q21634K83371J424901P62712p66675j059327
9180d25368l3762O17389K05560k39746L0209L55528l8626p76169j017900o88795
9170b011680l12775m5272L81040Q69819Q72372K74619k73924l11479k47933m81999
9160a287212m23179N89934J738547J432556l27376j675809j388986k99430M20838
9151a220117Q98231J439523J242560k10493j558788j171748L25493R53587L42324
9142A040572j08613K02462L88273J00632K18069R22210R28161m01303j656534
9133A633929j281645J60273Q21851M3484j073617j255403l75396P26809J196611
9124E96896Q94251L61506N0462k31518p74254j148536o43074N31199J247010Q40145
$$ plain form
9114 1724087 1582308 843490 258887 266359 720290 1030591 737891 75369 -339191 -410952
9104 -410952 -617156 -994198 -822852 234842 1399252 1814014 1712023 1774559 1845637 1230825
9094 1230825 12497 -898699 -1030888 -867859 -979811 -1280388 -1326836 -901744 -176132 371560
9084 371560 223631 -604880 -1310647 -1058608 -20987 732857 443004 -579671 -1458778
9075 -1458778 -1699273 -1473862 -1146484 -746573 -79314 648756 714463 -145705 -924970 -361574
9065 -361574 1173166 1820180 719328 -665766 -554115 666470 1130157 162544 -1051390
9056 -1051390 -1326700 -729403 165801 1075272 1682361 1542407 860315 552884 980028 1346315
9046 1346315 964102 378053 435276 832697 583210 -381961 -1113508 -1118589 -977227 -1306781
$$ packed form
9114A724087j41779p38818n84603P472M53931L10301k92700o62522m14560p1761
9104d10952k06204l77042J71346J057694J164410M14762j01991O2536P1078o14812
9094A230825j218328r11196j32189J63029j11952l00577m6448M25092P25612N47692
9084C71560j47929q28511p05767K52039J037621P53844k89853j022675q79107
9075a458778k40495K25411L27378L99911O67259P28070O5707q60168p79265N63396
9065c61574J534740O47014j100852j385094J11651J220585M63687r67613j213934
9056a051390k75310N97297Q95204R09471O07089j39954o82092l07431M27144L66287
9046A346315l82213n86049N7223L97421k49487r65171p31547n081J41362l29554
$$ plain form
9036 -1306781 -1939514 -2404957 -2471351 -1882652 -381688 1455519 2181742 1083539 -710145
9027 -710145 -1574503 -1398960 -1301683 -1721056 -1984075 -1681359 -1222776 -853295 -301030 298158
9017 298158 322974 -54708 242055 1390228 1991703 1082304 -326845 -767295 -332990 4367
9007 4367 130934 458112 640953 115558 -662510 -938992 -1018851 -1406257 -1278858 332611
8997 332611 2338821 2692323 1548708 1090394 2002500 2466435 1332201 23538 86960
8988 86960 744995 427062 -652146 -1071404 -496040 70390 -126920 -868978 -1537229 -1635779
8978 -1635779 -1009521 -48155 613046 782402 648056 148065 -718920 -1097673 -91122
8969 -91122 1514497 1798880 311779 -1371535 -2073740 -2254941 -2244180 -1273190 560589
$$ packed form
9036a306781o32733m65443o6394N88699J500964J837207P26223j098203j793684
9027g10145q64358J75543R7277m19373k63019L02716M58583L69481N52265N99188
9017B98158K4816l77682K96763J148173O01475r09399j409149m40450M34305L37357
9007D367J26567L27178J82841n25395p78068k76482p9859l87406J27399J611469
8997C32611K006210L53502j143615m58314R12106M63935j134234j308663O3422
8988H6960O58035l17933j079208m19258N75364N66430j97310p42058o68251r8550
8978a635779O26258R61366O61201J69356j34346m99991q66985l78753J006551
8969i1122J605619K84383j487101j683314p02205j81201J0761R70990J833779
$$ plain form
8960 560589 1305264 -194411 -2174028 -2315778 -1050527 -586076 -1544434 -2545811 -2604379
8951 -2604379 -2060203 -1359823 -568070 -52345 -284349 -954097 -1328545 -1310238 -1220105 -963442
8941 -963442 -453078 -350609 -1194416 -2222540 -2280166 -1509001 -921427 -718740 -368869 -21824
8931 -21824 -397140 -1345495 -1854824 -1546568 -1047832 -868546 -920673 -1068002 -1157011 -662209
8921 -662209 651487 1887815 1939933 1102231 625305 785844 642868 -223882 -958028 -716123
8911 -716123 230955 1007864 1069077 450152 -376281 -856723 -941558 -1090000 -1402889 -1379996
8901 -1379996 -1008948 -1141177 -1946451 -2074502 -610435 1136958 1371091 477675 148211
8892 148211 544859 446690 -200962 -225204 300669 -76420 -1442710 -1962728 -865048 138239
$$ packed form
8960E60589P44675j499675j979617j41750J265251M64451r58358j001377n8568
8951b604379N44176P00380P91753N15725k32004o69748l74448J8307R0133K56663
8941i63442N10364J02469q43807j028124n7626P71165N87574K02687L49871L47045
8931b1824l75316r48355n09329L08256M98736J79286n2127j47329q9009M94802
8921f62209J313696J236328N2118q37702m76926J60539j42976q66750p34146K41905
8911g16123R47078P76909O1213o18925q26433m80442q4835j48442l12889K2893
8901a379996L71048j32229q05274j28051J464067J747393K34133q93416l29464
8892A48211L96648r8169o47652k4242N25873l77089j366290n20018J097680J003287
$$ plain form
8882 138239 -501788 -1965405 -2753819 -2914944 -3095433 -2746168 -1026636 1282415 2403494
8873 2403494 1818341 686547 159462 213794 126805 -522616 -1350187 -1483553 -657315 62554
8863 62554 -619276 -2319685 -3183916 -2348385 -1085681 -873814 -1440032 -1639746 -1285617 -917040
8853 -917040 -500112 260556 709495 -214503 -2184602 -3498409 -3193331 -2132164 -1572092
8844 -1572092 -1593743 -1594299 -1548667 -1815881 -2097727 -1702182 -876549 -776539 -1675698 -2226770
8834 -2226770 -1337788 61694 335144 -351026 -374269 659948 1359244 994264 654888
8825 654888 1101298 1196020 -178874 -2055910 -2829083 -2654302 -2681288 -2782396 -1944095 -379180
8815 -379180 613136 607097 207810 -398376 -1340394 -1885238 -1243506 -285281 -468120 -1260131
$$ packed form
8882A38239o40027j463617p88414j61125j80489L49265J719532K309051J121079
8873B403494n85153j131794n27085N4332q6989o49421q27571j33366Q26238P19869
8863F2554o81830j700409q64231Q35531J262704K11867n66218j99714L54129L68577
8853i17040M16928P60668M48939r23998j970099j313807L05078J061167N60072
8844a572092k1651n56M5632k67214k81846L95545Q25633J00010q99159n51072
8834b226770Q88982J399482K73450o86170k3243J034217O99296l64980l39376
8825F54888M46410R4722j374894j877036p73173J74781k6986j01108Q38301J564915
8815c79180R92316o039l99287o06186r42018n44844O41732R58225j82839p92011
$$ plain form
8805 -1260131 -829556 745883 1419213 611803 109583 819097 1254655 434135 -207335
8796 -207335 603681 1688603 1578990 1052754 1413412 1882480 1082603 -114444 188748
8787 188748 1499245 1315078 -1086301 -3453339 -3563070 -1726235 206619 1024189 796238
8778 796238 269110 117941 348982 360411 -103059 -450738 -224231 18836 -402095 -1098567
8768 -1098567 -1295417 -1189918 -1515387 -2139412 -2266981 -1780790 -1254221 -874907 -485161 -408971
8758 -408971 -982005 -1493832 -1000985 -87165 -285916 -1661795 -2568772 -2126674 -1291332 -904903
8748 -904903 -397576 591838 897684 -407305 -2064264 -2117047 -722902 162484 -336412
8739 -336412 -1023011 -664593 350652 891149 634189 135652 -37395 277322 895543 1355456
$$ packed form
8805a260131M30575J575439O73330q07410n02220P09514M35558q20520o41470
8796b07335Q11016J084922j09613n26236L60658M69068p99877j197047L03192
8787A88748J310497j84167k401379k367038j09731J836835J932854Q17570k27951
8778G96238n27128j51169K31041J1429m63470l47679K26507K43067m20931o96472
8768a098567j96850J05499l25469o24025j27569M86191N26569L79314L89746P6190
8758d08971n73034n11827M92847R13820j98751j375879r06977M42098Q35342L86429
8748i04903N07327R89414L05846j304989j656959n2783J394145Q85386m98896
8739c36412o86599L58418J015245N40497k56960m98537j73047L14717O18221M59913
$$ plain form
8729 1355456 1170793 273114 -930066 -1924529 -2256959 -1536391 119882 1670691 1946651
8720 1946651 1078373 411762 704189 1193787 928698 177771 -234378 -274362 -425074 -606630
8710 -606630 -445697 -257126 -628468 -1270368 -1468310 -1486125 -2136273 -2977354 -2557542 -796437
8700 -796437 554281 534452 389995 1261039 2052580 1261951 -263459 -428878 819447
8691 819447 1391004 247979 -1198605 -1362828 -562826 -17146 59224 343062 1034950 1556444
8681 1556444 1462078 1035794 890976 1213389 1510976 1180554 306141 -369165 -380674 -90908
8671 -90908 -107711 -615440 -1544266 -2765214 -3653303 -3202906 -1367517 320121 414475 -591019
8661 -591019 -1045000 -366296 614817 1260097 1790788 2298577 2287238 1569640 767058 526121
$$ packed form
8729A355456j84663q97679j203180r94463l32430P20568J656273J550809K75960
8720A946651q68278o66611K92427M89598k65089p50927m12149l9984j50712j81556
8710f06630J60933J88571l71342o41900j97942j7815o50148q41081M19812J761105
8700g96437J350718j9829j44457Q71044P91541p90629j525410j65419J248325
8691H19447N71557j143025j446584j64223Q00002N45680P6370K83838O91888N21494
8681A556444r4366m26284j44818L22413K97587l30422q74413o75306j1509K89766
8671i0908j6803n07729r28826j220948q88089M50397J835389J687638R4354j005494
8661e91019m53981O78704R81113O45280N30691N07789j1339p17598q02582k40937
$$ plain form
8651 526121 789508 1052157 910036 317428 -325920 -483356 -229718 -314914 -1016342 -1492642
8641 -1492642 -955280 147253 971736 1627592 2596290 3426855 3305228 2480621 1808535
8632 1808535 1274191 340583 -650941 -956752 -956264 -1530367 -2170188 -1548920 66642 894876
8622 894876 307442 -450025 -484852 -310361 -251037 283804 1276918 1623927 921409 145622
8612 145622 -80153 -256729 -472258 79633 1299884 1773362 1063071 556269 1022840 1272227
8602 1272227 461684 -213914 358418 1207726 1067318 508738 502635 406787 -629534 -1605121
8592 -1605121 -1130193 97435 344420 -483801 -1160111 -1288865 -1208397 -593797 787934
8583 787934 1699127 984673 -159393 209519 1451059 1224573 -471253 -978583 782533
$$ packed form
8651E26121K63387K62649j42121n92608o43348j57436K53638q5196p01428m76300
8641a492642N37362J102533Q24483O55856R68698Q30565j21627q24607o72086
8632A808535n34344r33608r91524l05811M88n74103o39821O21268J615562Q28234
8622H94876n87434p57467l4827J74491N9324N34841R93114L47009p02518p75787
8612A45622k25775j76576k15529N51891J220251M73478p10291n06802M66571K49387
8602A272227q10543o75598N72332Q49308j40408n58580o103r5848j036321r75587
8592a605121M74928J227628K46985q28221o76310j28754Q0468O14600J381731
8583G87934R11193p14454j144066L68912J241540k26486j695826n07330J761116
$$ plain form
8574 782533 2401787 1456344 -1173826 -2898956 -2844473 -2191300 -2013107 -2199171 -2253444 -2135561
8564 -2135561 -2110404 -2114527 -1549616 -41182 1557980 1676295 54682 -1559923 -1602692 -719831
8554 -719831 -472190 -903215 -967749 -684777 -929073 -1398966 -886592 352669 603710 -528953
8544 -528953 -1378154 -921965 -248882 -340341 -310706 712636 1544782 550662 -1731920 -3318732
8534 -3318732 -3474719 -3033092 -2455570 -1315105 241110 1092879 728869 111662 291634
8525 291634 872911 585170 -925093 -2515937 -2842567 -1877248 -859693 -756578 -1105224
8516 -1105224 -715825 672906 2025783 2395951 2036840 1738754 1614124 1223695 632969
8507 632969 531707 1187113 1927509 2000322 1521011 1174178 1241222 1386397 1327547 1240706
$$ packed form
8574G82533J619254r45443k630170j725130N4483O53173J78193j86064n4273J17883
8564b135561K5157m123N64911J508434J599162J18315j621613j614605m2769Q82861
8554g19831K47641m31025o4534K82972k44296m69893N12374J239261K51041j132663
8544e28953q49201M56189O73083r1459K9635J023342Q32146r94120k282582j586812
8534c318732j55987M41627N77522J140465J556215Q51769l64010o17207J79972
8525B91634N81277k87741j510263j590844l26630R65319J017555J03115l48646
8516a105224L89399J388731J352877L70168l59111k98086j24630l90429n90726
8507F32969j01262O55406P40396P2813m79311l46833O7044J45175n8850q6841
$$ plain form
8497 1240706 1344797 1433876 1117529 385090 -332654 -639012 -531927 -305988 -246707 -431945
8487 -431945 -711723 -819873 -535893 170758 998657 1302501 577900 -736647 -1326897 -491479
8477 -491479 726365 795264 -70038 -171895 1027863 2085053 2044799 2041312 3137366 4107930
8467 4107930 3249299 1267022 174028 62939 -595570 -1804112 -1856936 -504255 336881
8458 336881 -273128 -865668 -263007 546940 482760 254797 705434 1081269 571995 -784
8448 -784 306018 746329 270502 -513474 -470527 55083 55988 -281338 -195103 54833 -177021
8437 -177021 -515556 -347189 -152200 -505881 -669656 180018 1247307 1367938 994833 1051474
8427 1051474 814564 -824112 -2754759 -2779096 -987957 384859 359354 127830 511720
$$ packed form
8497A240706J04091Q9079l16347p32439p17744l06358J07085K25939N9281j85238
8487d31945k79778j08150K83980P06651Q27899L03844p24601j314547n90250Q35418
8477d91479J217844O8899q65302j01857J199758J057190m0254l487J096054R70564
8467D107930q58631j982277j092994j11089o58509j208542n2824J352681Q41136
8458C36881o10009n92540O02661Q09947o4180k27963M50637L75835n09274n72779
8448g84L06802M40311m75827p83976M2947N25610R05l37326Q6235K49936k31854
8437a77021l38535J68367J94989l53681j63775Q49674J067289J20631l73105N6641
8427A051474k36910j638676j930647k4337J791139J372816k5505k31524L83890
$$ plain form
8418 511720 786434 389288 -223551 -812484 -1625086 -2162175 -1513770 -200200 194981 -457235
8408 -457235 -614761 225275 624698 -305449 -1425205 -1479893 -845705 -438155 -334811 -368488
8398 -368488 -752618 -1275338 -1116878 -238804 257941 -127618 -440022 107186 862404 891310
8388 891310 310984 -272037 -632101 -581591 206808 1415724 2112042 2050399 1902237 1852746
8378 1852746 1279496 241705 -214006 162601 297445 -216790 -260142 722653 1458797 919134
8368 919134 49416 -55179 -202916 -1518157 -3005947 -2763429 -916910 625926 957902
8359 957902 843320 798346 347154 -612215 -1282623 -1242603 -1043522 -1128128 -1178226 -956726
8349 -956726 -882772 -1225746 -1412918 -768047 401200 994463 378048 -825673 -1334879 -581824
$$ packed form
8418E11720K74714l97146o12839n88933q12602n37089O48405J313570L95181o52216
8408d57235j57526Q40036L99423r30147j119756n4688O34188M07550J03344l3677
8398c68488l84130n22720J58460Q78074M96745l85559l12404N47208P55218K8906
8388H91310n80326n83021l60064N0510P88399J208916O96318o1643j48162m9491
8378A852746n73250j037791m55711L76607J34844n14235m3352R82795P36144n39663
8368I19134q69718j04595j47737j315241j487790K42518J846519J542836L31976
8359I57902j14582m4974m51192r59369o70408M0020J99081q4606n0098K21500
8349i56726P3954l42974j87172O44871J169247N93263o16415j203721n09206P53055
$$ plain form
8339 -581824 645978 1098730 448756 -553788 -1161563 -1290209 -1087409 -574928 -19436
8330 -19436 -3914 -626802 -1064227 -456010 979021 2102663 2063296 1171692 613540 1217833
8320 1217833 2395796 2611956 1212248 -696763 -1733653 -1975574 -2285894 -2536814 -1894499
8311 -1894499 -580587 235749 305486 413650 471524 -630405 -2715062 -3794813 -2863650
8302 -2863650 -1481859 -1301326 -1605415 -910332 340547 631095 67449 193315 1419905
8293 1419905 2452882 2341726 1624749 1225427 1368627 1792629 2096329 1757715 649636
8284 649636 -398424 -347114 686373 1527337 1420487 696918 -38685 -627055 -1105778 -1375098
8274 -1375098 -1359593 -1121518 -694763 -100894 449802 632770 280124 -529734 -1456835 -1895258
$$ packed form
8339e81824J227802M52752o49974j002544o07775j28646K02800N12481N55492
8330a9436J5522o22888m37425O08217J435031J123642l9367q91604n58152O04293
8320A217833J177963K16160j399708j909011j036890k41921l10320k50920O42315
8311a894499J313912Q16336O9737J08164N7874j101929k084657j079751R31163
8302b863650J381791J80533l04089O95083J250879K90548n63646J25866J226590
8293A419905J032977j11156p16977l99322J43200M24002L03700l38614j108079
8284F49636j048060N1310J033487Q40964j06850p23569p35603n88370m78723k69320
8274a375098J5505K38075M26755N93869N50696J82968l52646q09858r27101m38423
$$ plain form
8264 -1895258 -1420817 -497006 -239621 -1067382 -2041535 -2043681 -1197532 -533534 -549940 -751480
8254 -751480 -508269 163043 711892 663268 128930 -211163 175832 973582 1369874 1089195
8244 1089195 582266 203242 -148542 -502115 -668421 -736089 -923340 -867457 -66531 835679
8234 835679 490825 -1008179 -1816813 -907448 430173 647854 146160 122920 439598 263374
8224 263374 -81456 285283 909649 560457 -551590 -892907 -10840 811297 590455 -91650
8214 -91650 -291929 18081 370710 562908 582175 504518 669718 1230907 1527503 853511
8204 853511 -112492 188718 1944295 3342635 2748062 582404 -1524904 -2576826 -2525498
8195 -2525498 -1612797 -378311 157383 -656958 -2130070 -2855613 -2353553 -1477530 -1090162
$$ packed form
8264a895258M74441R23811K57385q27761r74153k146Q46149O63998j6406k01540
8254g51480K43211O71312N48849m8624n34338l40093L86995P97750L96292k80679
8244A089195n06929l79024l51784l53573j66306o7668j87251N5883Q00926R02210
8234H35679l44854j499004q08634R09365J337621K17681n01694k3240L16678j76224
8224B63374l44830L66739O24366l49192j112047l41317Q82067Q22137k20842o82105
8214i1650k00279L10010L52629J92198J9267p7657J65200N61189K96596o73992
8204H53511r66003L01210J755577J398340n94573k165658k107308j051922N1328
8195b525498R12701J234486N35694q14341j473112p25543N02060Q76023L87368
$$ plain form
8186 -1090162 -949338 -286205 913185 1797891 1810948 1389881 1204912 1159508 742119 116282
8176 116282 29831 548369 752086 115104 -578333 -362202 432466 635934 -123806 -1026432
8166 -1026432 -1197213 -575428 328268 970651 1046858 689695 438896 674683 1126887 1243437
8156 1243437 916168 515144 347316 404687 503926 407157 11921 -361879 -230885 244650
8146 244650 235219 -536201 -1147260 -755620 -6796 -209375 -1365294 -2073680 -1459338 -252883
8136 -252883 332052 46599 -451441 -548529 -147379 477547 947494 1058375 954660 886637
8126 886637 799068 448468 -42081 -145863 325258 768045 497280 -182546 -154829 943220
8116 943220 1766010 653555 -1982228 -3617826 -2552502 -62497 1344857 1152771 906226
$$ packed form
8186a090162J40824O63133J199390Q84706J3057m21067j84969m5404m17389o25837
8176A16282q6451N18538K03717o36982o93437K16131P94668K03468p59740r02626
8166a026432j70781O21785R03696O42383P6207l57163k50799K35787M52204J16550
8156A243437l27269m01024j67828N7371R9239r6769l95236l73800J30994M75535
8146B44650r431p71420o11059L91640P48824k02579j155919p08386O14342J206455
8136b52883N84935k85453m98040r7088M01150O24926M69947J10881j03715o8023
8126H86637q7569l50600m90549j03782M71121M42787k70765o79826K7717J098049
8116I43220Q22790j112455k635783j635598J065324K490005J407354j92086k46545
$$ plain form
8107 906226 1403522 1628099 822884 -145324 -400716 -550047 -1331510 -1988290 -1507603 -629665
8097 -629665 -886389 -1979695 -1854868 388887 3069009 3966309 2863870 1400270 928914
8088 928914 1164290 896368 -315016 -1443351 -1163645 453726 1875751 1760631 167389
8079 167389 -1927737 -3618313 -4358642 -4040866 -3206751 -2597697 -2212715 -1469601 -443009
8070 -443009 23291 -268163 -453861 -58512 338395 433165 821205 1516816 1350083 -56375
8060 -56375 -1174316 -786628 83868 5587 -521907 -419448 -357403 -1443219 -2642869 -2116190
8050 -2116190 -492289 -92442 -1155084 -1635012 -848211 -406041 -935418 -756320 970594
8041 970594 2329698 1559547 -121102 -464731 486327 917111 107476 -986880 -1494806
$$ packed form
8107I06226M97296K24577q05215r68208k55392j49331p81463o56780M80687Q77938
8097f29665k56724j093306J24827K243755K680122Q97300j102439j463600m71356
8088I28914K35376k67922j211384j128335K79706J617371J422025j15120j593242
8079A67389k095126j690576p40329L17776Q34115O09054L84982P43114J026592
8070d43009M66300k91454j85698L95349L96907R4770L88040O95611j66733j406458
8060e6375j117941L87688Q70496p8281n27494J02459O2045j085816j199650N26679
8050b116190J623901L99847j062642m79928P86801M42170n29377J79098J726914
8041I70594J359104p70151j680649l43629R51058M30784q09635j094356n07926
$$ plain form
8032 -1494806 -1472479 -1207974 -837114 -594534 -676104 -919726 -1051888 -993657 -663258 27096
8022 27096 689737 601694 -281317 -1040318 -924780 -227631 319755 477975 486900 621904
8012 621904 1025664 1529271 1554640 750895 -298093 -712900 -584146 -690758 -1013064 -692049
8002 -692049 345945 949359 363497 -776535 -1541719 -1793443 -1716596 -1295269 -779505 -707951
7992 -707951 -970529 -848193 -452668 -939650 -2583073 -3804062 -3083369 -940390 928904
7983 928904 1695418 1677788 1349068 1045974 1079829 1230222 621892 -1110576 -3050633 -4106673
7973 -4106673 -4297309 -4194924 -3789916 -2878415 -2022438 -1997585 -2520203 -2546837 -1817888 -1240509
7963 -1240509 -1583484 -2420984 -2653751 -1801468 -551595 11521 -337566 -759241 -543976
$$ packed form
8032a494806K2327K64505L70860K42580q1570k43622j32162N8231L30399O90354
8022B7096O62641q8043q83011p59001J15538O97149N47386J58220Q925J35004
8012F21904M03760N03607K5369q03745j048988m14807J28754j06612l22306L21015
8002f92049J037994O03414n85862j140032p65184k51724P6847M21327N15764P1554
7992g07951k62578J22336L95525m86982j643423j220989P20693K142979J869294
7983I28904P66514j7630l28720l03094L3855J50393o08330j732468j940057j056040
7973d106673j90636J02385M05008R11501Q55977K4853n22618k6634P28949N77379
7963a240509l42975q37500k32767Q52283J249873N63116l49087m21675K15265
$$ plain form
7954 -543976 8225 379472 826545 1667338 2227285 1820212 1254728 1661152 2163413 875963
7944 875963 -1702918 -2760563 -1280479 419902 372432 -351714 -266956 -299791 -1665439
7935 -1665439 -2975812 -2269806 -500404 -90719 -998403 -1164434 -223723 296488 217073
7926 217073 980315 2416276 2315233 51849 -2095658 -2364463 -1824421 -1987274 -2329323
7917 -2329323 -1792932 -906335 -655371 -659572 -150347 395213 201375 -212410 80635 798824
7907 798824 1188252 1497906 2151167 2285660 958967 -739990 -784482 718574 1505663
7898 1505663 424867 -1125077 -1581307 -1350585 -1628230 -2422380 -2899501 -2799650 -2399139
7889 -2399139 -1688076 -636724 131992 -80530 -1005779 -1723172 -1796803 -1406082 -704708 72049
$$ packed form
7954e43976N52201L71247M47073Q40793N59947m07073n65484M06424N02261j287450
7944H75963k578881j057645J480084J700381m7470p24146Q4758l2835j365648
7935a665439j310373P06006J769402M09685r07684j66031R40711N20211p9415
7926B17073P63242J435961j01043k263384k147507k68805N40042j62853l42049
7917b329323N36391Q86597K50964m201N09225N45560j93838m13785K93045P18189
7907G98824L89428L09654O53261J34493j326693j698957m4492J503056P87089
7898A505663j080796j549944m56230K30722k77645p94150m77121R9851M00511
7889b399139P11063J051352P68716k12522r25249p17393p3631L90721P01374P76757
$$ plain form
7879 72049 172935 -895831 -2233001 -2339256 -1193178 -346369 -626069 -1019180 -482419
7870 -482419 399572 573685 254394 207569 147661 -593272 -1309535 -577264 1384855 2681065
7860 2681065 2341175 1431621 1112377 1087423 743712 468467 773564 1144382 903332 458592
7850 458592 582584 1059916 1170831 1040940 1363633 2083812 2461010 2250461 1765296 943483
7840 943483 -457888 -1748404 -1712342 -489540 206177 -554678 -1443497 -822216 648819
7831 648819 813851 -795145 -2186243 -1783167 -598354 -397651 -802383 1242 2029648
7822 2029648 3050218 1883722 273890 282266 1338437 1489317 441837 -551510 -1082542
7813 -1082542 -1715476 -2051575 -951278 1111407 2071110 1173738 -92825 -556118 -822797
$$ packed form
7879G2049J00886j068766j337170j06255J146078Q46809k79700l93111N36761
7870d82419Q81991J74113l19291m6825n9908p40933p16263P32271J962119J296210
7860B681065l39890r09554l19244k4954l43711k75245L05097L70818k41050m44740
7850D58592J23992M77332J10915j29891L22693P20179L77198k10549m85165q21813
7840I43483j401371j290516L6062J222802O95717p60855q88819O21281J471035
7831F48819J65032j608996j391098M03076J184813K00703m04732Q03625K028406
7822B029648J020570j166496j609832Q376J056171J50880j047480r93347n31032
7813a082542o32934l36099J100297K062685R59703q97372j266563m63293k66679
$$ plain form
7804 -822797 -1379403 -1348294 -370386 211549 -453310 -1078114 -406468 616619 647604 348710
7794 348710 908305 1560381 961409 -63604 238113 1289697 907298 -1003761 -2172298
7785 -2172298 -1478278 -208361 521142 1112115 1651910 1135390 -473183 -1456210 -827215
7776 -827215 66020 -371928 -1683037 -2312616 -1738070 -595575 370785 620223 -49253
7767 -49253 -994683 -1229395 -861191 -905871 -1294611 -600665 1498886 3095951 2551658 762074
7757 762074 -388293 -627009 -853945 -1091465 -562604 698978 1803384 2282624 2238197
7748 2238197 1608050 456502 -412229 -350709 -20265 -384527 -900445 -207491 1448421
7739 1448421 2104701 815272 -916507 -1212053 -262948 285790 -259944 -961600 -823328
$$ packed form
7804h22797n56606L1109R77908N81935o64859o24804O71646J023087L0985k98894
7794C48710N59595O52076n98972j025013L01717J051584l82399j911059j168537
7785b172298O94020J269917P29503N90973N39795n16520j608573r83027O28995
7776h27215Q93235m37948j311109o29579N74546J142495R66360K49438o69476
7767d9253r45430k34712L68204m4680l88740O93946K099551J597065n44293j789584
7757G62074j150367k38716k26936k37520N28861J261582J104406M79240m4427
7748B238197o30147j151548q68731O1520L30444l64262n15918O92954J655912
7739A448421O56280j289429j731779k95546R49105N48738n45734p01656J38272
$$ plain form
7730 -823328 -61160 504440 644476 742035 950633 1013523 890322 844211 717046 -66089
7720 -66089 -1280346 -1560561 -186068 1483205 1535962 11927 -1428058 -1948264 -2086311
7711 -2086311 -2065234 -1458202 -761473 -1302156 -2917095 -3618128 -2475282 -983592 -463638
7702 -463638 -69610 1080211 1719555 500717 -1246412 -1236487 277920 1169975 908906
7693 908906 850279 1406350 1494172 871224 571845 664852 -81651 -1687522 -2351667 -1272916
$$ packed form
7730h23328P62168N65600J40036R7559K08598O2890j23201m6111j27165p83135
7720f6089j214257k80215J374493J669273N2757j524035j439985n20206j38047
7711b086311K1077O07032O96729n40683j614939p01033J142846J491690N19954
7702d63638L94028J149821O39344j218838j747129R925J514407Q92055k61069
7693I08906n8627N56071Q7822o22948k99379R3007p46503j605871o64145J078751
$$ [...]
##END NTUPLES=NMR SPECTRUM
##END=
