##TITLE=31Pdec_LR-767-2-CHL
 CCl4, 24 sc
 10.5.2023
##JCAMPDX= 6.0         $$ Bruker NMR JCAMP-DX V2.0
##DATA TYPE= NMR SPECTRUM
##DATA CLASS= NTUPLES
##ORIGIN= UXNMR, Bruker Analytische Messtechnik GmbH
##OWNER= root
$$ XWIN-NMR		Version 3.5
$$ Wed May 10 16:25:33 2023 Russian Standard Time (UT+4h)  she@DPX200
##.OBSERVE FREQUENCY= 81.013821
##.OBSERVE NUCLEUS= ^31P
##.ACQUISITION MODE= SIMULTANEOUS
##.ACQUISITION SCHEME= undefined
##.AVERAGES= 24
##.DIGITISER RES= 16
##SPECTROMETER/DATA SYSTEM= spect
##.PULSE SEQUENCE= zgpg30
##.SOLVENT NAME= DMSO
##.SHIFT REFERENCE= (INTERNAL, DMSO, 0, 248.564)
##AUDIT TRAIL= $$ (NUMBER, WHEN, WHO, WHERE, WHAT)
$$ ##TITLE= Audit trail, XWIN-NMR		Version 3.5
$$ ##JCAMPDX= 5.01
$$ ##ORIGIN= Bruker BioSpin GmbH
$$ ##OWNER= she
$$ F:/spectra/data/she/nmr/P31/1/pdata/1/auditp.txt
$$ ##AUDIT TRAIL=  $$ (NUMBER, WHEN, WHO, WHERE, WHAT)
(   1,<2023-05-10 16:24:18.93 +0400>,<she>,<DPX200>,
      <created by zg, POWCHK disabled, PULCHK disabled
       configuration hash MD5:
       00 E9 B6 7A A2 85 ED C7 34 08 36 98 17 FE 4E 26
       data hash MD5: 32K
       D5 00 0A 14 B4 7B 48 5B 10 9C AB 32 97 D0 FC E0>)
(   2,<2023-05-10 16:24:39.21 +0400>,<she>,<DPX200>,
      <Start of raw data processing
       efp BC_mod = 2 LB = 1 FT_mod = 6 PKNL = 1 PHC0 = -11128.64 PHC1 = 425.4849 SI = 64K 
       data hash MD5: 64K
       28 A3 56 23 63 75 96 1A E1 FE 7F F9 8D CA F8 3D>)
(   3,<2023-05-10 16:24:53.10 +0400>,<she>,<DPX200>,
      <pk PHC0 = 27.72047 PHC1 = 0 
       data hash MD5: 64K
       7D 6A 0D BB C6 0D EC 19 03 94 AA 65 03 E6 A3 30>)
(   4,<2023-05-10 16:24:58.81 +0400>,<she>,<DPX200>,
      <abs ABSG = 5 
       data hash MD5: 64K
       2F 7F A4 6A A5 84 0B 2B 11 99 2D 25 E5 34 7F 28>)
$$ ##END=
$$ 
$$ hash MD5
$$ 65 7F F4 51 2D 61 B2 BD 2C DC 5A D3 6C 07 0C 89
##$RELAX= 
##$RELAX= 
##$RELAX= 
##$RELAX= 
##$RELAX= 
##$RELAX= 
##$RELAX= 
##$RELAX= 
##$RELAX= 
$$ Bruker specific parameters
$$ --------------------------
##$DU= <F:/spectra>
##$EXPNO= 1
##$NAME= <P31>
##$PROCNO= 1
##$TYPE= <nmr>
##$USER= <she>
##$AMP= (0..31)
100 100 100 100 100 100 100 100 100 100 100 100 100 100 100 100 100 100 
100 100 100 100 100 100 100 100 100 100 100 100 100 100 
##$AQSEQ= 0
##$AQ_mod= 1
##$AUNM= <au_zg>
##$AUTOPOS= <>
##$BF1= 81.014009
##$BF2= 200.13
##$BF3= 200.13
##$BF4= 200.13
##$BF5= 200.13
##$BF6= 200.13
##$BF7= 200.13
##$BF8= 200.13
##$BYTORDA= 1
##$CFDGTYP= 0
##$CFRGTYP= 5
##$CHEMSTR= <none>
##$CNST= (0..31)
1 1 145 1 1 1 1 1 1 1 1 1 1 1 1 1 1 1 1 1 1 1 1 1 1 1 1 1 1 1 1 1 
##$CPDPRG= <waltz16>
##$CPDPRG1= <>
##$CPDPRG2= <waltz16>
##$CPDPRG3= <>
##$CPDPRG4= <mlev>
##$CPDPRG5= <mlev>
##$CPDPRG6= <mlev>
##$CPDPRG7= <mlev>
##$CPDPRG8= <mlev>
##$CPDPRGB= <>
##$CPDPRGT= <>
##$D= (0..31)
0 1 0 0 0 0 0 0 0 0 0 0.03 2e-05 3e-06 0 0 0 0 0 0 0 0 0 0 0 0 0 0 0 0 
0 0 
##$DATE= 1683721458
##$DBL= (0..7)
120 120 120 11 120 120 24 19 
##$DBP= (0..7)
150 150 150 150 150 150 150 150 
##$DBP07= 0
##$DBPNAM0= <>
##$DBPNAM1= <>
$$ [...]
##$SUBNAM3= <"">
##$SUBNAM4= <"">
##$SUBNAM5= <"">
##$SUBNAM6= <"">
##$SUBNAM7= <"">
##$SUBNAM8= <"">
##$SUBNAM9= <"">
##$SW= 501.771253377433
##$SWIBOX= (0..15)
0 1 3 0 0 0 0 0 0 0 0 0 0 0 0 0 
##$SW_h= 40650.406504065
##$TD= 32768
##$TD0= 1
##$TE= 0
##$TE2= 300
##$TE3= 300
##$TEG= 300
##$TL= (0..7)
0 120 53 12 22 120 120 120 
##$TP= (0..7)
150 150 150 150 150 150 150 150 
##$TP07= 0
##$TPNAME0= <>
##$TPNAME1= <>
##$TPNAME2= <>
##$TPNAME3= <>
##$TPNAME4= <>
##$TPNAME5= <>
##$TPNAME6= <>
##$TPNAME7= <>
##$TPOAL= (0..7)
0.5 0.5 0.5 0.5 0.5 0.5 0.5 0.5 
##$TPOFFS= (0..7)
0 0 0 0 0 0 0 0 
##$TUNHIN= 0
##$TUNHOUT= 0
##$TUNXOUT= 0
##$USERA1= <user>
##$USERA2= <user>
##$USERA3= <user>
##$USERA4= <user>
##$USERA5= <user>
##$V9= 5
##$VALIST= <valist>
##$VCLIST= <CCCCCCCCCCCCCCC>
##$VD= 0
##$VDLIST= <DDDDDDDDDDDDDDD>
##$VPLIST= <PPPPPPPPPPPPPPP>
##$VTLIST= <TTTTTTTTTTTTTTT>
##$WBST= 1024
##$WBSW= 4
##$XGAIN= (0..3)
0 0 0 0 
##$XL= 0
##$YL= 0
##$YMAX_a= 14718
##$YMIN_a= -16543
##$ZGOPTNS= <>
##$ZL1= 120
##$ZL2= 120
##$ZL3= 120
##$ZL4= 120
##$ABSF1= 248.5645
##$ABSF2= -253.2056
##$ABSG= 5
##$ABSL= 3
##$ALPHA= 0
##$AQORDER= 0
##$ASSFAC= 0
##$ASSFACI= 0
##$ASSFACX= 0
##$ASSWID= 0
##$AUNMP= <proc_1d>
##$AZFE= 0.1
##$AZFW= 0.5
##$BCFW= 0
##$BC_mod= 2
##$BYTORDP= 0
##$COROFFS= 0
##$CY= -3
##$DATMOD= 1
##$DC= 0
##$DFILT= <>
##$DTYPP= 0
##$F1P= 0
##$F2P= 0
##$FCOR= 1
##$FTSIZE= 65536
##$FT_mod= 6
##$GAMMA= 0
##$GB= 0
##$INTBC= 1
##$INTSCL= 6.047779e-11
##$ISEN= 30
##$LB= 1
##$LEV0= 0
##$LPBIN= 0
##$MAXI= 10000
##$MC2= 0
##$MEAN= 0
##$ME_mod= 0
##$MI= 50
##$NCOEF= 0
##$NC_proc= -5
##$NLEV= 6
##$NOISF1= 182.463
##$NOISF2= 159.3651
##$NSP= 0
##$NTH_PI= 0
##$NZP= 0
##$OFFSET= 248.5645
##$PC= 4
##$PHC0= -11100.92
##$PHC1= 425.4849
##$PH_mod= 1
##$PKNL= yes
##$PPARMOD= 0
##$PSCAL= 0
##$PSIGN= 0
##$REVERSE= no
##$SF= 81.0140089999694
##$SI= 65536
##$SIGF1= 159.3651
##$SIGF2= -187.1042
##$SINO= 113.3802
##$SIOLD= 16384
##$SREGLST= <1H.CDCl3>
##$SSB= 0
##$STSI= 65536
##$STSR= 0
##$SW_p= 40650.406504065
##$SYMM= 0
##$S_DEV= 0
##$TDeff= 32768
##$TDoff= 0
##$TI= <>
##$TILT= no
##$TM1= 0
##$TM2= 0
##$TOPLEV= 0
##$USERP1= <user>
##$USERP2= <user>
##$USERP3= <user>
##$USERP4= <user>
##$USERP5= <user>
##$WDW= 1
##$XDIM= 65536
##$YMAX_p= 479744142
##$YMIN_p= -20994229
$$ End of Bruker specific parameters
$$ ---------------------------------
##NTUPLES= NMR SPECTRUM
##VAR_NAME=  FREQUENCY,     SPECTRUM/REAL,   SPECTRUM/IMAG
##SYMBOL=    X,             R,               I
##VAR_TYPE=  INDEPENDENT,   DEPENDENT,       DEPENDENT
##VAR_FORM=  AFFN,          ASDF,            ASDF
##VAR_DIM=   65536,         65536,           65536
##UNITS=     HZ,            ARBITRARY UNITS, ARBITRARY UNITS
##FACTOR=    0.620285442955139, 1,           1
##FIRST=     20137.2065510682, 0,            0
##LAST=      -20513.1999529968, 0,           0
##MIN=       -20513.1999529968, -20994229,   0
##MAX=       20137.2065510682, 479744142,    0
$$ Real data points
##PAGE= N=1
##DATA TABLE= (X++(R..R)), XYDATA
$$ [...]
40075a10888J71818N7992j34791j12487R3905Q3728k54967m53289r1619N21251
$$ -110888 60930 118922 -15869 -128356 -34451 49277 -205690 -658979 -750598 -229347
40065b29347O47481P0478n77433n79342J7165N60390O33220L91501J33640o0100
$$ -229347 418134 488612 -88821 -668163 -650998 -90608 542612 934113 1067753 1007653
40055A007653j78881j46281j5008j9945k57707n23816n83172l87437J2620M65774
$$ 1007653 828772 682491 667483 647538 389831 -133985 -717157 -1104594 -1091974 -626200
40045f26200O13548K11516l59453m03489J08571M23305J13598l16132l09809r8987
$$ -626200 -12652 198864 -160589 -564078 -455507 -32202 81396 -234736 -544545 -643532
40035f43532j14392j56733J29918M30298K30238j92675j19506M11525O10521J52145
$$ -643532 -757924 -914657 -784739 -354441 -124203 -316878 -436384 -24859 585662 737807
40025G37807l92779m64797j84337O1210J34293O7669o9214q7455J33819L23052
$$ 737807 345028 -119769 -304106 -242896 -108603 -40934 -110148 -197603 -63784 259268
40015B59268J08575l49788n08634k51100j0710n56J01690M89879P75835N24418
$$ 259268 367843 18055 -490579 -741679 -752389 -752945 -651255 -161376 614459 1138877
40005A138877j02699n26184l80053J63105N27490K30881n07846q22234k61043
$$ 1138877 1036178 509994 129941 293046 820536 1051417 543571 -278663 -539706
39996e39706M33233K45556n74594p73815M1278Q04682O32244P5986M2097K87091
$$ -539706 -106473 139083 -435511 -1209326 -1168048 -363366 268878 344864 386961 674052
39986F74052j7666p23394q28129p0631O19308M75017j12105l30995q3288J17064
$$ 674052 656386 -67008 -895137 -965768 -346460 128557 16452 -314543 -397831 -280767
39976b80767K1674r5623L1490K79768L52414J47645j72671l58466k67968R562
$$ -280767 -259093 -354716 -323226 -43458 308956 456601 283930 -74536 -342504 -332942
39966c32942J96468J08572p1743J9334L66099M38078j10942q03546q37502j67342
$$ -332942 -136474 -27902 -99645 -80311 285788 723866 612924 -190622 -1028124 -1195466
39956a195466M38002M91643L27044K89656Q7838m93364q31910k59246P14485Q95162
$$ -1195466 -757464 -265821 61223 350879 438717 -54647 -886557 -1145803 -431318 463844
39946D63844P5179o70361m93819K13403N87779L83616n9827l81251l53676O8662
$$ 463844 539023 -131338 -625157 -411754 176025 559641 499814 118563 -235113 -166451
39936a66451N25200M81885k0207k85175O3150M96186L59258k02350n67473n36587
$$ -166451 358749 840634 820427 535252 598402 1094588 1453846 1251496 684023 147436
39926A47436l87027k70936q1121J79517L23342K51821K6532k54926m38621l27990
$$ 147436 -239591 -510527 -591648 -412131 -88789 163032 189564 -65362 -503983 -831973
39916h31973M5043L35821L09691J49688J00370O0555j41882l12637j55852J62328
$$ -831973 -786930 -451109 -141418 8270 108640 169195 27313 -285324 -441176 -278848
39906b78848J71965j87168m23430j70070L08875M72393J91325j26111r6460J25585
$$ -278848 -106883 -294051 -717481 -887551 -578676 -106283 85042 -41069 -137529 -11944
39896a1944Q5644k56262l93106m8529K98833J20722k55582j30547L63859M18107
$$ -11944 73700 -182562 -575668 -624197 -325364 -204642 -460224 -590771 -226912 191195
39886A91195p2527k79824J26804L74002m3545m15981o7749L75754N5060n40116
$$ 191195 118668 -161156 -34352 339650 296105 -119876 -187625 188129 243189 -296927
39876b96927l57664L43518L58240m16702p96786k87468K14272Q6731l3504L92371
$$ -296927 -654591 -311073 47167 -369535 -1166321 -1453789 -1239517 -1152786 -1186290 -793919
39866g93919O96055J89025m93170l25205M56023P31056J77771m44759n33886k54761
$$ -793919 -97864 91161 -402009 -727214 -271191 459865 637636 192877 -341009 -595770
39856e95770N8159L01289L34402J8479l53464k80798J47429K71024j31204m36764
$$ -595770 -537611 -236322 98080 116559 -236905 -517703 -370274 -99250 -230454 -667218
39846f67218j10953M56024M98272n3236n33459m63250q4250P0284j47533l89322
$$ -667218 -778171 -322147 176125 122889 -410570 -873820 -958070 -887786 -1035319 -1424641
39836a424641k82322R2595K71338Q289l20753j69508L60394N46370M6108n51858
$$ -1424641 -1706963 -1614368 -1343030 -1334741 -1655494 -1825002 -1464608 -918238 -872130 -1423988
39826a423988n43248j14659K2385k12317k04274K34856M85168J83829p6420K80619
$$ -1423988 -1967236 -2081895 -2059510 -2271827 -2476101 -2241245 -1756077 -1572248 -1648668 -1368049
39816a368049P40204M38873l61251n33866J91329P69879M03777l21698m14254
$$ -1368049 -627845 -188972 -550223 -1084089 -892760 -122881 280896 -40802 -455056
39807d55056R1989L91502J70954j36273j78734q2350k2469L4496Q0162j155j45258
$$ -455056 -363067 28435 199389 63116 -115618 -197968 -220437 -185941 -105779 -106934 -252192
39796b52192j14322J14853K76995K19267R5894O9199O9237l3535k09608l27708
$$ -252192 -366514 -251661 25334 244601 340495 409694 478931 445396 235788 -91920
39786i1920k96186j00429J68883L08617J70323j38307l34781k54178J7079K46912
$$ -91920 -388106 -488535 -319652 -11035 159288 20981 -313800 -567978 -550899 -303987
39776c03987K12375j36584n28798n19239J5618O28393P61211L81930m9683j80804
$$ -303987 -91612 -228196 -756994 -1276233 -1260615 -632222 128989 510919 461236 280432
39766B80432r5827o1545j46264j54271J10072N08425N88795J45340l39962k36001
$$ 280432 184605 123060 -23204 -177475 -67403 441022 1029817 1175157 835195 599194
39756E99194K57107K76271l66349p58755k72139L91951L04470k00755j75300K66197
$$ 599194 856301 1132572 766223 7468 -264671 127280 431750 230995 55695 321892
39746C21892J73224m88262o62431J3390N34789J40893n04745m42090J52204M48929
$$ 321892 495116 6854 -655577 -642187 -107398 33495 -471250 -913340 -761136 -312207
39736c12207K43338k4327p4482N6525L07052M83466K36637l55037o01100j17036
$$ -312207 -68869 -93196 -167678 -111153 195899 679365 916002 560965 -40135 -157171
39726a57171N15087N64709J85538N667J06838J19474N961J7767J02681M0115l8327
$$ -157171 357916 922625 1108163 1113830 1220668 1340142 1346103 1363870 1466551 1506666 1468339
39715A468339Q1825J41682j80889n33059l31900K17083L73392N6756p4038K27077
$$ 1468339 1550164 1691846 1510957 977898 645998 863081 1236473 1293229 1219191 1446268
39705A446268M30474J87846j57149k79424l61730n40872n14020r6681L39046L66392
$$ 1446268 1876742 2064588 1907439 1628015 1266285 725413 211393 114712 453758 820150
39695H20150N3994k59604l60734j44371L39253O33739K09216o79986j023875l30796
$$ 820150 874144 614540 253806 109435 448688 1082427 1291643 611657 -412218 -743014
39685g43014O17300P46515L5993o11852n57899R907N30461O47119L84031M5748
$$ -743014 -125714 620801 656794 44942 -512957 -503050 27411 674530 1058561 1104309
39675A104309p6722k0204m8968k12741k86363k07948j87582k48745j09887K63781
$$ 1104309 1027587 1007383 958415 745674 459311 251363 63781 -184964 -294851 -31070
39665c1070M61322K66859L1758O7107J41770j2348j82918j45338j62597m47167
$$ -31070 430252 697111 728869 795976 937746 925398 742480 597142 434545 -12622
39655a2622n92016k14652K55718K17764m1866J57396N94353M08288l85250p64936
$$ -12622 -604638 -819290 -563572 -345808 -387674 -230278 364075 772363 387113 -377823
39645c77823k98499K15726J20280j03549J48089M62066J43614n16983o53321j67714
$$ -377823 -676322 -460596 -340316 -443865 -295776 166290 309904 -207079 -860400 -1028114
39635a028114K29898J95871J30793L34621N16661L67035P3400j5216J05914J69978
$$ -1028114 -798216 -602345 -471552 -136931 379730 746765 820165 804949 910863 1080841
39625A080841J2308k76112m39305k75984R4426K63494L8368k21105q3601K76189
$$ 1080841 1093149 817037 377732 101748 196174 459668 498036 276931 193330 469519
39615D69519L26583L3255j00288Q5400J23638k09316l79034N0394N57894L55920
$$ 469519 796102 829357 729069 814469 938107 728791 349757 400151 958045 1313965
39605A313965l61987o49391k11887K22257R8233j69007j0501L11915J70852l39014
$$ 1313965 951978 302587 90700 312957 411190 242183 231682 543597 714449 375435
39595C75435m93452m7229L94518K57288k45971m96740k73099J23406L39646K81814
$$ 375435 -118017 -165246 229272 486560 240589 -256151 -529250 -405844 -66198 215616
39585B15616M7160k00824k87398j41106R2459J54413m6264k96013k84601L0031
$$ 215616 262776 61952 -225446 -366552 -274093 -119680 -165944 -461957 -746558 -716527
39575g16527L18469K39632r8739k06763J58261O07449N81651P4396l91390m51760
$$ -716527 -398058 -158426 -257165 -463928 -305667 301782 883433 957829 566439 114679
39565A14679k36631p394J66437K53929J43521j23320k91607k66706k57869l43644
$$ 114679 -121952 -129346 37091 291020 434541 311221 19614 -247092 -504961 -848605
39555h48605k49169J36437L85349J18926l10033k49526L06261P44073P04007L74432
$$ -848605 -1097774 -961337 -575988 -457062 -767095 -1016621 -710360 33713 737720 1112152
39545A112152k4565m47798o85753m45661R1628L74112K84706K37241L12102N2309
$$ 1112152 1087587 639789 -45964 -491625 -399997 -25885 258821 496062 808164 860473
39535H60473n40016o31665J91282J013812P69902j89326o53018l29469j8328j41872
$$ 860473 320457 -311208 -119926 893886 1663788 1474462 821444 491975 473647 331775
39525C31775k26174R496J23264r9532j21801L47876O51817K12164l89951k49102
$$ 331775 105601 115097 238361 138829 17028 364904 1016721 1228885 838934 589832
39515E89832L82163M41214k56551o95423k18809M86544M58708j34022l43540J19778
$$ 589832 971995 1413209 1156658 461235 242426 728970 1187678 1053656 710116 829894
39505H29894N39525L06623k62528n03990l31435j30513j6021K18917M74095L18377
$$ 829894 1369419 1676042 1413514 909524 578089 447576 431555 650472 1124567 1442944
39495A442944k17238m58836j07374J51480l16573r50323p71043o043J72370m39663
$$ 1442944 1225706 766870 659496 810976 494403 -455920 -1226963 -1233006 -1060636 -1500299
39485a500299o32648L14266J398524J343467M18778j62495o5503K4608k42040
$$ -1500299 -2132947 -1818681 -420157 923310 1342088 1179593 1114090 1138698 896658
39476H96658m61050l54637j42519J9895J85378J73655k28797o08935l22856L62355
$$ 896658 435608 80971 -61548 -41653 143725 317380 88583 -520352 -843208 -480853
39466d80853M60313j79589n12989O2456O95195M06389l96288o23661j40358K72122
$$ -480853 -20540 -200129 -713118 -650662 44533 450922 54634 -569027 -709385 -437263
39456d37263K38942J10935R6499j0319j83513n5363L62584N24556J72229k43635
$$ -437263 -198321 -87386 9113 -1206 -184719 -240082 122502 647058 819287 575652
39446E75652k47922K1945J75824J63277J40416N3092k33599n56358n93555l29170
$$ 575652 327730 349675 525499 688776 829192 882284 648685 92327 -501228 -830398
39436h30398n0478J04111K71169M80297M86519J81575j08273n9086R8318j04039
$$ -830398 -880876 -776765 -505596 -25299 461220 642795 534522 475436 573754 469715
39426D69715n52593n89947k6018M53059K62500k10446k84307r2865k26496n37340
$$ 469715 -82878 -672825 -698843 -245784 16716 -193730 -478037 -570902 -797398 -1334738
39416a334738k92811M60735P42579J69482l49244k7971N47223L83792l56220o87418
$$ -1334738 -1627549 -1166814 -424235 -254753 -603997 -631968 -84745 299047 -57173 -744591
39406g44591k97418K16928M18187M56907M59908K76898n3432k09828r3412N6744
$$ -744591 -1042009 -825081 -406894 50013 509921 786819 733387 523559 430147 486891
39396D86891J10894J59888J69340q012k55763k90943j60014j84309l82274l99993
$$ 486891 597785 757673 927013 919001 663238 372295 212281 27972 -354302 -754295
39386g54295q0035L03807M36662K54266j24494m19005k62756L28406P18568L77052
$$ -754295 -834330 -530523 -93861 160405 35911 -383094 -645850 -317444 401124 778176
39376G78176l15818n57801k63756l7190j01779n3339K61983M14538J45968k17952
$$ 778176 462358 -95443 -359199 -396389 -498168 -551507 -289524 125014 270982 53030
39366E3030l41020k84099j67544J1512J13727r737q7376K06005M97376J81341
$$ 53030 -287990 -572089 -739633 -728121 -614394 -624131 -711507 -505502 -8126 173215
39356A73215l86764k49969M65697N16060l89548q68394j9379J003437P33913l41978
$$ 173215 -213549 -463518 2179 518239 128691 -739703 -759082 244355 978268 636290
39346F36290o73909q2936K25947k32267o02638k44687L52473N14290K94730Q3313
$$ 636290 -37619 -120555 105392 -126875 -729513 -974200 -621727 -107437 187293 270606
39336B70606k8801j58582l27931m39387l19052J44869O69705O75029P7936l93002
$$ 270606 241805 83223 -244708 -684095 -1003147 -858278 -188573 486456 564392 171390
39326A71390j69960K98295K81861q3785j67674P232j07386n10633o23271k76585
$$ 171390 1430 299725 581586 497801 330127 337359 229973 -280660 -903931 -1180516
39316a180516R2754K16604K19696J19450j71140m02360k50750P9904J99256K50584
$$ -1180516 -1087762 -871158 -651462 -532012 -703152 -1105512 -1356262 -1276358 -1077102 -826518
39306h26518N19223O29423R9380n58389m15586L28797N88973J45892j20992J47767
$$ -826518 -307295 322128 421508 -136881 -552467 -223670 365303 511195 390203 537970
39296E37970K82182m7122k77363j55522j91591m49716k09075N86036Q66293J53520
$$ 537970 820152 773030 495667 340145 148554 -301162 -510237 75799 942092 1095612
39286A095612n53001m41765j54869l95711n37594J37419R00423O77419j48012
$$ 1095612 542611 100846 -54023 -449734 -987328 -849909 50514 727933 579921
39277E79921m34501j10965O6156l649R7890J93892p9639k16214L67124R02702
$$ 579921 145420 34455 100611 96962 194852 388744 309105 92891 460015 1362717
39267A362717K34724j056406j221108l8844P96535K82894n63261n44488M3844
$$ 1362717 1597441 541035 -680073 -718917 77618 360512 -202749 -747237 -703393
39258g03393L41165K85861K06319L3103k68451k85861J00342K96753l7610l40833
$$ -703393 -362228 -76367 129952 163055 -105396 -391257 -290915 5838 -31772 -372605
39248c72605j05458K52616J76335q5255n9120P0555m4570j32609J47727L90782
$$ -372605 -478063 -225447 -49112 -134367 -193487 -122932 -167502 -300111 -152384 238398
39238B38398O9915m49058m39101n511J99599J62777L73703O77854L98081l48035
$$ 238398 308313 -140745 -579846 -585357 -385758 -222981 150722 828576 1226657 878622
39228H78622n86703j9487M43291J42604l15512j78391J69313m8698n56673m03888
$$ 878622 291919 272432 715723 858327 542815 364424 533737 485039 -71634 -475522
39218d75522M32347Q90002M00944k98143l26094Q8383R5338m69531r11342o72532
$$ -475522 -43175 846827 1247771 949628 623534 711917 807255 337724 -573618 -1246150
39208a246150K6323N67720N90338K11066j38803p8373L09011M83930J22660l46157
$$ -1246150 -1219827 -652107 -61769 149297 10494 -67879 241132 725062 847722 501565
39198E01565k73209K21221L41131j97719o80169m24943K21326M39135J17387j42091
$$ 501565 228356 449577 790708 592989 -87180 -512123 -290797 148338 265725 123634
39188A23634k8472J25197M2545k8788J96823M88272L80450j44641n65305m44512
$$ 123634 95162 220359 262904 234116 430939 919211 1299661 1155020 589715 145203
39178A45203L0322K82747R2544j33354j1334J59356j57296p40602p35735N6170
$$ 145203 175525 458272 550816 417462 406128 565484 408188 -332414 -1068149 -1011979
39168a011979P19422M95970j23451k29931J10692J41050k37599l59532J6126L29870
$$ -1011979 -292557 203413 79962 -149969 -39277 101773 -135826 -495358 -479232 -149362
39158a49362J89189p2914n4739J45843K75336K89186J69402j06312k79980n8313
$$ -149362 39827 -33087 -87826 58017 333353 622539 791941 685629 405649 347336
39148C47336K70497J33713l13362k96014K47796M15846j44249n12452j9583N03360
$$ 347336 617833 751546 438184 142170 389966 805812 661563 149111 129528 632888
39138F32888N5191p61507o29251L05992O37081k5227m96049l3026N16777K59549
$$ 632888 688079 -73428 -702679 -396687 240394 215167 -280882 -313908 202869 462418
39128D62418k54044o1411N42604N26493j46153m87114j00786K54420m6424n41361
$$ 462418 208374 146963 689567 1216060 1069907 582793 482007 736427 690003 148642
39118A48642m84023L2868L42106K30747J06479K41220L61229R9416m45816p66555
$$ 148642 -335381 -302513 39593 270340 376819 618039 979268 1078684 632868 -133687
39108a33687m87598J75337N17967P8407o78628p27849K22067J157016R55192j13650
$$ -133687 -621285 -445948 72019 150426 -528202 -1256051 -1033984 123032 1078224 964574
39098I64574p60149m46947M8440J6256j45050J82894O52507M76251k75629p55993
$$ 964574 204425 -242522 -194082 -177826 -322876 -139982 512525 988776 713147 -42846
39088d2846n58725r7006J86624K88068K81213J26948m8363j8382J13375M5541
$$ -42846 -601571 -698577 -511953 -223885 57328 184276 135913 117531 230906 276447
39078B76447j25816L105L97257N22208J64322k70243m42256m75448m64727k13087
$$ 276447 150631 153736 550993 1073201 1237523 967280 525024 49576 -415151 -628238
39068f28238K38608M11866J03267k22468j54679L3803q2288l66866m24892k49115
$$ -628238 -389630 22236 125503 -96965 -251644 -217841 -300129 -666995 -1091887 -1341002
39058a341002p9482P2925K90848M11494K78569R8794J22655K01373P4364j45482
$$ -1341002 -1420484 -1347559 -1056711 -645217 -366648 -267854 -145199 56174 130538 -14944
39048a4944k06029j94948l15390l95462j39076K71540L58447R1505n6824J51725
$$ -14944 -220973 -415921 -731311 -1126773 -1265849 -994309 -635862 -544357 -601181 -449456
39038d49456L80766K56001j04635l02441j98871k8904j4478m6299J09099L54590
$$ -449456 -68690 187311 82676 -219765 -418636 -447540 -462018 -508317 -399218 -44628
39028d4628L17247j7386j26296K32081M55070m098n56407k53019N54020N53282
$$ -44628 272619 255233 128937 361018 816088 811990 255583 2564 556584 1109866
39018A109866l96769q54842l4451R04527O91646j40693l56940k4702k3575k95882
$$ 1109866 713097 -141745 -176196 728331 1419977 1279284 922344 897642 874067 578185
39008E78185j28141K70147M0544o53384p46729q5805L13949j4209l72379k77321
$$ 578185 450044 720191 760735 107351 -639378 -725183 -411234 -425443 -797822 -1075143
38998a075143j54717k56266j09651M28567O77573K80613j33124l5394J62875k0105
$$ -1075143 -1229860 -1486126 -1595777 -1167210 -489637 -209024 -342148 -377542 -214667 -234772
38988b34772k82727k03991J3390R9782K70079N84123N23235r0699n01803j37604
$$ -234772 -517499 -721490 -708100 -608318 -338239 245884 769119 678420 176617 39013
38978C9013L74145J85063l87817m23188J29912N43036N46029M75204L84152p367
$$ 39013 413158 598221 210404 -212784 -82872 460164 1006193 1481397 1865549 1858182
38968A858182n20571n78460j35022K19808J68098j3025j08733k56632m48734m00085
$$ 1858182 1337611 759151 624129 843937 1012035 999010 890277 633645 184911 -215174
38958b15174j11914K5228q7136l8166L44558N69763K08338l80093n31264k16449
$$ -215174 -327088 -301860 -388996 -427162 -82604 487159 695497 315404 -215860 -432309
38948d32309J8522o3294j13517J05584K65785N0380j90760P7461N79140M31936
$$ -432309 -413787 -477081 -590598 -485014 -219229 -168849 -359609 -282148 296992 728928
38938G28928m57914r58411k41744Q60697R12635p4928p19152l30776K75341L02039
$$ 728928 271014 -687397 -929141 -68444 844191 769263 50111 -280665 -5324 296715
38928B96715J16709K59356L50054j11786o48325n35395p5765o1285l48209j20268
$$ 296715 413424 672780 1022834 911048 262723 -272672 -348437 -409722 -757931 -878199
38918h78199N96283Q65007L75758o6708R6429L26557J3906m65529m13499K0400
$$ -878199 -281916 583091 958849 892141 988570 1315127 1329033 863504 450005 470405
38908D70405R6117l37635o30017l12443K58680M54207K18904L9058J75518K99000
$$ 470405 566522 228887 -401130 -713573 -454893 -686 218218 257276 432794 731794
38898G31794N0722l21221k77936J47377L05478j07678n30157l07279L75091P38213
$$ 731794 782516 461295 183359 330736 636214 528536 -1621 -308900 66191 804404
38888H04404L73487l88448q86464o41493K70525J078762R08215j30333q54379
$$ 804404 1177891 789443 -97021 -738514 -467989 610773 1518988 1388655 534276
38879E34276m75991L18260M00467j45142l03982J97963N61875K82519j89071m02612
$$ 534276 58285 376545 777012 631870 327888 525851 1087726 1370245 1181174 778562
38869G78562n67232q13678o61530J33885Q60612P32189P6827j19953L47138O76570
$$ 778562 211330 -602348 -1263878 -1129993 -269381 462808 539635 419682 766820 1443390
38859A443390K94534l54319n16991j66369J01559M422r0997J17767K68712j14092
$$ 1443390 1737924 1383605 866614 700245 801804 806226 715229 832996 1101708 987616
38849I87616o94855n98603K87571R53508N95556k59222n37926r5083L17493K82105
$$ 987616 292761 -305842 -18271 935237 1530793 1271571 733645 638562 956055 1238160
38839A238160J12242Q0959K9871j31308j75541P130K11110K71164K05452l083
$$ 1238160 1350402 1431361 1461232 1329924 1154383 1161513 1372623 1643787 1849239 1846156
38829A846156l22662m35091j04000L03786K51308j17723k27143m2017L02p0619
$$ 1846156 1523494 1088403 984403 1288189 1539497 1421774 1194631 1152614 1152916 1082297
38819A082297J58326M71495K00420m34784l75778N07429R55263K43187o47233
$$ 1082297 1240623 1712118 1912538 1477754 1101976 1609405 2564668 2807855 2160622
38810B160622o26503j36464j21998l49936n6213M42276K14139n72213p80442q4196
$$ 2160622 1534119 1397655 1275657 925721 869508 1311784 1525923 953710 173268 89072
38800H9072N87770M84152q6539m71473m66253k30322l2053j42088m81987n02475
$$ 89072 676842 1160994 1074455 602982 136729 -93593 -125646 -267734 -749721 -1252196
38790a252196O2180N95684M14295j51513k99619n9894q1608l46647k15314K84137
$$ -1252196 -1190016 -594332 -180037 -331550 -631169 -691063 -772671 -1119318 -1334632 -1050495
38780a050495L80232o5760k29443K99974Q17900O16969m2419n07942n54915k66671
$$ -1050495 -670263 -736023 -965466 -665492 152408 769377 726958 219016 -335899 -602570
38770f02570K07030M66944J49994l55083k63233L19235M13138k07196n04921J36807
$$ -602570 -395540 71404 221398 -133685 -396918 -77683 335455 128259 -376662 -239855
38760b39855Q25433N74066j66513l87926j33456j13251l22790k30235N0492m9781
$$ -239855 585578 1159644 993131 605205 471749 358498 35708 -194527 -144035 -193816
38750a93816l95886k97638K34230M27527K5180l26870j62156J60094J64957n1299
$$ -193816 -589702 -887340 -653110 -225583 -200403 -527273 -689429 -529335 -364378 -415677
38740d15677j38128J2294L06510N66554M82865j06827p77604q06909o7873P37670
$$ -415677 -553805 -541511 -235001 331553 814418 707591 -70013 -876922 -944795 -207125
38730b07125Q87287L76188k48469n07699l51367j00860p2041j72539l4453L47186
$$ -207125 680162 1056350 807881 300182 -51185 -152045 -224086 -396625 -431078 -83892
38720h3892M81320J63797p7508J88109M84444J42643n42273p13588k97570l3018
$$ -83892 397428 561225 483717 671826 1156270 1298913 756640 43052 -254518 -287536
38710b87536k17090l46842r6979K18263L28508L52779K94106k0133l30803j17650
$$ -287536 -504626 -851468 -948447 -730184 -401676 -48897 245209 225076 -105727 -223377
38700b23377M27725M93515l8101l39818n3319J03831l09523n66119j8577O90078
$$ -223377 204348 697863 659762 319944 266625 370456 60933 -505186 -523763 166315
38690A66315O03098r9075n74697o07255m54783k8677P06896J030396L30615o64841
$$ 166315 769413 670338 95641 -511614 -966397 -995074 -288178 742218 1072833 407992
38680D07992p16256Q5050M99663P8345l18470n6468L90974M09791R7308k28766
$$ 407992 -308264 -223214 276449 354794 36324 -20144 370830 780621 877929 649163
38670F49163n28525o79830l78154K37588N29128K56202q6034q8435M5434L6486
$$ 649163 120638 -559192 -937346 -699758 -170630 85572 -462 -88897 -43463 -6977
38660f977n3459j75420m03089m94360q1572N02846M49398k05823m53810P6751
$$ -6977 -60436 -235856 -638945 -1133305 -1214877 -712031 -262633 -468456 -922266 -845515
38650h45515M50515J1633m48780m9927O13179M56080k52314l70610K12372N26360
$$ -845515 -395000 -383367 -832147 -882074 -268895 187185 -65129 -435739 -223367 302993
38640C02993K20620j6321J65228K11734k00783n26511l08018O4715O1979j72822
$$ 302993 523613 507292 672520 884254 683471 156960 -151058 -86343 -24364 -197186
38630a97186k14608n5437M6619M2636M0073O1105J14170K34678K96805J10610
$$ -197186 -411794 -467231 -420612 -377976 -337903 -276798 -162628 72050 368855 479465
38620D79465j75803j61600J87452M22451K56294j12134m42986p01030o89578q3034
$$ 479465 303662 142062 329514 751965 1008259 896125 453139 -247891 -937469 -1020503
38610a020503Q29611J083334K67977p03676p18910L5789M40973O4007m12610l66386
$$ -1020503 -190892 892442 1160419 456743 -262167 -226378 214595 278602 -134008 -500394
38600e00394k3632J66138K65625N16582P12814M38811k25927p01122o27722k61486
$$ -500394 -524026 -357888 -92263 424319 1137133 1575944 1350017 648895 21173 -240313
38590b40313m1697l0973R609J50291K00113R0137M1005J89160K99899J18773j77225
$$ -240313 -282010 -312983 -303374 -153083 47030 137167 178172 367332 667231 786004 608779
38579F08779k26564p1753q4260l08412l42180k5L44661L13628M2044j45289k33416
$$ 608779 382215 310462 226202 -82210 -424390 -424415 -79754 233874 275918 130629 -102787
38568a02787l36426l09334J7234L87998L70973O682k08437k5291K28301J29283
$$ -102787 -439213 -748547 -731313 -343315 27658 34340 -174097 -199388 28913 158196
38558A58196k90732o15954n29618j33737J72937J43055j629J46859N50461O72500
$$ 158196 -132536 -748490 -1278108 -1411845 -1238908 -1095853 -1097482 -950623 -400162 272338
38548B72338K42042k66771k77477M8489J06798j88716l27970p3886J90951J29156
$$ 272338 514380 247609 -29868 18621 125419 -63297 -391267 -465153 -274202 -145046
38538a45046p5011j36903j06433r9479l112K24529L13111R7318j25095k8555K14672
$$ -145046 -220057 -356960 -463393 -562872 -565984 -341455 -28344 68974 -56121 -84676 129996
38527A29996K51086J47133K02097L36676K08321j20783j92161R7249K83421O8840
$$ 129996 381082 528215 730312 1066988 1275309 1154526 962365 1059614 1343035 1411875
38517A411875k06157j26655J48398J92471K063o5103P7862J32616l6621j58136
$$ 1411875 1205718 1079063 1227461 1419932 1421995 1356892 1434754 1567370 1530749 1372613
38507A372613k9142R2951j24966m98869m91174K2182M95094M05349m3371k18522
$$ 1372613 1343471 1436422 1311456 812587 321413 343595 838689 1244038 1200667 982145
38497I82145N4402K82832N4907l69301m57181j35853K13384L60600M45589N84969
$$ 982145 1036547 1319379 1374286 1004985 547804 411951 625335 985935 1431524 2016493
38487B016493O26546M36254J63100K4179p568j08657k90790l60398j92046N6553
$$ 2016493 2643039 3079293 3242393 3266572 3259004 3150347 2859557 2499159 2307113 2363666
38477B363666N5693l29399p81025p82715k53905K43573J83226k07058k93012N617
$$ 2363666 2419359 2089960 1308935 526220 272315 515888 699114 492056 199044 204661
38467B04661J49578p4656j91121J04652L53827J01899k69462j43844K64941K21725
$$ 204661 354239 279583 88462 193114 546941 648840 379378 235534 500475 722200
38457G22200l28288o61234l93159L9986J60932N4144j8613k4723N4253L12946
$$ 722200 393912 -267322 -660481 -620495 -459563 -405419 -424032 -448755 -394502 -81556
38447h1556N58742L86375j23717l31185J8629L34479P7808m12195n03174k14545
$$ -81556 477186 863561 739844 408659 427288 761767 839575 427380 -75794 -290339
38437b90339K669N0591J25903J69801J9272j03486J04293L82656K20959k72030
$$ -290339 -287670 -237079 -111176 58625 77897 -25589 78704 461360 682319 410289
38427D10289m66573j71197J50850J84067J47358K31394K37581J5164k20497k48237
$$ 410289 -56284 -227481 -76631 107436 254794 486188 723769 738933 518436 270199
38417B70199j25948O4493L41200N06874J74190n98349j101958p89966j7864M07479
$$ 270199 144251 208744 549944 1056818 1231008 632659 -469299 -1259265 -1277129 -869650
38407h69650K37301l4715O4743L82527M09572j139l79854k06346L63764O28599
$$ -869650 -632349 -667064 -602321 -219794 189778 188639 -191215 -397561 -33797 594802
38397E94802K83904j43037r9439J48853Q378m04338m36613j4568K07022p7888
$$ 594802 878706 735669 636230 785083 793461 389123 -47490 -62058 144964 67076
38387F7076l56095j67267K22222L60732K46979P0590j42451k77218p8154K83459
$$ 67076 -289019 -456286 -234064 126668 373647 444237 301786 24568 -53586 229873
38377B29873J95229m08685p11137k35325K92743R0695l16917N8366Q85018Q47318
$$ 229873 425102 16417 -694720 -930045 -637302 -546607 -863524 -805158 79860 927178
38367I27178k60019j049422n28020N07702P14120M3183m68665k84686J20774K14275
$$ 927178 667159 -382263 -910283 -402581 311539 354722 -113943 -398629 -277855 -63580
38357f3580R8365P6570P8111j14382l45934k30041K14464M61244J94917j77702
$$ -63580 34785 111355 189466 75084 -270850 -500891 -286427 174817 369734 192032
38347A92032q4623L36887M20080R720k54663Q3773N67039M73932j76385p36784
$$ 192032 107409 444296 864376 874096 619433 703206 1270245 1744177 1567792 831008
38337H31008p92444m59978k8253K50079J61181k32506m65827j90377K91143M10132
$$ 831008 38564 -421414 -449667 -199588 -38407 -270913 -736740 -927117 -635974 -225842
38327b25842J19407j37728j20557J7753J38147K25847J58959j33671l37352j00646
$$ -225842 -106435 -244163 -364720 -346967 -208820 17027 175986 42315 -295037 -395683
38317c95683L19171L35973l4533j56148K16441N52453L79931q8570m31316n66327
$$ -395683 -76512 259461 224928 68780 285221 837674 1217605 1129035 697719 131392
38307A31392n19604j78264L43974N59408K44979j57221j84596k5549r7424k97284
$$ 131392 -388212 -566476 -222502 336906 581885 424664 240068 214519 117095 -180189
38297a80189k12849J35294L17821J92396Q4601K38088M67157M46284R5327l77565
$$ -180189 -393038 -257744 60077 252473 337074 575162 1042319 1488603 1583930 1206365
38287A206365o48479n13524j15810J23867k1893k73904k17912R9067K26283m2419
$$ 1206365 557886 44362 -71448 52419 30526 -243378 -461290 -362223 -135940 -178359
38277a78359l72406l48171m242K82097K98808J82649J13661N2837r5499k22063
$$ -178359 -550765 -898936 -903178 -621081 -322273 -139624 -25963 26874 -68625 -290688
38267b90688j33613J17308K60986J77839k597j83674l77497m54046k19259J19933
$$ -290688 -424301 -306993 -46007 131832 129235 -54439 -431936 -885982 -1105241 -985308
38257i85308N5896l90394m89089J20152P43713O52499K32708K73075N65420L00259
$$ -985308 -929412 -1319806 -1808895 -1688743 -945030 -292531 -59823 213252 778672 1078931
38247A078931l98659n81626j15986R1602k35338k06926N58674J042854M65620
$$ 1078931 680272 98646 -17340 74262 -161076 -368002 190672 1233526 1699146
38238A699146l35315k61656K48857P4705o11804o58556P8939M93708L0040n28335
$$ 1699146 1363831 1102175 1351032 1425737 813933 155377 234316 728024 758064 229729
38228B29729l87816J48254L53824J14945j92498l58912m39111m70783l91101j24812
$$ 229729 -158087 -9833 343991 458936 266438 -92474 -531585 -1002368 -1393469 -1518281
38218a518281L00656O27123N11115J2247l25816k07890o1317l09618n55886j79267
$$ -1518281 -1217625 -590502 -79387 -67140 -392956 -600846 -662163 -971781 -1527667 -1706934
38208a706934N28879O67683R6829l49199j27814L10383L26297n0951l66012l49564
$$ -1706934 -1178055 -510372 -413543 -762742 -890556 -580173 -253876 -304827 -670839 -1020403
38198a020403n1041K68737K72311p5422l04046l8250L51846K72196j18564k02829
$$ -1020403 -1071444 -802707 -530396 -605818 -909864 -948114 -596268 -324072 -442636 -645465
38188f45465q717q3678l19893k0494P06175Q24339M9288n44559k23559K36288
$$ -645465 -654182 -737860 -1057753 -1078247 -372072 452267 501555 -43004 -266563 -30275
38178c0275o2489o01490l79846L91390P10721L89685Q3574M7799m7840k50352
$$ -30275 -92764 -694254 -1074100 -682710 28011 417696 501270 549069 501229 250877
38168B50877k59009j16186r2961m0318K94848N28611J68849l15689m0961P67922
$$ 250877 -8132 -124318 -217279 -257597 37251 565862 734711 419022 378061 1145983
38158A145983R89077M13351O5909M14663N64686j34451q61635o22848J32672K74519
$$ 1145983 2135060 2548411 2614320 3028983 3593669 3459218 2597583 1974735 2107407 2381926
38148B381926k24421l95219J00982N18215K46733l54196n73964k38877K58307
$$ 2381926 2157505 1762286 1863268 2381483 2628216 2274020 1700056 1461179 1719486
38139A719486M71132K68865j06574k81813j54385K0904M5060N4217J90724K72066
$$ 1719486 2190618 2459483 2352909 2071096 1916711 1937615 1982675 2036892 2227616 2499682
38129B499682J04850j17436j19339m0324j84383m36597m34421k29169k19256m14872
$$ 2499682 2604532 2487096 2367757 2327433 2143050 1706453 1272032 1042863 823607 408735
38119D08735l56053R4907M41464L01116k0928o3437Q9768P9428n4672K2840K98467
$$ 408735 52682 147589 589053 890169 869241 805804 895572 975000 920328 943168 1241635
38108A241635L65920M6351l53754m95089l91617k30358q8553J3961Q729r1748
$$ 1241635 1607555 1653906 1300152 805063 413446 183088 94535 108496 117225 25477
38098B5477j23727o853R3449K7917m0386J52824N22842O68645L98495j5673k17454
$$ 25477 -98250 -105103 -11654 16263 -24123 128701 651543 1320188 1718683 1703010 1485556
38087A485556k01374k05406l12874l73648k65939l4818K26834M50592N22764L37717
$$ 1485556 1284182 1078776 765902 392254 126315 91497 318331 768923 1291687 1629404
38077A629404j13k05897j69014j18930k71308m53297l22835J07120M30784L48619
$$ 1629404 1629291 1423394 1254380 1135450 864142 410845 88010 195130 625914 974533
38067I74533k9263l94959n03521k09691L98489P95726L91418o03633j116210m96102
$$ 974533 945270 550311 46790 -162901 235588 1031314 1422732 819099 -297111 -793213
38057g93213M96757O48154j0063l20087J83806N96299J61365n04296m61896L1130
$$ -793213 -296456 351698 341635 21548 205354 801653 963018 458722 -3174 27956
38047B7956N9778l54964l47307K41995N63443J81336k57920j70721P8514j1889
$$ 27956 87734 -267230 -614537 -372542 190901 372237 114317 -56404 22110 10221
38037A0221j78213J2923K87109J42894k28667k62624N0150K71300L03377L52227
$$ 10221 -167992 -155069 132040 274934 46267 -216357 -166207 105093 408470 760697
38027G60697L13717l2977l54245j11907M28579L99998l12422p61963k99169N12343
$$ 760697 1074414 1041437 687192 575285 1003864 1403862 1091440 329477 30308 542651
38017E42651P73733M12037l6239k69426k90134n5483L38094M18474j01390p05007
$$ 542651 1316384 1728421 1692182 1422756 1132622 1077139 1415233 1833707 1732317 1027310
38007A027310o12969J24450O43876M24513r3791k27542L0283J20428k40141o46357
$$ 1027310 414341 538791 1182667 1607180 1513389 1285847 1316130 1436558 1196417 550060
37997E50060n17988J01146M72525N1524p01831p85801J7155P61045N83644j19616
$$ 550060 32072 133218 605743 657267 -44564 -830365 -813210 -52165 531479 411863
37987D11863l14169J73612N03798J59849l28685l09082j8413j09324n26468n40469
$$ 411863 97694 271306 775104 934953 606268 297186 278773 169449 -357019 -897488
37977h97488J26194Q21047Q30722K83603j61471k21093j29696l9105J57071L35621
$$ -897488 -771294 49753 880475 1164078 1002607 781514 651818 612713 769784 1105405
37967A105405Q2038n61041q09754j45030P77385R16872L21533k0170K41503L67441
$$ 1105405 1187443 626402 -183352 -328382 449003 1365875 1687408 1667238 1908741 2276182
37957B276182q3554m42429j29891K26229j86604q67546o81852K71806P15839J55112
$$ 2276182 2192628 1750199 1620308 1846537 1659933 792387 110535 382341 1098180 1253292
37947A253292m24074j81911L23332J74123m30056n83040q9727L75344L50170R0749
$$ 1253292 829218 647307 970639 1144762 714706 131666 41939 417283 767453 858202
37937H58202k4901j8270r2753k77941m41492m33251j59703K90711N84085M18514
$$ 858202 833301 815031 722278 444337 2845 -430406 -590109 -299398 284687 703201
37927G03201q7864m65993m13025r7969J09855Q6140J4456O5957J62357J29837
$$ 703201 615337 149344 -263681 -361650 -251795 -165655 -151199 -85242 77115 206952
37917B06952K599j252J57795K03453p1453m40648m97073j73639K32548M70919
$$ 206952 209551 208299 366094 569547 498094 57446 -439627 -613266 -380718 90201
37907I0201M99442L25429K2665j47670j4898J34956q9950m82769m33892Q2046
$$ 90201 589643 915072 937737 790067 775169 910125 820175 337406 -96486 -14440
37897a4440L53840K3959l19406p8483M09316M55219R2861j15048l1351J8512j3265
$$ -14440 339400 363359 43953 -34530 374786 830005 922866 807818 776467 794979 781714
37886G81714J42607M05024L34532j18863m70547m40399k83519k16753n7577L04128
$$ 781714 924321 1329345 1663877 1545014 1074467 634068 350549 133796 76219 380347
37876C80347N36523L07571k01510n08915l60157J26627O28404Q05772N56871J84690
$$ 380347 916870 1224441 1022931 514016 153859 280486 908890 1714662 2271533 2456223
37866B456223P7365J84567J24110j64461l00027j07169R0082L6574o8646n4855
$$ 2456223 2533588 2718155 2842265 2677804 2377777 2270608 2360690 2397264 2328618 2273763
37856B273763j58544m94269o09027j52129L59087J64675n11544o54207O0745P55841
$$ 2273763 2115219 1620950 1011923 859794 1218881 1383556 872012 217805 278550 1034391
37846A034391O22762J7833k20754k8382J43k93574m26842j91996m0862k71052
$$ 1034391 1657153 1674986 1454232 1425850 1425993 1132419 705577 513581 472719 201667
37836B01667m47201j19153L45954K97003j02914p3726N15425Q78765N27853j2579
$$ 201667 -245534 -364687 -18733 278270 175356 101630 617055 1495820 2023673 2011094
37826B011094j30653o9719l00593n25632j67641M80156N47110m7729m53856k24974
$$ 2011094 1880441 1810722 1510129 984497 816856 1297012 1844122 1796393 1342537 1117563
37816A117563R8222J5933j59060o57K76848L07809K27527K52691J27430l59334
$$ 1117563 1215785 1231718 1072658 1072001 1348849 1656658 1884185 2136876 2264306 1904972
37806A904972p32449m42320J61229K26523l45997p60013m40106L28872R34719
$$ 1904972 1172523 730203 891432 1117955 771958 11945 -428161 -99289 835430
37797H35430J047566O12709k15806r53067j045581m81860J56429L74206K10174
$$ 835430 1882996 2495705 2279899 1326832 281251 -200609 -44180 330026 540200
37788E40200l5881j66303j03607R4284J53908j19505m13573k10248L88438O53734
$$ 540200 504319 338016 234409 328693 482601 363096 -50477 -260725 127713 781447
37778G81447K63009k06304j77211N8105q2259m29739l25431K41322N16218J06659
$$ 781447 1044456 838152 660941 719046 636787 207048 -118383 122939 639157 745816
37768G45816m41039m83405j68311n1513j88812j43510K32528N41972M35727O4743
$$ 745816 304777 -178628 -346939 -398452 -587264 -730774 -498246 43726 479453 544196
37758E44196k17532k94772k27374j4342L00748M49204J91347k80265m75626j88936
$$ 544196 326664 31892 -195482 -209824 90924 540128 731475 451210 -24416 -213352
37748b13352K61025M16617J48737k71978m24122r1457M58354O31941J76554m27068
$$ -213352 47673 464290 613027 341049 -83073 -174530 283824 915765 1092319 665251
37738F65251n54114k73941j33662k16686q1171L11718M09100Q9483K3285M72548
$$ 665251 111137 -162804 -296466 -513152 -594323 -282605 126495 215978 239263 711811
37728G11811N80112k83218j170329p29106O59561J238015L64886o55160n71604
$$ 711811 1291923 1008705 -161624 -890730 -231169 1006846 1371732 716572 144968
37719A44968J76615M68545J73541n5790k4952r2528l17274l42164p6498J47843
$$ 144968 321583 790128 963669 907879 882927 790399 473125 130961 54463 202306
37709B02306J45064J13262K16259K95772J41951j55185k63539R89L73606L41838
$$ 202306 347370 460632 676891 972663 1114614 959429 695890 696879 1070485 1412323
37699A412323k06730o79021m41651K84902O37280K38412l78388n87814l91636
$$ 1412323 1205593 526572 84921 369823 1007103 1245515 867127 279313 -112323
37690a12323j14401J00760K03039J03187o8655r23K56527K74041l912r4285J38952
$$ -112323 -226724 -125964 77075 180262 111607 110684 367211 641252 637340 543055 682007
37679F82007J59319k46285m42465l2663L40098Q8208k13768J57170O52701K99859
$$ 682007 841326 595041 152576 119913 460011 548219 334451 491621 1144322 1444181
37669A444181n42772o85956r1703J41724k56365l22892L27874P71753L75386j80783
$$ 1444181 901409 215453 123750 265474 9109 -313783 14091 785844 1161230 980447
37659I80447j52128J29936J02580m4088k691p3218m45284n58563j0700O06930
$$ 980447 828319 958255 1060835 1016747 1014056 940838 495554 -63009 -73709 533221
37649E33221N99729K30049P7153J8176k64350m07819L107M78211L29352j15899
$$ 533221 1132950 1362999 1440152 1458328 1193978 786159 789266 1267477 1596829 1480930
37639A480930p5539L00904K48376j86556k40741J43956J96669l04553o53341m22162
$$ 1480930 1405391 1706295 1954671 1768115 1527374 1671330 1867999 1563446 910105 487943
37629D87943l5200J35947L02464N40345M23478j69740o09982l68223K35959N53988
$$ 487943 452743 588690 891154 1431499 1854977 1685237 1075255 707032 942991 1496979
37619A496979M15290P2344k39611l78761k74663n1324J03458K34182M33983M58207
$$ 1496979 1912269 1984613 1745002 1366241 1091578 1040254 1143712 1377894 1811877 2270084
37609B270084N2063m19667l41968J61351L55065O0940j27830N7996J52172q0475
$$ 2270084 2322147 1902480 1560512 1721863 2076928 2137868 2010038 2068034 2220206 2139731
37599B139731j73353J21341L01325L3297j94751M6851L30456J48061j51512L5593
$$ 2139731 1966378 2087719 2389044 2422341 2227590 2274441 2604897 2752958 2601446 2637039
37589B637039N31754P02861M47512J80295J43942L29159P35876J149207J038717
$$ 2637039 3168793 3871654 4319166 4499461 4643403 4972562 5708438 6857645 7896362
37580G896362K78952m05949l34975J54264K49240j83232o50219q90760r65662
$$ 7896362 8175314 7769365 7434390 7588654 7837894 7654662 7004443 6113683 5148021
37571E148021p86002l01461N1202j82476o99292p98589l85285R664O5336p9774
$$ 5148021 4362019 4060558 4111760 3929284 3229992 2431403 2046118 2055782 2121118 2041344
37561B041344k66996m22798l77303j10451L3539j17564j50917K30948N31638K13440
$$ 2041344 1774348 1351550 974247 863796 897335 779771 628854 859802 1391440 1604880
37551A604880l08408k95914P3714Q6283k09980j77999J42771J17047k14704j53810
$$ 1604880 1296472 1000558 1074272 1160555 950575 772576 915347 1032394 817690 663880
37541F63880L08795L76137j34475m39491j53550J36217L8663j2911K21145K07299
$$ 663880 972675 1348812 1214337 774846 621296 757513 796176 783265 1004410 1211709
37531A211709l27315p33986m68241M6077K12124J60234K22637K17484q4621l75320
$$ 1211709 884394 150408 -317833 -271756 -59632 100602 323239 540723 456102 80782
37521H0782k93287R931K43552L65918K49854l42199j066999j084230k95696L43087
$$ 80782 -212505 -202574 40978 406896 656750 314551 -752448 -1836678 -2132374 -1789287
37511a789287K70264J37516N16494P86731K47493n26784n49495L290K17591k9199
$$ -1789287 -1519023 -1381507 -865013 -78282 169211 -357573 -907068 -903778 -686187 -715386
37501g15386r9312J45285K07445l8594j57984L9872K72271L43074L20422K33189
$$ -715386 -814698 -669413 -461968 -500562 -658546 -618674 -346403 -3329 317093 550282
37491E50282Q9777K9541M3284j39462m92217n14342q3282J42081k19076n04483
$$ 550282 640059 669600 712884 573422 81205 -433137 -516419 -374338 -593414 -1097897
37481a097897q4354M97232M08665o6992q9641K97629M21532K47054K32253K75103
$$ -1097897 -1182251 -685019 -276354 -343346 -432987 -135358 286174 533228 765481 1040584
37471A040584j8620l43364j71172J16738j37475m54816Q4098R77788Q22045l13825
$$ 1040584 1021964 678600 507428 624166 486691 31875 115973 1093761 1915806 1601981
37461A601981q09761p7436N63730J67119l96465j50518L51187K17295j84042n3240
$$ 1601981 792220 714784 1278514 1445633 1049168 898650 1249837 1467132 1283090 1229850
37451A229850L47410K73742r1273n280M77125O02754J62960k73983k99670j23292
$$ 1229850 1577260 1851002 1759729 1754449 2231574 2834328 2997288 2723305 2423635 2300343
37441B300343r5883k77844m84363m73292j61407K19678L72075L35655L03063J31725
$$ 2300343 2204460 1926616 1442253 968961 807554 1027232 1399307 1734962 2038025 2169750
37431B169750l81527q07315m63309M19123P89551K76460l11580l08656o3008l1897
$$ 2169750 1788223 980908 517599 936722 1726273 2002733 1691153 1382497 1319489 1287592
37421A287592K0164K99035L67897j2688k56669N1037L13847n8595n35351l50727
$$ 1287592 1307756 1606791 1974688 1962000 1705331 1756368 2070215 2011620 1476269 1125542
37411A125542J33558N1266m43924m29971K31729O80390L76407k58117n86040m45972
$$ 1125542 1259100 1310366 866442 436471 668200 1348590 1724997 1466880 880840 434868
37401D34868n1657K63875K44256N5848K14065P61232R44855K86523n21492n58528
$$ 434868 383211 647086 891342 947190 1161255 1922487 2867342 3153865 2632373 2073845
37391B073845p5843j8709m56543n59292o7663K87742J5475m12833l93331k7913
$$ 2073845 1998002 1979293 1522750 963458 895795 1183537 1199012 786179 392848 364935
37381C64935K25905K16840J00216M1558J11816K13493J01664k30914l35945R6744
$$ 364935 590840 807680 907896 949454 1061270 1274763 1376427 1145513 809568 906312
37371I06312O14922N41691m620l00278j63900j45610m71985n99399j41175M28621
$$ 906312 1521234 2062925 2058305 1758027 1594127 1448517 976532 377133 235958 664579
37361F64579M60727N4112j91343n7781J17057L9554j46232j29766R8233K02482
$$ 664579 1125306 1179418 988075 930294 1047351 1086905 940673 810907 909140 1111622
37351A111622l7127l37723k14663L16599O70097M70710L7231j79312k38283l75505
$$ 1111622 1074495 736772 522109 838708 1508805 1979515 2016746 1837434 1599151 1223646
37341A223646l97490J1949N94939P43152L49528j05877k84805k86194k26351n8549
$$ 1223646 826156 838105 1433044 2176196 2525724 2419847 2135042 1848848 1622497 1563948
37331A563948J15214L3663k84411m63893k66565J17903L44817K52044p2981l53474
$$ 1563948 1679162 1712825 1428414 964521 697956 815859 1160676 1412720 1339739 986265
37321I86265l12880p5K13298J53665J08349K99709M41148K26489q0622p3219Q0622
$$ 986265 673385 673310 886608 1040273 1148622 1448331 1889479 2115968 2035346 1962127 2042749
37310B042749m3775l30827l29481r7521j07656l57799l14563J81154O25726O13700
$$ 2042749 1998974 1668147 1338666 1241145 1133489 775690 461127 642281 1268007 1881707
37300A881707L14804N5098o8343m9758P3824P4570k01203m31354j95645K86843
$$ 1881707 2196511 2251609 2183266 2133508 2207332 2281902 2080699 1649345 1453700 1740543
37290A740543L92736M7697k12809j57438j10873j89558n0208L69150N81809L44515
$$ 1740543 2133279 2180976 1968167 1810729 1699856 1510298 1460090 1829240 2411049 2755564
37280B755564P0386J06388K01552O8325r3948n1680o905j79195l54264k78112
$$ 2755564 2825950 2932338 3133890 3202215 3108267 3056587 3049682 2870487 2516223 2238111
37270B238111j18135j17746j39678L3783K46040K17302J3248r9234o7109r992
$$ 2238111 2119976 2002230 1862552 1896335 2142375 2359677 2372925 2273691 2206582 2196590
37260B196590N3487J58851K29054J82411P4744j3738p2618n6809Q8431K26942
$$ 2196590 2250077 2408928 2637982 2820393 2895137 2881399 2808781 2751972 2840403 3067345
37250C067345J34057j15177j72557N4908K28848Q4972j85287k29654L4552M19110
$$ 3067345 3201402 3086225 2913668 2968576 3197424 3282396 3097109 2867455 2902007 3321117
37240C321117O71420N98907K15853j83478l13633k32792j46894j1700K94041N33247
$$ 3321117 3992537 4591444 4807297 4623819 4310186 4077394 3930500 3918800 4212841 4746088
37230D746088L51450r5195k84973j06914M9171K634N577J78711K97859K67599
$$ 4746088 5097538 5002343 4717370 4610456 4659627 4662261 4667838 4846549 5144408 5412007
37220E412007K76413L69197L75783L26797M08478N01397L66482K39346M99629
$$ 5412007 5688420 6057617 6433400 6760197 7168675 7670072 8036554 8275900 8775529
37211H775529P91429L91257m70499o98662m299N83447L01789l02681m73516l48413
$$ 8775529 9566958 9958215 9487716 8789054 8784755 9368202 9669991 9367310 8893794 8545381
37201H545381k59059O9074P36963R90032L42143l56135p7468P44632R05728L18684
$$ 8545381 8286322 8355396 9092359 10082391 10424534 10068399 9990931 10735563 11641291 11959975
37191A1959975k9203K12046L47270R753j95356K46522R13443J100383P65054M32805
$$ 11959975 11930772 12142818 12490088 12499841 12304485 12551007 13464450 14564833 15329887 15762692
37181A5762692M73642P45740Q29809N32817J81894K67807P54418J092173J059955
$$ 15762692 16236334 16982074 17811883 18344700 18526594 18794401 19548819 20640992 21700947
37172B1700947J097288J492053J794194J543093J092756J090079J504581J834115
$$ 21700947 22798235 24290288 26084482 27627575 28720331 29810410 31314991 33149106
37164C3149106J990834K308943K847349L310390L575404L801833M122705M621741
$$ 33149106 35139940 37448883 40296232 43606622 47182026 50983859 55106564 59728305
37156E9728305N417567O411893P262458P985319R164633J1092760J3181721J4830216
$$ 59728305 65145872 71557765 78820223 86805542 95970175 107062935 120244656 135074872
37148A35074872J6420308J8763470K1955124K5490447K9109498L2718195L5780299
$$ 135074872 151495180 170258650 192213774 217704221 246813719 279531914 315312213
37141C15312213L7560791L7638278L5397433K9507451J9073276N254700r158367
$$ 315312213 352873004 390511282 425908715 455416166 474489442 479744142 470585775
37134D70585775k1700398l1059614l6514362l7946166l6477305l3873764l0982721
$$ 470585775 448885377 417825763 381311401 343365235 306887930 273014166 242031445
37127B42031445k7562226k3647248k0037646j7282424j5179845j3481593j2165311
$$ 242031445 214469219 190821971 170784325 153501901 138322056 124840463 112675152
37120A12675152j0896029r246119p609603o822289o696344o117277m851727l935566
$$ 112675152 101779123 92533004 84923401 78101112 71404768 65287491 60435764 56500198
37112E6500198l829009l601779k656014j860383j984153k268619j758752r59260
$$ 56500198 52671189 49069410 46413396 44553013 42568860 40300241 38541489 37582229
37104C7582229p87575p98342j9484J104653J318836P72608Q69462J887603K494937
$$ 37582229 36794654 35996312 35976828 37081481 38400317 39172925 40042387 41929990 44424927
37095D4424927K028607J619858K242255K994002K460057Q67926l74922p99104
$$ 44424927 46453534 48073392 50315647 53309649 55769706 56637632 56262710 55463606
37087E5463606j267709k350712l461190l889520l792013l651449l410157k790490
$$ 55463606 54195897 51845185 48383995 44494475 40702462 37051013 33640856 30850366
37079C0850366k087587j906322k200170k259350j769571j255647j188794j230531
$$ 30850366 28762779 26856457 24656287 22396937 20627366 19371719 18182925 16952394
37071A6952394q63251l46909l74709r39382j233652p67825j9736K48830q8656
$$ 16952394 16089143 15742234 15367525 14428143 13194491 12426666 12406930 12655760 12567104
37062A2567104n38833o34563l27918P5289J81080j83399q01429j250229j259823
$$ 12567104 12028271 11393708 11065790 11141079 11322159 11138760 10337331 9087102 7827279
37053G827279q57600k93633N7072o8941m61077n43879j36266J97254l3983m19510
$$ 7827279 6969679 6676046 6733118 6664177 6203100 5659221 5522955 5720209 5686226 5266716
37043E266716k58735K64365L17381k49551o81007n31003k32347j96250j85855
$$ 5266716 5007981 5272346 5589727 5340176 4659169 4128166 3895819 3699569 3513714
37034C513714J4825R0744j33875k19058J06020L21751l5970m68206k38590M12379
$$ 3513714 3528539 3619283 3485408 3266350 3372370 3694121 3658151 3189945 2951355 3363734
37024C363734O17479J84134k83407m13124l90634k91993P6119N39650N26623m7077
$$ 3363734 3981213 4165347 3881940 3468816 3078182 2786189 2862308 3401958 3928581 3881504
37014C881504m92151k91571J88946L20790R5217p3591q8892j77035l23825k59157
$$ 3881504 3389353 3097782 3286728 3607518 3702735 3629144 3540252 3363217 3039392 2780235
37004B780235j3148J8319k81558m72447k00630K21699K64529k6633j56256J3787
$$ 2780235 2767087 2785406 2503848 2031401 1830771 2052470 2316999 2290366 2134110 2147897
36994B147897J26207L4623N9976L27140M15123M6047l75823l95560k33537k98262
$$ 2147897 2274104 2308727 2368703 2695843 3110966 3157013 2781190 2385630 2152093 1853831
36984A853831l74428k4175M81564M63815m8280l46955j86317l1420q1553M0067
$$ 1853831 1479403 1455228 1936792 2400607 2352327 2005372 1819055 1787635 1706082 1746149
36974A746149L85305L97771n7603k53788K43119P50083M86190k26901n48426l94438
$$ 1746149 2131454 2529225 2471622 2217834 2460953 3211036 3697226 3470325 2921899 2527461
36964B527461l12061m32710l86652r4771J03558O5320k0577o4057j14531n9005
$$ 2527461 2215400 1782690 1396038 1301267 1404825 1470145 1449568 1385511 1270980 1211975
36954A211975K05795M05439K22070j10258j09631J42615J22194k21874l48776
$$ 1211975 1417770 1823209 2045279 1935021 1825390 1968005 2090199 1868325 1519549
36945A519549l8150K45330J45995l7338K7757P4628k54677o38978m42740K71385
$$ 1519549 1481399 1726729 1872724 1835386 1863143 1937771 1683094 1044116 601376 872761
36935H72761P06910M10680j38619k89012j28416j74352m19392l35450J52897M06691
$$ 872761 1579671 1990351 1851732 1562720 1434304 1259952 840560 505110 658007 1064698
36925A064698R7462j71729J39297M55548q1501j046222j102921n575R16866O82034
$$ 1064698 1162160 990431 1129728 1585276 1503775 457553 -645368 -650943 265923 947957
36915I47957J0536N0618O18274O90035J05567l06947j24397J44941J5150k92045
$$ 947957 958493 1009111 1627385 2317420 2422987 2116040 1991643 2136584 2151734 1859689
36905A859689l41393r6602J91559L17050J82801j54880m16542l45328n6216J12924
$$ 1859689 1518296 1421694 1613253 1930303 2113104 1958224 1541682 1196354 1140138 1253062
36895A253062P7192N5746J76902L16988L26147J79656n6227k13688r8394K07746
$$ 1253062 1330254 1386000 1562902 1879890 2206037 2385693 2329466 2115778 2017384 2225130
36885B225130L04130N720l04436k09460Q5451P7735k35483l99830k42543l6595
$$ 2225130 2529260 2534980 2230544 2021084 2106535 2184270 1948787 1548957 1306414 1269819
36875A269819M5506J15910J79233O6508j51331j53822J06992K97565K25674N8664
$$ 1269819 1315325 1431235 1610468 1676976 1525645 1371823 1478815 1776380 2002054 2060718
36865B060718q4919l13334n65050m75760R8014P54509R91310P17349J59574m27017
$$ 2060718 1975799 1662465 1097415 621655 719669 1474178 2465488 3182837 3342411 2915394
36855B915394p62109n91942l2293L78068K53898j74065m06838l03967j01344L6372
$$ 2915394 2153285 1561343 1529050 1907118 2161016 1986951 1580113 1276146 1174802 1211174
36845A211174J62463L00679L45787K53820J20392O203j45067l24077l38253l9503
$$ 1211174 1373637 1674316 2020103 2273923 2394315 2400518 2255451 1931374 1593121 1553618
36835A553618L91138N78325M00562J12557o5396k38244m97067n41324o6223N83567
$$ 1553618 1944756 2523081 2923643 3036200 2970804 2732560 2235493 1694169 1627946 2211513
36825B211513O90831J74194k35809n3491K77930J38300l22601n09216k91881k2700
$$ 2211513 2902344 3076538 2840729 2787238 3065168 3203468 2880867 2371651 2079770 2057070
36815B057070J16174K07017K06827K7493j07989O5407L30862K91517Q8007J78401
$$ 2057070 2173244 2380261 2587088 2614581 2506592 2571999 2902861 3194378 3282385 3460786
36805C460786M58305L38654k08431m56394n5811L57785J42846l39345k82193L56467
$$ 3460786 3919091 4257745 4049314 3592920 3537109 3894894 4037740 3698395 3416202 3772669
36795C772669Q10713N56065q6174m24769j63279L85667O95155N75890L43365M08488
$$ 3772669 4583382 5139447 5053273 4628504 4465225 4850892 5546047 6121937 6465302 6873790
36785F873790P99161J259310J699759K212264K672532K776449K598687K685809
$$ 6873790 7672951 8932261 10632020 12844284 15516816 18293265 20891952 23577761
36777B3577761L328301M042760M043391L008021J196993q80980k653983l635043
$$ 23577761 26906062 30948822 34992213 38000234 39197227 38316247 35662264 32027221
36769C2027221l773669l542962l394777l250188k785033k057232j504728j370964
$$ 32027221 28253552 24710590 21315813 18065625 15280592 13223360 11718632 10347668
36761A0347668j439849j354461r69837l98206P6597J44069k36222o65897o70671
$$ 10347668 8907819 7553358 6583521 6185315 6261912 6405981 6169759 5503862 4833191
36752D833191k76834J2952j00671l20718k13211J76347M45976M31263L27048K49785
$$ 4833191 4556357 4569309 4468638 4147920 3934709 4111056 4557032 4988295 5315343 5565128
36742E565128P4430j84200k19192Q9780L79157L25929J73690K79877L86108l8374
$$ 5565128 5639558 5455358 5236166 5325946 5705103 6031032 6204722 6484599 6870707 6832333
36732F832333q14216j129345p13646k30548k34629m32971l90165k89581m07747
$$ 6832333 6018117 4888772 4175126 3944578 3709949 3276978 2886813 2597232 2189485
36723B189485m27231j7598L64319J20499l53044j50004O24743Q43883M5720q22191
$$ 2189485 1762254 1744656 2108975 2229474 1876430 1726426 2351169 3195052 3240772 2418581
36713B418581p78122j48997P1992l14082n92446k65732L20133N43259K88639l1888
$$ 2418581 1640459 1491462 1563454 1249372 656926 391194 711327 1254586 1543225 1511337
36703A511337p2745N2997L5148j32388j65503p427K0513k36417m35780k73190
$$ 1511337 1438592 1491589 1526737 1394349 1228846 1221419 1241932 1005515 569735 296545
36693B96545j0724l2368j61696K4497L95008M07377N486k43080P729M14504M54564
$$ 296545 285821 253453 91757 116254 511262 918639 924125 681045 688774 1103278 1557842
36682A557842K3454n46420p65705l51491L75755O54281K31794j72499Q0736M56762
$$ 1557842 1581296 1034876 269171 -82320 293435 947716 1179510 1007011 1087747 1544509
36672A544509P0614p13999o62118L72051J092058O51950k44769o05473m51336
$$ 1544509 1615123 901124 239006 611057 1703115 2355065 2110296 1504823 1053487
36663A053487k56867m9851J98438J06018m09498o44762j18639N51740N63776J29103
$$ 1053487 796620 746769 945207 1051225 641727 -3035 -121674 430066 993842 1122945
36653A122945o0089p969j51462l72888k33627J14177J68334j379M9531K21876
$$ 1122945 1062856 1054887 903425 530537 296910 411087 579421 578042 627573 849449
36643H49449M5157l67584m37216j34328Q176r6405L4080M53249N53244R3023l23941
$$ 849449 894606 527022 89806 -44522 -36346 -132751 -98671 354578 907822 1000845 676904
36632F76904j71256K34455L02745K5780j45212K8974L51564M53829J18829m84853
$$ 676904 505648 740103 1042848 1068628 923416 952390 1303954 1757783 1876612 1391759
36622A391759q48384o20010m6277L22795K89793Q2961q7583j62002m5366K61337
$$ 1391759 543375 -76635 -122912 199883 489676 572637 485054 323052 277686 539023
36612E39023M28975J58454l02190m56390k65648o1519Q5969L01282L60675l6170
$$ 539023 967998 1126452 824262 367872 102224 40705 126674 427956 788631 752461
36602G52461n24998m46575K8702P6112l72451m58689N4605K40495l67028p54553
$$ 752461 227463 -219112 -190410 -114298 -486749 -945438 -890833 -650338 -1017366 -1771919
36592a771919j0725J022993R29942r2976o07948j72050K47280R2403l172L69948
$$ -1771919 -1782644 -759651 170291 77315 -530633 -702683 -455403 -363000 -366172 3776
36582C776N19202r2153p43899n31015J88877M06813N0088p5519K74442M38739
$$ 3776 522978 430825 -313074 -844089 -655212 -248399 -198311 -273830 612 439351
36572D39351M3826l72672k68607Q0778J29097p8733j04977J33757L14365K38444
$$ 439351 483177 110505 -158102 -77324 51773 -26960 -131937 1820 316185 554629
36562E54629p121l12808n74393n28001J6216P21279Q84958K35447o57873r43323
$$ 554629 547508 234700 -339693 -867694 -851478 -130199 754759 990206 332333 -610990
36552f10990l56652N48489R56454N53587j75354m33625J4622N55955M82105j01661
$$ -610990 -967642 -419153 537301 1090888 915534 481909 496531 1052486 1534591 1432930
36542A432930m37113j43733L01260K46477k88988o96812n45851m9784K07335p2407
$$ 1432930 995817 852084 1153344 1399821 1110833 414021 -131830 -181614 25721 -46686
36532d6686n30289n20186P2569N81701L91716j80015k88388K29259O30080L77564
$$ -46686 -576975 -1097161 -1024592 -442891 -51175 -231190 -519578 -290319 339761 717325
36522G17325j13858j76744J43102K78258O095l40978m07468j91128O9877J51147
$$ 717325 603467 426723 569825 848083 854178 513200 105732 -85396 -15519 135628
36512A35628K9156o8439Q3326L58918M15588K00870j4966j54839m02863o37960
$$ 135628 164784 96345 179671 538589 954177 1155047 1140081 985242 582379 -55581
36502e5581m22206J52212K98820k69404o71049j34730O49870M72009m68040p58005
$$ -55581 -477787 -325575 -26755 -296159 -967208 -1101938 -452068 19941 -448099 -1206104
36492a206104R7303R39406P06557j10088l93957k3198K35472K6116k19221j16908
$$ -1206104 -1108801 -169395 537162 427074 33117 9919 245391 271507 52286 -64622
36482f4622J22651J43754J2829O2859L29912M15882J3286n62336o23528J4763
$$ -64622 58029 201783 214612 277471 607383 1023265 1036551 474215 -149313 -134550
36472a34550O72316N75851j78774p71575o74141j52476K26979K12233q0413l83887
$$ -134550 537766 1113617 934843 163268 -510873 -663349 -436370 -224137 -304550 -688437
36462f88437m28391j40485J98014K23878o768n7369K59768N80639M81593M5353
$$ -688437 -1116828 -1257313 -1059299 -835421 -842189 -899558 -639790 -59151 422442 467795
36452D67795k70157k00710O1918J33479j29232m52893m20942L7762N14884N73065
$$ 467795 197638 -3072 58846 192325 63093 -389800 -810742 -772980 -258096 314969
36442C14969K27618j49631k77007j44459J02752K44640R3175k45333l73302j26581
$$ 314969 542587 392956 115949 -28510 74242 318882 412057 166724 -206578 -333159
36432c33159J11016m4775l49042l07106O907R5245p9514k1878M00138O49295L56187
$$ -333159 -222143 -266918 -615960 -923066 -916159 -820914 -900428 -922306 -522168 127127 483314
36421D83314j14080k66612j59150r0914k9929J80385L37709J16114l28949m37771
$$ 483314 369234 102622 -56528 -147442 -177371 3014 340723 456837 127888 -309883
36411c09883L6312O71877Q06891J95011p42229j235208q36177J13482P73372O60359
$$ -309883 -273571 398306 1205197 1400208 657979 -577229 -1413406 -1299924 -526552 133807
36401A33807J12660j92291l8158J84453O2100l11605m71640j76693K64357L60096
$$ 133807 246467 54176 16018 200471 262571 -49034 -520674 -697367 -433010 -72914
36391g2914N9960k03242j24350J01398J69604J31887J86331K49573J03895j88103
$$ -72914 -12954 -216196 -340546 -239148 -69544 62343 248674 498247 602142 414039
36381D14039l74715l84203k67668K5107M07838M45165p1300n41426k40561N15286
$$ 414039 39324 -344879 -612547 -587440 -179602 265563 194263 -347163 -587724 -72438
36371g2438O84932L7550m86806k07194L48409L79497l7181l40428m35350n38222
$$ -72438 612494 650044 163238 -43956 304453 683950 646769 306341 -129009 -667231
36361f67231m84489L0684O97691P99005J97382m35235m75551k4326L83692M14399
$$ -667231 -1151720 -1121036 -423345 375660 573042 137807 -337744 -362070 21622 436021
36351D36021J31874k17074m37450m58200k85243K1384K81775K51271n5521k04842
$$ 436021 567895 350821 -86629 -544829 -830072 -808688 -526913 -275642 -331163 -536005
36341e36005J67274P41119P99993K02554l82018l99245j16125p5024k28858r8081
$$ -536005 -368731 372388 1172381 1374935 992917 593672 477547 402523 173665 75584
36331G5584L91430P09888M08394l03509p81752o22312l2736M35531M49447J06479
$$ 75584 467014 1176902 1585296 1281787 500035 -122277 -155013 280518 729965 836444
36321H36444l44483p09886p07053n7569R29803J296972N30026n90341r06457m09310
$$ 836444 491961 -217925 -924978 -982547 -52744 1244228 1774254 1183913 277456 -131854
36311a31854n1595k14653l36212p8323J88038K72874M87798P33094L41657o46547
$$ -131854 -183449 -398102 -734314 -812637 -624599 -351725 136073 869167 1210824 564277
36301E64277j110576m47337M21449M49708k9791j32667Q3143L8700j28138P9830
$$ 564277 -546299 -993636 -572187 -122479 -152270 -284937 -201794 -163094 -291232 -211402
36291b11402M14863K95815n5885k2886K04285J235l90589j90525M38115N25176
$$ -211402 203461 499276 443391 420505 624790 626025 235436 44911 483026 1008202
36281A008202n8326l58392O6357M95723L10616j55297l94789m23633l52958j27686
$$ 1008202 949876 591484 657841 1153564 1464180 1308883 914094 490461 137503 9817
36271I817K6267k31746n19221n3294R06477J067129L7096q91453o01609K59762
$$ 9817 36084 -195662 -714883 -768177 138300 1205429 1242525 351072 -250537 9225
36261I225M44027n2845l51486k16467j11597j52831n6234J04065J3661j53872
$$ 9225 453252 400407 48921 -167546 -279143 -431974 -488208 -384143 -370482 -524354
36251e24354M6264M87551O02244K83673l3730j30147j71143j80520o691K00700
$$ -524354 -478090 9461 611705 895378 861648 731501 560358 379838 373147 573847
36241E73847J21035j22118r8574J60394J79457j12871k28787L2028K39225Q2281
$$ 573847 694882 572764 474190 634584 814041 701170 472383 504411 743636 825917
36231H25917j43907j15380J7277O2470J92065M72714M89111r500m89164l13235
$$ 825917 682010 566630 583907 646377 838442 1311156 1800267 1790767 1301603 988368
36221I88368K24772K80858k34805n16490j32094L29051K13135k30552l42774o5834
$$ 988368 1213140 1493998 1259193 742703 610609 939660 1152795 922243 579469 513635
36211E13635J10650m7477l11559m30005l00620J37105O97698Q30726K92755k38491
$$ 513635 624285 576808 265249 -164756 -465376 -328271 369427 1200153 1492908 1254417
36201A254417M1617P49100P05727k47955q86014m47255K15617O8677m78801m19908
$$ 1254417 1296034 2045134 2750861 2502906 1616892 1169637 1385254 1453931 975130 555222
36191E55222J00342J36472l45263m27480J42821N43208K69772j51331j75479j6947
$$ 555222 655564 792036 446773 19293 162114 705322 975094 823763 648284 631337
36181F31337j5450m5805J3249n9906k84135k54240J38155M07941K82586J33269
$$ 631337 615887 570082 583331 523425 239290 -14950 123205 531146 813732 947001
36171I47001K01565J32881k16630k74742K78946P39017L75300l62116n31523j59042
$$ 947001 1148566 1281447 1064817 790075 1069021 1808038 2183338 1821222 1289699 1130657
36161A130657m4422l64693m70566n8754L54766K99317k4930k07930j67442j0894
$$ 1130657 1086235 721542 250976 192222 546988 846305 821375 613445 446003 435109
36151D35109K10699M12981M49410L04156J07349m7083j04849J5616K42365K71597
$$ 435109 645808 1058789 1508199 1812355 1919704 1872621 1767772 1783388 2025753 2297350
36141B297350j4282k50158r9716J45697k2606m64994n20204j265M92240L95503
$$ 2297350 2283068 2032910 1933194 2078891 2056285 1591291 1071087 1069822 1562062 1957565
36131A957565j17101m18311j31939N39649R68345O04616m07610j193028j032452
$$ 1957565 1840464 1422153 1290214 1829863 2798208 3402824 2995214 1802186 769734
36122G69734k01401M15586M16222J49423l63m5444p0318j5416M8047j22446m90592
$$ 769734 568333 983919 1400141 1549564 1549201 1503757 1433439 1418023 1466070 1343624 853032
36111H53032o19182k46283K84468M17228N6636l45071l26908M6696K33233j21516
$$ 853032 233850 -12433 272035 689263 745899 400828 73920 120616 353849 232333
36101B32333o17229n04410K63852Q31419N70800o1544k65139m1157L6160j62029
$$ 232333 -384896 -889306 -625454 205965 776765 715221 450082 408925 445085 283056
36091B83056k80857k35552k21660j26564K56540N48130K12409l83128l29827L34602
$$ 283056 2199 -233353 -455013 -581577 -325037 223093 435502 52374 -277453 57149
36081E7149N72288N753m82216k35886J72159N2277k70070k05078N1172N6797L324
$$ 57149 629437 635190 152974 -82912 89247 141524 -128546 -333624 -282452 -225655 -222331
36070b22331J83642K16167k67690p04020l59442M04470O42059K79824L0253Q4563
$$ -222331 -38689 177478 -90212 -794232 -1153674 -749204 -107145 172679 202932 287495
36060B87495j5616k85819k02508J85956J24555n64185j008108n53823K59801N26418
$$ 287495 271879 -13940 -216448 -30492 94063 -470122 -1478230 -2032053 -1772252 -1245834
36050a245834J88619j16956l2132K16046K68772K3740l14559l82528q615M94737
$$ -1245834 -1057215 -1174171 -1206303 -990257 -721485 -697745 -1012304 -1394832 -1403447 -908710
36040i08710O17428K90144m6505o8023P8396J41029J19349R0321J9972n1980M9030
$$ -908710 -291282 -1138 -47643 -115666 -37270 103759 223108 313429 333401 281421 330451
36029C30451K78153K44299k62675q16778p69236o9680O08543O28862Q8684l84150
$$ 330451 608604 852903 590228 -226550 -995786 -1065466 -456923 171939 260623 -123527
36019a23527m33361l16707l48593l11369J67169P95879Q05444R6405m44726j61292
$$ -123527 -556888 -873595 -1222188 -1533557 -1366388 -570509 234935 331340 -113386 -274678
36009b74678M26373M49509l6026l29453k70689k90897m39975k58968L02355O31731
$$ -274678 151695 601204 565178 235725 -34964 -325861 -765836 -1024804 -722449 -90718
35999i0718L37494k25070n21933m34445j29250K02999L46622K00036j7461m0915
$$ -90718 246776 21706 -500227 -934672 -1063922 -860923 -514301 -314265 -331726 -372641
35989c72641M5761P6841K12022N25172N34309p3851n93933k02404N55042M47771
$$ -372641 -326880 -250039 -38017 487155 1021464 947613 353680 151276 706318 1154089
35979A154089l70966m99956L19532O49005k15015r65381m59942L92852K96582
$$ 1154089 783123 283167 602699 1251704 1036689 71308 -388634 4218 300800
35970C00800k22794N0467O92811L63538p12021r55647j4372P24113M09591j49130
$$ 300800 78006 128473 821284 1184822 472801 -482846 -497218 226895 636486 487356
35960D87356j16176R2516j19161l69460r4255L40465K26386k94194m41923J8885
$$ 487356 371180 463696 344535 -24925 -119180 221285 447671 153477 -288446 -269561
35950b69561M70143L11750k78595n98434k86508K44225L62620O5959j13380j8250
$$ -269561 200582 512332 233737 -364697 -651205 -406980 -44360 21599 -91781 -110031
35940a10031n1582k66869r2822N41469O90014j71842j002171o08761M27886N93583
$$ -110031 -161613 -428482 -521304 20165 710179 538337 -463834 -1072595 -644709 -51126
35930e1126k06627o32798j20569M37662L83530J87026K59264K12870j49206k79934
$$ -51126 -257753 -890551 -1011120 -573458 -189928 -2902 256362 469232 320026 40092
35920D0092P5783L18245N2243k40250j53271o0320k77936m04005r8939K71570
$$ 40092 115875 434120 486363 246113 92842 32522 -245414 -649419 -748358 -476788
35910d76788L29143K44076J40545k00803n94467l73273M19837P93067L43453p1624
$$ -476788 -147645 96431 236976 36173 -558294 -931567 -511730 281337 624790 553166
35900E53166J27911K51595k49419o24681j83823L53304J44459k16515J24584N28983
$$ 553166 681077 932672 683253 58572 -125251 228053 372512 155997 280581 809564
35890H09564n2579j011431r02724J43095O46623J71896k82119k12133j84552l55997
$$ 809564 756985 -254446 -1157170 -1014075 -367452 -195556 -477675 -689808 -874360 -1230357
35880a230357r9953N72905P55722K21657j38905J04038K57344p4170k29437J99301
$$ -1230357 -1330310 -757405 -1683 219974 81069 185107 442451 368281 138844 338145
35870C38145N14267J31083l96814l67872m6543L862q3239N7460K21008O0644k07954
$$ 338145 852412 983495 586681 218809 172266 176128 92889 150349 371357 432001 224047
35859B24047k06999m5913P861N8062K44543L14429M5497k84273l12078j34940
$$ 224047 17048 -28865 -21004 37058 281601 596030 641527 357254 45176 -89764
35849h9764o2474j56255k99283l76068k13336K25995N12570J99609l41988k96279
$$ -89764 -152238 -308493 -607776 -983844 -1197180 -971185 -458615 -259006 -600994 -897273
35839h97273K87514M98741J07418j9521M70776N93293l40128j323556j024504
$$ -897273 -609759 -111018 -3600 -23121 447655 1040948 700820 -622736 -1647240
35830a647240K10315R22862O22227J10538J5942J28751J37976P7325j6557j76482
$$ -1647240 -1436925 -514063 108164 218702 234644 363395 501371 578696 562139 385657
35820C85657k37134n3281J48240J34908R5036J59620m7685o66784r17094j20521
$$ 385657 148523 95242 243482 378390 473426 633046 585361 -81423 -998517 -1119038
35810a119038R82371J065108J57684m40495j51864K34906R5094j18848N4965K34043
$$ -1119038 -136667 928441 1086125 645630 493766 728672 823766 704918 759883 993926
35800I93926M9763p1498K74455O19155L76141j31738j99985J27351K44679J4548
$$ 993926 1043689 972191 1246646 1865801 2241942 2110204 1910219 2037570 2282249 2296797
35790B296797j55682j12196j09810k03390j37839Q7586J20258j34465k94594j03705
$$ 2296797 2141115 2028919 1919109 1715719 1577880 1665466 1785724 1651259 1356665 1252960
35780A252960J55502J14354j28057k08360m9675J02504Q5484l2385j67016l03339
$$ 1252960 1408462 1522816 1394759 1186399 1136724 1239228 1324712 1292327 1125311 821972
35770H21972l49412j80795Q6536J29402j24762l10045j11247K55902L32738M6931
$$ 821972 472560 291765 378301 507703 382941 72896 -38351 217551 550289 597220
35760E97220k58141l34185k33799n3576J68867K96039J87998l328J3485J90727
$$ 597220 339079 4894 -228905 -282481 -113614 182425 370423 367095 380580 571307
35750E71307J96898j1141j10753J1228Q8908J2462O675Q7611p8008m84507n67445
$$ 571307 768205 757064 646311 657539 746447 758909 765584 853195 775187 290680 -276765
35739b76765q4235L64296K06266k31914l09859m7300J32232J98321L39644L61863
$$ -276765 -361000 3296 209562 -22352 -332211 -379511 -247279 -48958 290686 652549
35729F52549K5252l14763j94304R6860k0605l32780j69694L18524K90946l33399
$$ 652549 677801 363038 168734 265594 244989 -87791 -257485 61039 351985 18586
35719A8586o42842j89247L57671L95999K60362L74103M05765m2164n74886n64760
$$ 18586 -624256 -813503 -455832 -59833 200529 574632 980397 938233 363347 -201413
35709b01413j06947K24686K10339K3742k08973l76591k48459J37657K93555l4449
$$ -201413 -308360 -83674 126665 150407 -58566 -435157 -683616 -545959 -252404 -286853
35699b86853l64816j81786K43223L36117J88038L25709P12911P35353J82123m08847
$$ -286853 -651669 -833455 -590232 -254115 -66077 259632 972543 1707896 1890019 1481172
35689A481172m98602j53523J90692J87922k21094p15645p39703j22740N18535
$$ 1481172 982570 829047 1019739 1207661 986567 270922 -468781 -591521 -72986
35680g2986M45572j92863n30109j70714L43740L82692J6969k66730k16355P5933
$$ -72986 372586 179723 -350386 -521100 -177360 205332 222301 -44429 -260784 -184851
35670a84851L81113M24814O3120m41284n97347k95043O5421J81563J98449K61909
$$ -184851 196262 621076 684196 242912 -354435 -649478 -584057 -402494 -204045 57864
35660E7864J77847j44503l24095m6544L33641K52113j95016l86920j08903J92058
$$ 57864 235711 91208 -232887 -279431 54210 306323 111307 -275613 -384516 -192458
35650a92458J27293j37614k38476q4176J77246L68257L39044O9906k11705k64586
$$ -192458 -65165 -202779 -441255 -525431 -348185 20072 359116 429022 217317 -47269
35640d7269j90092k44990l29742j05211L41879M88622J93338n2591K6354J533
$$ -47269 -237361 -482351 -812093 -917304 -575425 -86803 106535 53944 80298 81831
35630H1831m36964p52337l31721M34490O33192J63544k13203q2876J61177J33022
$$ 81831 -355133 -1107470 -1439191 -1004701 -371509 -207965 -421168 -504044 -342867 -209845
35620b09845k1498r5507j52052j62888P0650L94930L10085k06607m77496r1845
$$ -209845 -231343 -326850 -478902 -641790 -571140 -176210 133875 -72732 -550228 -642073
35610f42073M52382M97734J28385j38082j31518k2947R7687J69202O694l58526
$$ -642073 -189691 308043 436428 298346 166828 143881 241568 410770 417464 58938
35600E8938n01345j83078K30656L48976L47535M86884M79494j2350n88477n57066
$$ 58938 -442407 -625485 -394829 -45853 301682 788566 1268060 1255710 667233 110167
35590A10167J4607L91543K13220j85807m11910l69452o7617L41634M26354k9733
$$ 110167 124774 516317 729537 543730 131820 -237632 -305249 36385 462739 433006
35580D33006n04196l39300K49842M73796J85901j526J60609J78749k37036o29496
$$ 433006 -71190 -410490 -160648 313148 499049 497523 658132 836881 599845 -29651
35570b9651n25709r3467K39899L03050R0503l15248n44901k26125L52556M60224
$$ -29651 -555360 -648827 -408928 -105878 -15375 -330623 -875524 -1101649 -749093 -288869
35560b88869m127l22256r3533J63314n4635l84534k33550K64031N13323L27851
$$ -288869 -292996 -615252 -708785 -545471 -600106 -984640 -1218190 -954159 -440836 -112985
35550a12985J9143j34175j08162k0035m0880j99108j86855K58057P52190O25851
$$ -112985 -93842 -228017 -336179 -356214 -397094 -596202 -783057 -525000 227190 853041
35540H53041k8543l86074j58106R627k44280l13589K38451P34687M00089l67263
$$ 853041 824498 438424 280318 289945 45665 -267924 -29473 705214 1105303 738040
35530G38040o35539l13962O847J37870K93118L56685O8825k98934l11780j88737
$$ 738040 102501 -211461 -204614 -66744 226374 583059 651884 352950 41170 -147567
35520a47567m11086p43370n37111J48643O22481O39856N22983L22052j76688o40338
$$ -147567 -558653 -1302023 -1839134 -1690491 -1068010 -428154 94829 416881 240193 -400145
35510d00145m17298L05448N70285J03380k56621P4423N31612L59875k68761o41123
$$ -400145 -817443 -511995 58290 161670 -94951 -20528 511084 870959 602198 -38925
35500c8925m76886n1041K56637K01762j72855m28130j69882L19274L99471N2207
$$ -38925 -515811 -566852 -310215 -108453 -281308 -709438 -879320 -560046 -160575 -108368
35490a08368j31315j964n3542l71265l34037K12249M49106r6599o08349k03815
$$ -108368 -239683 -241647 -295189 -666454 -1000491 -788242 -339136 -435735 -1044084 -1247899
35480a247899O13851P19150P2583l85612k56433l6712k5879J13762N42766Q19568
$$ -1247899 -634048 85102 157685 -227927 -484360 -521072 -546951 -433189 109577 929145
35470I29145N84803Q8054k23969k13232O724K35367K07323j46900m23416j76391
$$ 929145 1513948 1602002 1378033 1164801 1171525 1406892 1614215 1467315 1043899 867508
35460H67508L46907M35568l0658l57096q2603L53874L59837N1391j26038j77784
$$ 867508 1214415 1649983 1619325 1262229 1179626 1533500 1893337 1944728 1818690 1640906
35450A640906l44631m38105j10090L60592L13375k16190m19476N0931M92122K33848
$$ 1640906 1296275 858170 748080 1108672 1422047 1205857 786381 837312 1329434 1563282
35440A563282l21304l83103l5309n086l89674m91939R344N34121N10273J35335
$$ 1563282 1241978 858875 823566 818480 428806 -63133 -53789 480332 990605 1125940
35430A125940j19456j81731j48744P9070M45916M78370p0230o62834o22895n7149
$$ 1125940 1006484 824753 676009 755079 1200995 1679365 1609135 946301 323406 266257
35420B66257L91224M30808K19100j30612n13485n53368m3882N00138M16387j16718
$$ 266257 657481 1088289 1307389 1176777 663292 109924 66042 566180 982567 865849
35410H65849l52653r4709J94171K61046K32242K8494m83115q14394l43392M96898
$$ 865849 513196 418487 612658 873704 1105946 1134440 651325 -163069 -506461 -9563
35400i563O19292n443k58323K36281M90231l8030m21789O8750N80375J21344o91274
$$ -9563 609729 604286 345963 582244 1072475 1034445 612656 681406 1261781 1383125 691851
35389F91851o72213q479K73501J29564K73952N79040K71565m68869o44216j60769
$$ 691851 19638 11159 284660 414224 688176 1267216 1538781 1069912 425696 264927
35379B64927N8218k13682j71242L65031M56856k52858p44834k86981L24215J09352
$$ 264927 323145 109463 -61779 303252 760108 507250 -237584 -524565 -200350 -90998
35369i0998n14965n40573J3452L58192K80130J91644J77164l1458k93816j60218
$$ -90998 -605963 -1146536 -1133084 -774892 -494762 -303118 -125954 -157412 -451228 -611446
35359f11446K92794M75381J83231j44211j51769j6729l3115j76575k49985j69792
$$ -611446 -318652 156729 339960 195749 43980 27251 -5864 -182439 -432424 -602216
35349f02216K3739K44444L74057L38102J96357O8958P18l8979q8893j57370j52766
$$ -602216 -578477 -334033 40024 378126 574483 643441 644159 605180 516287 358917 206151
35338B06151R3128N18161O40004P0853p77694j014674m29876K15689K98284J19362
$$ 206151 299279 817440 1457444 1528297 750603 -264071 -693947 -478258 -179974 -60612
35328f0612J78920K87739N0673k52275p8892L52246L08751k51448n55768k06550
$$ -60612 118308 406047 456720 204445 125553 477799 786550 535102 -20666 -227216
35318b27216K68759L07490Q0160r02J5032j19548k72344j37289J77447K43102
$$ -227216 41543 349033 429193 428291 443323 323775 51431 -85858 91589 334691
35308C34691m9153l12078j74790K73005O08789N02006q801n46315p02873m22834
$$ 334691 285538 -26540 -201330 71675 680464 1182470 1173669 627354 -75519 -498353
35298d98353o1668L2216o5520k2561K07677K85096K4043k52756j66024J28928
$$ -498353 -560021 -527805 -593325 -615886 -408209 -123113 -99070 -351826 -517850 -388922
35288c88922J97148N8859J44698M53458L72113l38114r50114p17374K9024M18748
$$ -388922 -191774 -132915 11783 465241 837354 499240 -450874 -1168248 -1139224 -720476
35278g20476L45066L85942N97603L89006k89508o41209k75543J39209J740k63384
$$ -720476 -375410 10532 608135 997141 707633 66424 -209119 -69910 -68170 -331554
35268c31554n1613L22148J98259k61517l54023L8175M14879N24807M92567K71863
$$ -331554 -383167 -61019 137240 -124277 -478300 -440125 -25246 499561 992128 1263991
35258A263991k41198o66480m97345L3532J92448j42163l37620m1489L56738M34277
$$ 1263991 1022793 356313 -141032 -107500 84948 -57215 -394835 -436324 -79586 354691
35248C54691K55523K1882k11351l13416j19353J76807J89704k2548m4854J35835
$$ 354691 610214 632096 420745 107329 -12024 164783 354487 331939 287085 422920
35238D22920R8388k08265l25638r6323R2011N4590O9385J74214l254m14440m26027
$$ 422920 521308 313043 -12595 -108918 -16907 37683 107068 281282 278028 -136412 -562439
35227e62439R5084L76616l2900m56102j97257K96149K25082k27631l00736M8672
$$ -562439 -467355 -90739 -123639 -579741 -776998 -480849 -255767 -483398 -784134 -735462
35217g35462K23881R3757P2288K20911J63883j07434j56088J01935K40382P8006
$$ -735462 -511581 -417824 -345536 -124625 39258 -68176 -224264 -122329 118053 196059
35207A96059o1783M29j2919k87670n49003m78021j35330K07831L65891K64572
$$ 196059 134276 134705 121786 -165884 -714887 -1192908 -1328238 -1120407 -754516 -489944
35197d89944l3695k47923j03552K85469N02757L40061p17k22312k23797p3812
$$ -489944 -523639 -771562 -875114 -589645 -86888 253173 252456 30144 -193653 -267465
35187b67465J05917K18869K70230L04168K27386p7378l89906k88755J54200K88802
$$ -267465 -161548 57321 327551 631719 859105 781727 391821 103066 257266 546068
35177E46068j50968n07778j58335M59584M90442j3361k45843L5406K26564m1445
$$ 546068 395100 -112678 -271013 188571 679013 665652 419809 455215 681779 640334
35167F40334l49551k30725J75241M53051M16189J02910l19937n44844l94297j25568
$$ 640334 290783 60058 235299 688350 1104539 1207449 887512 342668 -51629 -177197
35157a77197q7467j58394Q177L07789L31359Q7876n2933n6480j70870k62619J035
$$ -177197 -264664 -423058 -414881 -107092 224267 312143 259210 202730 31860 -230759 -229724
35146b29724L41314J38445m28973m95294O7862L90292Q9376r3332L15619N86928
$$ -229724 111590 250035 -178938 -674232 -606370 -216078 -126702 -220034 95585 682513
35136F82513N4889o13346m23533L36526N64862K6603m54625l23021P8807K15097
$$ 682513 737402 124056 -299477 37049 601911 628514 173889 -149132 -70325 144772
35126A44772K1710k05516j64742J88480M83730K59179l37358n77015j86055J74438
$$ 144772 166482 -39034 -203776 -15296 468434 727613 390255 -186760 -372815 -198377
35116a98377p9464n25835m42764N4716L20941K40716K04101K88502K35814P4689
$$ -198377 -277841 -803676 -1246440 -1191724 -870783 -630067 -425966 -137464 98350 173039
35106A73039N6711J10176Q462q1297J24878L73482J86339l00177m93332k51516
$$ 173039 229750 339926 348388 267091 391969 765451 951790 651613 158281 -93235
35096i3235J3610N1277k8019j44627k43249q2549L41728M41415j54935p55624
$$ -93235 -79625 -28348 -56367 -200994 -444243 -526792 -185064 256351 101416 -654208
35086f54208m75008L27978N48272R1856r2250K67996L64828j12240l46615J30119
$$ -654208 -1129216 -801238 -252966 -161110 -253360 14636 379464 267224 -79391 50728
35076E0728N61427K72038k20560k07326L8356l3252j85295K1544K68499P3766
$$ 50728 612155 884193 663633 456307 494663 461411 276116 297660 566159 639925
35066F39925k23145n6573K71147J12523k96458k05241L02155M26210L1956j76472
$$ 639925 416780 360207 631354 743877 447419 242178 544333 970543 1002499 826027
35056H26027O3545J62915j97382m81137k43790J19957P6136k11352k70866q7129
$$ 826027 889572 1052487 855105 373968 130178 250135 326271 114919 -155947 -243076
35046b43076N1862J33416L23374M99694L73185q644k91048l28076l07705l23361
$$ -243076 -191214 -57798 265576 765270 1138455 1129811 838763 510687 202982 -120379
35036a20379j74350K33696N52736L54882k45606o41268m84042j21033p5236l11227
$$ -120379 -294729 -61033 491703 846585 600979 -40289 -524331 -645364 -720600 -1031827
35026a031827l57820n6180K46053K99909L08704M69875N56145K89607j37024k91070
$$ -1031827 -1389647 -1445827 -1199774 -899865 -591161 -121286 434859 724466 587442 296372
35016B96372j04868R0907N8372j12948k17835j60346j6646n615k48439m49316
$$ 296372 191504 282411 340783 227835 10000 -150346 -166992 -172607 -421046 -870362
35006h70362j30402N82290Q28327J34610p07268n78963L47736P73863J11679p18916
$$ -870362 -1000764 -418474 409853 544463 -162805 -741768 -394032 379831 491510 -227406
34996b27406o76849O261M11296L07529J69921J64901k1078l75942l87849R8576
$$ -227406 -904255 -897994 -486698 -179169 -9248 155653 134575 -241367 -629216 -530640
34986e30640M89309K79104j81121k14008J87496M06581J27539k92633m29442l22904
$$ -530640 -41331 237773 56652 -157356 30140 436721 564260 271627 -157815 -480719
34976d80719k21564j51472k5199N9202l1862j36627L1015L87059M94251J78540
$$ -480719 -702283 -853755 -878954 -819752 -851614 -988241 -957226 -570167 -75916 102624
34966A02624j60410o1552L61855N63083K87180j01354j11373K16159L42226o0420
$$ 102624 -57786 -119338 242517 805600 1092780 991426 880053 1096212 1438438 1378018
34956A378018o18630o71936j20904M01416L09288k26224n62183l91595K4582L13178
$$ 1378018 759388 87452 -33452 367964 677252 451028 -111155 -502750 -478168 -164990
34946a64990L32217R8845k60972m55724k74056M5475N3870k13647k19839K15511
$$ -164990 167227 266072 5100 -450624 -724680 -679205 -625335 -838982 -1058821 -843310
34936h43310N34802K87967r1402Q0953O10495O15872j63723r07300p85585j2996
$$ -843310 -308508 -20541 -111943 -30990 579505 1195377 1031654 124354 -661231 -674227
34926f74227N18217L65397p6254k11862N1655L15334K27910j24839l73541l10748
$$ -674227 -156010 209387 133133 -78729 -27074 288260 516170 391331 17790 -292958
34916b92958o5499J51987K93928L70781K99777N6298j70301k18651k31530l84520
$$ -292958 -358457 -206470 87458 458239 758016 814314 644013 425362 193832 -190688
34906a90688m43800l5037O08138O85267r2744q90794p01639K98852R08200M34995
$$ -190688 -634488 -669525 -61387 623880 531136 -359658 -1061297 -762445 145755 580750
34896E80750m48936o42038O96O31399N75077N3537l18069l43660k77773k70867
$$ 580750 131814 -510224 -509528 121871 696948 750485 432416 88756 -189017 -459884
34886d59884j64959J21992L09404P4949m33647o53765k67104L52241N48256K01657
$$ -459884 -624843 -502851 -193447 -118498 -552145 -1205910 -1473014 -1120773 -572517 -370860
34876c70860j24831L8561M34938N04796K19419L5203R0451J9129l00974m15635
$$ -370860 -495691 -457130 -22192 482604 702023 737226 827677 846806 545832 130197
34866A30197o1528K74351R1531k65225j51452K89008L70486L9869p4731J80739
$$ 130197 68669 343020 434551 169326 17874 306882 677368 717237 642506 823245
34856H23245K03378k52437n70003l13261L8690j7009j17221K23134N96955L37514
$$ 823245 1026623 774186 204183 -109078 -70388 -87397 -204618 18516 615471 952985
34846I52985k62760l58414M6169J32759l03315n02193n2454L99576K14423k44829
$$ 952985 690225 331811 377980 510739 207424 -294769 -347223 52353 266776 21947
34836B1947k82154M1383J52938o8114k29713j36117K8950J34165K01518J33453
$$ 21947 -260207 -218824 -65886 -134000 -363713 -499830 -470880 -336715 -135197 -1744
34826a744j61368l88314j40265L87162N13753R1429j85671J42522M85982R8997
$$ -1744 -163112 -551426 -691691 -304529 209224 300653 114982 257504 743486 842483
34816H42483o20383o07109J88934N94033k5157p35535m39488M41357O37901l3958
$$ 842483 222100 -385009 -196075 397958 372801 -362734 -802222 -360865 277036 243078
34806B43078n10922j88898K96147K50379p1076j22186K7554L5417l2806L4125
$$ 243078 -267844 -456742 -160595 89784 18708 -103478 -75924 -40507 -73313 -39188
34796c9188Q0543r4776k68015j78544l9035j18768j78464P9254L38104J38028
$$ -39188 41355 -53421 -321436 -499980 -539015 -657783 -836247 -756993 -418889 -280861
34786b80861k46249j53706L78255O43472L54103l1164j19400m6139j8995j6459
$$ -280861 -527110 -680816 -302561 340911 695014 663850 544450 498311 479316 462857
34776D62857o5775k50638l39688P508N48284N85913k5044n85005m85409Q6902
$$ 462857 397082 146444 -193244 -185736 362548 948461 923417 338412 -146997 -60095
34766f0095N82981P07763M15032j68084o08813n06001j30586j21666m04675k11299
$$ -60095 522886 1230649 1645681 1477597 868784 362783 232197 110531 -294144 -505443
34756e05443N41551Q42874J32417o60319m73064K53444L60987j47304k54777K59417
$$ -505443 36108 878982 1011399 351080 -121984 131460 492447 345143 90366 349783
34746C49783M56155j46760p49410n40152R2745K53854j47639m46582k53503J69934
$$ 349783 805938 659178 -90232 -630384 -537639 -283785 -431424 -878006 -1131509 -961575
34736i61575M38871M47961K43810j08044m15664l87926M5919N51016O86673L82211
$$ -961575 -522704 -74743 169067 61023 -354641 -742567 -696648 -145632 541041 923252
34726I23252j5386j90560j89120j89684j43379Q3220L13316J90394k50277n10655
$$ 923252 907866 717306 528186 338502 195123 278343 591659 782053 531776 21121
34716B1121k77168J70841L68896K10225p4155k07303j5645L99694N51031N2198
$$ 21121 -256047 -85206 283690 493915 419760 212457 196812 596506 1147537 1199735
34706A199735o57905o54063J53814P15684L24914l02385j60955M55882M94707
$$ 1199735 541830 -112233 41581 757265 1082179 779794 618839 1074721 1569428
34697A569428j27996m86350k41487j03314m91327q04213m71427J29434L52833
$$ 1569428 1441432 955082 713595 610281 118954 -685259 -1156686 -1027252 -674419
34688f74419K20062J28111J53782J69938K21111L01630J44141l17826o32541m13034
$$ -674419 -454357 -326246 -172464 -2526 218585 520215 664356 346530 -286011 -699045
34678f99045Q7857L84072L87444K32932j15899n85782p06226k08210L80867L80160
$$ -699045 -611188 -227116 160328 393260 277361 -308421 -1014647 -1222857 -841990 -461830
34668d61830k8349j06169K67994M77692K16363j00127j24100q3547k15143k96222
$$ -461830 -490179 -596348 -328354 149338 365701 265574 141474 57927 -157216 -453438
34658d53438j26288K5431r0504j64278J90203O71206O05904k0568m28859j01769
$$ -453438 -579726 -554295 -644799 -809077 -618874 52332 658236 637668 208809 107040
34648A07040M79117M83428j48692o58995n06292l5751Q1189k16265l64396k0717
$$ 107040 586157 1069585 920893 261898 -244394 -280145 -198956 -415221 -779617 -800334
34638h00334M65900N53639J84811k43212l92428k48195L292J47114O9259j12147
$$ -800334 -334434 219205 404016 160804 -231624 -479819 -476527 -329413 -260154 -372301
34628c72301j30937O5710J79351k9531l53780m08761j45545J87828M52686O34819
$$ -372301 -503238 -437528 -258177 -287708 -641488 -1050249 -1195794 -1007966 -555280 79539
34618G9539N73027J24412m02125m47830M7715N15264N18958K43203K8910j42220
$$ 79539 652566 776978 374853 -72977 -25262 490002 1008960 1252163 1281073 1138853
34608A138853l90088n36479l71456p9015K820j17579j92555j86512k20565j87093
$$ 1138853 748765 212286 -159170 -238185 -235365 -352944 -545499 -732011 -952576 -1139669
34598a139669J20387N10576N02509L9605l25261j61803K62422M06580K01728M5495
$$ -1139669 -1019282 -508706 -6197 33408 -291853 -453656 -191234 215346 417074 462569
34588D62569J72655L53783K48018j64051n80123o91584m38120k3048K69691L12874
$$ 462569 635224 989007 1237025 1072974 492851 -198733 -636853 -659901 -390210 -77336
34578g7336K29554K27621L27427L14313L0128l37913m11451j15420J47426j4477
$$ -77336 152218 379839 707266 1021579 1051707 713794 302343 186923 334349 319872
34568C19872m28202n47231j80881K63198L60808K03173J40491K29392K31910M7167
$$ 319872 -108330 -655561 -836442 -573244 -212436 -9263 131228 360620 592530 639697
34558F39697j51965j90496p3651Q8489J59587K8896k33228l46798j53965J18822
$$ 639697 487732 297236 223585 312074 471661 500557 267329 -79469 -233434 -114612
34548a14612J75319J00274J60442K64176P8496l10135l76914L6684L96602K39725
$$ -114612 60707 160981 321423 585599 664095 353960 -22954 13730 410332 650057
34538F50057j69469l11575j68328o4105m9832M5235J46130O3127j7221K48682
$$ 650057 480588 169013 685 -63420 -113252 -68017 78113 141240 124019 372701
34528C72701O52479N51658j55954p46628o39493j57506N1810o8203j27036l4128
$$ 372701 1025180 1576838 1420884 674256 34763 -122743 -70933 -139136 -266172 -300300
34518c00300l1201j21179n0638J28101M0405l22129m20599L6803N50964M84443
$$ -300300 -331501 -452680 -503318 -375217 -334812 -656941 -1077540 -1040737 -489773 -5330
34508e330l6684l27790r2006K99612M26603K69009j4474l37139n57144m49667
$$ -5330 -42014 -369804 -461810 -162198 264405 533414 518940 181801 -375343 -825010
34498h25010k9096L46851L99954K54779J63278J32024M2620o0082n8154N295K0058
$$ -825010 -854106 -507255 -107301 147478 310756 442780 485400 425318 367164 372459 392517
34487C92517J1028L1590j993j46285k53786j92675p3963k0303O9802K35403K09259
$$ 392517 403545 435135 433142 286857 33071 -159604 -233567 -253870 -184068 51335 260594
34476B60594j33240l65421r3124K91070J22566m06072m54854R4148L95927L0666
$$ 260594 127354 -238067 -331191 -40121 82445 -323627 -778481 -684333 -288406 -257740
34466b57740l07811l4261K84646r7549p55415o98279L9771M57371J54175j59273
$$ -257740 -565551 -599812 -315166 -412715 -1168130 -1866409 -1826638 -1369267 -1215092 -1374365
34456a374365Q9742M53929K67870k97138n36995k35747J47257K06775P6773J03695
$$ -1374365 -1284623 -830694 -562824 -859962 -1396957 -1632704 -1485447 -1278672 -1201899 -1098204
34446a098204L01385L36382K1555l67116m24158j73264k0679j24402j57002J24953
$$ -1098204 -796819 -460437 -438882 -805998 -1230156 -1403420 -1424099 -1548501 -1705503 -1580550
34436a580550M29191L76366J18829P7825K41448K20367m8618j66439O7803L09689
$$ -1580550 -1151359 -774993 -656164 -578339 -336891 -116524 -165142 -331581 -263778 45911
34426D5911J90449j45517k82397j13981P3903L7743j08636p5782J77633L30362
$$ 45911 236360 90843 -191554 -305535 -231632 -193889 -302525 -378307 -200674 129688
34416A29688J06690k94093m12323j68755L0179o8349j92201m9485J59982J04947
$$ 129688 236378 -57715 -470038 -638793 -608614 -676963 -869164 -918649 -758667 -653720
34406f53720r5313r0616Q9574J05571j06799k43374j00955J87969L52986J87803
$$ -653720 -749033 -839649 -750075 -644504 -751303 -994677 -1095632 -907663 -554677 -366874
34396c66874k93690o76597m07110M35825R82995O40004o4056k68291l0065j5836
$$ -366874 -660564 -1337161 -1744271 -1308446 -325451 314553 250497 -17794 -47859 -63695
34386f3695k48511j26781L77077N42457Q2706l95590l75045p3292J59645L11469
$$ -63695 -312206 -438987 -61910 480547 563253 167663 -207382 -280674 -121029 190440
34376A90440K92790j32058o38873m15878N55641J106225M22196p09027r59934
$$ 190440 483230 351172 -287701 -703579 -147938 958287 1380483 671456 -288478
34367b88478k35430M20398L32328j70317m45458k16496L50497P75239O01695l7994
$$ -288478 -523908 -103510 228818 58501 -386957 -603453 -252956 522283 1123978 1085984
34357A085984m48088k83309l5523j77779l26395P6989O58359N48223k28740o80246
$$ 1085984 637896 354587 319064 141285 -185110 -108121 550238 1098461 869721 189475
34347A89475k67601L59697L47361k10933n26102k23780K29734K16741k04043m05185
$$ 189475 -78126 281571 628932 417999 -108103 -331883 -102149 114592 -89451 -494636
34337d94636j06478J78782p6605n07251l45287L13233N51861P5680k89253O1634
$$ -494636 -601114 -422332 -498937 -1006188 -1351475 -1038242 -486381 -410701 -699954 -638320
34327f38320N46361M15442l4377r2228J30169L6316k98286k79799J27584L85750
$$ -638320 -91959 323483 289106 196878 327047 363363 65077 -214722 -87138 298612
34317B98612L02211J37471o3889m11522n65535r5669N85678N68608j86736p07431
$$ 298612 600823 738294 674405 262883 -302652 -398321 187357 755965 569229 -138202
34307a38202m12528J65289L22770R8386r0916r3086M4896K85222M62092L56592
$$ -138202 -550730 -385441 -62671 35715 -55201 -148287 -103391 181831 643923 1000515
34297A000515P5629o2157p2528k33263m59465l74282m2928P3476j7336J70305
$$ 1000515 1076144 1013987 941459 708196 248731 -125551 -168479 -95003 -112339 57966
34287E7966N68243M36728l45473q15127l56300K59652P7223n15096m69770J78685
$$ 57966 626209 1062937 717464 -97663 -453963 -194311 -117088 -632184 -1101954 -923269
34277i23269M07832q2480m00440N5109O28542M69011j55250l42991L4044K45617
$$ -923269 -515437 -597917 -998357 -943248 -314706 154305 -945 -343936 -309892 -64275
34267f4275l5452k35145O2711L18818o2692n96073l89857L21054M35232j85446
$$ -64275 -99727 -334872 -272161 46657 -16035 -612108 -1001965 -680911 -245679 -431125
34257d31125m02272K65555O96074Q957q36796n43037L73317M73981j88813l08229
$$ -431125 -833397 -567842 128232 137189 -699607 -1242644 -869327 -395346 -584159 -892388
34247h92388L14572N09483p0400l55265J13768L38978k38901o51230j63044L71989
$$ -892388 -577816 -68333 -138733 -493998 -380230 -41252 -280153 -931383 -1094427 -722438
34237g22438P8417l40529Q5623P83507O13864j80701n13718l01932k60352l35300
$$ -722438 -644021 -984550 -898927 -115420 498444 317743 -195975 -497907 -758259 -1093559
34227a093559R5016P33386O45534l1266j71685M31471O99185R8657n33749m84998
$$ -1093559 -998543 -265157 380377 349111 177426 608897 1308082 1406739 872990 387992
34217C87992k28489l42690m60011j06171K81391Q6546l35814j64878N63471R78226
$$ 387992 159503 -183187 -643198 -749369 -467978 -381432 -717246 -882124 -318653 659573
34207F59573O12416o5398m02242l19233j63911j42179j31857J9408J90537J21263
$$ 659573 1271989 1206591 804349 485116 321205 179026 47169 66577 257114 378377
34197C78377j54853k44846N7833L92346L15156k1337j14478O6891M3613l45515
$$ 378377 223524 -21322 36511 428857 744013 722676 608198 675089 718702 373187
34187C73187o31910m40865m6770J06082N5015J03415K13691O6108l37712n36600
$$ 373187 -258723 -699588 -746358 -640276 -585261 -481846 -268155 -202047 -539759 -1076359
$$ [...]
##END NTUPLES=NMR SPECTRUM
##END=
